add_cacheability_metadata-2540772-3.patch

Test status
StatusResult
Last receivedWed, 08/05/2015 - 11:34:00
Last requestedWed, 08/05/2015 - 11:34:53
Last testedWed, 08/05/2015 - 11:35:41
Test count1
Environment status
PHP 5.5 MySQLfail
File information
Fileadd_cacheability_metadata-2540772-3.patch
BranchPage Manager - 8.x-1.x
LinkIssue Link
SummaryFAILED: [[SimpleTest]]: [PHP 5.5 MySQL] 544 pass(es), 1 fail(s), and 0 exception(s).
Details

PHP 5.5 MySQL

  1. Setup environment
  2. Detect an invalid patch URL
  3. Detect invalid repository information
  4. Detect invalid patch format
  5. Detect a non-applicable patch
  6. Detect invalid PHP syntax
  7. Detect a Drupal installation failure
  8. Detect a test run failure
  9. Detect a failing test
    Review the test failures below then if necessary run them locally until the problem has been fixed.
  10. Complete test suite with all tests passing
544 pass(es), 1 fail(s), and 0 exception(s)

Non-pass

Test namePassFailException
ExpandDrupal\Tests\page_manager\Unit\RouteParamContextTest010
MessageGroupFilenameLineFunctionStatus
Drupal\Tests\page_manager\Unit\RouteParamContextTest::testOnPageContext Prophecy\Exception\Call\UnexpectedCallException: Method call: - createDataDefinition("entity:node") on Double\Drupal\Core\TypedData\TypedDataManager\P1 was not expected, expected calls were: - getDefaultConstraints(exact(Drupal\Core\TypedData\DataDefinition:000000001a90a2450000000023a20f51 Object ( 'definition' => Array ( 'type' => 'entity:user' ) ))) - create(exact(Drupal\Core\TypedData\DataDefinition:000000001a90a2450000000023a20f51 Object ( 'definition' => Array ( 'type' => 'entity:user' ) )), exact("banana")) - createDataDefinition(exact("bar")) /var/lib/drupaltestbot/sites/default/files/checkout/core/lib/Drupal/Core/Plugin/Context/ContextDefinition.php:243 /var/lib/drupaltestbot/sites/default/files/checkout/core/lib/Drupal/Core/Plugin/Context/Context.php:95 /var/lib/drupaltestbot/sites/default/files/checkout/sites/default/modules/page_manager/src/EventSubscriber/RouteParamContext.php:75 /var/lib/drupaltestbot/sites/default/files/checkout/sites/default/modules/page_manager/tests/src/Unit/RouteParamContextTest.php:82 OtherRouteParamContextTest.php34Drupal\Tests\page_manager\Unit\RouteParamContextTest->testOnPageContext()

All

Test namePassFailException
LeafDrupal\page_manager\Tests\PageConfigSchemaTest300
LeafDrupal\page_manager\Tests\PageManagerAdminTest25800
LeafDrupal\page_manager\Tests\PageManagerTranslationIntegrationTest3800
LeafDrupal\page_manager\Tests\PageNodeSelectionTest7300
LeafDrupal\page_manager\Tests\PagePlaceholderTest2600
LeafDrupal\page_manager\Tests\StaticContextTest11200
LeafDrupal\Tests\page_manager\Unit\BlockDisplayVariantTest600
LeafDrupal\Tests\page_manager\Unit\BlockPluginCollectionTest100
LeafDrupal\Tests\page_manager\Unit\BlockVariantTraitTest400
LeafDrupal\Tests\page_manager\Unit\CurrentUserContextTest100
LeafDrupal\Tests\page_manager\Unit\PageAccessTest600
LeafDrupal\Tests\page_manager\Unit\PageExecutableTest400
LeafDrupal\Tests\page_manager\Unit\PageManagerRoutesTest300
LeafDrupal\Tests\page_manager\Unit\PageTest200
ExpandDrupal\Tests\page_manager\Unit\RouteParamContextTest010
MessageGroupFilenameLineFunctionStatus
Drupal\Tests\page_manager\Unit\RouteParamContextTest::testOnPageContext Prophecy\Exception\Call\UnexpectedCallException: Method call: - createDataDefinition("entity:node") on Double\Drupal\Core\TypedData\TypedDataManager\P1 was not expected, expected calls were: - getDefaultConstraints(exact(Drupal\Core\TypedData\DataDefinition:000000001a90a2450000000023a20f51 Object ( 'definition' => Array ( 'type' => 'entity:user' ) ))) - create(exact(Drupal\Core\TypedData\DataDefinition:000000001a90a2450000000023a20f51 Object ( 'definition' => Array ( 'type' => 'entity:user' ) )), exact("banana")) - createDataDefinition(exact("bar")) /var/lib/drupaltestbot/sites/default/files/checkout/core/lib/Drupal/Core/Plugin/Context/ContextDefinition.php:243 /var/lib/drupaltestbot/sites/default/files/checkout/core/lib/Drupal/Core/Plugin/Context/Context.php:95 /var/lib/drupaltestbot/sites/default/files/checkout/sites/default/modules/page_manager/src/EventSubscriber/RouteParamContext.php:75 /var/lib/drupaltestbot/sites/default/files/checkout/sites/default/modules/page_manager/tests/src/Unit/RouteParamContextTest.php:82 OtherRouteParamContextTest.php34Drupal\Tests\page_manager\Unit\RouteParamContextTest->testOnPageContext()
LeafDrupal\Tests\page_manager\Unit\VariantAwareTraitTest700