fix_php_notices_test-2545168-4.patch

Test status
StatusResult
Last receivedWed, 08/05/2015 - 16:43:41
Last requestedWed, 08/05/2015 - 17:05:12
Last testedWed, 08/05/2015 - 17:09:12
Test count1
Environment status
PHP 5.5 MySQLfail
File information
Filefix_php_notices_test-2545168-4.patch
BranchMonitoring - 8.x-1.x
LinkIssue Link
SummaryFAILED: [[SimpleTest]]: [PHP 5.5 MySQL] 1,804 pass(es), 7 fail(s), and 5 exception(s).
Details

PHP 5.5 MySQL

  1. Setup environment
  2. Detect an invalid patch URL
  3. Detect invalid repository information
  4. Detect invalid patch format
  5. Detect a non-applicable patch
  6. Detect invalid PHP syntax
  7. Detect a Drupal installation failure
  8. Detect a test run failure
  9. Detect a failing test
    Review the test failures below then if necessary run them locally until the problem has been fixed.
  10. Complete test suite with all tests passing
1,804 pass(es), 7 fail(s), and 5 exception(s)

Non-pass

Test namePassFailException
ExpandDrupal\monitoring\Tests\MonitoringCaptchaTest021
MessageGroupFilenameLineFunctionStatus
The test did not complete due to a fatal error.Completion checkMonitoringCaptchaTest.php31Drupal\monitoring\Tests\MonitoringCaptchaTest->testCaptchaSensor()
Unable to install modules captcha, monitoring, monitoring_test due to missing modules captcha.OtherMonitoringTestBase.php23Drupal\monitoring\Tests\MonitoringTestBase->setUp()
Exception: Failed to install modules, aborting test in Drupal\monitoring\Tests\MonitoringTestBase->setUp() (line 25 of /var/lib/drupaltestbot/sites/default/files/checkout/sites/default/modules/monitoring/src/Tests/MonitoringTestBase.php). Drupal\monitoring\Tests\MonitoringTestBase->setUp() Drupal\monitoring\Tests\MonitoringCaptchaTest->setUp() Drupal\simpletest\TestBase->run(Array) simpletest_script_run_one_test('12', 'Drupal\monitoring\Tests\MonitoringCaptchaTest') Uncaught exceptionMonitoringTestBase.php25Drupal\monitoring\Tests\MonitoringTestBase->setUp()
ExpandDrupal\monitoring\Tests\MonitoringPastTest011
MessageGroupFilenameLineFunctionStatus
The test did not complete due to a fatal error.Completion checkMonitoringPastTest.php36Drupal\monitoring\Tests\MonitoringPastTest->testPastSensors()
Undefined index: pastDrupal\simpletest\KernelTestBase->enableModules(Array) Drupal\simpletest\KernelTestBase->setUp() Drupal\monitoring\Tests\MonitoringUnitTestBase->setUp() Drupal\monitoring\Tests\MonitoringPastTest->setUp() Drupal\simpletest\TestBase->run(Array) simpletest_script_run_one_test('10', 'Drupal\monitoring\Tests\MonitoringPastTest') NoticeKernelTestBase.php493Drupal\simpletest\KernelTestBase->enableModules()
ExpandDrupal\monitoring\Tests\MonitoringPaymentTest011
MessageGroupFilenameLineFunctionStatus
The test did not complete due to a fatal error.Completion checkMonitoringPaymentTest.php37Drupal\monitoring\Tests\MonitoringPaymentTest->testPaymentSensors()
Undefined index: paymentDrupal\simpletest\KernelTestBase->enableModules(Array) Drupal\simpletest\KernelTestBase->setUp() Drupal\monitoring\Tests\MonitoringUnitTestBase->setUp() Drupal\monitoring\Tests\MonitoringPaymentTest->setUp() Drupal\simpletest\TestBase->run(Array) simpletest_script_run_one_test('9', 'Drupal\monitoring\Tests\MonitoringPaymentTest') NoticeKernelTestBase.php493Drupal\simpletest\KernelTestBase->enableModules()
ExpandDrupal\monitoring\Tests\MonitoringSearchAPITest011
MessageGroupFilenameLineFunctionStatus
The test did not complete due to a fatal error.Completion checkMonitoringSearchAPITest.php59Drupal\monitoring\Tests\MonitoringSearchAPITest->testSensors()
Undefined index: search_apiDrupal\simpletest\KernelTestBase->enableModules(Array) Drupal\simpletest\KernelTestBase->setUp() Drupal\monitoring\Tests\MonitoringUnitTestBase->setUp() Drupal\monitoring\Tests\MonitoringSearchAPITest->setUp() Drupal\simpletest\TestBase->run(Array) simpletest_script_run_one_test('8', 'Drupal\monitoring\Tests\MonitoringSearchAPITest') NoticeKernelTestBase.php493Drupal\simpletest\KernelTestBase->enableModules()
ExpandDrupal\monitoring_demo\Tests\MonitoringDemoTest021
MessageGroupFilenameLineFunctionStatus
The test did not complete due to a fatal error.Completion checkMonitoringDemoTest.php35Drupal\monitoring_demo\Tests\MonitoringDemoTest->testInstalled()
Unable to install modules: module 'monitoring_demo' is missing its dependency module search_api.OtherMonitoringTestBase.php23Drupal\monitoring\Tests\MonitoringTestBase->setUp()
Exception: Failed to install modules, aborting test in Drupal\monitoring\Tests\MonitoringTestBase->setUp() (line 25 of /var/lib/drupaltestbot/sites/default/files/checkout/sites/default/modules/monitoring/src/Tests/MonitoringTestBase.php). Drupal\monitoring\Tests\MonitoringTestBase->setUp() Drupal\monitoring_demo\Tests\MonitoringDemoTest->setUp() Drupal\simpletest\TestBase->run(Array) simpletest_script_run_one_test('1', 'Drupal\monitoring_demo\Tests\MonitoringDemoTest') Uncaught exceptionMonitoringTestBase.php25Drupal\monitoring\Tests\MonitoringTestBase->setUp()

All

Test namePassFailException
LeafDrupal\monitoring\Tests\MonitoringApiTest8100
ExpandDrupal\monitoring\Tests\MonitoringCaptchaTest021
MessageGroupFilenameLineFunctionStatus
The test did not complete due to a fatal error.Completion checkMonitoringCaptchaTest.php31Drupal\monitoring\Tests\MonitoringCaptchaTest->testCaptchaSensor()
Unable to install modules captcha, monitoring, monitoring_test due to missing modules captcha.OtherMonitoringTestBase.php23Drupal\monitoring\Tests\MonitoringTestBase->setUp()
Exception: Failed to install modules, aborting test in Drupal\monitoring\Tests\MonitoringTestBase->setUp() (line 25 of /var/lib/drupaltestbot/sites/default/files/checkout/sites/default/modules/monitoring/src/Tests/MonitoringTestBase.php). Drupal\monitoring\Tests\MonitoringTestBase->setUp() Drupal\monitoring\Tests\MonitoringCaptchaTest->setUp() Drupal\simpletest\TestBase->run(Array) simpletest_script_run_one_test('12', 'Drupal\monitoring\Tests\MonitoringCaptchaTest') Uncaught exceptionMonitoringTestBase.php25Drupal\monitoring\Tests\MonitoringTestBase->setUp()
LeafDrupal\monitoring\Tests\MonitoringCoreKernelTest16000
LeafDrupal\monitoring\Tests\MonitoringCoreWebTest18500
ExpandDrupal\monitoring\Tests\MonitoringPastTest011
MessageGroupFilenameLineFunctionStatus
The test did not complete due to a fatal error.Completion checkMonitoringPastTest.php36Drupal\monitoring\Tests\MonitoringPastTest->testPastSensors()
Undefined index: pastDrupal\simpletest\KernelTestBase->enableModules(Array) Drupal\simpletest\KernelTestBase->setUp() Drupal\monitoring\Tests\MonitoringUnitTestBase->setUp() Drupal\monitoring\Tests\MonitoringPastTest->setUp() Drupal\simpletest\TestBase->run(Array) simpletest_script_run_one_test('10', 'Drupal\monitoring\Tests\MonitoringPastTest') NoticeKernelTestBase.php493Drupal\simpletest\KernelTestBase->enableModules()
ExpandDrupal\monitoring\Tests\MonitoringPaymentTest011
MessageGroupFilenameLineFunctionStatus
The test did not complete due to a fatal error.Completion checkMonitoringPaymentTest.php37Drupal\monitoring\Tests\MonitoringPaymentTest->testPaymentSensors()
Undefined index: paymentDrupal\simpletest\KernelTestBase->enableModules(Array) Drupal\simpletest\KernelTestBase->setUp() Drupal\monitoring\Tests\MonitoringUnitTestBase->setUp() Drupal\monitoring\Tests\MonitoringPaymentTest->setUp() Drupal\simpletest\TestBase->run(Array) simpletest_script_run_one_test('9', 'Drupal\monitoring\Tests\MonitoringPaymentTest') NoticeKernelTestBase.php493Drupal\simpletest\KernelTestBase->enableModules()
ExpandDrupal\monitoring\Tests\MonitoringSearchAPITest011
MessageGroupFilenameLineFunctionStatus
The test did not complete due to a fatal error.Completion checkMonitoringSearchAPITest.php59Drupal\monitoring\Tests\MonitoringSearchAPITest->testSensors()
Undefined index: search_apiDrupal\simpletest\KernelTestBase->enableModules(Array) Drupal\simpletest\KernelTestBase->setUp() Drupal\monitoring\Tests\MonitoringUnitTestBase->setUp() Drupal\monitoring\Tests\MonitoringSearchAPITest->setUp() Drupal\simpletest\TestBase->run(Array) simpletest_script_run_one_test('8', 'Drupal\monitoring\Tests\MonitoringSearchAPITest') NoticeKernelTestBase.php493Drupal\simpletest\KernelTestBase->enableModules()
LeafDrupal\monitoring\Tests\MonitoringServicesTest58500
LeafDrupal\monitoring\Tests\MonitoringUITest67600
LeafDrupal\monitoring\Tests\MonitoringViewDisplayTest2800
ExpandDrupal\monitoring_demo\Tests\MonitoringDemoTest021
MessageGroupFilenameLineFunctionStatus
The test did not complete due to a fatal error.Completion checkMonitoringDemoTest.php35Drupal\monitoring_demo\Tests\MonitoringDemoTest->testInstalled()
Unable to install modules: module 'monitoring_demo' is missing its dependency module search_api.OtherMonitoringTestBase.php23Drupal\monitoring\Tests\MonitoringTestBase->setUp()
Exception: Failed to install modules, aborting test in Drupal\monitoring\Tests\MonitoringTestBase->setUp() (line 25 of /var/lib/drupaltestbot/sites/default/files/checkout/sites/default/modules/monitoring/src/Tests/MonitoringTestBase.php). Drupal\monitoring\Tests\MonitoringTestBase->setUp() Drupal\monitoring_demo\Tests\MonitoringDemoTest->setUp() Drupal\simpletest\TestBase->run(Array) simpletest_script_run_one_test('1', 'Drupal\monitoring_demo\Tests\MonitoringDemoTest') Uncaught exceptionMonitoringTestBase.php25Drupal\monitoring\Tests\MonitoringTestBase->setUp()
LeafDrupal\monitoring_multigraph\Tests\MultigraphServicesTest2600
LeafDrupal\monitoring_multigraph\Tests\MultigraphWebTest6300