fix_database_backend-2545464-1.patch

Test status
StatusResult
Last receivedTue, 08/04/2015 - 15:12:00
Last requestedTue, 08/04/2015 - 15:34:06
Last testedTue, 08/04/2015 - 15:35:01
Test count1
Environment status
PHP 5.5 MySQLfail
File information
Filefix_database_backend-2545464-1.patch
BranchSearch API - 8.x-1.x
LinkIssue Link
SummaryFAILED: [[SimpleTest]]: [PHP 5.5 MySQL] 865 pass(es), 11 fail(s), and 23 exception(s).
Details

PHP 5.5 MySQL

  1. Setup environment
  2. Detect an invalid patch URL
  3. Detect invalid repository information
  4. Detect invalid patch format
  5. Detect a non-applicable patch
  6. Detect invalid PHP syntax
  7. Detect a Drupal installation failure
  8. Detect a test run failure
  9. Detect a failing test
    Review the test failures below then if necessary run them locally until the problem has been fixed.
  10. Complete test suite with all tests passing
865 pass(es), 11 fail(s), and 23 exception(s)

Non-pass

Test namePassFailException
ExpandDrupal\search_api\Tests\Processor\ContentAccessTest68016
MessageGroupFilenameLineFunctionStatus
Undefined index: typeDrupal\search_api_db\Plugin\search_api\backend\Database->fieldsUpdated(Object) Drupal\search_api_db\Plugin\search_api\backend\Database->addIndex(Object) Drupal\search_api\Task\ServerTaskManager->execute(Object) Drupal\search_api\Entity\Server->indexItems(Object, Array) Drupal\search_api\Entity\Index->indexItems(Array) Drupal\search_api\Entity\Index->trackItemsInsertedOrUpdated('entity:user', Array, 'trackItemsInserted') Drupal\search_api\Entity\Index->trackItemsInserted('entity:user', Array) Drupal\search_api\Entity\Index->reactToDatasourceSwitch(Object) Drupal\search_api\Entity\Index->postSave(Object, 1) Drupal\Core\Entity\EntityStorageBase->doPostSave(Object, 1) Drupal\Core\Entity\EntityStorageBase->save(Object) Drupal\Core\Config\Entity\ConfigEntityStorage->save(Object) Drupal\Core\Entity\Entity->save() Drupal\Core\Config\Entity\ConfigEntityBase->save() Drupal\search_api\Tests\Processor\ContentAccessTest->setUp() Drupal\simpletest\TestBase->run(Array) simpletest_script_run_one_test('5', 'Drupal\search_api\Tests\Processor\ContentAccessTest') NoticeDatabase.php660Drupal\search_api_db\Plugin\search_api\backend\Database->fieldsUpdated()
Undefined index: typeDrupal\search_api_db\Plugin\search_api\backend\Database->fieldsUpdated(Object) Drupal\search_api_db\Plugin\search_api\backend\Database->addIndex(Object) Drupal\search_api\Task\ServerTaskManager->execute(Object) Drupal\search_api\Entity\Server->indexItems(Object, Array) Drupal\search_api\Entity\Index->indexItems(Array) Drupal\search_api\Entity\Index->trackItemsInsertedOrUpdated('entity:user', Array, 'trackItemsInserted') Drupal\search_api\Entity\Index->trackItemsInserted('entity:user', Array) Drupal\search_api\Entity\Index->reactToDatasourceSwitch(Object) Drupal\search_api\Entity\Index->postSave(Object, 1) Drupal\Core\Entity\EntityStorageBase->doPostSave(Object, 1) Drupal\Core\Entity\EntityStorageBase->save(Object) Drupal\Core\Config\Entity\ConfigEntityStorage->save(Object) Drupal\Core\Entity\Entity->save() Drupal\Core\Config\Entity\ConfigEntityBase->save() Drupal\search_api\Tests\Processor\ContentAccessTest->setUp() Drupal\simpletest\TestBase->run(Array) simpletest_script_run_one_test('5', 'Drupal\search_api\Tests\Processor\ContentAccessTest') NoticeDatabase.php672Drupal\search_api_db\Plugin\search_api\backend\Database->fieldsUpdated()
Drupal\search_api\SearchApiException: Unknown field in filter clause: entity:comment/status. in Drupal\search_api_db\Plugin\search_api\backend\Database->createFilterCondition() (line 1780 of /var/lib/drupaltestbot/sites/default/files/checkout/sites/default/modules/search_api/search_api_db/src/Plugin/search_api/backend/Database.php). Drupal\search_api_db\Plugin\search_api\backend\Database->createFilterCondition(Object, Array, Object, Object) Drupal\search_api_db\Plugin\search_api\backend\Database->createFilterCondition(Object, Array, Object, Object) Drupal\search_api_db\Plugin\search_api\backend\Database->createFilterCondition(Object, Array, Object, Object) Drupal\search_api_db\Plugin\search_api\backend\Database->createFilterCondition(Object, Array, Object, Object) Drupal\search_api_db\Plugin\search_api\backend\Database->createDbQuery(Object, Array) Drupal\search_api_db\Plugin\search_api\backend\Database->search(Object) Drupal\search_api\Entity\Server->search(Object) Drupal\search_api\Query\Query->execute() Drupal\search_api\Tests\Processor\ContentAccessTest->testQueryAccessAll() Drupal\simpletest\TestBase->run(Array) simpletest_script_run_one_test('5', 'Drupal\search_api\Tests\Processor\ContentAccessTest') Uncaught exceptionDatabase.php1780Drupal\search_api_db\Plugin\search_api\backend\Database->createFilterCondition()
Undefined index: typeDrupal\search_api_db\Plugin\search_api\backend\Database->fieldsUpdated(Object) Drupal\search_api_db\Plugin\search_api\backend\Database->addIndex(Object) Drupal\search_api\Task\ServerTaskManager->execute(Object) Drupal\search_api\Entity\Server->indexItems(Object, Array) Drupal\search_api\Entity\Index->indexItems(Array) Drupal\search_api\Entity\Index->trackItemsInsertedOrUpdated('entity:user', Array, 'trackItemsInserted') Drupal\search_api\Entity\Index->trackItemsInserted('entity:user', Array) Drupal\search_api\Entity\Index->reactToDatasourceSwitch(Object) Drupal\search_api\Entity\Index->postSave(Object, 1) Drupal\Core\Entity\EntityStorageBase->doPostSave(Object, 1) Drupal\Core\Entity\EntityStorageBase->save(Object) Drupal\Core\Config\Entity\ConfigEntityStorage->save(Object) Drupal\Core\Entity\Entity->save() Drupal\Core\Config\Entity\ConfigEntityBase->save() Drupal\search_api\Tests\Processor\ContentAccessTest->setUp() Drupal\simpletest\TestBase->run(Array) simpletest_script_run_one_test('5', 'Drupal\search_api\Tests\Processor\ContentAccessTest') NoticeDatabase.php660Drupal\search_api_db\Plugin\search_api\backend\Database->fieldsUpdated()
Undefined index: typeDrupal\search_api_db\Plugin\search_api\backend\Database->fieldsUpdated(Object) Drupal\search_api_db\Plugin\search_api\backend\Database->addIndex(Object) Drupal\search_api\Task\ServerTaskManager->execute(Object) Drupal\search_api\Entity\Server->indexItems(Object, Array) Drupal\search_api\Entity\Index->indexItems(Array) Drupal\search_api\Entity\Index->trackItemsInsertedOrUpdated('entity:user', Array, 'trackItemsInserted') Drupal\search_api\Entity\Index->trackItemsInserted('entity:user', Array) Drupal\search_api\Entity\Index->reactToDatasourceSwitch(Object) Drupal\search_api\Entity\Index->postSave(Object, 1) Drupal\Core\Entity\EntityStorageBase->doPostSave(Object, 1) Drupal\Core\Entity\EntityStorageBase->save(Object) Drupal\Core\Config\Entity\ConfigEntityStorage->save(Object) Drupal\Core\Entity\Entity->save() Drupal\Core\Config\Entity\ConfigEntityBase->save() Drupal\search_api\Tests\Processor\ContentAccessTest->setUp() Drupal\simpletest\TestBase->run(Array) simpletest_script_run_one_test('5', 'Drupal\search_api\Tests\Processor\ContentAccessTest') NoticeDatabase.php672Drupal\search_api_db\Plugin\search_api\backend\Database->fieldsUpdated()
Drupal\search_api\SearchApiException: Unknown field in filter clause: entity:comment/status. in Drupal\search_api_db\Plugin\search_api\backend\Database->createFilterCondition() (line 1780 of /var/lib/drupaltestbot/sites/default/files/checkout/sites/default/modules/search_api/search_api_db/src/Plugin/search_api/backend/Database.php). Drupal\search_api_db\Plugin\search_api\backend\Database->createFilterCondition(Object, Array, Object, Object) Drupal\search_api_db\Plugin\search_api\backend\Database->createFilterCondition(Object, Array, Object, Object) Drupal\search_api_db\Plugin\search_api\backend\Database->createFilterCondition(Object, Array, Object, Object) Drupal\search_api_db\Plugin\search_api\backend\Database->createFilterCondition(Object, Array, Object, Object) Drupal\search_api_db\Plugin\search_api\backend\Database->createDbQuery(Object, Array) Drupal\search_api_db\Plugin\search_api\backend\Database->search(Object) Drupal\search_api\Entity\Server->search(Object) Drupal\search_api\Query\Query->execute() Drupal\search_api\Tests\Processor\ContentAccessTest->testQueryAccessComments() Drupal\simpletest\TestBase->run(Array) simpletest_script_run_one_test('5', 'Drupal\search_api\Tests\Processor\ContentAccessTest') Uncaught exceptionDatabase.php1780Drupal\search_api_db\Plugin\search_api\backend\Database->createFilterCondition()
Undefined index: typeDrupal\search_api_db\Plugin\search_api\backend\Database->fieldsUpdated(Object) Drupal\search_api_db\Plugin\search_api\backend\Database->addIndex(Object) Drupal\search_api\Task\ServerTaskManager->execute(Object) Drupal\search_api\Entity\Server->indexItems(Object, Array) Drupal\search_api\Entity\Index->indexItems(Array) Drupal\search_api\Entity\Index->trackItemsInsertedOrUpdated('entity:user', Array, 'trackItemsInserted') Drupal\search_api\Entity\Index->trackItemsInserted('entity:user', Array) Drupal\search_api\Entity\Index->reactToDatasourceSwitch(Object) Drupal\search_api\Entity\Index->postSave(Object, 1) Drupal\Core\Entity\EntityStorageBase->doPostSave(Object, 1) Drupal\Core\Entity\EntityStorageBase->save(Object) Drupal\Core\Config\Entity\ConfigEntityStorage->save(Object) Drupal\Core\Entity\Entity->save() Drupal\Core\Config\Entity\ConfigEntityBase->save() Drupal\search_api\Tests\Processor\ContentAccessTest->setUp() Drupal\simpletest\TestBase->run(Array) simpletest_script_run_one_test('5', 'Drupal\search_api\Tests\Processor\ContentAccessTest') NoticeDatabase.php660Drupal\search_api_db\Plugin\search_api\backend\Database->fieldsUpdated()
Undefined index: typeDrupal\search_api_db\Plugin\search_api\backend\Database->fieldsUpdated(Object) Drupal\search_api_db\Plugin\search_api\backend\Database->addIndex(Object) Drupal\search_api\Task\ServerTaskManager->execute(Object) Drupal\search_api\Entity\Server->indexItems(Object, Array) Drupal\search_api\Entity\Index->indexItems(Array) Drupal\search_api\Entity\Index->trackItemsInsertedOrUpdated('entity:user', Array, 'trackItemsInserted') Drupal\search_api\Entity\Index->trackItemsInserted('entity:user', Array) Drupal\search_api\Entity\Index->reactToDatasourceSwitch(Object) Drupal\search_api\Entity\Index->postSave(Object, 1) Drupal\Core\Entity\EntityStorageBase->doPostSave(Object, 1) Drupal\Core\Entity\EntityStorageBase->save(Object) Drupal\Core\Config\Entity\ConfigEntityStorage->save(Object) Drupal\Core\Entity\Entity->save() Drupal\Core\Config\Entity\ConfigEntityBase->save() Drupal\search_api\Tests\Processor\ContentAccessTest->setUp() Drupal\simpletest\TestBase->run(Array) simpletest_script_run_one_test('5', 'Drupal\search_api\Tests\Processor\ContentAccessTest') NoticeDatabase.php672Drupal\search_api_db\Plugin\search_api\backend\Database->fieldsUpdated()
Drupal\search_api\SearchApiException: Unknown field in filter clause: entity:comment/status. in Drupal\search_api_db\Plugin\search_api\backend\Database->createFilterCondition() (line 1780 of /var/lib/drupaltestbot/sites/default/files/checkout/sites/default/modules/search_api/search_api_db/src/Plugin/search_api/backend/Database.php). Drupal\search_api_db\Plugin\search_api\backend\Database->createFilterCondition(Object, Array, Object, Object) Drupal\search_api_db\Plugin\search_api\backend\Database->createFilterCondition(Object, Array, Object, Object) Drupal\search_api_db\Plugin\search_api\backend\Database->createFilterCondition(Object, Array, Object, Object) Drupal\search_api_db\Plugin\search_api\backend\Database->createFilterCondition(Object, Array, Object, Object) Drupal\search_api_db\Plugin\search_api\backend\Database->createDbQuery(Object, Array) Drupal\search_api_db\Plugin\search_api\backend\Database->search(Object) Drupal\search_api\Entity\Server->search(Object) Drupal\search_api\Query\Query->execute() Drupal\search_api\Tests\Processor\ContentAccessTest->testQueryAccessOwn() Drupal\simpletest\TestBase->run(Array) simpletest_script_run_one_test('5', 'Drupal\search_api\Tests\Processor\ContentAccessTest') Uncaught exceptionDatabase.php1780Drupal\search_api_db\Plugin\search_api\backend\Database->createFilterCondition()
Undefined index: typeDrupal\search_api_db\Plugin\search_api\backend\Database->fieldsUpdated(Object) Drupal\search_api_db\Plugin\search_api\backend\Database->addIndex(Object) Drupal\search_api\Task\ServerTaskManager->execute(Object) Drupal\search_api\Entity\Server->indexItems(Object, Array) Drupal\search_api\Entity\Index->indexItems(Array) Drupal\search_api\Entity\Index->trackItemsInsertedOrUpdated('entity:user', Array, 'trackItemsInserted') Drupal\search_api\Entity\Index->trackItemsInserted('entity:user', Array) Drupal\search_api\Entity\Index->reactToDatasourceSwitch(Object) Drupal\search_api\Entity\Index->postSave(Object, 1) Drupal\Core\Entity\EntityStorageBase->doPostSave(Object, 1) Drupal\Core\Entity\EntityStorageBase->save(Object) Drupal\Core\Config\Entity\ConfigEntityStorage->save(Object) Drupal\Core\Entity\Entity->save() Drupal\Core\Config\Entity\ConfigEntityBase->save() Drupal\search_api\Tests\Processor\ContentAccessTest->setUp() Drupal\simpletest\TestBase->run(Array) simpletest_script_run_one_test('5', 'Drupal\search_api\Tests\Processor\ContentAccessTest') NoticeDatabase.php660Drupal\search_api_db\Plugin\search_api\backend\Database->fieldsUpdated()
Undefined index: typeDrupal\search_api_db\Plugin\search_api\backend\Database->fieldsUpdated(Object) Drupal\search_api_db\Plugin\search_api\backend\Database->addIndex(Object) Drupal\search_api\Task\ServerTaskManager->execute(Object) Drupal\search_api\Entity\Server->indexItems(Object, Array) Drupal\search_api\Entity\Index->indexItems(Array) Drupal\search_api\Entity\Index->trackItemsInsertedOrUpdated('entity:user', Array, 'trackItemsInserted') Drupal\search_api\Entity\Index->trackItemsInserted('entity:user', Array) Drupal\search_api\Entity\Index->reactToDatasourceSwitch(Object) Drupal\search_api\Entity\Index->postSave(Object, 1) Drupal\Core\Entity\EntityStorageBase->doPostSave(Object, 1) Drupal\Core\Entity\EntityStorageBase->save(Object) Drupal\Core\Config\Entity\ConfigEntityStorage->save(Object) Drupal\Core\Entity\Entity->save() Drupal\Core\Config\Entity\ConfigEntityBase->save() Drupal\search_api\Tests\Processor\ContentAccessTest->setUp() Drupal\simpletest\TestBase->run(Array) simpletest_script_run_one_test('5', 'Drupal\search_api\Tests\Processor\ContentAccessTest') NoticeDatabase.php672Drupal\search_api_db\Plugin\search_api\backend\Database->fieldsUpdated()
Drupal\search_api\SearchApiException: Unknown field in filter clause: entity:node/status. in Drupal\search_api_db\Plugin\search_api\backend\Database->createFilterCondition() (line 1780 of /var/lib/drupaltestbot/sites/default/files/checkout/sites/default/modules/search_api/search_api_db/src/Plugin/search_api/backend/Database.php). Drupal\search_api_db\Plugin\search_api\backend\Database->createFilterCondition(Object, Array, Object, Object) Drupal\search_api_db\Plugin\search_api\backend\Database->createFilterCondition(Object, Array, Object, Object) Drupal\search_api_db\Plugin\search_api\backend\Database->createFilterCondition(Object, Array, Object, Object) Drupal\search_api_db\Plugin\search_api\backend\Database->createFilterCondition(Object, Array, Object, Object) Drupal\search_api_db\Plugin\search_api\backend\Database->createDbQuery(Object, Array) Drupal\search_api_db\Plugin\search_api\backend\Database->search(Object) Drupal\search_api\Entity\Server->search(Object) Drupal\search_api\Query\Query->execute() Drupal\search_api\Tests\Processor\ContentAccessTest->testQueryAccessWithNodeGrants() Drupal\simpletest\TestBase->run(Array) simpletest_script_run_one_test('5', 'Drupal\search_api\Tests\Processor\ContentAccessTest') Uncaught exceptionDatabase.php1780Drupal\search_api_db\Plugin\search_api\backend\Database->createFilterCondition()
Undefined index: typeDrupal\search_api_db\Plugin\search_api\backend\Database->fieldsUpdated(Object) Drupal\search_api_db\Plugin\search_api\backend\Database->addIndex(Object) Drupal\search_api\Task\ServerTaskManager->execute(Object) Drupal\search_api\Entity\Server->indexItems(Object, Array) Drupal\search_api\Entity\Index->indexItems(Array) Drupal\search_api\Entity\Index->trackItemsInsertedOrUpdated('entity:user', Array, 'trackItemsInserted') Drupal\search_api\Entity\Index->trackItemsInserted('entity:user', Array) Drupal\search_api\Entity\Index->reactToDatasourceSwitch(Object) Drupal\search_api\Entity\Index->postSave(Object, 1) Drupal\Core\Entity\EntityStorageBase->doPostSave(Object, 1) Drupal\Core\Entity\EntityStorageBase->save(Object) Drupal\Core\Config\Entity\ConfigEntityStorage->save(Object) Drupal\Core\Entity\Entity->save() Drupal\Core\Config\Entity\ConfigEntityBase->save() Drupal\search_api\Tests\Processor\ContentAccessTest->setUp() Drupal\simpletest\TestBase->run(Array) simpletest_script_run_one_test('5', 'Drupal\search_api\Tests\Processor\ContentAccessTest') NoticeDatabase.php660Drupal\search_api_db\Plugin\search_api\backend\Database->fieldsUpdated()
Undefined index: typeDrupal\search_api_db\Plugin\search_api\backend\Database->fieldsUpdated(Object) Drupal\search_api_db\Plugin\search_api\backend\Database->addIndex(Object) Drupal\search_api\Task\ServerTaskManager->execute(Object) Drupal\search_api\Entity\Server->indexItems(Object, Array) Drupal\search_api\Entity\Index->indexItems(Array) Drupal\search_api\Entity\Index->trackItemsInsertedOrUpdated('entity:user', Array, 'trackItemsInserted') Drupal\search_api\Entity\Index->trackItemsInserted('entity:user', Array) Drupal\search_api\Entity\Index->reactToDatasourceSwitch(Object) Drupal\search_api\Entity\Index->postSave(Object, 1) Drupal\Core\Entity\EntityStorageBase->doPostSave(Object, 1) Drupal\Core\Entity\EntityStorageBase->save(Object) Drupal\Core\Config\Entity\ConfigEntityStorage->save(Object) Drupal\Core\Entity\Entity->save() Drupal\Core\Config\Entity\ConfigEntityBase->save() Drupal\search_api\Tests\Processor\ContentAccessTest->setUp() Drupal\simpletest\TestBase->run(Array) simpletest_script_run_one_test('5', 'Drupal\search_api\Tests\Processor\ContentAccessTest') NoticeDatabase.php672Drupal\search_api_db\Plugin\search_api\backend\Database->fieldsUpdated()
Undefined index: typeDrupal\search_api_db\Plugin\search_api\backend\Database->fieldsUpdated(Object) Drupal\search_api_db\Plugin\search_api\backend\Database->addIndex(Object) Drupal\search_api\Task\ServerTaskManager->execute(Object) Drupal\search_api\Entity\Server->indexItems(Object, Array) Drupal\search_api\Entity\Index->indexItems(Array) Drupal\search_api\Entity\Index->trackItemsInsertedOrUpdated('entity:user', Array, 'trackItemsInserted') Drupal\search_api\Entity\Index->trackItemsInserted('entity:user', Array) Drupal\search_api\Entity\Index->reactToDatasourceSwitch(Object) Drupal\search_api\Entity\Index->postSave(Object, 1) Drupal\Core\Entity\EntityStorageBase->doPostSave(Object, 1) Drupal\Core\Entity\EntityStorageBase->save(Object) Drupal\Core\Config\Entity\ConfigEntityStorage->save(Object) Drupal\Core\Entity\Entity->save() Drupal\Core\Config\Entity\ConfigEntityBase->save() Drupal\search_api\Tests\Processor\ContentAccessTest->setUp() Drupal\simpletest\TestBase->run(Array) simpletest_script_run_one_test('5', 'Drupal\search_api\Tests\Processor\ContentAccessTest') NoticeDatabase.php660Drupal\search_api_db\Plugin\search_api\backend\Database->fieldsUpdated()
Undefined index: typeDrupal\search_api_db\Plugin\search_api\backend\Database->fieldsUpdated(Object) Drupal\search_api_db\Plugin\search_api\backend\Database->addIndex(Object) Drupal\search_api\Task\ServerTaskManager->execute(Object) Drupal\search_api\Entity\Server->indexItems(Object, Array) Drupal\search_api\Entity\Index->indexItems(Array) Drupal\search_api\Entity\Index->trackItemsInsertedOrUpdated('entity:user', Array, 'trackItemsInserted') Drupal\search_api\Entity\Index->trackItemsInserted('entity:user', Array) Drupal\search_api\Entity\Index->reactToDatasourceSwitch(Object) Drupal\search_api\Entity\Index->postSave(Object, 1) Drupal\Core\Entity\EntityStorageBase->doPostSave(Object, 1) Drupal\Core\Entity\EntityStorageBase->save(Object) Drupal\Core\Config\Entity\ConfigEntityStorage->save(Object) Drupal\Core\Entity\Entity->save() Drupal\Core\Config\Entity\ConfigEntityBase->save() Drupal\search_api\Tests\Processor\ContentAccessTest->setUp() Drupal\simpletest\TestBase->run(Array) simpletest_script_run_one_test('5', 'Drupal\search_api\Tests\Processor\ContentAccessTest') NoticeDatabase.php672Drupal\search_api_db\Plugin\search_api\backend\Database->fieldsUpdated()
ExpandDrupal\search_api\Tests\ViewsTest1990
MessageGroupFilenameLineFunctionStatus
5 items were indexed.OtherViewsTest.php47Drupal\search_api\Tests\ViewsTest->testFulltextSearch()
The search view displays the correct number of results.OtherViewsTest.php51Drupal\search_api\Tests\ViewsTest->testFulltextSearch()
Entity #1 found in the results.OtherViewsTest.php53Drupal\search_api\Tests\ViewsTest->testFulltextSearch()
Entity #2 found in the results.OtherViewsTest.php53Drupal\search_api\Tests\ViewsTest->testFulltextSearch()
Entity #3 found in the results.OtherViewsTest.php53Drupal\search_api\Tests\ViewsTest->testFulltextSearch()
Entity #4 found in the results.OtherViewsTest.php53Drupal\search_api\Tests\ViewsTest->testFulltextSearch()
Entity #5 found in the results.OtherViewsTest.php53Drupal\search_api\Tests\ViewsTest->testFulltextSearch()
The search view displays the correct number of results.OtherViewsTest.php60Drupal\search_api\Tests\ViewsTest->testFulltextSearch()
Entity #3 found in the results.OtherViewsTest.php63Drupal\search_api\Tests\ViewsTest->testFulltextSearch()
ExpandDrupal\search_api_db\Tests\BackendTest1427
MessageGroupFilenameLineFunctionStatus
Undefined index: index_tablesDrupal\search_api_db\Tests\BackendTest->checkServerTables() Drupal\search_api_db\Tests\BackendTest->testFramework() Drupal\simpletest\TestBase->run(Array) simpletest_script_run_one_test('2', 'Drupal\search_api_db\Tests\BackendTest') NoticeBackendTest.php112Drupal\search_api_db\Tests\BackendTest->checkServerTables()
Undefined index: field_tablesDrupal\search_api_db\Tests\BackendTest->checkServerTables() Drupal\search_api_db\Tests\BackendTest->testFramework() Drupal\simpletest\TestBase->run(Array) simpletest_script_run_one_test('2', 'Drupal\search_api_db\Tests\BackendTest') NoticeBackendTest.php113Drupal\search_api_db\Tests\BackendTest->checkServerTables()
Normalized storage table existsOtherBackendTest.php115Drupal\search_api_db\Tests\BackendTest->checkServerTables()
Invalid argument supplied for foreach()Drupal\search_api_db\Tests\BackendTest->checkServerTables() Drupal\search_api_db\Tests\BackendTest->testFramework() Drupal\simpletest\TestBase->run(Array) simpletest_script_run_one_test('2', 'Drupal\search_api_db\Tests\BackendTest') WarningBackendTest.php116Drupal\search_api_db\Tests\BackendTest->checkServerTables()
Undefined index: field_tablesDrupal\search_api_db\Tests\BackendTest->updateIndex() Drupal\search_api_db\Tests\BackendTest->testFramework() Drupal\simpletest\TestBase->run(Array) simpletest_script_run_one_test('2', 'Drupal\search_api_db\Tests\BackendTest') NoticeBackendTest.php151Drupal\search_api_db\Tests\BackendTest->updateIndex()
array_keys() expects parameter 1 to be array, null givenarray_keys(NULL) Drupal\search_api_db\Tests\BackendTest->updateIndex() Drupal\search_api_db\Tests\BackendTest->testFramework() Drupal\simpletest\TestBase->run(Array) simpletest_script_run_one_test('2', 'Drupal\search_api_db\Tests\BackendTest') WarningBackendTest.php151Drupal\search_api_db\Tests\BackendTest->updateIndex()
sort() expects parameter 1 to be array, null givensort(NULL) Drupal\search_api_db\Tests\BackendTest->updateIndex() Drupal\search_api_db\Tests\BackendTest->testFramework() Drupal\simpletest\TestBase->run(Array) simpletest_script_run_one_test('2', 'Drupal\search_api_db\Tests\BackendTest') WarningBackendTest.php153Drupal\search_api_db\Tests\BackendTest->updateIndex()
Value array ( 0 => 'entity:entity_test/body', 1 => 'entity:entity_test/category', 2 => 'entity:entity_test/id', 3 => 'entity:entity_test/name', 4 => 'entity:entity_test/type', 5 => 'search_api_language', ) is equal to value NULL.OtherBackendTest.php154Drupal\search_api_db\Tests\BackendTest->updateIndex()
Drupal\search_api\SearchApiException: Unknown index database_search_index. in Drupal\search_api_db\Plugin\search_api\backend\Database->search() (line 1281 of /var/lib/drupaltestbot/sites/default/files/checkout/sites/default/modules/search_api/search_api_db/src/Plugin/search_api/backend/Database.php). Drupal\search_api_db\Plugin\search_api\backend\Database->search(Object) Drupal\search_api\Entity\Server->search(Object) Drupal\search_api\Query\Query->execute() Drupal\search_api_db\Tests\BackendTest->searchNoResults() Drupal\search_api_db\Tests\BackendTest->testFramework() Drupal\simpletest\TestBase->run(Array) simpletest_script_run_one_test('2', 'Drupal\search_api_db\Tests\BackendTest') Uncaught exceptionDatabase.php1281Drupal\search_api_db\Plugin\search_api\backend\Database->search()

All

Test namePassFailException
LeafDrupal\search_api\Tests\CustomDataTypesUnitTest1800
LeafDrupal\search_api\Tests\IndexStorageUnitTest500
LeafDrupal\search_api\Tests\IntegrationTest22700
LeafDrupal\search_api\Tests\LanguageIntegrationUnitTest3500
LeafDrupal\search_api\Tests\LocalActionsWebTest1500
LeafDrupal\search_api\Tests\OverviewPageTest12100
ExpandDrupal\search_api\Tests\Processor\ContentAccessTest68016
MessageGroupFilenameLineFunctionStatus
Undefined index: typeDrupal\search_api_db\Plugin\search_api\backend\Database->fieldsUpdated(Object) Drupal\search_api_db\Plugin\search_api\backend\Database->addIndex(Object) Drupal\search_api\Task\ServerTaskManager->execute(Object) Drupal\search_api\Entity\Server->indexItems(Object, Array) Drupal\search_api\Entity\Index->indexItems(Array) Drupal\search_api\Entity\Index->trackItemsInsertedOrUpdated('entity:user', Array, 'trackItemsInserted') Drupal\search_api\Entity\Index->trackItemsInserted('entity:user', Array) Drupal\search_api\Entity\Index->reactToDatasourceSwitch(Object) Drupal\search_api\Entity\Index->postSave(Object, 1) Drupal\Core\Entity\EntityStorageBase->doPostSave(Object, 1) Drupal\Core\Entity\EntityStorageBase->save(Object) Drupal\Core\Config\Entity\ConfigEntityStorage->save(Object) Drupal\Core\Entity\Entity->save() Drupal\Core\Config\Entity\ConfigEntityBase->save() Drupal\search_api\Tests\Processor\ContentAccessTest->setUp() Drupal\simpletest\TestBase->run(Array) simpletest_script_run_one_test('5', 'Drupal\search_api\Tests\Processor\ContentAccessTest') NoticeDatabase.php660Drupal\search_api_db\Plugin\search_api\backend\Database->fieldsUpdated()
Undefined index: typeDrupal\search_api_db\Plugin\search_api\backend\Database->fieldsUpdated(Object) Drupal\search_api_db\Plugin\search_api\backend\Database->addIndex(Object) Drupal\search_api\Task\ServerTaskManager->execute(Object) Drupal\search_api\Entity\Server->indexItems(Object, Array) Drupal\search_api\Entity\Index->indexItems(Array) Drupal\search_api\Entity\Index->trackItemsInsertedOrUpdated('entity:user', Array, 'trackItemsInserted') Drupal\search_api\Entity\Index->trackItemsInserted('entity:user', Array) Drupal\search_api\Entity\Index->reactToDatasourceSwitch(Object) Drupal\search_api\Entity\Index->postSave(Object, 1) Drupal\Core\Entity\EntityStorageBase->doPostSave(Object, 1) Drupal\Core\Entity\EntityStorageBase->save(Object) Drupal\Core\Config\Entity\ConfigEntityStorage->save(Object) Drupal\Core\Entity\Entity->save() Drupal\Core\Config\Entity\ConfigEntityBase->save() Drupal\search_api\Tests\Processor\ContentAccessTest->setUp() Drupal\simpletest\TestBase->run(Array) simpletest_script_run_one_test('5', 'Drupal\search_api\Tests\Processor\ContentAccessTest') NoticeDatabase.php672Drupal\search_api_db\Plugin\search_api\backend\Database->fieldsUpdated()
Drupal\search_api\SearchApiException: Unknown field in filter clause: entity:comment/status. in Drupal\search_api_db\Plugin\search_api\backend\Database->createFilterCondition() (line 1780 of /var/lib/drupaltestbot/sites/default/files/checkout/sites/default/modules/search_api/search_api_db/src/Plugin/search_api/backend/Database.php). Drupal\search_api_db\Plugin\search_api\backend\Database->createFilterCondition(Object, Array, Object, Object) Drupal\search_api_db\Plugin\search_api\backend\Database->createFilterCondition(Object, Array, Object, Object) Drupal\search_api_db\Plugin\search_api\backend\Database->createFilterCondition(Object, Array, Object, Object) Drupal\search_api_db\Plugin\search_api\backend\Database->createFilterCondition(Object, Array, Object, Object) Drupal\search_api_db\Plugin\search_api\backend\Database->createDbQuery(Object, Array) Drupal\search_api_db\Plugin\search_api\backend\Database->search(Object) Drupal\search_api\Entity\Server->search(Object) Drupal\search_api\Query\Query->execute() Drupal\search_api\Tests\Processor\ContentAccessTest->testQueryAccessAll() Drupal\simpletest\TestBase->run(Array) simpletest_script_run_one_test('5', 'Drupal\search_api\Tests\Processor\ContentAccessTest') Uncaught exceptionDatabase.php1780Drupal\search_api_db\Plugin\search_api\backend\Database->createFilterCondition()
Undefined index: typeDrupal\search_api_db\Plugin\search_api\backend\Database->fieldsUpdated(Object) Drupal\search_api_db\Plugin\search_api\backend\Database->addIndex(Object) Drupal\search_api\Task\ServerTaskManager->execute(Object) Drupal\search_api\Entity\Server->indexItems(Object, Array) Drupal\search_api\Entity\Index->indexItems(Array) Drupal\search_api\Entity\Index->trackItemsInsertedOrUpdated('entity:user', Array, 'trackItemsInserted') Drupal\search_api\Entity\Index->trackItemsInserted('entity:user', Array) Drupal\search_api\Entity\Index->reactToDatasourceSwitch(Object) Drupal\search_api\Entity\Index->postSave(Object, 1) Drupal\Core\Entity\EntityStorageBase->doPostSave(Object, 1) Drupal\Core\Entity\EntityStorageBase->save(Object) Drupal\Core\Config\Entity\ConfigEntityStorage->save(Object) Drupal\Core\Entity\Entity->save() Drupal\Core\Config\Entity\ConfigEntityBase->save() Drupal\search_api\Tests\Processor\ContentAccessTest->setUp() Drupal\simpletest\TestBase->run(Array) simpletest_script_run_one_test('5', 'Drupal\search_api\Tests\Processor\ContentAccessTest') NoticeDatabase.php660Drupal\search_api_db\Plugin\search_api\backend\Database->fieldsUpdated()
Undefined index: typeDrupal\search_api_db\Plugin\search_api\backend\Database->fieldsUpdated(Object) Drupal\search_api_db\Plugin\search_api\backend\Database->addIndex(Object) Drupal\search_api\Task\ServerTaskManager->execute(Object) Drupal\search_api\Entity\Server->indexItems(Object, Array) Drupal\search_api\Entity\Index->indexItems(Array) Drupal\search_api\Entity\Index->trackItemsInsertedOrUpdated('entity:user', Array, 'trackItemsInserted') Drupal\search_api\Entity\Index->trackItemsInserted('entity:user', Array) Drupal\search_api\Entity\Index->reactToDatasourceSwitch(Object) Drupal\search_api\Entity\Index->postSave(Object, 1) Drupal\Core\Entity\EntityStorageBase->doPostSave(Object, 1) Drupal\Core\Entity\EntityStorageBase->save(Object) Drupal\Core\Config\Entity\ConfigEntityStorage->save(Object) Drupal\Core\Entity\Entity->save() Drupal\Core\Config\Entity\ConfigEntityBase->save() Drupal\search_api\Tests\Processor\ContentAccessTest->setUp() Drupal\simpletest\TestBase->run(Array) simpletest_script_run_one_test('5', 'Drupal\search_api\Tests\Processor\ContentAccessTest') NoticeDatabase.php672Drupal\search_api_db\Plugin\search_api\backend\Database->fieldsUpdated()
Drupal\search_api\SearchApiException: Unknown field in filter clause: entity:comment/status. in Drupal\search_api_db\Plugin\search_api\backend\Database->createFilterCondition() (line 1780 of /var/lib/drupaltestbot/sites/default/files/checkout/sites/default/modules/search_api/search_api_db/src/Plugin/search_api/backend/Database.php). Drupal\search_api_db\Plugin\search_api\backend\Database->createFilterCondition(Object, Array, Object, Object) Drupal\search_api_db\Plugin\search_api\backend\Database->createFilterCondition(Object, Array, Object, Object) Drupal\search_api_db\Plugin\search_api\backend\Database->createFilterCondition(Object, Array, Object, Object) Drupal\search_api_db\Plugin\search_api\backend\Database->createFilterCondition(Object, Array, Object, Object) Drupal\search_api_db\Plugin\search_api\backend\Database->createDbQuery(Object, Array) Drupal\search_api_db\Plugin\search_api\backend\Database->search(Object) Drupal\search_api\Entity\Server->search(Object) Drupal\search_api\Query\Query->execute() Drupal\search_api\Tests\Processor\ContentAccessTest->testQueryAccessComments() Drupal\simpletest\TestBase->run(Array) simpletest_script_run_one_test('5', 'Drupal\search_api\Tests\Processor\ContentAccessTest') Uncaught exceptionDatabase.php1780Drupal\search_api_db\Plugin\search_api\backend\Database->createFilterCondition()
Undefined index: typeDrupal\search_api_db\Plugin\search_api\backend\Database->fieldsUpdated(Object) Drupal\search_api_db\Plugin\search_api\backend\Database->addIndex(Object) Drupal\search_api\Task\ServerTaskManager->execute(Object) Drupal\search_api\Entity\Server->indexItems(Object, Array) Drupal\search_api\Entity\Index->indexItems(Array) Drupal\search_api\Entity\Index->trackItemsInsertedOrUpdated('entity:user', Array, 'trackItemsInserted') Drupal\search_api\Entity\Index->trackItemsInserted('entity:user', Array) Drupal\search_api\Entity\Index->reactToDatasourceSwitch(Object) Drupal\search_api\Entity\Index->postSave(Object, 1) Drupal\Core\Entity\EntityStorageBase->doPostSave(Object, 1) Drupal\Core\Entity\EntityStorageBase->save(Object) Drupal\Core\Config\Entity\ConfigEntityStorage->save(Object) Drupal\Core\Entity\Entity->save() Drupal\Core\Config\Entity\ConfigEntityBase->save() Drupal\search_api\Tests\Processor\ContentAccessTest->setUp() Drupal\simpletest\TestBase->run(Array) simpletest_script_run_one_test('5', 'Drupal\search_api\Tests\Processor\ContentAccessTest') NoticeDatabase.php660Drupal\search_api_db\Plugin\search_api\backend\Database->fieldsUpdated()
Undefined index: typeDrupal\search_api_db\Plugin\search_api\backend\Database->fieldsUpdated(Object) Drupal\search_api_db\Plugin\search_api\backend\Database->addIndex(Object) Drupal\search_api\Task\ServerTaskManager->execute(Object) Drupal\search_api\Entity\Server->indexItems(Object, Array) Drupal\search_api\Entity\Index->indexItems(Array) Drupal\search_api\Entity\Index->trackItemsInsertedOrUpdated('entity:user', Array, 'trackItemsInserted') Drupal\search_api\Entity\Index->trackItemsInserted('entity:user', Array) Drupal\search_api\Entity\Index->reactToDatasourceSwitch(Object) Drupal\search_api\Entity\Index->postSave(Object, 1) Drupal\Core\Entity\EntityStorageBase->doPostSave(Object, 1) Drupal\Core\Entity\EntityStorageBase->save(Object) Drupal\Core\Config\Entity\ConfigEntityStorage->save(Object) Drupal\Core\Entity\Entity->save() Drupal\Core\Config\Entity\ConfigEntityBase->save() Drupal\search_api\Tests\Processor\ContentAccessTest->setUp() Drupal\simpletest\TestBase->run(Array) simpletest_script_run_one_test('5', 'Drupal\search_api\Tests\Processor\ContentAccessTest') NoticeDatabase.php672Drupal\search_api_db\Plugin\search_api\backend\Database->fieldsUpdated()
Drupal\search_api\SearchApiException: Unknown field in filter clause: entity:comment/status. in Drupal\search_api_db\Plugin\search_api\backend\Database->createFilterCondition() (line 1780 of /var/lib/drupaltestbot/sites/default/files/checkout/sites/default/modules/search_api/search_api_db/src/Plugin/search_api/backend/Database.php). Drupal\search_api_db\Plugin\search_api\backend\Database->createFilterCondition(Object, Array, Object, Object) Drupal\search_api_db\Plugin\search_api\backend\Database->createFilterCondition(Object, Array, Object, Object) Drupal\search_api_db\Plugin\search_api\backend\Database->createFilterCondition(Object, Array, Object, Object) Drupal\search_api_db\Plugin\search_api\backend\Database->createFilterCondition(Object, Array, Object, Object) Drupal\search_api_db\Plugin\search_api\backend\Database->createDbQuery(Object, Array) Drupal\search_api_db\Plugin\search_api\backend\Database->search(Object) Drupal\search_api\Entity\Server->search(Object) Drupal\search_api\Query\Query->execute() Drupal\search_api\Tests\Processor\ContentAccessTest->testQueryAccessOwn() Drupal\simpletest\TestBase->run(Array) simpletest_script_run_one_test('5', 'Drupal\search_api\Tests\Processor\ContentAccessTest') Uncaught exceptionDatabase.php1780Drupal\search_api_db\Plugin\search_api\backend\Database->createFilterCondition()
Undefined index: typeDrupal\search_api_db\Plugin\search_api\backend\Database->fieldsUpdated(Object) Drupal\search_api_db\Plugin\search_api\backend\Database->addIndex(Object) Drupal\search_api\Task\ServerTaskManager->execute(Object) Drupal\search_api\Entity\Server->indexItems(Object, Array) Drupal\search_api\Entity\Index->indexItems(Array) Drupal\search_api\Entity\Index->trackItemsInsertedOrUpdated('entity:user', Array, 'trackItemsInserted') Drupal\search_api\Entity\Index->trackItemsInserted('entity:user', Array) Drupal\search_api\Entity\Index->reactToDatasourceSwitch(Object) Drupal\search_api\Entity\Index->postSave(Object, 1) Drupal\Core\Entity\EntityStorageBase->doPostSave(Object, 1) Drupal\Core\Entity\EntityStorageBase->save(Object) Drupal\Core\Config\Entity\ConfigEntityStorage->save(Object) Drupal\Core\Entity\Entity->save() Drupal\Core\Config\Entity\ConfigEntityBase->save() Drupal\search_api\Tests\Processor\ContentAccessTest->setUp() Drupal\simpletest\TestBase->run(Array) simpletest_script_run_one_test('5', 'Drupal\search_api\Tests\Processor\ContentAccessTest') NoticeDatabase.php660Drupal\search_api_db\Plugin\search_api\backend\Database->fieldsUpdated()
Undefined index: typeDrupal\search_api_db\Plugin\search_api\backend\Database->fieldsUpdated(Object) Drupal\search_api_db\Plugin\search_api\backend\Database->addIndex(Object) Drupal\search_api\Task\ServerTaskManager->execute(Object) Drupal\search_api\Entity\Server->indexItems(Object, Array) Drupal\search_api\Entity\Index->indexItems(Array) Drupal\search_api\Entity\Index->trackItemsInsertedOrUpdated('entity:user', Array, 'trackItemsInserted') Drupal\search_api\Entity\Index->trackItemsInserted('entity:user', Array) Drupal\search_api\Entity\Index->reactToDatasourceSwitch(Object) Drupal\search_api\Entity\Index->postSave(Object, 1) Drupal\Core\Entity\EntityStorageBase->doPostSave(Object, 1) Drupal\Core\Entity\EntityStorageBase->save(Object) Drupal\Core\Config\Entity\ConfigEntityStorage->save(Object) Drupal\Core\Entity\Entity->save() Drupal\Core\Config\Entity\ConfigEntityBase->save() Drupal\search_api\Tests\Processor\ContentAccessTest->setUp() Drupal\simpletest\TestBase->run(Array) simpletest_script_run_one_test('5', 'Drupal\search_api\Tests\Processor\ContentAccessTest') NoticeDatabase.php672Drupal\search_api_db\Plugin\search_api\backend\Database->fieldsUpdated()
Drupal\search_api\SearchApiException: Unknown field in filter clause: entity:node/status. in Drupal\search_api_db\Plugin\search_api\backend\Database->createFilterCondition() (line 1780 of /var/lib/drupaltestbot/sites/default/files/checkout/sites/default/modules/search_api/search_api_db/src/Plugin/search_api/backend/Database.php). Drupal\search_api_db\Plugin\search_api\backend\Database->createFilterCondition(Object, Array, Object, Object) Drupal\search_api_db\Plugin\search_api\backend\Database->createFilterCondition(Object, Array, Object, Object) Drupal\search_api_db\Plugin\search_api\backend\Database->createFilterCondition(Object, Array, Object, Object) Drupal\search_api_db\Plugin\search_api\backend\Database->createFilterCondition(Object, Array, Object, Object) Drupal\search_api_db\Plugin\search_api\backend\Database->createDbQuery(Object, Array) Drupal\search_api_db\Plugin\search_api\backend\Database->search(Object) Drupal\search_api\Entity\Server->search(Object) Drupal\search_api\Query\Query->execute() Drupal\search_api\Tests\Processor\ContentAccessTest->testQueryAccessWithNodeGrants() Drupal\simpletest\TestBase->run(Array) simpletest_script_run_one_test('5', 'Drupal\search_api\Tests\Processor\ContentAccessTest') Uncaught exceptionDatabase.php1780Drupal\search_api_db\Plugin\search_api\backend\Database->createFilterCondition()
Undefined index: typeDrupal\search_api_db\Plugin\search_api\backend\Database->fieldsUpdated(Object) Drupal\search_api_db\Plugin\search_api\backend\Database->addIndex(Object) Drupal\search_api\Task\ServerTaskManager->execute(Object) Drupal\search_api\Entity\Server->indexItems(Object, Array) Drupal\search_api\Entity\Index->indexItems(Array) Drupal\search_api\Entity\Index->trackItemsInsertedOrUpdated('entity:user', Array, 'trackItemsInserted') Drupal\search_api\Entity\Index->trackItemsInserted('entity:user', Array) Drupal\search_api\Entity\Index->reactToDatasourceSwitch(Object) Drupal\search_api\Entity\Index->postSave(Object, 1) Drupal\Core\Entity\EntityStorageBase->doPostSave(Object, 1) Drupal\Core\Entity\EntityStorageBase->save(Object) Drupal\Core\Config\Entity\ConfigEntityStorage->save(Object) Drupal\Core\Entity\Entity->save() Drupal\Core\Config\Entity\ConfigEntityBase->save() Drupal\search_api\Tests\Processor\ContentAccessTest->setUp() Drupal\simpletest\TestBase->run(Array) simpletest_script_run_one_test('5', 'Drupal\search_api\Tests\Processor\ContentAccessTest') NoticeDatabase.php660Drupal\search_api_db\Plugin\search_api\backend\Database->fieldsUpdated()
Undefined index: typeDrupal\search_api_db\Plugin\search_api\backend\Database->fieldsUpdated(Object) Drupal\search_api_db\Plugin\search_api\backend\Database->addIndex(Object) Drupal\search_api\Task\ServerTaskManager->execute(Object) Drupal\search_api\Entity\Server->indexItems(Object, Array) Drupal\search_api\Entity\Index->indexItems(Array) Drupal\search_api\Entity\Index->trackItemsInsertedOrUpdated('entity:user', Array, 'trackItemsInserted') Drupal\search_api\Entity\Index->trackItemsInserted('entity:user', Array) Drupal\search_api\Entity\Index->reactToDatasourceSwitch(Object) Drupal\search_api\Entity\Index->postSave(Object, 1) Drupal\Core\Entity\EntityStorageBase->doPostSave(Object, 1) Drupal\Core\Entity\EntityStorageBase->save(Object) Drupal\Core\Config\Entity\ConfigEntityStorage->save(Object) Drupal\Core\Entity\Entity->save() Drupal\Core\Config\Entity\ConfigEntityBase->save() Drupal\search_api\Tests\Processor\ContentAccessTest->setUp() Drupal\simpletest\TestBase->run(Array) simpletest_script_run_one_test('5', 'Drupal\search_api\Tests\Processor\ContentAccessTest') NoticeDatabase.php672Drupal\search_api_db\Plugin\search_api\backend\Database->fieldsUpdated()
Undefined index: typeDrupal\search_api_db\Plugin\search_api\backend\Database->fieldsUpdated(Object) Drupal\search_api_db\Plugin\search_api\backend\Database->addIndex(Object) Drupal\search_api\Task\ServerTaskManager->execute(Object) Drupal\search_api\Entity\Server->indexItems(Object, Array) Drupal\search_api\Entity\Index->indexItems(Array) Drupal\search_api\Entity\Index->trackItemsInsertedOrUpdated('entity:user', Array, 'trackItemsInserted') Drupal\search_api\Entity\Index->trackItemsInserted('entity:user', Array) Drupal\search_api\Entity\Index->reactToDatasourceSwitch(Object) Drupal\search_api\Entity\Index->postSave(Object, 1) Drupal\Core\Entity\EntityStorageBase->doPostSave(Object, 1) Drupal\Core\Entity\EntityStorageBase->save(Object) Drupal\Core\Config\Entity\ConfigEntityStorage->save(Object) Drupal\Core\Entity\Entity->save() Drupal\Core\Config\Entity\ConfigEntityBase->save() Drupal\search_api\Tests\Processor\ContentAccessTest->setUp() Drupal\simpletest\TestBase->run(Array) simpletest_script_run_one_test('5', 'Drupal\search_api\Tests\Processor\ContentAccessTest') NoticeDatabase.php660Drupal\search_api_db\Plugin\search_api\backend\Database->fieldsUpdated()
Undefined index: typeDrupal\search_api_db\Plugin\search_api\backend\Database->fieldsUpdated(Object) Drupal\search_api_db\Plugin\search_api\backend\Database->addIndex(Object) Drupal\search_api\Task\ServerTaskManager->execute(Object) Drupal\search_api\Entity\Server->indexItems(Object, Array) Drupal\search_api\Entity\Index->indexItems(Array) Drupal\search_api\Entity\Index->trackItemsInsertedOrUpdated('entity:user', Array, 'trackItemsInserted') Drupal\search_api\Entity\Index->trackItemsInserted('entity:user', Array) Drupal\search_api\Entity\Index->reactToDatasourceSwitch(Object) Drupal\search_api\Entity\Index->postSave(Object, 1) Drupal\Core\Entity\EntityStorageBase->doPostSave(Object, 1) Drupal\Core\Entity\EntityStorageBase->save(Object) Drupal\Core\Config\Entity\ConfigEntityStorage->save(Object) Drupal\Core\Entity\Entity->save() Drupal\Core\Config\Entity\ConfigEntityBase->save() Drupal\search_api\Tests\Processor\ContentAccessTest->setUp() Drupal\simpletest\TestBase->run(Array) simpletest_script_run_one_test('5', 'Drupal\search_api\Tests\Processor\ContentAccessTest') NoticeDatabase.php672Drupal\search_api_db\Plugin\search_api\backend\Database->fieldsUpdated()
LeafDrupal\search_api\Tests\Processor\ProcessorIntegrationTest7300
LeafDrupal\search_api\Tests\Processor\RenderedItemTest4200
LeafDrupal\search_api\Tests\ServerStorageUnitTest600
LeafDrupal\search_api\Tests\ServerTaskUnitTest5900
ExpandDrupal\search_api\Tests\ViewsTest1990
MessageGroupFilenameLineFunctionStatus
5 items were indexed.OtherViewsTest.php47Drupal\search_api\Tests\ViewsTest->testFulltextSearch()
The search view displays the correct number of results.OtherViewsTest.php51Drupal\search_api\Tests\ViewsTest->testFulltextSearch()
Entity #1 found in the results.OtherViewsTest.php53Drupal\search_api\Tests\ViewsTest->testFulltextSearch()
Entity #2 found in the results.OtherViewsTest.php53Drupal\search_api\Tests\ViewsTest->testFulltextSearch()
Entity #3 found in the results.OtherViewsTest.php53Drupal\search_api\Tests\ViewsTest->testFulltextSearch()
Entity #4 found in the results.OtherViewsTest.php53Drupal\search_api\Tests\ViewsTest->testFulltextSearch()
Entity #5 found in the results.OtherViewsTest.php53Drupal\search_api\Tests\ViewsTest->testFulltextSearch()
The search view displays the correct number of results.OtherViewsTest.php60Drupal\search_api\Tests\ViewsTest->testFulltextSearch()
Entity #3 found in the results.OtherViewsTest.php63Drupal\search_api\Tests\ViewsTest->testFulltextSearch()
ExpandDrupal\search_api_db\Tests\BackendTest1427
MessageGroupFilenameLineFunctionStatus
Undefined index: index_tablesDrupal\search_api_db\Tests\BackendTest->checkServerTables() Drupal\search_api_db\Tests\BackendTest->testFramework() Drupal\simpletest\TestBase->run(Array) simpletest_script_run_one_test('2', 'Drupal\search_api_db\Tests\BackendTest') NoticeBackendTest.php112Drupal\search_api_db\Tests\BackendTest->checkServerTables()
Undefined index: field_tablesDrupal\search_api_db\Tests\BackendTest->checkServerTables() Drupal\search_api_db\Tests\BackendTest->testFramework() Drupal\simpletest\TestBase->run(Array) simpletest_script_run_one_test('2', 'Drupal\search_api_db\Tests\BackendTest') NoticeBackendTest.php113Drupal\search_api_db\Tests\BackendTest->checkServerTables()
Normalized storage table existsOtherBackendTest.php115Drupal\search_api_db\Tests\BackendTest->checkServerTables()
Invalid argument supplied for foreach()Drupal\search_api_db\Tests\BackendTest->checkServerTables() Drupal\search_api_db\Tests\BackendTest->testFramework() Drupal\simpletest\TestBase->run(Array) simpletest_script_run_one_test('2', 'Drupal\search_api_db\Tests\BackendTest') WarningBackendTest.php116Drupal\search_api_db\Tests\BackendTest->checkServerTables()
Undefined index: field_tablesDrupal\search_api_db\Tests\BackendTest->updateIndex() Drupal\search_api_db\Tests\BackendTest->testFramework() Drupal\simpletest\TestBase->run(Array) simpletest_script_run_one_test('2', 'Drupal\search_api_db\Tests\BackendTest') NoticeBackendTest.php151Drupal\search_api_db\Tests\BackendTest->updateIndex()
array_keys() expects parameter 1 to be array, null givenarray_keys(NULL) Drupal\search_api_db\Tests\BackendTest->updateIndex() Drupal\search_api_db\Tests\BackendTest->testFramework() Drupal\simpletest\TestBase->run(Array) simpletest_script_run_one_test('2', 'Drupal\search_api_db\Tests\BackendTest') WarningBackendTest.php151Drupal\search_api_db\Tests\BackendTest->updateIndex()
sort() expects parameter 1 to be array, null givensort(NULL) Drupal\search_api_db\Tests\BackendTest->updateIndex() Drupal\search_api_db\Tests\BackendTest->testFramework() Drupal\simpletest\TestBase->run(Array) simpletest_script_run_one_test('2', 'Drupal\search_api_db\Tests\BackendTest') WarningBackendTest.php153Drupal\search_api_db\Tests\BackendTest->updateIndex()
Value array ( 0 => 'entity:entity_test/body', 1 => 'entity:entity_test/category', 2 => 'entity:entity_test/id', 3 => 'entity:entity_test/name', 4 => 'entity:entity_test/type', 5 => 'search_api_language', ) is equal to value NULL.OtherBackendTest.php154Drupal\search_api_db\Tests\BackendTest->updateIndex()
Drupal\search_api\SearchApiException: Unknown index database_search_index. in Drupal\search_api_db\Plugin\search_api\backend\Database->search() (line 1281 of /var/lib/drupaltestbot/sites/default/files/checkout/sites/default/modules/search_api/search_api_db/src/Plugin/search_api/backend/Database.php). Drupal\search_api_db\Plugin\search_api\backend\Database->search(Object) Drupal\search_api\Entity\Server->search(Object) Drupal\search_api\Query\Query->execute() Drupal\search_api_db\Tests\BackendTest->searchNoResults() Drupal\search_api_db\Tests\BackendTest->testFramework() Drupal\simpletest\TestBase->run(Array) simpletest_script_run_one_test('2', 'Drupal\search_api_db\Tests\BackendTest') Uncaught exceptionDatabase.php1281Drupal\search_api_db\Plugin\search_api\backend\Database->search()
LeafDrupal\search_api_db_defaults\Tests\IntegrationTest1800
LeafDrupal\Tests\search_api\Unit\Plugin\Processor\AddURLTest200
LeafDrupal\Tests\search_api\Unit\Plugin\Processor\AggregatedFieldTest900
LeafDrupal\Tests\search_api\Unit\Plugin\Processor\FieldsProcessorPluginBaseTest1300
LeafDrupal\Tests\search_api\Unit\Plugin\Processor\HighlightTest1300
LeafDrupal\Tests\search_api\Unit\Plugin\Processor\HtmlFilterTest2500
LeafDrupal\Tests\search_api\Unit\Plugin\Processor\IgnoreCaseTest400
LeafDrupal\Tests\search_api\Unit\Plugin\Processor\IgnoreCharacterTest3900
LeafDrupal\Tests\search_api\Unit\Plugin\Processor\LanguageTest200
LeafDrupal\Tests\search_api\Unit\Plugin\Processor\NodeStatusTest300
LeafDrupal\Tests\search_api\Unit\Plugin\Processor\RoleFilterTest200
LeafDrupal\Tests\search_api\Unit\Plugin\Processor\StopwordsTest800
LeafDrupal\Tests\search_api\Unit\Plugin\Processor\TokenizerTest2200
LeafDrupal\Tests\search_api\Unit\Plugin\Processor\TransliterationTest300