verify_stability_with-2538360-18.patch

Test status
StatusResult
Last receivedTue, 08/04/2015 - 12:43:00
Last requestedTue, 08/04/2015 - 12:43:02
Last testedTue, 08/04/2015 - 12:46:23
Test count1
Environment status
PHP 5.5 MySQLfail
File information
Fileverify_stability_with-2538360-18.patch
BranchTranslation Management Tool - 8.x-1.x
LinkIssue Link
SummaryFAILED: [[SimpleTest]]: [PHP 5.5 MySQL] 2,429 pass(es), 3 fail(s), and 0 exception(s).
Details

PHP 5.5 MySQL

  1. Setup environment
  2. Detect an invalid patch URL
  3. Detect invalid repository information
  4. Detect invalid patch format
  5. Detect a non-applicable patch
  6. Detect invalid PHP syntax
  7. Detect a Drupal installation failure
  8. Detect a test run failure
  9. Detect a failing test
    Review the test failures below then if necessary run them locally until the problem has been fixed.
  10. Complete test suite with all tests passing
2,429 pass(es), 3 fail(s), and 0 exception(s)

Non-pass

Test namePassFailException
ExpandDrupal\tmgmt_content\Tests\ContentEntitySourceUiTest26830
MessageGroupFilenameLineFunctionStatus
"jDkUlCat" foundOtherContentEntitySourceUiTest.php122Drupal\tmgmt_content\Tests\ContentEntitySourceUiTest->testNodeTranslateTabSingleCheckout()
Raw "<div data-drupal-selector="edit-actions" class="form-actions js-form-wrapper form-wrapper" id="edit-actions">" foundOtherContentEntitySourceUiTest.php123Drupal\tmgmt_content\Tests\ContentEntitySourceUiTest->testNodeTranslateTabSingleCheckout()
[04-Aug-2015 12:43:51 UTC] Uncaught PHP Exception Drupal\tmgmt\TMGMTException: "The job has no translator assigned." at /var/lib/drupaltestbot/sites/default/files/checkout/sites/default/modules/tmgmt/src/Entity/Job.php line 408 Fatal errorUnknown0Unknown

All

Test namePassFailException
LeafDrupal\tmgmt\Tests\CrudTest19900
LeafDrupal\tmgmt\Tests\HelperTest4300
LeafDrupal\tmgmt\Tests\LocalTasksTests3100
LeafDrupal\tmgmt\Tests\PluginsTest6500
LeafDrupal\tmgmt\Tests\TMGMTCartTest5200
LeafDrupal\tmgmt\Tests\TMGMTUiTest58300
LeafDrupal\tmgmt\Tests\TranslatorTest4400
LeafDrupal\tmgmt\Tests\TranslatorUITest3000
LeafDrupal\tmgmt_config\Tests\ConfigSourceListTest22000
LeafDrupal\tmgmt_config\Tests\ConfigSourceUiTest23500
LeafDrupal\tmgmt_config\Tests\ConfigSourceUnitTest3900
LeafDrupal\tmgmt_content\Tests\ContentEntitySourceListTest14600
ExpandDrupal\tmgmt_content\Tests\ContentEntitySourceUiTest26830
MessageGroupFilenameLineFunctionStatus
"jDkUlCat" foundOtherContentEntitySourceUiTest.php122Drupal\tmgmt_content\Tests\ContentEntitySourceUiTest->testNodeTranslateTabSingleCheckout()
Raw "<div data-drupal-selector="edit-actions" class="form-actions js-form-wrapper form-wrapper" id="edit-actions">" foundOtherContentEntitySourceUiTest.php123Drupal\tmgmt_content\Tests\ContentEntitySourceUiTest->testNodeTranslateTabSingleCheckout()
[04-Aug-2015 12:43:51 UTC] Uncaught PHP Exception Drupal\tmgmt\TMGMTException: "The job has no translator assigned." at /var/lib/drupaltestbot/sites/default/files/checkout/sites/default/modules/tmgmt/src/Entity/Job.php line 408 Fatal errorUnknown0Unknown
LeafDrupal\tmgmt_content\Tests\ContentEntitySourceUnitTest14600
LeafDrupal\tmgmt_content\Tests\ContentEntitySuggestionsTest2400
LeafDrupal\tmgmt_demo\Tests\TMGMTDemoTest3100
LeafDrupal\tmgmt_file\Tests\FileTranslatorTest16000
LeafDrupal\tmgmt_locale\Tests\LocaleSourceTest6300
LeafDrupal\tmgmt_locale\Tests\LocaleSourceUiTest5000