gateway_plugins-2292319-25.patch

Test status
StatusResult
Last receivedSun, 08/23/2015 - 23:51:00
Last requestedSun, 08/23/2015 - 23:51:01
Last testedSun, 08/23/2015 - 23:51:28
Test count2
Environment status
PHP 5.5 MySQLfail
File information
Filegateway_plugins-2292319-25.patch
BranchSMS Framework - 8.x-1.x
LinkIssue Link
SummaryFAILED: [[SimpleTest]]: [PHP 5.5 MySQL] 0 pass(es), 6 fail(s), and 6 exception(s).
Details

PHP 5.5 MySQL

  1. Setup environment
  2. Detect an invalid patch URL
  3. Detect invalid repository information
  4. Detect invalid patch format
  5. Detect a non-applicable patch
  6. Detect invalid PHP syntax
  7. Detect a Drupal installation failure
  8. Detect a test run failure
  9. Detect a failing test
    Review the test failures below then if necessary run them locally until the problem has been fixed.
  10. Complete test suite with all tests passing
0 pass(es), 6 fail(s), and 6 exception(s)

Non-pass

Test namePassFailException
ExpandDrupal\sms\Tests\SmsFrameworkWebTest011
MessageGroupFilenameLineFunctionStatus
The test did not complete due to a fatal error.Completion checkSmsFrameworkWebTest.php20Drupal\sms\Tests\SmsFrameworkWebTest->testHookGatewayIntegration()
Drupal\Core\Config\Schema\SchemaIncompleteException: Schema errors for sms.gateway.config with the following errors: sms.gateway.config:langcode variable type is string but applied schema class is Drupal\Core\Config\Schema\Mapping in Drupal\Core\Config\Testing\ConfigSchemaChecker->onConfigSave() (line 98 of /var/lib/drupaltestbot/sites/default/files/checkout/core/lib/Drupal/Core/Config/Testing/ConfigSchemaChecker.php). Drupal\Core\Config\Testing\ConfigSchemaChecker->onConfigSave(Object, 'config.save', Object) Drupal\Component\EventDispatcher\ContainerAwareEventDispatcher->dispatch('config.save', Object) Drupal\Core\Config\Config->save(1) Drupal\Core\Config\ConfigInstaller->createConfiguration('', Array) Drupal\Core\Config\ConfigInstaller->installDefaultConfig('module', 'sms') Drupal\Core\ProxyClass\Config\ConfigInstaller->installDefaultConfig('module', 'sms') Drupal\Core\Extension\ModuleInstaller->install(Array, 1) Drupal\Core\ProxyClass\Extension\ModuleInstaller->install(Array, 1) Drupal\simpletest\WebTestBase->installModulesFromClassProperty(Object) Drupal\simpletest\WebTestBase->setUp() Drupal\sms\Tests\SmsFrameworkWebTestBase->setUp() Drupal\simpletest\TestBase->run(Array) simpletest_script_run_one_test('6', 'Drupal\sms\Tests\SmsFrameworkWebTest') Uncaught exceptionConfigSchemaChecker.php98Drupal\Core\Config\Testing\ConfigSchemaChecker->onConfigSave()
ExpandDrupal\sms_blast\Tests\SmsBlastWebTest011
MessageGroupFilenameLineFunctionStatus
The test did not complete due to a fatal error.Completion checkSmsBlastWebTest.php24Drupal\sms_blast\Tests\SmsBlastWebTest->testSendBlast()
Drupal\Core\Config\Schema\SchemaIncompleteException: Schema errors for sms.gateway.config with the following errors: sms.gateway.config:langcode variable type is string but applied schema class is Drupal\Core\Config\Schema\Mapping in Drupal\Core\Config\Testing\ConfigSchemaChecker->onConfigSave() (line 98 of /var/lib/drupaltestbot/sites/default/files/checkout/core/lib/Drupal/Core/Config/Testing/ConfigSchemaChecker.php). Drupal\Core\Config\Testing\ConfigSchemaChecker->onConfigSave(Object, 'config.save', Object) Drupal\Component\EventDispatcher\ContainerAwareEventDispatcher->dispatch('config.save', Object) Drupal\Core\Config\Config->save(1) Drupal\Core\Config\ConfigInstaller->createConfiguration('', Array) Drupal\Core\Config\ConfigInstaller->installDefaultConfig('module', 'sms') Drupal\Core\ProxyClass\Config\ConfigInstaller->installDefaultConfig('module', 'sms') Drupal\Core\Extension\ModuleInstaller->install(Array, 1) Drupal\Core\ProxyClass\Extension\ModuleInstaller->install(Array, 1) Drupal\simpletest\WebTestBase->installModulesFromClassProperty(Object) Drupal\simpletest\WebTestBase->setUp() Drupal\sms\Tests\SmsFrameworkWebTestBase->setUp() Drupal\simpletest\TestBase->run(Array) simpletest_script_run_one_test('5', 'Drupal\sms_blast\Tests\SmsBlastWebTest') Uncaught exceptionConfigSchemaChecker.php98Drupal\Core\Config\Testing\ConfigSchemaChecker->onConfigSave()
ExpandDrupal\sms_devel\Tests\SmsDevelWebTest011
MessageGroupFilenameLineFunctionStatus
The test did not complete due to a fatal error.Completion checkSmsDevelWebTest.php24Drupal\sms_devel\Tests\SmsDevelWebTest->testDevelSendReceiveForm()
Drupal\Core\Config\Schema\SchemaIncompleteException: Schema errors for sms.gateway.config with the following errors: sms.gateway.config:langcode variable type is string but applied schema class is Drupal\Core\Config\Schema\Mapping in Drupal\Core\Config\Testing\ConfigSchemaChecker->onConfigSave() (line 98 of /var/lib/drupaltestbot/sites/default/files/checkout/core/lib/Drupal/Core/Config/Testing/ConfigSchemaChecker.php). Drupal\Core\Config\Testing\ConfigSchemaChecker->onConfigSave(Object, 'config.save', Object) Drupal\Component\EventDispatcher\ContainerAwareEventDispatcher->dispatch('config.save', Object) Drupal\Core\Config\Config->save(1) Drupal\Core\Config\ConfigInstaller->createConfiguration('', Array) Drupal\Core\Config\ConfigInstaller->installDefaultConfig('module', 'sms') Drupal\Core\ProxyClass\Config\ConfigInstaller->installDefaultConfig('module', 'sms') Drupal\Core\Extension\ModuleInstaller->install(Array, 1) Drupal\Core\ProxyClass\Extension\ModuleInstaller->install(Array, 1) Drupal\simpletest\WebTestBase->installModulesFromClassProperty(Object) Drupal\simpletest\WebTestBase->setUp() Drupal\sms\Tests\SmsFrameworkWebTestBase->setUp() Drupal\simpletest\TestBase->run(Array) simpletest_script_run_one_test('1', 'Drupal\sms_devel\Tests\SmsDevelWebTest') Uncaught exceptionConfigSchemaChecker.php98Drupal\Core\Config\Testing\ConfigSchemaChecker->onConfigSave()
ExpandDrupal\sms_track\Tests\SmsTrackArchiveTest011
MessageGroupFilenameLineFunctionStatus
The test did not complete due to a fatal error.Completion checkSmsTrackArchiveTest.php25Drupal\sms_track\Tests\SmsTrackArchiveTest->testArchiveWriteForSentMessages()
Drupal\Core\Config\Schema\SchemaIncompleteException: Schema errors for sms.gateway.config with the following errors: sms.gateway.config:langcode variable type is string but applied schema class is Drupal\Core\Config\Schema\Mapping in Drupal\Core\Config\Testing\ConfigSchemaChecker->onConfigSave() (line 98 of /var/lib/drupaltestbot/sites/default/files/checkout/core/lib/Drupal/Core/Config/Testing/ConfigSchemaChecker.php). Drupal\Core\Config\Testing\ConfigSchemaChecker->onConfigSave(Object, 'config.save', Object) Drupal\Component\EventDispatcher\ContainerAwareEventDispatcher->dispatch('config.save', Object) Drupal\Core\Config\Config->save(1) Drupal\Core\Config\ConfigInstaller->createConfiguration('', Array) Drupal\Core\Config\ConfigInstaller->installDefaultConfig('module', 'sms') Drupal\Core\ProxyClass\Config\ConfigInstaller->installDefaultConfig('module', 'sms') Drupal\Core\Extension\ModuleInstaller->install(Array, 1) Drupal\Core\ProxyClass\Extension\ModuleInstaller->install(Array, 1) Drupal\simpletest\WebTestBase->installModulesFromClassProperty(Object) Drupal\simpletest\WebTestBase->setUp() Drupal\simpletest\TestBase->run(Array) simpletest_script_run_one_test('2', 'Drupal\sms_track\Tests\SmsTrackArchiveTest') Uncaught exceptionConfigSchemaChecker.php98Drupal\Core\Config\Testing\ConfigSchemaChecker->onConfigSave()
ExpandDrupal\sms_user\Tests\SmsUserWebTest011
MessageGroupFilenameLineFunctionStatus
The test did not complete due to a fatal error.Completion checkSmsUserWebTest.php28Drupal\sms_user\Tests\SmsUserWebTest->testNumberConfirmationAndSmsUserSend()
Drupal\Core\Config\Schema\SchemaIncompleteException: Schema errors for sms.gateway.config with the following errors: sms.gateway.config:langcode variable type is string but applied schema class is Drupal\Core\Config\Schema\Mapping in Drupal\Core\Config\Testing\ConfigSchemaChecker->onConfigSave() (line 98 of /var/lib/drupaltestbot/sites/default/files/checkout/core/lib/Drupal/Core/Config/Testing/ConfigSchemaChecker.php). Drupal\Core\Config\Testing\ConfigSchemaChecker->onConfigSave(Object, 'config.save', Object) Drupal\Component\EventDispatcher\ContainerAwareEventDispatcher->dispatch('config.save', Object) Drupal\Core\Config\Config->save(1) Drupal\Core\Config\ConfigInstaller->createConfiguration('', Array) Drupal\Core\Config\ConfigInstaller->installDefaultConfig('module', 'sms') Drupal\Core\ProxyClass\Config\ConfigInstaller->installDefaultConfig('module', 'sms') Drupal\Core\Extension\ModuleInstaller->install(Array, 1) Drupal\Core\ProxyClass\Extension\ModuleInstaller->install(Array, 1) Drupal\simpletest\WebTestBase->installModulesFromClassProperty(Object) Drupal\simpletest\WebTestBase->setUp() Drupal\sms\Tests\SmsFrameworkWebTestBase->setUp() Drupal\simpletest\TestBase->run(Array) simpletest_script_run_one_test('3', 'Drupal\sms_user\Tests\SmsUserWebTest') Uncaught exceptionConfigSchemaChecker.php98Drupal\Core\Config\Testing\ConfigSchemaChecker->onConfigSave()
ExpandDrupal\sms_valid\Tests\SmsValidWebTest011
MessageGroupFilenameLineFunctionStatus
The test did not complete due to a fatal error.Completion checkSmsValidWebTest.php37Drupal\sms_valid\Tests\SmsValidWebTest->testSmsValidValidate()
Drupal\Core\Config\Schema\SchemaIncompleteException: Schema errors for sms.gateway.config with the following errors: sms.gateway.config:langcode variable type is string but applied schema class is Drupal\Core\Config\Schema\Mapping in Drupal\Core\Config\Testing\ConfigSchemaChecker->onConfigSave() (line 98 of /var/lib/drupaltestbot/sites/default/files/checkout/core/lib/Drupal/Core/Config/Testing/ConfigSchemaChecker.php). Drupal\Core\Config\Testing\ConfigSchemaChecker->onConfigSave(Object, 'config.save', Object) Drupal\Component\EventDispatcher\ContainerAwareEventDispatcher->dispatch('config.save', Object) Drupal\Core\Config\Config->save(1) Drupal\Core\Config\ConfigInstaller->createConfiguration('', Array) Drupal\Core\Config\ConfigInstaller->installDefaultConfig('module', 'sms') Drupal\Core\ProxyClass\Config\ConfigInstaller->installDefaultConfig('module', 'sms') Drupal\Core\Extension\ModuleInstaller->install(Array, 1) Drupal\Core\ProxyClass\Extension\ModuleInstaller->install(Array, 1) Drupal\simpletest\WebTestBase->installModulesFromClassProperty(Object) Drupal\simpletest\WebTestBase->setUp() Drupal\sms_valid\Tests\SmsValidWebTest->setUp() Drupal\simpletest\TestBase->run(Array) simpletest_script_run_one_test('4', 'Drupal\sms_valid\Tests\SmsValidWebTest') Uncaught exceptionConfigSchemaChecker.php98Drupal\Core\Config\Testing\ConfigSchemaChecker->onConfigSave()

All

Test namePassFailException
ExpandDrupal\sms\Tests\SmsFrameworkWebTest011
MessageGroupFilenameLineFunctionStatus
The test did not complete due to a fatal error.Completion checkSmsFrameworkWebTest.php20Drupal\sms\Tests\SmsFrameworkWebTest->testHookGatewayIntegration()
Drupal\Core\Config\Schema\SchemaIncompleteException: Schema errors for sms.gateway.config with the following errors: sms.gateway.config:langcode variable type is string but applied schema class is Drupal\Core\Config\Schema\Mapping in Drupal\Core\Config\Testing\ConfigSchemaChecker->onConfigSave() (line 98 of /var/lib/drupaltestbot/sites/default/files/checkout/core/lib/Drupal/Core/Config/Testing/ConfigSchemaChecker.php). Drupal\Core\Config\Testing\ConfigSchemaChecker->onConfigSave(Object, 'config.save', Object) Drupal\Component\EventDispatcher\ContainerAwareEventDispatcher->dispatch('config.save', Object) Drupal\Core\Config\Config->save(1) Drupal\Core\Config\ConfigInstaller->createConfiguration('', Array) Drupal\Core\Config\ConfigInstaller->installDefaultConfig('module', 'sms') Drupal\Core\ProxyClass\Config\ConfigInstaller->installDefaultConfig('module', 'sms') Drupal\Core\Extension\ModuleInstaller->install(Array, 1) Drupal\Core\ProxyClass\Extension\ModuleInstaller->install(Array, 1) Drupal\simpletest\WebTestBase->installModulesFromClassProperty(Object) Drupal\simpletest\WebTestBase->setUp() Drupal\sms\Tests\SmsFrameworkWebTestBase->setUp() Drupal\simpletest\TestBase->run(Array) simpletest_script_run_one_test('6', 'Drupal\sms\Tests\SmsFrameworkWebTest') Uncaught exceptionConfigSchemaChecker.php98Drupal\Core\Config\Testing\ConfigSchemaChecker->onConfigSave()
ExpandDrupal\sms_blast\Tests\SmsBlastWebTest011
MessageGroupFilenameLineFunctionStatus
The test did not complete due to a fatal error.Completion checkSmsBlastWebTest.php24Drupal\sms_blast\Tests\SmsBlastWebTest->testSendBlast()
Drupal\Core\Config\Schema\SchemaIncompleteException: Schema errors for sms.gateway.config with the following errors: sms.gateway.config:langcode variable type is string but applied schema class is Drupal\Core\Config\Schema\Mapping in Drupal\Core\Config\Testing\ConfigSchemaChecker->onConfigSave() (line 98 of /var/lib/drupaltestbot/sites/default/files/checkout/core/lib/Drupal/Core/Config/Testing/ConfigSchemaChecker.php). Drupal\Core\Config\Testing\ConfigSchemaChecker->onConfigSave(Object, 'config.save', Object) Drupal\Component\EventDispatcher\ContainerAwareEventDispatcher->dispatch('config.save', Object) Drupal\Core\Config\Config->save(1) Drupal\Core\Config\ConfigInstaller->createConfiguration('', Array) Drupal\Core\Config\ConfigInstaller->installDefaultConfig('module', 'sms') Drupal\Core\ProxyClass\Config\ConfigInstaller->installDefaultConfig('module', 'sms') Drupal\Core\Extension\ModuleInstaller->install(Array, 1) Drupal\Core\ProxyClass\Extension\ModuleInstaller->install(Array, 1) Drupal\simpletest\WebTestBase->installModulesFromClassProperty(Object) Drupal\simpletest\WebTestBase->setUp() Drupal\sms\Tests\SmsFrameworkWebTestBase->setUp() Drupal\simpletest\TestBase->run(Array) simpletest_script_run_one_test('5', 'Drupal\sms_blast\Tests\SmsBlastWebTest') Uncaught exceptionConfigSchemaChecker.php98Drupal\Core\Config\Testing\ConfigSchemaChecker->onConfigSave()
ExpandDrupal\sms_devel\Tests\SmsDevelWebTest011
MessageGroupFilenameLineFunctionStatus
The test did not complete due to a fatal error.Completion checkSmsDevelWebTest.php24Drupal\sms_devel\Tests\SmsDevelWebTest->testDevelSendReceiveForm()
Drupal\Core\Config\Schema\SchemaIncompleteException: Schema errors for sms.gateway.config with the following errors: sms.gateway.config:langcode variable type is string but applied schema class is Drupal\Core\Config\Schema\Mapping in Drupal\Core\Config\Testing\ConfigSchemaChecker->onConfigSave() (line 98 of /var/lib/drupaltestbot/sites/default/files/checkout/core/lib/Drupal/Core/Config/Testing/ConfigSchemaChecker.php). Drupal\Core\Config\Testing\ConfigSchemaChecker->onConfigSave(Object, 'config.save', Object) Drupal\Component\EventDispatcher\ContainerAwareEventDispatcher->dispatch('config.save', Object) Drupal\Core\Config\Config->save(1) Drupal\Core\Config\ConfigInstaller->createConfiguration('', Array) Drupal\Core\Config\ConfigInstaller->installDefaultConfig('module', 'sms') Drupal\Core\ProxyClass\Config\ConfigInstaller->installDefaultConfig('module', 'sms') Drupal\Core\Extension\ModuleInstaller->install(Array, 1) Drupal\Core\ProxyClass\Extension\ModuleInstaller->install(Array, 1) Drupal\simpletest\WebTestBase->installModulesFromClassProperty(Object) Drupal\simpletest\WebTestBase->setUp() Drupal\sms\Tests\SmsFrameworkWebTestBase->setUp() Drupal\simpletest\TestBase->run(Array) simpletest_script_run_one_test('1', 'Drupal\sms_devel\Tests\SmsDevelWebTest') Uncaught exceptionConfigSchemaChecker.php98Drupal\Core\Config\Testing\ConfigSchemaChecker->onConfigSave()
ExpandDrupal\sms_track\Tests\SmsTrackArchiveTest011
MessageGroupFilenameLineFunctionStatus
The test did not complete due to a fatal error.Completion checkSmsTrackArchiveTest.php25Drupal\sms_track\Tests\SmsTrackArchiveTest->testArchiveWriteForSentMessages()
Drupal\Core\Config\Schema\SchemaIncompleteException: Schema errors for sms.gateway.config with the following errors: sms.gateway.config:langcode variable type is string but applied schema class is Drupal\Core\Config\Schema\Mapping in Drupal\Core\Config\Testing\ConfigSchemaChecker->onConfigSave() (line 98 of /var/lib/drupaltestbot/sites/default/files/checkout/core/lib/Drupal/Core/Config/Testing/ConfigSchemaChecker.php). Drupal\Core\Config\Testing\ConfigSchemaChecker->onConfigSave(Object, 'config.save', Object) Drupal\Component\EventDispatcher\ContainerAwareEventDispatcher->dispatch('config.save', Object) Drupal\Core\Config\Config->save(1) Drupal\Core\Config\ConfigInstaller->createConfiguration('', Array) Drupal\Core\Config\ConfigInstaller->installDefaultConfig('module', 'sms') Drupal\Core\ProxyClass\Config\ConfigInstaller->installDefaultConfig('module', 'sms') Drupal\Core\Extension\ModuleInstaller->install(Array, 1) Drupal\Core\ProxyClass\Extension\ModuleInstaller->install(Array, 1) Drupal\simpletest\WebTestBase->installModulesFromClassProperty(Object) Drupal\simpletest\WebTestBase->setUp() Drupal\simpletest\TestBase->run(Array) simpletest_script_run_one_test('2', 'Drupal\sms_track\Tests\SmsTrackArchiveTest') Uncaught exceptionConfigSchemaChecker.php98Drupal\Core\Config\Testing\ConfigSchemaChecker->onConfigSave()
ExpandDrupal\sms_user\Tests\SmsUserWebTest011
MessageGroupFilenameLineFunctionStatus
The test did not complete due to a fatal error.Completion checkSmsUserWebTest.php28Drupal\sms_user\Tests\SmsUserWebTest->testNumberConfirmationAndSmsUserSend()
Drupal\Core\Config\Schema\SchemaIncompleteException: Schema errors for sms.gateway.config with the following errors: sms.gateway.config:langcode variable type is string but applied schema class is Drupal\Core\Config\Schema\Mapping in Drupal\Core\Config\Testing\ConfigSchemaChecker->onConfigSave() (line 98 of /var/lib/drupaltestbot/sites/default/files/checkout/core/lib/Drupal/Core/Config/Testing/ConfigSchemaChecker.php). Drupal\Core\Config\Testing\ConfigSchemaChecker->onConfigSave(Object, 'config.save', Object) Drupal\Component\EventDispatcher\ContainerAwareEventDispatcher->dispatch('config.save', Object) Drupal\Core\Config\Config->save(1) Drupal\Core\Config\ConfigInstaller->createConfiguration('', Array) Drupal\Core\Config\ConfigInstaller->installDefaultConfig('module', 'sms') Drupal\Core\ProxyClass\Config\ConfigInstaller->installDefaultConfig('module', 'sms') Drupal\Core\Extension\ModuleInstaller->install(Array, 1) Drupal\Core\ProxyClass\Extension\ModuleInstaller->install(Array, 1) Drupal\simpletest\WebTestBase->installModulesFromClassProperty(Object) Drupal\simpletest\WebTestBase->setUp() Drupal\sms\Tests\SmsFrameworkWebTestBase->setUp() Drupal\simpletest\TestBase->run(Array) simpletest_script_run_one_test('3', 'Drupal\sms_user\Tests\SmsUserWebTest') Uncaught exceptionConfigSchemaChecker.php98Drupal\Core\Config\Testing\ConfigSchemaChecker->onConfigSave()
ExpandDrupal\sms_valid\Tests\SmsValidWebTest011
MessageGroupFilenameLineFunctionStatus
The test did not complete due to a fatal error.Completion checkSmsValidWebTest.php37Drupal\sms_valid\Tests\SmsValidWebTest->testSmsValidValidate()
Drupal\Core\Config\Schema\SchemaIncompleteException: Schema errors for sms.gateway.config with the following errors: sms.gateway.config:langcode variable type is string but applied schema class is Drupal\Core\Config\Schema\Mapping in Drupal\Core\Config\Testing\ConfigSchemaChecker->onConfigSave() (line 98 of /var/lib/drupaltestbot/sites/default/files/checkout/core/lib/Drupal/Core/Config/Testing/ConfigSchemaChecker.php). Drupal\Core\Config\Testing\ConfigSchemaChecker->onConfigSave(Object, 'config.save', Object) Drupal\Component\EventDispatcher\ContainerAwareEventDispatcher->dispatch('config.save', Object) Drupal\Core\Config\Config->save(1) Drupal\Core\Config\ConfigInstaller->createConfiguration('', Array) Drupal\Core\Config\ConfigInstaller->installDefaultConfig('module', 'sms') Drupal\Core\ProxyClass\Config\ConfigInstaller->installDefaultConfig('module', 'sms') Drupal\Core\Extension\ModuleInstaller->install(Array, 1) Drupal\Core\ProxyClass\Extension\ModuleInstaller->install(Array, 1) Drupal\simpletest\WebTestBase->installModulesFromClassProperty(Object) Drupal\simpletest\WebTestBase->setUp() Drupal\sms_valid\Tests\SmsValidWebTest->setUp() Drupal\simpletest\TestBase->run(Array) simpletest_script_run_one_test('4', 'Drupal\sms_valid\Tests\SmsValidWebTest') Uncaught exceptionConfigSchemaChecker.php98Drupal\Core\Config\Testing\ConfigSchemaChecker->onConfigSave()