commerce_discount-discount_percentage_maximum_amount-2543242-4.patch

Test status
StatusResult
Last receivedSat, 08/01/2015 - 16:22:01
Last requestedSat, 08/01/2015 - 16:22:02
Last testedSat, 08/01/2015 - 16:26:56
Test count1
Environment status
MySQLfail
File information
Filecommerce_discount-discount_percentage_maximum_amount-2543242-4.patch
BranchCommerce Discount - 7.x-1.x
LinkIssue Link
SummaryFAILED: [[SimpleTest]]: [MySQL] 524 pass(es), 0 fail(s), and 4 exception(s).
Details

MySQL

  1. Setup environment
  2. Detect an invalid patch URL
  3. Detect invalid repository information
  4. Detect invalid patch format
  5. Detect a non-applicable patch
  6. Detect invalid PHP syntax
  7. Detect a Drupal installation failure
  8. Detect a test run failure
  9. Detect a failing test
    Review the test failures below then if necessary run them locally until the problem has been fixed.
  10. Complete test suite with all tests passing
524 pass(es), 0 fail(s), and 4 exception(s)

Non-pass

Test namePassFailException
ExpandDiscounts (CommerceDiscountTest) [Commerce discounts]31802
MessageGroupFilenameLineFunctionStatus
PDOException: SQLSTATE[23000]: Integrity constraint violation: 1048 Column 'commerce_percentage_maximum_currency_code' cannot be null: INSERT INTO {field_data_commerce_percentage_maximum} (entity_type, entity_id, revision_id, bundle, delta, language, commerce_percentage_maximum_amount, commerce_percentage_maximum_currency_code, commerce_percentage_maximum_data) VALUES (:db_insert_placeholder_0, :db_insert_placeholder_1, :db_insert_placeholder_2, :db_insert_placeholder_3, :db_insert_placeholder_4, :db_insert_placeholder_5, :db_insert_placeholder_6, :db_insert_placeholder_7, :db_insert_placeholder_8); Array ( [:db_insert_placeholder_0] => commerce_discount_offer [:db_insert_placeholder_1] => 1 [:db_insert_placeholder_2] => 1 [:db_insert_placeholder_3] => percentage [:db_insert_placeholder_4] => 0 [:db_insert_placeholder_5] => und [:db_insert_placeholder_6] => 0 [:db_insert_placeholder_7] => [:db_insert_placeholder_8] => ) in field_sql_storage_field_storage_write() (line 514 of /var/lib/drupaltestbot/sites/default/files/checkout/modules/field/modules/field_sql_storage/field_sql_storage.module).Uncaught exceptiondatabase.inc2171PDOStatement->execute()
PDOException: SQLSTATE[23000]: Integrity constraint violation: 1048 Column 'commerce_percentage_maximum_currency_code' cannot be null: INSERT INTO {field_data_commerce_percentage_maximum} (entity_type, entity_id, revision_id, bundle, delta, language, commerce_percentage_maximum_amount, commerce_percentage_maximum_currency_code, commerce_percentage_maximum_data) VALUES (:db_insert_placeholder_0, :db_insert_placeholder_1, :db_insert_placeholder_2, :db_insert_placeholder_3, :db_insert_placeholder_4, :db_insert_placeholder_5, :db_insert_placeholder_6, :db_insert_placeholder_7, :db_insert_placeholder_8); Array ( [:db_insert_placeholder_0] => commerce_discount_offer [:db_insert_placeholder_1] => 1 [:db_insert_placeholder_2] => 1 [:db_insert_placeholder_3] => percentage [:db_insert_placeholder_4] => 0 [:db_insert_placeholder_5] => und [:db_insert_placeholder_6] => 0 [:db_insert_placeholder_7] => [:db_insert_placeholder_8] => ) in field_sql_storage_field_storage_write() (line 514 of /var/lib/drupaltestbot/sites/default/files/checkout/modules/field/modules/field_sql_storage/field_sql_storage.module).Uncaught exceptiondatabase.inc2171PDOStatement->execute()
ExpandDiscounts usage (CommerceDiscountUsageTest) [Commerce discounts]11202
MessageGroupFilenameLineFunctionStatus
PDOException: SQLSTATE[23000]: Integrity constraint violation: 1048 Column 'commerce_percentage_maximum_currency_code' cannot be null: INSERT INTO {field_data_commerce_percentage_maximum} (entity_type, entity_id, revision_id, bundle, delta, language, commerce_percentage_maximum_amount, commerce_percentage_maximum_currency_code, commerce_percentage_maximum_data) VALUES (:db_insert_placeholder_0, :db_insert_placeholder_1, :db_insert_placeholder_2, :db_insert_placeholder_3, :db_insert_placeholder_4, :db_insert_placeholder_5, :db_insert_placeholder_6, :db_insert_placeholder_7, :db_insert_placeholder_8); Array ( [:db_insert_placeholder_0] => commerce_discount_offer [:db_insert_placeholder_1] => 1 [:db_insert_placeholder_2] => 1 [:db_insert_placeholder_3] => percentage [:db_insert_placeholder_4] => 0 [:db_insert_placeholder_5] => und [:db_insert_placeholder_6] => 0 [:db_insert_placeholder_7] => [:db_insert_placeholder_8] => ) in field_sql_storage_field_storage_write() (line 514 of /var/lib/drupaltestbot/sites/default/files/checkout/modules/field/modules/field_sql_storage/field_sql_storage.module).Uncaught exceptiondatabase.inc2171PDOStatement->execute()
PDOException: SQLSTATE[23000]: Integrity constraint violation: 1048 Column 'commerce_percentage_maximum_currency_code' cannot be null: INSERT INTO {field_data_commerce_percentage_maximum} (entity_type, entity_id, revision_id, bundle, delta, language, commerce_percentage_maximum_amount, commerce_percentage_maximum_currency_code, commerce_percentage_maximum_data) VALUES (:db_insert_placeholder_0, :db_insert_placeholder_1, :db_insert_placeholder_2, :db_insert_placeholder_3, :db_insert_placeholder_4, :db_insert_placeholder_5, :db_insert_placeholder_6, :db_insert_placeholder_7, :db_insert_placeholder_8); Array ( [:db_insert_placeholder_0] => commerce_discount_offer [:db_insert_placeholder_1] => 1 [:db_insert_placeholder_2] => 1 [:db_insert_placeholder_3] => percentage [:db_insert_placeholder_4] => 0 [:db_insert_placeholder_5] => und [:db_insert_placeholder_6] => 0 [:db_insert_placeholder_7] => [:db_insert_placeholder_8] => ) in field_sql_storage_field_storage_write() (line 514 of /var/lib/drupaltestbot/sites/default/files/checkout/modules/field/modules/field_sql_storage/field_sql_storage.module).Uncaught exceptiondatabase.inc2171PDOStatement->execute()

All

Test namePassFailException
ExpandDiscounts (CommerceDiscountTest) [Commerce discounts]31802
MessageGroupFilenameLineFunctionStatus
PDOException: SQLSTATE[23000]: Integrity constraint violation: 1048 Column 'commerce_percentage_maximum_currency_code' cannot be null: INSERT INTO {field_data_commerce_percentage_maximum} (entity_type, entity_id, revision_id, bundle, delta, language, commerce_percentage_maximum_amount, commerce_percentage_maximum_currency_code, commerce_percentage_maximum_data) VALUES (:db_insert_placeholder_0, :db_insert_placeholder_1, :db_insert_placeholder_2, :db_insert_placeholder_3, :db_insert_placeholder_4, :db_insert_placeholder_5, :db_insert_placeholder_6, :db_insert_placeholder_7, :db_insert_placeholder_8); Array ( [:db_insert_placeholder_0] => commerce_discount_offer [:db_insert_placeholder_1] => 1 [:db_insert_placeholder_2] => 1 [:db_insert_placeholder_3] => percentage [:db_insert_placeholder_4] => 0 [:db_insert_placeholder_5] => und [:db_insert_placeholder_6] => 0 [:db_insert_placeholder_7] => [:db_insert_placeholder_8] => ) in field_sql_storage_field_storage_write() (line 514 of /var/lib/drupaltestbot/sites/default/files/checkout/modules/field/modules/field_sql_storage/field_sql_storage.module).Uncaught exceptiondatabase.inc2171PDOStatement->execute()
PDOException: SQLSTATE[23000]: Integrity constraint violation: 1048 Column 'commerce_percentage_maximum_currency_code' cannot be null: INSERT INTO {field_data_commerce_percentage_maximum} (entity_type, entity_id, revision_id, bundle, delta, language, commerce_percentage_maximum_amount, commerce_percentage_maximum_currency_code, commerce_percentage_maximum_data) VALUES (:db_insert_placeholder_0, :db_insert_placeholder_1, :db_insert_placeholder_2, :db_insert_placeholder_3, :db_insert_placeholder_4, :db_insert_placeholder_5, :db_insert_placeholder_6, :db_insert_placeholder_7, :db_insert_placeholder_8); Array ( [:db_insert_placeholder_0] => commerce_discount_offer [:db_insert_placeholder_1] => 1 [:db_insert_placeholder_2] => 1 [:db_insert_placeholder_3] => percentage [:db_insert_placeholder_4] => 0 [:db_insert_placeholder_5] => und [:db_insert_placeholder_6] => 0 [:db_insert_placeholder_7] => [:db_insert_placeholder_8] => ) in field_sql_storage_field_storage_write() (line 514 of /var/lib/drupaltestbot/sites/default/files/checkout/modules/field/modules/field_sql_storage/field_sql_storage.module).Uncaught exceptiondatabase.inc2171PDOStatement->execute()
LeafDiscounts date (CommerceDiscountDateTest) [Commerce discounts]9400
ExpandDiscounts usage (CommerceDiscountUsageTest) [Commerce discounts]11202
MessageGroupFilenameLineFunctionStatus
PDOException: SQLSTATE[23000]: Integrity constraint violation: 1048 Column 'commerce_percentage_maximum_currency_code' cannot be null: INSERT INTO {field_data_commerce_percentage_maximum} (entity_type, entity_id, revision_id, bundle, delta, language, commerce_percentage_maximum_amount, commerce_percentage_maximum_currency_code, commerce_percentage_maximum_data) VALUES (:db_insert_placeholder_0, :db_insert_placeholder_1, :db_insert_placeholder_2, :db_insert_placeholder_3, :db_insert_placeholder_4, :db_insert_placeholder_5, :db_insert_placeholder_6, :db_insert_placeholder_7, :db_insert_placeholder_8); Array ( [:db_insert_placeholder_0] => commerce_discount_offer [:db_insert_placeholder_1] => 1 [:db_insert_placeholder_2] => 1 [:db_insert_placeholder_3] => percentage [:db_insert_placeholder_4] => 0 [:db_insert_placeholder_5] => und [:db_insert_placeholder_6] => 0 [:db_insert_placeholder_7] => [:db_insert_placeholder_8] => ) in field_sql_storage_field_storage_write() (line 514 of /var/lib/drupaltestbot/sites/default/files/checkout/modules/field/modules/field_sql_storage/field_sql_storage.module).Uncaught exceptiondatabase.inc2171PDOStatement->execute()
PDOException: SQLSTATE[23000]: Integrity constraint violation: 1048 Column 'commerce_percentage_maximum_currency_code' cannot be null: INSERT INTO {field_data_commerce_percentage_maximum} (entity_type, entity_id, revision_id, bundle, delta, language, commerce_percentage_maximum_amount, commerce_percentage_maximum_currency_code, commerce_percentage_maximum_data) VALUES (:db_insert_placeholder_0, :db_insert_placeholder_1, :db_insert_placeholder_2, :db_insert_placeholder_3, :db_insert_placeholder_4, :db_insert_placeholder_5, :db_insert_placeholder_6, :db_insert_placeholder_7, :db_insert_placeholder_8); Array ( [:db_insert_placeholder_0] => commerce_discount_offer [:db_insert_placeholder_1] => 1 [:db_insert_placeholder_2] => 1 [:db_insert_placeholder_3] => percentage [:db_insert_placeholder_4] => 0 [:db_insert_placeholder_5] => und [:db_insert_placeholder_6] => 0 [:db_insert_placeholder_7] => [:db_insert_placeholder_8] => ) in field_sql_storage_field_storage_write() (line 514 of /var/lib/drupaltestbot/sites/default/files/checkout/modules/field/modules/field_sql_storage/field_sql_storage.module).Uncaught exceptiondatabase.inc2171PDOStatement->execute()