gateway_plugins-2292319-20.patch

Test status
StatusResult
Last receivedThu, 07/30/2015 - 14:42:00
Last requestedThu, 07/30/2015 - 14:42:01
Last testedThu, 07/30/2015 - 14:42:59
Test count1
Environment status
PHP 5.5 MySQLfail
File information
Filegateway_plugins-2292319-20.patch
BranchSMS Framework - 8.x-1.x
LinkIssue Link
SummaryFAILED: [[SimpleTest]]: [PHP 5.5 MySQL] 354 pass(es), 23 fail(s), and 4 exception(s).
Details

PHP 5.5 MySQL

  1. Setup environment
  2. Detect an invalid patch URL
  3. Detect invalid repository information
  4. Detect invalid patch format
  5. Detect a non-applicable patch
  6. Detect invalid PHP syntax
  7. Detect a Drupal installation failure
  8. Detect a test run failure
  9. Detect a failing test
    Review the test failures below then if necessary run them locally until the problem has been fixed.
  10. Complete test suite with all tests passing
354 pass(es), 23 fail(s), and 4 exception(s)

Non-pass

Test namePassFailException
ExpandDrupal\sms\Tests\SmsFrameworkWebTest5992
MessageGroupFilenameLineFunctionStatus
HTTP response expected 200, actual 500BrowserSmsFrameworkWebTest.php43Drupal\sms\Tests\SmsFrameworkWebTest->testDefaultGateway()
Failed to set field default to testOtherSmsFrameworkWebTest.php48Drupal\sms\Tests\SmsFrameworkWebTest->testDefaultGateway()
Found the Save settings buttonOtherSmsFrameworkWebTest.php48Drupal\sms\Tests\SmsFrameworkWebTest->testDefaultGateway()
Found the requested form fields at admin/config/smsframework/gatewaysOtherSmsFrameworkWebTest.php48Drupal\sms\Tests\SmsFrameworkWebTest->testDefaultGateway()
HTTP response expected 200, actual 500BrowserSmsFrameworkWebTest.php49Drupal\sms\Tests\SmsFrameworkWebTest->testDefaultGateway()
InvalidArgumentException: Gateway test configured without a plugin id. in Drupal\sms\Gateway\GatewayManager->buildGateways() (line 199 of /var/lib/drupaltestbot/sites/default/files/checkout/sites/default/modules/smsframework/src/Gateway/GatewayManager.php). Drupal\sms\Gateway\GatewayManager->buildGateways() Drupal\sms\Gateway\GatewayManager->getAvailableGateways() Drupal\sms\Gateway\GatewayManager->getGateway('log') Drupal\sms\Gateway\GatewayManager->getDefaultGateway() sms_default_gateway() Drupal\sms\Tests\SmsFrameworkWebTest->testDefaultGateway() Drupal\simpletest\TestBase->run(Array) simpletest_script_run_one_test('6', 'Drupal\sms\Tests\SmsFrameworkWebTest') Uncaught exceptionGatewayManager.php199Drupal\sms\Gateway\GatewayManager->buildGateways()
[30-Jul-2015 14:42:32 UTC] Uncaught PHP Exception InvalidArgumentException: "Gateway test configured without a plugin id." at /var/lib/drupaltestbot/sites/default/files/checkout/sites/default/modules/smsframework/src/Gateway/GatewayManager.php line 199 Fatal errorUnknown0Unknown
[30-Jul-2015 14:42:32 UTC] Uncaught PHP Exception InvalidArgumentException: "Gateway test configured without a plugin id." at /var/lib/drupaltestbot/sites/default/files/checkout/sites/default/modules/smsframework/src/Gateway/GatewayManager.php line 199 Fatal errorUnknown0Unknown
HTTP response expected 200, actual 500BrowserSmsFrameworkWebTest.php68Drupal\sms\Tests\SmsFrameworkWebTest->testGatewayConfiguration()
InvalidArgumentException: Gateway test configured without a plugin id. in Drupal\sms\Gateway\GatewayManager->buildGateways() (line 199 of /var/lib/drupaltestbot/sites/default/files/checkout/sites/default/modules/smsframework/src/Gateway/GatewayManager.php). Drupal\sms\Gateway\GatewayManager->buildGateways() Drupal\sms\Gateway\GatewayManager->getAvailableGateways() Drupal\sms\Gateway\GatewayManager->getGateway('test') sms_gateways('gateway', 'test') Drupal\sms\Tests\SmsFrameworkWebTest->testGatewayConfiguration() Drupal\simpletest\TestBase->run(Array) simpletest_script_run_one_test('6', 'Drupal\sms\Tests\SmsFrameworkWebTest') Uncaught exceptionGatewayManager.php199Drupal\sms\Gateway\GatewayManager->buildGateways()
[30-Jul-2015 14:42:39 UTC] Uncaught PHP Exception InvalidArgumentException: "Gateway test configured without a plugin id." at /var/lib/drupaltestbot/sites/default/files/checkout/sites/default/modules/smsframework/src/Gateway/GatewayManager.php line 199 Fatal errorUnknown0Unknown
ExpandDrupal\sms_user\Tests\SmsUserWebTest15142
MessageGroupFilenameLineFunctionStatus
The test did not complete due to a fatal error.Completion checkSmsUserWebTest.php28Drupal\sms_user\Tests\SmsUserWebTest->testNumberConfirmationAndSmsUserSend()
Failed to set field number to 1234567890OtherSmsUserWebTest.php39Drupal\sms_user\Tests\SmsUserWebTest->testNumberConfirmationAndSmsUserSend()
Found the Confirm number buttonOtherSmsUserWebTest.php39Drupal\sms_user\Tests\SmsUserWebTest->testNumberConfirmationAndSmsUserSend()
Found the requested form fields at user/2/mobileOtherSmsUserWebTest.php39Drupal\sms_user\Tests\SmsUserWebTest->testNumberConfirmationAndSmsUserSend()
HTTP response expected 200, actual 500BrowserSmsUserWebTest.php40Drupal\sms_user\Tests\SmsUserWebTest->testNumberConfirmationAndSmsUserSend()
Undefined index: messageDrupal\sms_user\Tests\SmsUserWebTest->testNumberConfirmationAndSmsUserSend() Drupal\simpletest\TestBase->run(Array) simpletest_script_run_one_test('3', 'Drupal\sms_user\Tests\SmsUserWebTest') NoticeSmsUserWebTest.php47Drupal\sms_user\Tests\SmsUserWebTest->testNumberConfirmationAndSmsUserSend()
Undefined offset: 1Drupal\sms_user\Tests\SmsUserWebTest->testNumberConfirmationAndSmsUserSend() Drupal\simpletest\TestBase->run(Array) simpletest_script_run_one_test('3', 'Drupal\sms_user\Tests\SmsUserWebTest') NoticeSmsUserWebTest.php48Drupal\sms_user\Tests\SmsUserWebTest->testNumberConfirmationAndSmsUserSend()
Failed to set field confirm_code to OtherSmsUserWebTest.php50Drupal\sms_user\Tests\SmsUserWebTest->testNumberConfirmationAndSmsUserSend()
Found the Confirm number buttonOtherSmsUserWebTest.php50Drupal\sms_user\Tests\SmsUserWebTest->testNumberConfirmationAndSmsUserSend()
Found the requested form fields at user/2/mobileOtherSmsUserWebTest.php50Drupal\sms_user\Tests\SmsUserWebTest->testNumberConfirmationAndSmsUserSend()
HTTP response expected 200, actual 500BrowserSmsUserWebTest.php51Drupal\sms_user\Tests\SmsUserWebTest->testNumberConfirmationAndSmsUserSend()
Successfully confirmed user phone number 1234567890OtherSmsUserWebTest.php54Drupal\sms_user\Tests\SmsUserWebTest->testNumberConfirmationAndSmsUserSend()
SMS User opt out settings available after number confirmed.OtherSmsUserWebTest.php56Drupal\sms_user\Tests\SmsUserWebTest->testNumberConfirmationAndSmsUserSend()
SMS User sleep enable settings available after number confirmed.OtherSmsUserWebTest.php57Drupal\sms_user\Tests\SmsUserWebTest->testNumberConfirmationAndSmsUserSend()
Successfully sent message to user with permissionOtherSmsUserWebTest.php61Drupal\sms_user\Tests\SmsUserWebTest->testNumberConfirmationAndSmsUserSend()
Message sent through the correct gateway.OtherSmsUserWebTest.php63Drupal\sms_user\Tests\SmsUserWebTest->testNumberConfirmationAndSmsUserSend()

All

Test namePassFailException
ExpandDrupal\sms\Tests\SmsFrameworkWebTest5992
MessageGroupFilenameLineFunctionStatus
HTTP response expected 200, actual 500BrowserSmsFrameworkWebTest.php43Drupal\sms\Tests\SmsFrameworkWebTest->testDefaultGateway()
Failed to set field default to testOtherSmsFrameworkWebTest.php48Drupal\sms\Tests\SmsFrameworkWebTest->testDefaultGateway()
Found the Save settings buttonOtherSmsFrameworkWebTest.php48Drupal\sms\Tests\SmsFrameworkWebTest->testDefaultGateway()
Found the requested form fields at admin/config/smsframework/gatewaysOtherSmsFrameworkWebTest.php48Drupal\sms\Tests\SmsFrameworkWebTest->testDefaultGateway()
HTTP response expected 200, actual 500BrowserSmsFrameworkWebTest.php49Drupal\sms\Tests\SmsFrameworkWebTest->testDefaultGateway()
InvalidArgumentException: Gateway test configured without a plugin id. in Drupal\sms\Gateway\GatewayManager->buildGateways() (line 199 of /var/lib/drupaltestbot/sites/default/files/checkout/sites/default/modules/smsframework/src/Gateway/GatewayManager.php). Drupal\sms\Gateway\GatewayManager->buildGateways() Drupal\sms\Gateway\GatewayManager->getAvailableGateways() Drupal\sms\Gateway\GatewayManager->getGateway('log') Drupal\sms\Gateway\GatewayManager->getDefaultGateway() sms_default_gateway() Drupal\sms\Tests\SmsFrameworkWebTest->testDefaultGateway() Drupal\simpletest\TestBase->run(Array) simpletest_script_run_one_test('6', 'Drupal\sms\Tests\SmsFrameworkWebTest') Uncaught exceptionGatewayManager.php199Drupal\sms\Gateway\GatewayManager->buildGateways()
[30-Jul-2015 14:42:32 UTC] Uncaught PHP Exception InvalidArgumentException: "Gateway test configured without a plugin id." at /var/lib/drupaltestbot/sites/default/files/checkout/sites/default/modules/smsframework/src/Gateway/GatewayManager.php line 199 Fatal errorUnknown0Unknown
[30-Jul-2015 14:42:32 UTC] Uncaught PHP Exception InvalidArgumentException: "Gateway test configured without a plugin id." at /var/lib/drupaltestbot/sites/default/files/checkout/sites/default/modules/smsframework/src/Gateway/GatewayManager.php line 199 Fatal errorUnknown0Unknown
HTTP response expected 200, actual 500BrowserSmsFrameworkWebTest.php68Drupal\sms\Tests\SmsFrameworkWebTest->testGatewayConfiguration()
InvalidArgumentException: Gateway test configured without a plugin id. in Drupal\sms\Gateway\GatewayManager->buildGateways() (line 199 of /var/lib/drupaltestbot/sites/default/files/checkout/sites/default/modules/smsframework/src/Gateway/GatewayManager.php). Drupal\sms\Gateway\GatewayManager->buildGateways() Drupal\sms\Gateway\GatewayManager->getAvailableGateways() Drupal\sms\Gateway\GatewayManager->getGateway('test') sms_gateways('gateway', 'test') Drupal\sms\Tests\SmsFrameworkWebTest->testGatewayConfiguration() Drupal\simpletest\TestBase->run(Array) simpletest_script_run_one_test('6', 'Drupal\sms\Tests\SmsFrameworkWebTest') Uncaught exceptionGatewayManager.php199Drupal\sms\Gateway\GatewayManager->buildGateways()
[30-Jul-2015 14:42:39 UTC] Uncaught PHP Exception InvalidArgumentException: "Gateway test configured without a plugin id." at /var/lib/drupaltestbot/sites/default/files/checkout/sites/default/modules/smsframework/src/Gateway/GatewayManager.php line 199 Fatal errorUnknown0Unknown
LeafDrupal\sms_blast\Tests\SmsBlastWebTest1600
LeafDrupal\sms_devel\Tests\SmsDevelWebTest2300
LeafDrupal\sms_track\Tests\SmsTrackArchiveTest13200
ExpandDrupal\sms_user\Tests\SmsUserWebTest15142
MessageGroupFilenameLineFunctionStatus
The test did not complete due to a fatal error.Completion checkSmsUserWebTest.php28Drupal\sms_user\Tests\SmsUserWebTest->testNumberConfirmationAndSmsUserSend()
Failed to set field number to 1234567890OtherSmsUserWebTest.php39Drupal\sms_user\Tests\SmsUserWebTest->testNumberConfirmationAndSmsUserSend()
Found the Confirm number buttonOtherSmsUserWebTest.php39Drupal\sms_user\Tests\SmsUserWebTest->testNumberConfirmationAndSmsUserSend()
Found the requested form fields at user/2/mobileOtherSmsUserWebTest.php39Drupal\sms_user\Tests\SmsUserWebTest->testNumberConfirmationAndSmsUserSend()
HTTP response expected 200, actual 500BrowserSmsUserWebTest.php40Drupal\sms_user\Tests\SmsUserWebTest->testNumberConfirmationAndSmsUserSend()
Undefined index: messageDrupal\sms_user\Tests\SmsUserWebTest->testNumberConfirmationAndSmsUserSend() Drupal\simpletest\TestBase->run(Array) simpletest_script_run_one_test('3', 'Drupal\sms_user\Tests\SmsUserWebTest') NoticeSmsUserWebTest.php47Drupal\sms_user\Tests\SmsUserWebTest->testNumberConfirmationAndSmsUserSend()
Undefined offset: 1Drupal\sms_user\Tests\SmsUserWebTest->testNumberConfirmationAndSmsUserSend() Drupal\simpletest\TestBase->run(Array) simpletest_script_run_one_test('3', 'Drupal\sms_user\Tests\SmsUserWebTest') NoticeSmsUserWebTest.php48Drupal\sms_user\Tests\SmsUserWebTest->testNumberConfirmationAndSmsUserSend()
Failed to set field confirm_code to OtherSmsUserWebTest.php50Drupal\sms_user\Tests\SmsUserWebTest->testNumberConfirmationAndSmsUserSend()
Found the Confirm number buttonOtherSmsUserWebTest.php50Drupal\sms_user\Tests\SmsUserWebTest->testNumberConfirmationAndSmsUserSend()
Found the requested form fields at user/2/mobileOtherSmsUserWebTest.php50Drupal\sms_user\Tests\SmsUserWebTest->testNumberConfirmationAndSmsUserSend()
HTTP response expected 200, actual 500BrowserSmsUserWebTest.php51Drupal\sms_user\Tests\SmsUserWebTest->testNumberConfirmationAndSmsUserSend()
Successfully confirmed user phone number 1234567890OtherSmsUserWebTest.php54Drupal\sms_user\Tests\SmsUserWebTest->testNumberConfirmationAndSmsUserSend()
SMS User opt out settings available after number confirmed.OtherSmsUserWebTest.php56Drupal\sms_user\Tests\SmsUserWebTest->testNumberConfirmationAndSmsUserSend()
SMS User sleep enable settings available after number confirmed.OtherSmsUserWebTest.php57Drupal\sms_user\Tests\SmsUserWebTest->testNumberConfirmationAndSmsUserSend()
Successfully sent message to user with permissionOtherSmsUserWebTest.php61Drupal\sms_user\Tests\SmsUserWebTest->testNumberConfirmationAndSmsUserSend()
Message sent through the correct gateway.OtherSmsUserWebTest.php63Drupal\sms_user\Tests\SmsUserWebTest->testNumberConfirmationAndSmsUserSend()
LeafDrupal\sms_valid\Tests\SmsValidWebTest10900