verify_stability_with-2538360-5.patch

Test status
StatusResult
Last receivedTue, 07/28/2015 - 13:45:00
Last requestedTue, 07/28/2015 - 14:36:48
Last testedTue, 07/28/2015 - 14:39:50
Test count1
Environment status
PHP 5.5 MySQLfail
File information
Fileverify_stability_with-2538360-5.patch
BranchTranslation Management Tool - 8.x-1.x
LinkIssue Link
SummaryFAILED: [[SimpleTest]]: [PHP 5.5 MySQL] 1,984 pass(es), 251 fail(s), and 8 exception(s).
Details

PHP 5.5 MySQL

  1. Setup environment
  2. Detect an invalid patch URL
  3. Detect invalid repository information
  4. Detect invalid patch format
  5. Detect a non-applicable patch
  6. Detect invalid PHP syntax
  7. Detect a Drupal installation failure
  8. Detect a test run failure
  9. Detect a failing test
    Review the test failures below then if necessary run them locally until the problem has been fixed.
  10. Complete test suite with all tests passing
1,984 pass(es), 251 fail(s), and 8 exception(s)

Non-pass

Test namePassFailException
ExpandDrupal\tmgmt\Tests\TMGMTCartTest4260
MessageGroupFilenameLineFunctionStatus
The test did not complete due to a fatal error.Completion checkTMGMTCartTest.php43Drupal\tmgmt\Tests\TMGMTCartTest->testCartEnforceSourceLanguage()
"One job needs to be checked out." foundOtherTMGMTCartTest.php84Drupal\tmgmt\Tests\TMGMTCartTest->testCartEnforceSourceLanguage()
Raw "One item skipped as for the language English it was not possible to retrieve a translation." foundOtherTMGMTCartTest.php85Drupal\tmgmt\Tests\TMGMTCartTest->testCartEnforceSourceLanguage()
"You have enforced the the job source language which most likely resulted in having a translation of your original content as the job source text. You should review the job translation received from the translator carefully to prevent the content quality loss." foundOtherTMGMTCartTest.php86Drupal\tmgmt\Tests\TMGMTCartTest->testCartEnforceSourceLanguage()
Found the Submit to translator buttonOtherTMGMTCartTest.php91Drupal\tmgmt\Tests\TMGMTCartTest->testCartEnforceSourceLanguage()
Found the requested form fields at OtherTMGMTCartTest.php91Drupal\tmgmt\Tests\TMGMTCartTest->testCartEnforceSourceLanguage()
ExpandDrupal\tmgmt\Tests\TMGMTUiTest359534
MessageGroupFilenameLineFunctionStatus
"test_source:test:1" foundOtherTMGMTUiTest.php68Drupal\tmgmt\Tests\TMGMTUiTest->testCheckoutForm()
"test_source:test:1" foundOtherTMGMTUiTest.php79Drupal\tmgmt\Tests\TMGMTUiTest->testCheckoutForm()
"test_source:test:2" foundOtherTMGMTUiTest.php80Drupal\tmgmt\Tests\TMGMTUiTest->testCheckoutForm()
"test_source:test:3" foundOtherTMGMTUiTest.php81Drupal\tmgmt\Tests\TMGMTUiTest->testCheckoutForm()
Failed to set field target_language to elOtherTMGMTUiTest.php90Drupal\tmgmt\Tests\TMGMTUiTest->testCheckoutForm()
Failed to set field settings[action] to translateOtherTMGMTUiTest.php90Drupal\tmgmt\Tests\TMGMTUiTest->testCheckoutForm()
Found the Submit to translator buttonOtherTMGMTUiTest.php90Drupal\tmgmt\Tests\TMGMTUiTest->testCheckoutForm()
Found the requested form fields at OtherTMGMTUiTest.php90Drupal\tmgmt\Tests\TMGMTUiTest->testCheckoutForm()
"Test translator (auto created) can not translate from English to Greek." foundOtherTMGMTUiTest.php91Drupal\tmgmt\Tests\TMGMTUiTest->testCheckoutForm()
Failed to set field target_language to esOtherTMGMTUiTest.php101Drupal\tmgmt\Tests\TMGMTUiTest->testCheckoutForm()
Failed to set field settings[action] to translateOtherTMGMTUiTest.php101Drupal\tmgmt\Tests\TMGMTUiTest->testCheckoutForm()
Found the Submit to translator buttonOtherTMGMTUiTest.php101Drupal\tmgmt\Tests\TMGMTUiTest->testCheckoutForm()
Found the requested form fields at OtherTMGMTUiTest.php101Drupal\tmgmt\Tests\TMGMTUiTest->testCheckoutForm()
Value false is TRUE.OtherTMGMTUiTest.php105Drupal\tmgmt\Tests\TMGMTUiTest->testCheckoutForm()
Value false is TRUE.OtherTMGMTUiTest.php108Drupal\tmgmt\Tests\TMGMTUiTest->testCheckoutForm()
Value false is TRUE.OtherTMGMTUiTest.php108Drupal\tmgmt\Tests\TMGMTUiTest->testCheckoutForm()
Value false is TRUE.OtherTMGMTUiTest.php108Drupal\tmgmt\Tests\TMGMTUiTest->testCheckoutForm()
"Test translation created" foundOtherTMGMTUiTest.php110Drupal\tmgmt\Tests\TMGMTUiTest->testCheckoutForm()
"Job overview" foundOtherTMGMTUiTest.php114Drupal\tmgmt\Tests\TMGMTUiTest->testCheckoutForm()
Value '1' is not equal to value '1'.OtherTMGMTUiTest.php120Drupal\tmgmt\Tests\TMGMTUiTest->testCheckoutForm()
"You can provide a label for this job in order to identify it easily later on." foundOtherTMGMTUiTest.php127Drupal\tmgmt\Tests\TMGMTUiTest->testCheckoutForm()
"test_source:test:1" foundOtherTMGMTUiTest.php128Drupal\tmgmt\Tests\TMGMTUiTest->testCheckoutForm()
Failed to set field target_language to esOtherTMGMTUiTest.php134Drupal\tmgmt\Tests\TMGMTUiTest->testCheckoutForm()
Failed to set field settings[action] to submitOtherTMGMTUiTest.php134Drupal\tmgmt\Tests\TMGMTUiTest->testCheckoutForm()
Found the Submit to translator buttonOtherTMGMTUiTest.php134Drupal\tmgmt\Tests\TMGMTUiTest->testCheckoutForm()
Found the requested form fields at OtherTMGMTUiTest.php134Drupal\tmgmt\Tests\TMGMTUiTest->testCheckoutForm()
"Test submit" foundOtherTMGMTUiTest.php135Drupal\tmgmt\Tests\TMGMTUiTest->testCheckoutForm()
Value false is TRUE.OtherTMGMTUiTest.php137Drupal\tmgmt\Tests\TMGMTUiTest->testCheckoutForm()
Drupal\tmgmt\TMGMTException: Cannot get the translator. in Drupal\tmgmt\Entity\Job->getTranslator() (line 409 of /var/lib/drupaltestbot/sites/default/files/checkout/sites/default/modules/tmgmt/src/Entity/Job.php). Drupal\tmgmt\Entity\Job->getTranslator() Drupal\tmgmt\Entity\Job->getSetting('action') Drupal\tmgmt_test\Plugin\tmgmt\Translator\TestTranslator->canTranslate(Object, Object) Drupal\tmgmt\Entity\Translator->canTranslate(Object) tmgmt_translator_load_available(Object) tmgmt_job_needs_checkout_form(Object) tmgmt_job_checkout_multiple(Array) Drupal\tmgmt\Tests\TMGMTUiTest->testCheckoutForm() Drupal\simpletest\TestBase->run(Array) simpletest_script_run_one_test('13', 'Drupal\tmgmt\Tests\TMGMTUiTest') Uncaught exceptionJob.php409Drupal\tmgmt\Entity\Job->getTranslator()
[28-Jul-2015 14:37:29 UTC] Uncaught PHP Exception Drupal\tmgmt\TMGMTException: "Cannot get the translator." at /var/lib/drupaltestbot/sites/default/files/checkout/sites/default/modules/tmgmt/src/Entity/Job.php line 409 Fatal errorUnknown0Unknown
[28-Jul-2015 14:37:29 UTC] Uncaught PHP Exception Drupal\tmgmt\TMGMTException: "Cannot get the translator." at /var/lib/drupaltestbot/sites/default/files/checkout/sites/default/modules/tmgmt/src/Entity/Job.php line 409 Fatal errorUnknown0Unknown
[28-Jul-2015 14:37:29 UTC] Uncaught PHP Exception Drupal\tmgmt\TMGMTException: "Cannot get the translator." at /var/lib/drupaltestbot/sites/default/files/checkout/sites/default/modules/tmgmt/src/Entity/Job.php line 409 Fatal errorUnknown0Unknown
Drupal\tmgmt\TMGMTException: Cannot get the translator. in Drupal\tmgmt\Entity\Job->getTranslator() (line 409 of /var/lib/drupaltestbot/sites/default/files/checkout/sites/default/modules/tmgmt/src/Entity/Job.php). Drupal\tmgmt\Entity\Job->getTranslator() Drupal\tmgmt\Entity\Job->getSetting('action') Drupal\tmgmt_test\Plugin\tmgmt\Translator\TestTranslator->canTranslate(Object, Object) Drupal\tmgmt\Entity\Translator->canTranslate(Object) tmgmt_translator_load_available(Object) tmgmt_job_needs_checkout_form(Object) tmgmt_job_checkout_multiple(Array) Drupal\tmgmt\Tests\TMGMTUiTest->testCheckoutFunction() Drupal\simpletest\TestBase->run(Array) simpletest_script_run_one_test('13', 'Drupal\tmgmt\Tests\TMGMTUiTest') Uncaught exceptionJob.php409Drupal\tmgmt\Entity\Job->getTranslator()
Drupal\tmgmt\TMGMTException: Cannot get the translator. in Drupal\tmgmt\Entity\Job->getTranslator() (line 409 of /var/lib/drupaltestbot/sites/default/files/checkout/sites/default/modules/tmgmt/src/Entity/Job.php). Drupal\tmgmt\Entity\Job->getTranslator() Drupal\tmgmt\Entity\Job->getSetting('action') Drupal\tmgmt_test\Plugin\tmgmt\Translator\TestTranslator->canTranslate(Object, Object) Drupal\tmgmt\Entity\Translator->canTranslate(Object) tmgmt_translator_load_available(Object) tmgmt_job_needs_checkout_form(Object) tmgmt_job_checkout_multiple(Array) Drupal\tmgmt\Tests\TMGMTUiTest->testSuggestions() Drupal\simpletest\TestBase->run(Array) simpletest_script_run_one_test('13', 'Drupal\tmgmt\Tests\TMGMTUiTest') Uncaught exceptionJob.php409Drupal\tmgmt\Entity\Job->getTranslator()
Failed to set field target_language to esOtherTMGMTUiTest.php548Drupal\tmgmt\Tests\TMGMTUiTest->testAbortJob()
Failed to set field settings[action] to translateOtherTMGMTUiTest.php548Drupal\tmgmt\Tests\TMGMTUiTest->testAbortJob()
Found the Submit to translator buttonOtherTMGMTUiTest.php548Drupal\tmgmt\Tests\TMGMTUiTest->testAbortJob()
Found the requested form fields at admin/tmgmt/jobs/1OtherTMGMTUiTest.php548Drupal\tmgmt\Tests\TMGMTUiTest->testAbortJob()
Found the Abort job buttonOtherTMGMTUiTest.php551Drupal\tmgmt\Tests\TMGMTUiTest->testAbortJob()
Found the requested form fields at admin/tmgmt/jobs/1OtherTMGMTUiTest.php551Drupal\tmgmt\Tests\TMGMTUiTest->testAbortJob()
Found the Confirm buttonOtherTMGMTUiTest.php552Drupal\tmgmt\Tests\TMGMTUiTest->testAbortJob()
Found the requested form fields at OtherTMGMTUiTest.php552Drupal\tmgmt\Tests\TMGMTUiTest->testAbortJob()
Value false is TRUE.OtherTMGMTUiTest.php556Drupal\tmgmt\Tests\TMGMTUiTest->testAbortJob()
Value false is TRUE.OtherTMGMTUiTest.php558Drupal\tmgmt\Tests\TMGMTUiTest->testAbortJob()
Value false is TRUE.OtherTMGMTUiTest.php558Drupal\tmgmt\Tests\TMGMTUiTest->testAbortJob()
Value false is TRUE.OtherTMGMTUiTest.php558Drupal\tmgmt\Tests\TMGMTUiTest->testAbortJob()
Found the Resubmit buttonOtherTMGMTUiTest.php562Drupal\tmgmt\Tests\TMGMTUiTest->testAbortJob()
Found the requested form fields at admin/tmgmt/jobs/1OtherTMGMTUiTest.php562Drupal\tmgmt\Tests\TMGMTUiTest->testAbortJob()
Found the Confirm buttonOtherTMGMTUiTest.php563Drupal\tmgmt\Tests\TMGMTUiTest->testAbortJob()
Found the requested form fields at OtherTMGMTUiTest.php563Drupal\tmgmt\Tests\TMGMTUiTest->testAbortJob()
Raw "This job is a duplicate of the previously aborted job #1" foundOtherTMGMTUiTest.php566Drupal\tmgmt\Tests\TMGMTUiTest->testAbortJob()
Drupal\tmgmt\TMGMTException: Cannot get the translator. in Drupal\tmgmt\Entity\Job->getTranslator() (line 409 of /var/lib/drupaltestbot/sites/default/files/checkout/sites/default/modules/tmgmt/src/Entity/Job.php). Drupal\tmgmt\Entity\Job->getTranslator() Drupal\tmgmt\Tests\TMGMTUiTest->testAbortJob() Drupal\simpletest\TestBase->run(Array) simpletest_script_run_one_test('13', 'Drupal\tmgmt\Tests\TMGMTUiTest') Uncaught exceptionJob.php409Drupal\tmgmt\Entity\Job->getTranslator()
[28-Jul-2015 14:38:53 UTC] Uncaught PHP Exception Drupal\tmgmt\TMGMTException: "Cannot get the translator." at /var/lib/drupaltestbot/sites/default/files/checkout/sites/default/modules/tmgmt/src/Entity/Job.php line 409 Fatal errorUnknown0Unknown
[28-Jul-2015 14:38:53 UTC] Uncaught PHP Exception Drupal\tmgmt\TMGMTException: "Cannot get the translator." at /var/lib/drupaltestbot/sites/default/files/checkout/sites/default/modules/tmgmt/src/Entity/Job.php line 409 Fatal errorUnknown0Unknown
[28-Jul-2015 14:38:54 UTC] Uncaught PHP Exception Drupal\tmgmt\TMGMTException: "Cannot get the translator." at /var/lib/drupaltestbot/sites/default/files/checkout/sites/default/modules/tmgmt/src/Entity/Job.php line 409 Fatal errorUnknown0Unknown
"4 jobs need to be checked out." foundOtherTMGMTUiTest.php689Drupal\tmgmt\Tests\TMGMTUiTest->testCart()
[28-Jul-2015 14:39:17 UTC] Uncaught PHP Exception Drupal\tmgmt\TMGMTException: "Cannot get the translator." at /var/lib/drupaltestbot/sites/default/files/checkout/sites/default/modules/tmgmt/src/Entity/Job.php line 409 Fatal errorUnknown0Unknown
ExpandDrupal\tmgmt\Tests\TranslatorTest3840
MessageGroupFilenameLineFunctionStatus
"Add translator" foundOtherTranslatorTest.php65Drupal\tmgmt\Tests\TranslatorTest->testTranslatorHandling()
"b95gLv0I" not foundOtherTranslatorTest.php66Drupal\tmgmt\Tests\TranslatorTest->testTranslatorHandling()
"There are no translator plugins available. Please install a translator plugin." foundOtherTranslatorTest.php75Drupal\tmgmt\Tests\TranslatorTest->testTranslatorHandling()
[28-Jul-2015 14:37:28 UTC] Uncaught PHP Exception Drupal\Component\Plugin\Exception\PluginNotFoundException: "The "test_translator" plugin does not exist." at /var/lib/drupaltestbot/sites/default/files/checkout/core/lib/Drupal/Component/Plugin/Discovery/DiscoveryTrait.php line 57 Fatal errorUnknown0Unknown
ExpandDrupal\tmgmt_config\Tests\ConfigSourceListTest165634
MessageGroupFilenameLineFunctionStatus
"One job needs to be checked out." foundOtherConfigSourceListTest.php65Drupal\tmgmt_config\Tests\ConfigSourceListTest->testNodeTypeSubmissions()
"Article content type (English to ?, Unprocessed)" foundOtherConfigSourceListTest.php66Drupal\tmgmt_config\Tests\ConfigSourceListTest->testNodeTypeSubmissions()
Found the Submit to translator buttonOtherConfigSourceListTest.php69Drupal\tmgmt_config\Tests\ConfigSourceListTest->testNodeTypeSubmissions()
Found the requested form fields at OtherConfigSourceListTest.php69Drupal\tmgmt_config\Tests\ConfigSourceListTest->testNodeTypeSubmissions()
"Test translation created." foundOtherConfigSourceListTest.php74Drupal\tmgmt_config\Tests\ConfigSourceListTest->testNodeTypeSubmissions()
"The translation of Article content type to German is finished and can now be reviewed." foundOtherConfigSourceListTest.php75Drupal\tmgmt_config\Tests\ConfigSourceListTest->testNodeTypeSubmissions()
"One job needs to be checked out." foundOtherConfigSourceListTest.php86Drupal\tmgmt_config\Tests\ConfigSourceListTest->testNodeTypeSubmissions()
"Article content type and 1 more (English to ?, Unprocessed)" foundOtherConfigSourceListTest.php87Drupal\tmgmt_config\Tests\ConfigSourceListTest->testNodeTypeSubmissions()
Found the Submit to translator buttonOtherConfigSourceListTest.php90Drupal\tmgmt_config\Tests\ConfigSourceListTest->testNodeTypeSubmissions()
Found the requested form fields at OtherConfigSourceListTest.php90Drupal\tmgmt_config\Tests\ConfigSourceListTest->testNodeTypeSubmissions()
"Test translation created." foundOtherConfigSourceListTest.php95Drupal\tmgmt_config\Tests\ConfigSourceListTest->testNodeTypeSubmissions()
"The translation of Article content type to German is finished and can now be reviewed." foundOtherConfigSourceListTest.php96Drupal\tmgmt_config\Tests\ConfigSourceListTest->testNodeTypeSubmissions()
"The translation of Page content type to German is finished and can now be reviewed." foundOtherConfigSourceListTest.php97Drupal\tmgmt_config\Tests\ConfigSourceListTest->testNodeTypeSubmissions()
[28-Jul-2015 14:37:33 UTC] Uncaught PHP Exception Drupal\tmgmt\TMGMTException: "Cannot get the translator." at /var/lib/drupaltestbot/sites/default/files/checkout/sites/default/modules/tmgmt/src/Entity/Job.php line 409 Fatal errorUnknown0Unknown
[28-Jul-2015 14:37:34 UTC] Uncaught PHP Exception Drupal\tmgmt\TMGMTException: "Cannot get the translator." at /var/lib/drupaltestbot/sites/default/files/checkout/sites/default/modules/tmgmt/src/Entity/Job.php line 409 Fatal errorUnknown0Unknown
"One job needs to be checked out." foundOtherConfigSourceListTest.php114Drupal\tmgmt_config\Tests\ConfigSourceListTest->testViewTranslation()
"Archive view (English to ?, Unprocessed)" foundOtherConfigSourceListTest.php115Drupal\tmgmt_config\Tests\ConfigSourceListTest->testViewTranslation()
Found the Submit to translator buttonOtherConfigSourceListTest.php118Drupal\tmgmt_config\Tests\ConfigSourceListTest->testViewTranslation()
Found the requested form fields at OtherConfigSourceListTest.php118Drupal\tmgmt_config\Tests\ConfigSourceListTest->testViewTranslation()
"Test translation created." foundOtherConfigSourceListTest.php123Drupal\tmgmt_config\Tests\ConfigSourceListTest->testViewTranslation()
"The translation of Archive view to German is finished and can now be reviewed." foundOtherConfigSourceListTest.php124Drupal\tmgmt_config\Tests\ConfigSourceListTest->testViewTranslation()
Failed to set field items[views.view.archive] to 1OtherConfigSourceListTest.php134Drupal\tmgmt_config\Tests\ConfigSourceListTest->testViewTranslation()
Failed to set field items[views.view.content_recent] to 1OtherConfigSourceListTest.php134Drupal\tmgmt_config\Tests\ConfigSourceListTest->testViewTranslation()
Failed to set field items[views.view.content] to 1OtherConfigSourceListTest.php134Drupal\tmgmt_config\Tests\ConfigSourceListTest->testViewTranslation()
Failed to set field items[views.view.tmgmt_job_overview] to 1OtherConfigSourceListTest.php134Drupal\tmgmt_config\Tests\ConfigSourceListTest->testViewTranslation()
Found the Request translation buttonOtherConfigSourceListTest.php134Drupal\tmgmt_config\Tests\ConfigSourceListTest->testViewTranslation()
Found the requested form fields at OtherConfigSourceListTest.php134Drupal\tmgmt_config\Tests\ConfigSourceListTest->testViewTranslation()
"One job needs to be checked out." foundOtherConfigSourceListTest.php137Drupal\tmgmt_config\Tests\ConfigSourceListTest->testViewTranslation()
"Archive view and 3 more (English to ?, Unprocessed)" foundOtherConfigSourceListTest.php138Drupal\tmgmt_config\Tests\ConfigSourceListTest->testViewTranslation()
Found the Submit to translator buttonOtherConfigSourceListTest.php141Drupal\tmgmt_config\Tests\ConfigSourceListTest->testViewTranslation()
Found the requested form fields at OtherConfigSourceListTest.php141Drupal\tmgmt_config\Tests\ConfigSourceListTest->testViewTranslation()
"Test translation created." foundOtherConfigSourceListTest.php146Drupal\tmgmt_config\Tests\ConfigSourceListTest->testViewTranslation()
"The translation of Archive view to German is finished and can now be reviewed." foundOtherConfigSourceListTest.php147Drupal\tmgmt_config\Tests\ConfigSourceListTest->testViewTranslation()
"The translation of Recent content view to German is finished and can now be reviewed." foundOtherConfigSourceListTest.php148Drupal\tmgmt_config\Tests\ConfigSourceListTest->testViewTranslation()
"The translation of Content view to German is finished and can now be reviewed." foundOtherConfigSourceListTest.php149Drupal\tmgmt_config\Tests\ConfigSourceListTest->testViewTranslation()
"The translation of Job overview view to German is finished and can now be reviewed." foundOtherConfigSourceListTest.php150Drupal\tmgmt_config\Tests\ConfigSourceListTest->testViewTranslation()
Failed to set field items[views.view.tmgmt_job_items] to 1OtherConfigSourceListTest.php156Drupal\tmgmt_config\Tests\ConfigSourceListTest->testViewTranslation()
Found the Add to cart buttonOtherConfigSourceListTest.php156Drupal\tmgmt_config\Tests\ConfigSourceListTest->testViewTranslation()
Found the requested form fields at OtherConfigSourceListTest.php156Drupal\tmgmt_config\Tests\ConfigSourceListTest->testViewTranslation()
Link cart does not exist on http://ec2-52-10-99-150.us-west-2.compute.amazonaws.com/checkout/admin/tmgmt/sources/config/viewBrowserConfigSourceListTest.php157Drupal\tmgmt_config\Tests\ConfigSourceListTest->testViewTranslation()
Undefined offset: 0Drupal\tmgmt_config\Tests\ConfigSourceListTest->testViewTranslation() Drupal\simpletest\TestBase->run(Array) simpletest_script_run_one_test('10', 'Drupal\tmgmt_config\Tests\ConfigSourceListTest') NoticeConfigSourceListTest.php160Drupal\tmgmt_config\Tests\ConfigSourceListTest->testViewTranslation()
Trying to get property of non-objectDrupal\tmgmt_config\Tests\ConfigSourceListTest->testViewTranslation() Drupal\simpletest\TestBase->run(Array) simpletest_script_run_one_test('10', 'Drupal\tmgmt_config\Tests\ConfigSourceListTest') NoticeConfigSourceListTest.php160Drupal\tmgmt_config\Tests\ConfigSourceListTest->testViewTranslation()
Value '' is equal to value 'Cart'.OtherConfigSourceListTest.php161Drupal\tmgmt_config\Tests\ConfigSourceListTest->testViewTranslation()
Page title '' is equal to 'Cart | Drupal'.OtherConfigSourceListTest.php162Drupal\tmgmt_config\Tests\ConfigSourceListTest->testViewTranslation()
"Request translation" foundOtherConfigSourceListTest.php163Drupal\tmgmt_config\Tests\ConfigSourceListTest->testViewTranslation()
[28-Jul-2015 14:37:58 UTC] Uncaught PHP Exception Drupal\tmgmt\TMGMTException: "Cannot get the translator." at /var/lib/drupaltestbot/sites/default/files/checkout/sites/default/modules/tmgmt/src/Entity/Job.php line 409 Fatal errorUnknown0Unknown
"One job needs to be checked out." foundOtherConfigSourceListTest.php244Drupal\tmgmt_config\Tests\ConfigSourceListTest->testSimpleConfigTranslation()
"System information (English to ?, Unprocessed)" foundOtherConfigSourceListTest.php245Drupal\tmgmt_config\Tests\ConfigSourceListTest->testSimpleConfigTranslation()
Found the Submit to translator buttonOtherConfigSourceListTest.php248Drupal\tmgmt_config\Tests\ConfigSourceListTest->testSimpleConfigTranslation()
Found the requested form fields at OtherConfigSourceListTest.php248Drupal\tmgmt_config\Tests\ConfigSourceListTest->testSimpleConfigTranslation()
Raw "href="/checkout/admin/tmgmt/items/1?destination=admin/tmgmt/sources/config/_simple_config" title="Active job item: Needs review"" foundOtherConfigSourceListTest.php257Drupal\tmgmt_config\Tests\ConfigSourceListTest->testSimpleConfigTranslation()
"Test translation created." foundOtherConfigSourceListTest.php259Drupal\tmgmt_config\Tests\ConfigSourceListTest->testSimpleConfigTranslation()
"The translation of System information to German is finished and can now be reviewed." foundOtherConfigSourceListTest.php260Drupal\tmgmt_config\Tests\ConfigSourceListTest->testSimpleConfigTranslation()
Undefined offset: 0Drupal\tmgmt_config\Tests\ConfigSourceListTest->testSimpleConfigTranslation() Drupal\simpletest\TestBase->run(Array) simpletest_script_run_one_test('10', 'Drupal\tmgmt_config\Tests\ConfigSourceListTest') NoticeConfigSourceListTest.php264Drupal\tmgmt_config\Tests\ConfigSourceListTest->testSimpleConfigTranslation()
Uninitialized string offset: 0Drupal\simpletest\WebTestBase->getAbsoluteUrl(NULL) Drupal\tmgmt_config\Tests\ConfigSourceListTest->testSimpleConfigTranslation() Drupal\simpletest\TestBase->run(Array) simpletest_script_run_one_test('10', 'Drupal\tmgmt_config\Tests\ConfigSourceListTest') NoticeWebTestBase.php2475Drupal\simpletest\WebTestBase->getAbsoluteUrl()
Found the Save buttonOtherConfigSourceListTest.php266Drupal\tmgmt_config\Tests\ConfigSourceListTest->testSimpleConfigTranslation()
Found the requested form fields at OtherConfigSourceListTest.php266Drupal\tmgmt_config\Tests\ConfigSourceListTest->testSimpleConfigTranslation()
Failed to set field items[entity.user.admin_form] to 1OtherConfigSourceListTest.php272Drupal\tmgmt_config\Tests\ConfigSourceListTest->testSimpleConfigTranslation()
Found the Request translation buttonOtherConfigSourceListTest.php272Drupal\tmgmt_config\Tests\ConfigSourceListTest->testSimpleConfigTranslation()
Found the requested form fields at OtherConfigSourceListTest.php272Drupal\tmgmt_config\Tests\ConfigSourceListTest->testSimpleConfigTranslation()
"One job needs to be checked out." foundOtherConfigSourceListTest.php275Drupal\tmgmt_config\Tests\ConfigSourceListTest->testSimpleConfigTranslation()
"Account settings (English to ?, Unprocessed)" foundOtherConfigSourceListTest.php276Drupal\tmgmt_config\Tests\ConfigSourceListTest->testSimpleConfigTranslation()
Found the Submit to translator buttonOtherConfigSourceListTest.php277Drupal\tmgmt_config\Tests\ConfigSourceListTest->testSimpleConfigTranslation()
Found the requested form fields at OtherConfigSourceListTest.php277Drupal\tmgmt_config\Tests\ConfigSourceListTest->testSimpleConfigTranslation()
Expected 'http://ec2-52-10-99-150.us-west-2.compute.amazonaws.com/checkout/admin/tmgmt/sources/config/_simple_config' matches current URL (http://ec2-52-10-99-150.us-west-2.compute.amazonaws.com/checkout/user/4).OtherConfigSourceListTest.php280Drupal\tmgmt_config\Tests\ConfigSourceListTest->testSimpleConfigTranslation()
Value 0 is equal to value 2.OtherConfigSourceListTest.php288Drupal\tmgmt_config\Tests\ConfigSourceListTest->testSimpleConfigTranslation()
[28-Jul-2015 14:38:52 UTC] Uncaught PHP Exception Drupal\tmgmt\TMGMTException: "Cannot get the translator." at /var/lib/drupaltestbot/sites/default/files/checkout/sites/default/modules/tmgmt/src/Entity/Job.php line 409 Fatal errorUnknown0Unknown
ExpandDrupal\tmgmt_config\Tests\ConfigSourceUiTest173520
MessageGroupFilenameLineFunctionStatus
"One job needs to be checked out." foundOtherConfigSourceUiTest.php68Drupal\tmgmt_config\Tests\ConfigSourceUiTest->testNodeTypeTranslateTabSingleCheckout()
"Article content type (English to German, Unprocessed)" foundOtherConfigSourceUiTest.php69Drupal\tmgmt_config\Tests\ConfigSourceUiTest->testNodeTypeTranslateTabSingleCheckout()
Found the Submit to translator buttonOtherConfigSourceUiTest.php72Drupal\tmgmt_config\Tests\ConfigSourceUiTest->testNodeTypeTranslateTabSingleCheckout()
Found the requested form fields at OtherConfigSourceUiTest.php72Drupal\tmgmt_config\Tests\ConfigSourceUiTest->testNodeTypeTranslateTabSingleCheckout()
Link Needs review does not exist on http://ec2-52-10-99-150.us-west-2.compute.amazonaws.com/checkout/admin/structure/types/manage/article/translateBrowserConfigSourceUiTest.php89Drupal\tmgmt_config\Tests\ConfigSourceUiTest->testNodeTypeTranslateTabSingleCheckout()
Found the Save as completed buttonOtherConfigSourceUiTest.php90Drupal\tmgmt_config\Tests\ConfigSourceUiTest->testNodeTypeTranslateTabSingleCheckout()
Found the requested form fields at OtherConfigSourceUiTest.php90Drupal\tmgmt_config\Tests\ConfigSourceUiTest->testNodeTypeTranslateTabSingleCheckout()
"One job needs to be checked out." foundOtherConfigSourceUiTest.php99Drupal\tmgmt_config\Tests\ConfigSourceUiTest->testNodeTypeTranslateTabSingleCheckout()
"Article content type (English to Spanish, Unprocessed)" foundOtherConfigSourceUiTest.php100Drupal\tmgmt_config\Tests\ConfigSourceUiTest->testNodeTypeTranslateTabSingleCheckout()
Found the Submit to translator buttonOtherConfigSourceUiTest.php101Drupal\tmgmt_config\Tests\ConfigSourceUiTest->testNodeTypeTranslateTabSingleCheckout()
Found the requested form fields at OtherConfigSourceUiTest.php101Drupal\tmgmt_config\Tests\ConfigSourceUiTest->testNodeTypeTranslateTabSingleCheckout()
Value 0 is equal to value 2.OtherConfigSourceUiTest.php115Drupal\tmgmt_config\Tests\ConfigSourceUiTest->testNodeTypeTranslateTabSingleCheckout()
[28-Jul-2015 14:37:32 UTC] Uncaught PHP Exception Drupal\tmgmt\TMGMTException: "Cannot get the translator." at /var/lib/drupaltestbot/sites/default/files/checkout/sites/default/modules/tmgmt/src/Entity/Job.php line 409 Fatal errorUnknown0Unknown
[28-Jul-2015 14:37:32 UTC] Uncaught PHP Exception Drupal\tmgmt\TMGMTException: "Cannot get the translator." at /var/lib/drupaltestbot/sites/default/files/checkout/sites/default/modules/tmgmt/src/Entity/Job.php line 409 Fatal errorUnknown0Unknown
"2 jobs need to be checked out." foundOtherConfigSourceUiTest.php145Drupal\tmgmt_config\Tests\ConfigSourceUiTest->testNodeTypeTranslateTabMultipeCheckout()
"Article content type (English to German, Unprocessed)" foundOtherConfigSourceUiTest.php148Drupal\tmgmt_config\Tests\ConfigSourceUiTest->testNodeTypeTranslateTabMultipeCheckout()
Found the Submit to translator and continue buttonOtherConfigSourceUiTest.php149Drupal\tmgmt_config\Tests\ConfigSourceUiTest->testNodeTypeTranslateTabMultipeCheckout()
Found the requested form fields at OtherConfigSourceUiTest.php149Drupal\tmgmt_config\Tests\ConfigSourceUiTest->testNodeTypeTranslateTabMultipeCheckout()
"Article content type (English to Spanish, Unprocessed)" foundOtherConfigSourceUiTest.php150Drupal\tmgmt_config\Tests\ConfigSourceUiTest->testNodeTypeTranslateTabMultipeCheckout()
Found the Submit to translator buttonOtherConfigSourceUiTest.php151Drupal\tmgmt_config\Tests\ConfigSourceUiTest->testNodeTypeTranslateTabMultipeCheckout()
Found the requested form fields at OtherConfigSourceUiTest.php151Drupal\tmgmt_config\Tests\ConfigSourceUiTest->testNodeTypeTranslateTabMultipeCheckout()
"Test translation created." foundOtherConfigSourceUiTest.php155Drupal\tmgmt_config\Tests\ConfigSourceUiTest->testNodeTypeTranslateTabMultipeCheckout()
Value 0 is equal to value 2.OtherConfigSourceUiTest.php170Drupal\tmgmt_config\Tests\ConfigSourceUiTest->testNodeTypeTranslateTabMultipeCheckout()
[28-Jul-2015 14:37:55 UTC] Uncaught PHP Exception Drupal\tmgmt\TMGMTException: "Cannot get the translator." at /var/lib/drupaltestbot/sites/default/files/checkout/sites/default/modules/tmgmt/src/Entity/Job.php line 409 Fatal errorUnknown0Unknown
"One job needs to be checked out." foundOtherConfigSourceUiTest.php193Drupal\tmgmt_config\Tests\ConfigSourceUiTest->testViewTranslateTabSingleCheckout()
"Content view (English to German, Unprocessed)" foundOtherConfigSourceUiTest.php194Drupal\tmgmt_config\Tests\ConfigSourceUiTest->testViewTranslateTabSingleCheckout()
Found the Submit to translator buttonOtherConfigSourceUiTest.php197Drupal\tmgmt_config\Tests\ConfigSourceUiTest->testViewTranslateTabSingleCheckout()
Found the requested form fields at OtherConfigSourceUiTest.php197Drupal\tmgmt_config\Tests\ConfigSourceUiTest->testViewTranslateTabSingleCheckout()
Link Needs review does not exist on http://ec2-52-10-99-150.us-west-2.compute.amazonaws.com/checkout/admin/structure/views/view/content/translateBrowserConfigSourceUiTest.php214Drupal\tmgmt_config\Tests\ConfigSourceUiTest->testViewTranslateTabSingleCheckout()
Found the Save as completed buttonOtherConfigSourceUiTest.php215Drupal\tmgmt_config\Tests\ConfigSourceUiTest->testViewTranslateTabSingleCheckout()
Found the requested form fields at OtherConfigSourceUiTest.php215Drupal\tmgmt_config\Tests\ConfigSourceUiTest->testViewTranslateTabSingleCheckout()
"One job needs to be checked out." foundOtherConfigSourceUiTest.php224Drupal\tmgmt_config\Tests\ConfigSourceUiTest->testViewTranslateTabSingleCheckout()
"Content view (English to Spanish, Unprocessed)" foundOtherConfigSourceUiTest.php225Drupal\tmgmt_config\Tests\ConfigSourceUiTest->testViewTranslateTabSingleCheckout()
Found the Submit to translator buttonOtherConfigSourceUiTest.php226Drupal\tmgmt_config\Tests\ConfigSourceUiTest->testViewTranslateTabSingleCheckout()
Found the requested form fields at OtherConfigSourceUiTest.php226Drupal\tmgmt_config\Tests\ConfigSourceUiTest->testViewTranslateTabSingleCheckout()
Value 0 is equal to value 2.OtherConfigSourceUiTest.php240Drupal\tmgmt_config\Tests\ConfigSourceUiTest->testViewTranslateTabSingleCheckout()
[28-Jul-2015 14:38:19 UTC] Uncaught PHP Exception Drupal\tmgmt\TMGMTException: "Cannot get the translator." at /var/lib/drupaltestbot/sites/default/files/checkout/sites/default/modules/tmgmt/src/Entity/Job.php line 409 Fatal errorUnknown0Unknown
[28-Jul-2015 14:38:19 UTC] Uncaught PHP Exception Drupal\tmgmt\TMGMTException: "Cannot get the translator." at /var/lib/drupaltestbot/sites/default/files/checkout/sites/default/modules/tmgmt/src/Entity/Job.php line 409 Fatal errorUnknown0Unknown
"One job needs to be checked out." foundOtherConfigSourceUiTest.php283Drupal\tmgmt_config\Tests\ConfigSourceUiTest->testSimpleConfiguration()
"System information (English to German, Unprocessed)" foundOtherConfigSourceUiTest.php284Drupal\tmgmt_config\Tests\ConfigSourceUiTest->testSimpleConfiguration()
Found the Submit to translator buttonOtherConfigSourceUiTest.php287Drupal\tmgmt_config\Tests\ConfigSourceUiTest->testSimpleConfiguration()
Found the requested form fields at OtherConfigSourceUiTest.php287Drupal\tmgmt_config\Tests\ConfigSourceUiTest->testSimpleConfiguration()
Link Needs review does not exist on http://ec2-52-10-99-150.us-west-2.compute.amazonaws.com/checkout/admin/config/system/site-information/translateBrowserConfigSourceUiTest.php304Drupal\tmgmt_config\Tests\ConfigSourceUiTest->testSimpleConfiguration()
Found the Save buttonOtherConfigSourceUiTest.php305Drupal\tmgmt_config\Tests\ConfigSourceUiTest->testSimpleConfiguration()
Found the requested form fields at OtherConfigSourceUiTest.php305Drupal\tmgmt_config\Tests\ConfigSourceUiTest->testSimpleConfiguration()
"One job needs to be checked out." foundOtherConfigSourceUiTest.php314Drupal\tmgmt_config\Tests\ConfigSourceUiTest->testSimpleConfiguration()
"System information (English to Spanish, Unprocessed)" foundOtherConfigSourceUiTest.php315Drupal\tmgmt_config\Tests\ConfigSourceUiTest->testSimpleConfiguration()
Found the Submit to translator buttonOtherConfigSourceUiTest.php316Drupal\tmgmt_config\Tests\ConfigSourceUiTest->testSimpleConfiguration()
Found the requested form fields at OtherConfigSourceUiTest.php316Drupal\tmgmt_config\Tests\ConfigSourceUiTest->testSimpleConfiguration()
Value 0 is equal to value 2.OtherConfigSourceUiTest.php330Drupal\tmgmt_config\Tests\ConfigSourceUiTest->testSimpleConfiguration()
[28-Jul-2015 14:39:07 UTC] Uncaught PHP Exception Drupal\tmgmt\TMGMTException: "Cannot get the translator." at /var/lib/drupaltestbot/sites/default/files/checkout/sites/default/modules/tmgmt/src/Entity/Job.php line 409 Fatal errorUnknown0Unknown
[28-Jul-2015 14:39:08 UTC] Uncaught PHP Exception Drupal\tmgmt\TMGMTException: "Cannot get the translator." at /var/lib/drupaltestbot/sites/default/files/checkout/sites/default/modules/tmgmt/src/Entity/Job.php line 409 Fatal errorUnknown0Unknown
ExpandDrupal\tmgmt_content\Tests\ContentEntitySourceListTest14060
MessageGroupFilenameLineFunctionStatus
"One job needs to be checked out." foundOtherContentEntitySourceListTest.php180Drupal\tmgmt_content\Tests\ContentEntitySourceListTest->testTranslationSubmissions()
"One job needs to be checked out." foundOtherContentEntitySourceListTest.php189Drupal\tmgmt_content\Tests\ContentEntitySourceListTest->testTranslationSubmissions()
"3 jobs need to be checked out." foundOtherContentEntitySourceListTest.php206Drupal\tmgmt_content\Tests\ContentEntitySourceListTest->testTranslationSubmissions()
[28-Jul-2015 14:38:52 UTC] Uncaught PHP Exception Drupal\tmgmt\TMGMTException: "Cannot get the translator." at /var/lib/drupaltestbot/sites/default/files/checkout/sites/default/modules/tmgmt/src/Entity/Job.php line 409 Fatal errorUnknown0Unknown
[28-Jul-2015 14:38:53 UTC] Uncaught PHP Exception Drupal\tmgmt\TMGMTException: "Cannot get the translator." at /var/lib/drupaltestbot/sites/default/files/checkout/sites/default/modules/tmgmt/src/Entity/Job.php line 409 Fatal errorUnknown0Unknown
[28-Jul-2015 14:38:54 UTC] Uncaught PHP Exception Drupal\tmgmt\TMGMTException: "Cannot get the translator." at /var/lib/drupaltestbot/sites/default/files/checkout/sites/default/modules/tmgmt/src/Entity/Job.php line 409 Fatal errorUnknown0Unknown
ExpandDrupal\tmgmt_content\Tests\ContentEntitySourceUiTest204490
MessageGroupFilenameLineFunctionStatus
"One job needs to be checked out." foundOtherContentEntitySourceUiTest.php83Drupal\tmgmt_content\Tests\ContentEntitySourceUiTest->testNodeTranslateTabSingleCheckout()
"jZ0f8ymm" foundOtherContentEntitySourceUiTest.php84Drupal\tmgmt_content\Tests\ContentEntitySourceUiTest->testNodeTranslateTabSingleCheckout()
Found the Submit to translator buttonOtherContentEntitySourceUiTest.php87Drupal\tmgmt_content\Tests\ContentEntitySourceUiTest->testNodeTranslateTabSingleCheckout()
Found the requested form fields at OtherContentEntitySourceUiTest.php87Drupal\tmgmt_content\Tests\ContentEntitySourceUiTest->testNodeTranslateTabSingleCheckout()
"Test translation created." foundOtherContentEntitySourceUiTest.php91Drupal\tmgmt_content\Tests\ContentEntitySourceUiTest->testNodeTranslateTabSingleCheckout()
"The translation of jZ0f8ymm to German is finished and can now be reviewed." foundOtherContentEntitySourceUiTest.php95Drupal\tmgmt_content\Tests\ContentEntitySourceUiTest->testNodeTranslateTabSingleCheckout()
Link Needs review does not exist on http://ec2-52-10-99-150.us-west-2.compute.amazonaws.com/checkout/node/1/translationsBrowserContentEntitySourceUiTest.php98Drupal\tmgmt_content\Tests\ContentEntitySourceUiTest->testNodeTranslateTabSingleCheckout()
Found the Save as completed buttonOtherContentEntitySourceUiTest.php99Drupal\tmgmt_content\Tests\ContentEntitySourceUiTest->testNodeTranslateTabSingleCheckout()
Found the requested form fields at OtherContentEntitySourceUiTest.php99Drupal\tmgmt_content\Tests\ContentEntitySourceUiTest->testNodeTranslateTabSingleCheckout()
"The translation for jZ0f8ymm has been accepted." foundOtherContentEntitySourceUiTest.php101Drupal\tmgmt_content\Tests\ContentEntitySourceUiTest->testNodeTranslateTabSingleCheckout()
Link de_jZ0f8ymm does not exist on http://ec2-52-10-99-150.us-west-2.compute.amazonaws.com/checkout/node/1/translationsBrowserContentEntitySourceUiTest.php104Drupal\tmgmt_content\Tests\ContentEntitySourceUiTest->testNodeTranslateTabSingleCheckout()
"de_jZ0f8ymm" foundOtherContentEntitySourceUiTest.php105Drupal\tmgmt_content\Tests\ContentEntitySourceUiTest->testNodeTranslateTabSingleCheckout()
"de_mH3A66ERlZEhXfr3f6py" foundOtherContentEntitySourceUiTest.php106Drupal\tmgmt_content\Tests\ContentEntitySourceUiTest->testNodeTranslateTabSingleCheckout()
"One job needs to be checked out." foundOtherContentEntitySourceUiTest.php119Drupal\tmgmt_content\Tests\ContentEntitySourceUiTest->testNodeTranslateTabSingleCheckout()
"jZ0f8ymm" foundOtherContentEntitySourceUiTest.php120Drupal\tmgmt_content\Tests\ContentEntitySourceUiTest->testNodeTranslateTabSingleCheckout()
Found the Submit to translator buttonOtherContentEntitySourceUiTest.php121Drupal\tmgmt_content\Tests\ContentEntitySourceUiTest->testNodeTranslateTabSingleCheckout()
Found the requested form fields at OtherContentEntitySourceUiTest.php121Drupal\tmgmt_content\Tests\ContentEntitySourceUiTest->testNodeTranslateTabSingleCheckout()
Value 'http://ec2-52-10-99-150.us-west-2.compute.amazonaws.com/checkout/node/1' is equal to value 'http://ec2-52-10-99-150.us-west-2.compute.amazonaws.com/checkout/node/1/translations?destination=node/1'.OtherContentEntitySourceUiTest.php124Drupal\tmgmt_content\Tests\ContentEntitySourceUiTest->testNodeTranslateTabSingleCheckout()
"jZ0f8ymm" not foundOtherContentEntitySourceUiTest.php134Drupal\tmgmt_content\Tests\ContentEntitySourceUiTest->testNodeTranslateTabSingleCheckout()
[28-Jul-2015 14:37:33 UTC] Uncaught PHP Exception Drupal\tmgmt\TMGMTException: "Cannot get the translator." at /var/lib/drupaltestbot/sites/default/files/checkout/sites/default/modules/tmgmt/src/Entity/Job.php line 409 Fatal errorUnknown0Unknown
[28-Jul-2015 14:37:33 UTC] Uncaught PHP Exception Drupal\tmgmt\TMGMTException: "Cannot get the translator." at /var/lib/drupaltestbot/sites/default/files/checkout/sites/default/modules/tmgmt/src/Entity/Job.php line 409 Fatal errorUnknown0Unknown
"2 jobs need to be checked out." foundOtherContentEntitySourceUiTest.php191Drupal\tmgmt_content\Tests\ContentEntitySourceUiTest->testNodeTranslateTabMultipeCheckout()
"b5tt8cpO" foundOtherContentEntitySourceUiTest.php194Drupal\tmgmt_content\Tests\ContentEntitySourceUiTest->testNodeTranslateTabMultipeCheckout()
Found the Submit to translator and continue buttonOtherContentEntitySourceUiTest.php195Drupal\tmgmt_content\Tests\ContentEntitySourceUiTest->testNodeTranslateTabMultipeCheckout()
Found the requested form fields at OtherContentEntitySourceUiTest.php195Drupal\tmgmt_content\Tests\ContentEntitySourceUiTest->testNodeTranslateTabMultipeCheckout()
"b5tt8cpO" foundOtherContentEntitySourceUiTest.php196Drupal\tmgmt_content\Tests\ContentEntitySourceUiTest->testNodeTranslateTabMultipeCheckout()
Found the Submit to translator buttonOtherContentEntitySourceUiTest.php197Drupal\tmgmt_content\Tests\ContentEntitySourceUiTest->testNodeTranslateTabMultipeCheckout()
Found the requested form fields at OtherContentEntitySourceUiTest.php197Drupal\tmgmt_content\Tests\ContentEntitySourceUiTest->testNodeTranslateTabMultipeCheckout()
"Test translation created." foundOtherContentEntitySourceUiTest.php201Drupal\tmgmt_content\Tests\ContentEntitySourceUiTest->testNodeTranslateTabMultipeCheckout()
"The translation for b5tt8cpO has been accepted." foundOtherContentEntitySourceUiTest.php206Drupal\tmgmt_content\Tests\ContentEntitySourceUiTest->testNodeTranslateTabMultipeCheckout()
"de_b5tt8cpO" foundOtherContentEntitySourceUiTest.php211Drupal\tmgmt_content\Tests\ContentEntitySourceUiTest->testNodeTranslateTabMultipeCheckout()
"de_xfxS1P9vuUBw8EUUlM31" foundOtherContentEntitySourceUiTest.php212Drupal\tmgmt_content\Tests\ContentEntitySourceUiTest->testNodeTranslateTabMultipeCheckout()
"es_b5tt8cpO" foundOtherContentEntitySourceUiTest.php215Drupal\tmgmt_content\Tests\ContentEntitySourceUiTest->testNodeTranslateTabMultipeCheckout()
"es_xfxS1P9vuUBw8EUUlM31" foundOtherContentEntitySourceUiTest.php216Drupal\tmgmt_content\Tests\ContentEntitySourceUiTest->testNodeTranslateTabMultipeCheckout()
[28-Jul-2015 14:38:00 UTC] Uncaught PHP Exception Drupal\tmgmt\TMGMTException: "Cannot get the translator." at /var/lib/drupaltestbot/sites/default/files/checkout/sites/default/modules/tmgmt/src/Entity/Job.php line 409 Fatal errorUnknown0Unknown
"2 jobs need to be checked out." foundOtherContentEntitySourceUiTest.php286Drupal\tmgmt_content\Tests\ContentEntitySourceUiTest->testCommentTranslateTab()
"tWl5QsVY" foundOtherContentEntitySourceUiTest.php289Drupal\tmgmt_content\Tests\ContentEntitySourceUiTest->testCommentTranslateTab()
Found the Submit to translator and continue buttonOtherContentEntitySourceUiTest.php290Drupal\tmgmt_content\Tests\ContentEntitySourceUiTest->testCommentTranslateTab()
Found the requested form fields at OtherContentEntitySourceUiTest.php290Drupal\tmgmt_content\Tests\ContentEntitySourceUiTest->testCommentTranslateTab()
"tWl5QsVY" foundOtherContentEntitySourceUiTest.php291Drupal\tmgmt_content\Tests\ContentEntitySourceUiTest->testCommentTranslateTab()
Found the Submit to translator buttonOtherContentEntitySourceUiTest.php292Drupal\tmgmt_content\Tests\ContentEntitySourceUiTest->testCommentTranslateTab()
Found the requested form fields at OtherContentEntitySourceUiTest.php292Drupal\tmgmt_content\Tests\ContentEntitySourceUiTest->testCommentTranslateTab()
"Test translation created." foundOtherContentEntitySourceUiTest.php296Drupal\tmgmt_content\Tests\ContentEntitySourceUiTest->testCommentTranslateTab()
"The translation for tWl5QsVY has been accepted." foundOtherContentEntitySourceUiTest.php301Drupal\tmgmt_content\Tests\ContentEntitySourceUiTest->testCommentTranslateTab()
Link de_tWl5QsVY does not exist on http://ec2-52-10-99-150.us-west-2.compute.amazonaws.com/checkout/comment/1/translationsBrowserContentEntitySourceUiTest.php304Drupal\tmgmt_content\Tests\ContentEntitySourceUiTest->testCommentTranslateTab()
"de_gZy88QM6" foundOtherContentEntitySourceUiTest.php305Drupal\tmgmt_content\Tests\ContentEntitySourceUiTest->testCommentTranslateTab()
Link es_tWl5QsVY does not exist on http://ec2-52-10-99-150.us-west-2.compute.amazonaws.com/checkout/comment/1/translationsBrowserContentEntitySourceUiTest.php309Drupal\tmgmt_content\Tests\ContentEntitySourceUiTest->testCommentTranslateTab()
"es_gZy88QM6" foundOtherContentEntitySourceUiTest.php311Drupal\tmgmt_content\Tests\ContentEntitySourceUiTest->testCommentTranslateTab()
[28-Jul-2015 14:38:29 UTC] Uncaught PHP Exception Drupal\tmgmt\TMGMTException: "Cannot get the translator." at /var/lib/drupaltestbot/sites/default/files/checkout/sites/default/modules/tmgmt/src/Entity/Job.php line 409 Fatal errorUnknown0Unknown
ExpandDrupal\tmgmt_demo\Tests\TMGMTDemoTest2740
MessageGroupFilenameLineFunctionStatus
"2 jobs need to be checked out." foundOtherTMGMTDemoTest.php46Drupal\tmgmt_demo\Tests\TMGMTDemoTest->testInstalled()
"2 jobs need to be checked out." foundOtherTMGMTDemoTest.php52Drupal\tmgmt_demo\Tests\TMGMTDemoTest->testInstalled()
[28-Jul-2015 14:37:35 UTC] Uncaught PHP Exception Drupal\tmgmt\TMGMTException: "Cannot get the translator." at /var/lib/drupaltestbot/sites/default/files/checkout/sites/default/modules/tmgmt/src/Entity/Job.php line 409 Fatal errorUnknown0Unknown
[28-Jul-2015 14:37:36 UTC] Uncaught PHP Exception Drupal\tmgmt\TMGMTException: "Cannot get the translator." at /var/lib/drupaltestbot/sites/default/files/checkout/sites/default/modules/tmgmt/src/Entity/Job.php line 409 Fatal errorUnknown0Unknown
ExpandDrupal\tmgmt_locale\Tests\LocaleSourceUiTest39140
MessageGroupFilenameLineFunctionStatus
"Hello World" foundOtherLocaleSourceUiTest.php76Drupal\tmgmt_locale\Tests\LocaleSourceUiTest->testOverview()
"Locale" foundOtherLocaleSourceUiTest.php77Drupal\tmgmt_locale\Tests\LocaleSourceUiTest->testOverview()
"2" foundOtherLocaleSourceUiTest.php78Drupal\tmgmt_locale\Tests\LocaleSourceUiTest->testOverview()
Failed to set field target_language to gsw-berneOtherLocaleSourceUiTest.php79Drupal\tmgmt_locale\Tests\LocaleSourceUiTest->testOverview()
Found the Submit to translator buttonOtherLocaleSourceUiTest.php79Drupal\tmgmt_locale\Tests\LocaleSourceUiTest->testOverview()
Found the requested form fields at OtherLocaleSourceUiTest.php79Drupal\tmgmt_locale\Tests\LocaleSourceUiTest->testOverview()
Raw "Active job item: Needs review" foundOtherLocaleSourceUiTest.php83Drupal\tmgmt_locale\Tests\LocaleSourceUiTest->testOverview()
Raw "gsw-berne_Hello World" foundOtherLocaleSourceUiTest.php88Drupal\tmgmt_locale\Tests\LocaleSourceUiTest->testOverview()
Found the Save as completed buttonOtherLocaleSourceUiTest.php89Drupal\tmgmt_locale\Tests\LocaleSourceUiTest->testOverview()
Found the requested form fields at OtherLocaleSourceUiTest.php89Drupal\tmgmt_locale\Tests\LocaleSourceUiTest->testOverview()
Value 'Not translated' is equal to value 'Translation up to date'.OtherLocaleSourceUiTest.php97Drupal\tmgmt_locale\Tests\LocaleSourceUiTest->testOverview()
"Hello World" not foundOtherLocaleSourceUiTest.php113Drupal\tmgmt_locale\Tests\LocaleSourceUiTest->testOverview()
[28-Jul-2015 14:37:28 UTC] Uncaught PHP Exception Drupal\tmgmt\TMGMTException: "Cannot get the translator." at /var/lib/drupaltestbot/sites/default/files/checkout/sites/default/modules/tmgmt/src/Entity/Job.php line 409 Fatal errorUnknown0Unknown
[28-Jul-2015 14:37:29 UTC] Uncaught PHP Exception Drupal\tmgmt\TMGMTException: "Cannot get the translator." at /var/lib/drupaltestbot/sites/default/files/checkout/sites/default/modules/tmgmt/src/Entity/Job.php line 409 Fatal errorUnknown0Unknown

All

Test namePassFailException
LeafDrupal\tmgmt\Tests\CrudTest19900
LeafDrupal\tmgmt\Tests\HelperTest4300
LeafDrupal\tmgmt\Tests\LocalTasksTests3100
LeafDrupal\tmgmt\Tests\PluginsTest6500
ExpandDrupal\tmgmt\Tests\TMGMTCartTest4260
MessageGroupFilenameLineFunctionStatus
The test did not complete due to a fatal error.Completion checkTMGMTCartTest.php43Drupal\tmgmt\Tests\TMGMTCartTest->testCartEnforceSourceLanguage()
"One job needs to be checked out." foundOtherTMGMTCartTest.php84Drupal\tmgmt\Tests\TMGMTCartTest->testCartEnforceSourceLanguage()
Raw "One item skipped as for the language English it was not possible to retrieve a translation." foundOtherTMGMTCartTest.php85Drupal\tmgmt\Tests\TMGMTCartTest->testCartEnforceSourceLanguage()
"You have enforced the the job source language which most likely resulted in having a translation of your original content as the job source text. You should review the job translation received from the translator carefully to prevent the content quality loss." foundOtherTMGMTCartTest.php86Drupal\tmgmt\Tests\TMGMTCartTest->testCartEnforceSourceLanguage()
Found the Submit to translator buttonOtherTMGMTCartTest.php91Drupal\tmgmt\Tests\TMGMTCartTest->testCartEnforceSourceLanguage()
Found the requested form fields at OtherTMGMTCartTest.php91Drupal\tmgmt\Tests\TMGMTCartTest->testCartEnforceSourceLanguage()
ExpandDrupal\tmgmt\Tests\TMGMTUiTest359534
MessageGroupFilenameLineFunctionStatus
"test_source:test:1" foundOtherTMGMTUiTest.php68Drupal\tmgmt\Tests\TMGMTUiTest->testCheckoutForm()
"test_source:test:1" foundOtherTMGMTUiTest.php79Drupal\tmgmt\Tests\TMGMTUiTest->testCheckoutForm()
"test_source:test:2" foundOtherTMGMTUiTest.php80Drupal\tmgmt\Tests\TMGMTUiTest->testCheckoutForm()
"test_source:test:3" foundOtherTMGMTUiTest.php81Drupal\tmgmt\Tests\TMGMTUiTest->testCheckoutForm()
Failed to set field target_language to elOtherTMGMTUiTest.php90Drupal\tmgmt\Tests\TMGMTUiTest->testCheckoutForm()
Failed to set field settings[action] to translateOtherTMGMTUiTest.php90Drupal\tmgmt\Tests\TMGMTUiTest->testCheckoutForm()
Found the Submit to translator buttonOtherTMGMTUiTest.php90Drupal\tmgmt\Tests\TMGMTUiTest->testCheckoutForm()
Found the requested form fields at OtherTMGMTUiTest.php90Drupal\tmgmt\Tests\TMGMTUiTest->testCheckoutForm()
"Test translator (auto created) can not translate from English to Greek." foundOtherTMGMTUiTest.php91Drupal\tmgmt\Tests\TMGMTUiTest->testCheckoutForm()
Failed to set field target_language to esOtherTMGMTUiTest.php101Drupal\tmgmt\Tests\TMGMTUiTest->testCheckoutForm()
Failed to set field settings[action] to translateOtherTMGMTUiTest.php101Drupal\tmgmt\Tests\TMGMTUiTest->testCheckoutForm()
Found the Submit to translator buttonOtherTMGMTUiTest.php101Drupal\tmgmt\Tests\TMGMTUiTest->testCheckoutForm()
Found the requested form fields at OtherTMGMTUiTest.php101Drupal\tmgmt\Tests\TMGMTUiTest->testCheckoutForm()
Value false is TRUE.OtherTMGMTUiTest.php105Drupal\tmgmt\Tests\TMGMTUiTest->testCheckoutForm()
Value false is TRUE.OtherTMGMTUiTest.php108Drupal\tmgmt\Tests\TMGMTUiTest->testCheckoutForm()
Value false is TRUE.OtherTMGMTUiTest.php108Drupal\tmgmt\Tests\TMGMTUiTest->testCheckoutForm()
Value false is TRUE.OtherTMGMTUiTest.php108Drupal\tmgmt\Tests\TMGMTUiTest->testCheckoutForm()
"Test translation created" foundOtherTMGMTUiTest.php110Drupal\tmgmt\Tests\TMGMTUiTest->testCheckoutForm()
"Job overview" foundOtherTMGMTUiTest.php114Drupal\tmgmt\Tests\TMGMTUiTest->testCheckoutForm()
Value '1' is not equal to value '1'.OtherTMGMTUiTest.php120Drupal\tmgmt\Tests\TMGMTUiTest->testCheckoutForm()
"You can provide a label for this job in order to identify it easily later on." foundOtherTMGMTUiTest.php127Drupal\tmgmt\Tests\TMGMTUiTest->testCheckoutForm()
"test_source:test:1" foundOtherTMGMTUiTest.php128Drupal\tmgmt\Tests\TMGMTUiTest->testCheckoutForm()
Failed to set field target_language to esOtherTMGMTUiTest.php134Drupal\tmgmt\Tests\TMGMTUiTest->testCheckoutForm()
Failed to set field settings[action] to submitOtherTMGMTUiTest.php134Drupal\tmgmt\Tests\TMGMTUiTest->testCheckoutForm()
Found the Submit to translator buttonOtherTMGMTUiTest.php134Drupal\tmgmt\Tests\TMGMTUiTest->testCheckoutForm()
Found the requested form fields at OtherTMGMTUiTest.php134Drupal\tmgmt\Tests\TMGMTUiTest->testCheckoutForm()
"Test submit" foundOtherTMGMTUiTest.php135Drupal\tmgmt\Tests\TMGMTUiTest->testCheckoutForm()
Value false is TRUE.OtherTMGMTUiTest.php137Drupal\tmgmt\Tests\TMGMTUiTest->testCheckoutForm()
Drupal\tmgmt\TMGMTException: Cannot get the translator. in Drupal\tmgmt\Entity\Job->getTranslator() (line 409 of /var/lib/drupaltestbot/sites/default/files/checkout/sites/default/modules/tmgmt/src/Entity/Job.php). Drupal\tmgmt\Entity\Job->getTranslator() Drupal\tmgmt\Entity\Job->getSetting('action') Drupal\tmgmt_test\Plugin\tmgmt\Translator\TestTranslator->canTranslate(Object, Object) Drupal\tmgmt\Entity\Translator->canTranslate(Object) tmgmt_translator_load_available(Object) tmgmt_job_needs_checkout_form(Object) tmgmt_job_checkout_multiple(Array) Drupal\tmgmt\Tests\TMGMTUiTest->testCheckoutForm() Drupal\simpletest\TestBase->run(Array) simpletest_script_run_one_test('13', 'Drupal\tmgmt\Tests\TMGMTUiTest') Uncaught exceptionJob.php409Drupal\tmgmt\Entity\Job->getTranslator()
[28-Jul-2015 14:37:29 UTC] Uncaught PHP Exception Drupal\tmgmt\TMGMTException: "Cannot get the translator." at /var/lib/drupaltestbot/sites/default/files/checkout/sites/default/modules/tmgmt/src/Entity/Job.php line 409 Fatal errorUnknown0Unknown
[28-Jul-2015 14:37:29 UTC] Uncaught PHP Exception Drupal\tmgmt\TMGMTException: "Cannot get the translator." at /var/lib/drupaltestbot/sites/default/files/checkout/sites/default/modules/tmgmt/src/Entity/Job.php line 409 Fatal errorUnknown0Unknown
[28-Jul-2015 14:37:29 UTC] Uncaught PHP Exception Drupal\tmgmt\TMGMTException: "Cannot get the translator." at /var/lib/drupaltestbot/sites/default/files/checkout/sites/default/modules/tmgmt/src/Entity/Job.php line 409 Fatal errorUnknown0Unknown
Drupal\tmgmt\TMGMTException: Cannot get the translator. in Drupal\tmgmt\Entity\Job->getTranslator() (line 409 of /var/lib/drupaltestbot/sites/default/files/checkout/sites/default/modules/tmgmt/src/Entity/Job.php). Drupal\tmgmt\Entity\Job->getTranslator() Drupal\tmgmt\Entity\Job->getSetting('action') Drupal\tmgmt_test\Plugin\tmgmt\Translator\TestTranslator->canTranslate(Object, Object) Drupal\tmgmt\Entity\Translator->canTranslate(Object) tmgmt_translator_load_available(Object) tmgmt_job_needs_checkout_form(Object) tmgmt_job_checkout_multiple(Array) Drupal\tmgmt\Tests\TMGMTUiTest->testCheckoutFunction() Drupal\simpletest\TestBase->run(Array) simpletest_script_run_one_test('13', 'Drupal\tmgmt\Tests\TMGMTUiTest') Uncaught exceptionJob.php409Drupal\tmgmt\Entity\Job->getTranslator()
Drupal\tmgmt\TMGMTException: Cannot get the translator. in Drupal\tmgmt\Entity\Job->getTranslator() (line 409 of /var/lib/drupaltestbot/sites/default/files/checkout/sites/default/modules/tmgmt/src/Entity/Job.php). Drupal\tmgmt\Entity\Job->getTranslator() Drupal\tmgmt\Entity\Job->getSetting('action') Drupal\tmgmt_test\Plugin\tmgmt\Translator\TestTranslator->canTranslate(Object, Object) Drupal\tmgmt\Entity\Translator->canTranslate(Object) tmgmt_translator_load_available(Object) tmgmt_job_needs_checkout_form(Object) tmgmt_job_checkout_multiple(Array) Drupal\tmgmt\Tests\TMGMTUiTest->testSuggestions() Drupal\simpletest\TestBase->run(Array) simpletest_script_run_one_test('13', 'Drupal\tmgmt\Tests\TMGMTUiTest') Uncaught exceptionJob.php409Drupal\tmgmt\Entity\Job->getTranslator()
Failed to set field target_language to esOtherTMGMTUiTest.php548Drupal\tmgmt\Tests\TMGMTUiTest->testAbortJob()
Failed to set field settings[action] to translateOtherTMGMTUiTest.php548Drupal\tmgmt\Tests\TMGMTUiTest->testAbortJob()
Found the Submit to translator buttonOtherTMGMTUiTest.php548Drupal\tmgmt\Tests\TMGMTUiTest->testAbortJob()
Found the requested form fields at admin/tmgmt/jobs/1OtherTMGMTUiTest.php548Drupal\tmgmt\Tests\TMGMTUiTest->testAbortJob()
Found the Abort job buttonOtherTMGMTUiTest.php551Drupal\tmgmt\Tests\TMGMTUiTest->testAbortJob()
Found the requested form fields at admin/tmgmt/jobs/1OtherTMGMTUiTest.php551Drupal\tmgmt\Tests\TMGMTUiTest->testAbortJob()
Found the Confirm buttonOtherTMGMTUiTest.php552Drupal\tmgmt\Tests\TMGMTUiTest->testAbortJob()
Found the requested form fields at OtherTMGMTUiTest.php552Drupal\tmgmt\Tests\TMGMTUiTest->testAbortJob()
Value false is TRUE.OtherTMGMTUiTest.php556Drupal\tmgmt\Tests\TMGMTUiTest->testAbortJob()
Value false is TRUE.OtherTMGMTUiTest.php558Drupal\tmgmt\Tests\TMGMTUiTest->testAbortJob()
Value false is TRUE.OtherTMGMTUiTest.php558Drupal\tmgmt\Tests\TMGMTUiTest->testAbortJob()
Value false is TRUE.OtherTMGMTUiTest.php558Drupal\tmgmt\Tests\TMGMTUiTest->testAbortJob()
Found the Resubmit buttonOtherTMGMTUiTest.php562Drupal\tmgmt\Tests\TMGMTUiTest->testAbortJob()
Found the requested form fields at admin/tmgmt/jobs/1OtherTMGMTUiTest.php562Drupal\tmgmt\Tests\TMGMTUiTest->testAbortJob()
Found the Confirm buttonOtherTMGMTUiTest.php563Drupal\tmgmt\Tests\TMGMTUiTest->testAbortJob()
Found the requested form fields at OtherTMGMTUiTest.php563Drupal\tmgmt\Tests\TMGMTUiTest->testAbortJob()
Raw "This job is a duplicate of the previously aborted job #1" foundOtherTMGMTUiTest.php566Drupal\tmgmt\Tests\TMGMTUiTest->testAbortJob()
Drupal\tmgmt\TMGMTException: Cannot get the translator. in Drupal\tmgmt\Entity\Job->getTranslator() (line 409 of /var/lib/drupaltestbot/sites/default/files/checkout/sites/default/modules/tmgmt/src/Entity/Job.php). Drupal\tmgmt\Entity\Job->getTranslator() Drupal\tmgmt\Tests\TMGMTUiTest->testAbortJob() Drupal\simpletest\TestBase->run(Array) simpletest_script_run_one_test('13', 'Drupal\tmgmt\Tests\TMGMTUiTest') Uncaught exceptionJob.php409Drupal\tmgmt\Entity\Job->getTranslator()
[28-Jul-2015 14:38:53 UTC] Uncaught PHP Exception Drupal\tmgmt\TMGMTException: "Cannot get the translator." at /var/lib/drupaltestbot/sites/default/files/checkout/sites/default/modules/tmgmt/src/Entity/Job.php line 409 Fatal errorUnknown0Unknown
[28-Jul-2015 14:38:53 UTC] Uncaught PHP Exception Drupal\tmgmt\TMGMTException: "Cannot get the translator." at /var/lib/drupaltestbot/sites/default/files/checkout/sites/default/modules/tmgmt/src/Entity/Job.php line 409 Fatal errorUnknown0Unknown
[28-Jul-2015 14:38:54 UTC] Uncaught PHP Exception Drupal\tmgmt\TMGMTException: "Cannot get the translator." at /var/lib/drupaltestbot/sites/default/files/checkout/sites/default/modules/tmgmt/src/Entity/Job.php line 409 Fatal errorUnknown0Unknown
"4 jobs need to be checked out." foundOtherTMGMTUiTest.php689Drupal\tmgmt\Tests\TMGMTUiTest->testCart()
[28-Jul-2015 14:39:17 UTC] Uncaught PHP Exception Drupal\tmgmt\TMGMTException: "Cannot get the translator." at /var/lib/drupaltestbot/sites/default/files/checkout/sites/default/modules/tmgmt/src/Entity/Job.php line 409 Fatal errorUnknown0Unknown
ExpandDrupal\tmgmt\Tests\TranslatorTest3840
MessageGroupFilenameLineFunctionStatus
"Add translator" foundOtherTranslatorTest.php65Drupal\tmgmt\Tests\TranslatorTest->testTranslatorHandling()
"b95gLv0I" not foundOtherTranslatorTest.php66Drupal\tmgmt\Tests\TranslatorTest->testTranslatorHandling()
"There are no translator plugins available. Please install a translator plugin." foundOtherTranslatorTest.php75Drupal\tmgmt\Tests\TranslatorTest->testTranslatorHandling()
[28-Jul-2015 14:37:28 UTC] Uncaught PHP Exception Drupal\Component\Plugin\Exception\PluginNotFoundException: "The "test_translator" plugin does not exist." at /var/lib/drupaltestbot/sites/default/files/checkout/core/lib/Drupal/Component/Plugin/Discovery/DiscoveryTrait.php line 57 Fatal errorUnknown0Unknown
LeafDrupal\tmgmt\Tests\TranslatorUITest2700
ExpandDrupal\tmgmt_config\Tests\ConfigSourceListTest165634
MessageGroupFilenameLineFunctionStatus
"One job needs to be checked out." foundOtherConfigSourceListTest.php65Drupal\tmgmt_config\Tests\ConfigSourceListTest->testNodeTypeSubmissions()
"Article content type (English to ?, Unprocessed)" foundOtherConfigSourceListTest.php66Drupal\tmgmt_config\Tests\ConfigSourceListTest->testNodeTypeSubmissions()
Found the Submit to translator buttonOtherConfigSourceListTest.php69Drupal\tmgmt_config\Tests\ConfigSourceListTest->testNodeTypeSubmissions()
Found the requested form fields at OtherConfigSourceListTest.php69Drupal\tmgmt_config\Tests\ConfigSourceListTest->testNodeTypeSubmissions()
"Test translation created." foundOtherConfigSourceListTest.php74Drupal\tmgmt_config\Tests\ConfigSourceListTest->testNodeTypeSubmissions()
"The translation of Article content type to German is finished and can now be reviewed." foundOtherConfigSourceListTest.php75Drupal\tmgmt_config\Tests\ConfigSourceListTest->testNodeTypeSubmissions()
"One job needs to be checked out." foundOtherConfigSourceListTest.php86Drupal\tmgmt_config\Tests\ConfigSourceListTest->testNodeTypeSubmissions()
"Article content type and 1 more (English to ?, Unprocessed)" foundOtherConfigSourceListTest.php87Drupal\tmgmt_config\Tests\ConfigSourceListTest->testNodeTypeSubmissions()
Found the Submit to translator buttonOtherConfigSourceListTest.php90Drupal\tmgmt_config\Tests\ConfigSourceListTest->testNodeTypeSubmissions()
Found the requested form fields at OtherConfigSourceListTest.php90Drupal\tmgmt_config\Tests\ConfigSourceListTest->testNodeTypeSubmissions()
"Test translation created." foundOtherConfigSourceListTest.php95Drupal\tmgmt_config\Tests\ConfigSourceListTest->testNodeTypeSubmissions()
"The translation of Article content type to German is finished and can now be reviewed." foundOtherConfigSourceListTest.php96Drupal\tmgmt_config\Tests\ConfigSourceListTest->testNodeTypeSubmissions()
"The translation of Page content type to German is finished and can now be reviewed." foundOtherConfigSourceListTest.php97Drupal\tmgmt_config\Tests\ConfigSourceListTest->testNodeTypeSubmissions()
[28-Jul-2015 14:37:33 UTC] Uncaught PHP Exception Drupal\tmgmt\TMGMTException: "Cannot get the translator." at /var/lib/drupaltestbot/sites/default/files/checkout/sites/default/modules/tmgmt/src/Entity/Job.php line 409 Fatal errorUnknown0Unknown
[28-Jul-2015 14:37:34 UTC] Uncaught PHP Exception Drupal\tmgmt\TMGMTException: "Cannot get the translator." at /var/lib/drupaltestbot/sites/default/files/checkout/sites/default/modules/tmgmt/src/Entity/Job.php line 409 Fatal errorUnknown0Unknown
"One job needs to be checked out." foundOtherConfigSourceListTest.php114Drupal\tmgmt_config\Tests\ConfigSourceListTest->testViewTranslation()
"Archive view (English to ?, Unprocessed)" foundOtherConfigSourceListTest.php115Drupal\tmgmt_config\Tests\ConfigSourceListTest->testViewTranslation()
Found the Submit to translator buttonOtherConfigSourceListTest.php118Drupal\tmgmt_config\Tests\ConfigSourceListTest->testViewTranslation()
Found the requested form fields at OtherConfigSourceListTest.php118Drupal\tmgmt_config\Tests\ConfigSourceListTest->testViewTranslation()
"Test translation created." foundOtherConfigSourceListTest.php123Drupal\tmgmt_config\Tests\ConfigSourceListTest->testViewTranslation()
"The translation of Archive view to German is finished and can now be reviewed." foundOtherConfigSourceListTest.php124Drupal\tmgmt_config\Tests\ConfigSourceListTest->testViewTranslation()
Failed to set field items[views.view.archive] to 1OtherConfigSourceListTest.php134Drupal\tmgmt_config\Tests\ConfigSourceListTest->testViewTranslation()
Failed to set field items[views.view.content_recent] to 1OtherConfigSourceListTest.php134Drupal\tmgmt_config\Tests\ConfigSourceListTest->testViewTranslation()
Failed to set field items[views.view.content] to 1OtherConfigSourceListTest.php134Drupal\tmgmt_config\Tests\ConfigSourceListTest->testViewTranslation()
Failed to set field items[views.view.tmgmt_job_overview] to 1OtherConfigSourceListTest.php134Drupal\tmgmt_config\Tests\ConfigSourceListTest->testViewTranslation()
Found the Request translation buttonOtherConfigSourceListTest.php134Drupal\tmgmt_config\Tests\ConfigSourceListTest->testViewTranslation()
Found the requested form fields at OtherConfigSourceListTest.php134Drupal\tmgmt_config\Tests\ConfigSourceListTest->testViewTranslation()
"One job needs to be checked out." foundOtherConfigSourceListTest.php137Drupal\tmgmt_config\Tests\ConfigSourceListTest->testViewTranslation()
"Archive view and 3 more (English to ?, Unprocessed)" foundOtherConfigSourceListTest.php138Drupal\tmgmt_config\Tests\ConfigSourceListTest->testViewTranslation()
Found the Submit to translator buttonOtherConfigSourceListTest.php141Drupal\tmgmt_config\Tests\ConfigSourceListTest->testViewTranslation()
Found the requested form fields at OtherConfigSourceListTest.php141Drupal\tmgmt_config\Tests\ConfigSourceListTest->testViewTranslation()
"Test translation created." foundOtherConfigSourceListTest.php146Drupal\tmgmt_config\Tests\ConfigSourceListTest->testViewTranslation()
"The translation of Archive view to German is finished and can now be reviewed." foundOtherConfigSourceListTest.php147Drupal\tmgmt_config\Tests\ConfigSourceListTest->testViewTranslation()
"The translation of Recent content view to German is finished and can now be reviewed." foundOtherConfigSourceListTest.php148Drupal\tmgmt_config\Tests\ConfigSourceListTest->testViewTranslation()
"The translation of Content view to German is finished and can now be reviewed." foundOtherConfigSourceListTest.php149Drupal\tmgmt_config\Tests\ConfigSourceListTest->testViewTranslation()
"The translation of Job overview view to German is finished and can now be reviewed." foundOtherConfigSourceListTest.php150Drupal\tmgmt_config\Tests\ConfigSourceListTest->testViewTranslation()
Failed to set field items[views.view.tmgmt_job_items] to 1OtherConfigSourceListTest.php156Drupal\tmgmt_config\Tests\ConfigSourceListTest->testViewTranslation()
Found the Add to cart buttonOtherConfigSourceListTest.php156Drupal\tmgmt_config\Tests\ConfigSourceListTest->testViewTranslation()
Found the requested form fields at OtherConfigSourceListTest.php156Drupal\tmgmt_config\Tests\ConfigSourceListTest->testViewTranslation()
Link cart does not exist on http://ec2-52-10-99-150.us-west-2.compute.amazonaws.com/checkout/admin/tmgmt/sources/config/viewBrowserConfigSourceListTest.php157Drupal\tmgmt_config\Tests\ConfigSourceListTest->testViewTranslation()
Undefined offset: 0Drupal\tmgmt_config\Tests\ConfigSourceListTest->testViewTranslation() Drupal\simpletest\TestBase->run(Array) simpletest_script_run_one_test('10', 'Drupal\tmgmt_config\Tests\ConfigSourceListTest') NoticeConfigSourceListTest.php160Drupal\tmgmt_config\Tests\ConfigSourceListTest->testViewTranslation()
Trying to get property of non-objectDrupal\tmgmt_config\Tests\ConfigSourceListTest->testViewTranslation() Drupal\simpletest\TestBase->run(Array) simpletest_script_run_one_test('10', 'Drupal\tmgmt_config\Tests\ConfigSourceListTest') NoticeConfigSourceListTest.php160Drupal\tmgmt_config\Tests\ConfigSourceListTest->testViewTranslation()
Value '' is equal to value 'Cart'.OtherConfigSourceListTest.php161Drupal\tmgmt_config\Tests\ConfigSourceListTest->testViewTranslation()
Page title '' is equal to 'Cart | Drupal'.OtherConfigSourceListTest.php162Drupal\tmgmt_config\Tests\ConfigSourceListTest->testViewTranslation()
"Request translation" foundOtherConfigSourceListTest.php163Drupal\tmgmt_config\Tests\ConfigSourceListTest->testViewTranslation()
[28-Jul-2015 14:37:58 UTC] Uncaught PHP Exception Drupal\tmgmt\TMGMTException: "Cannot get the translator." at /var/lib/drupaltestbot/sites/default/files/checkout/sites/default/modules/tmgmt/src/Entity/Job.php line 409 Fatal errorUnknown0Unknown
"One job needs to be checked out." foundOtherConfigSourceListTest.php244Drupal\tmgmt_config\Tests\ConfigSourceListTest->testSimpleConfigTranslation()
"System information (English to ?, Unprocessed)" foundOtherConfigSourceListTest.php245Drupal\tmgmt_config\Tests\ConfigSourceListTest->testSimpleConfigTranslation()
Found the Submit to translator buttonOtherConfigSourceListTest.php248Drupal\tmgmt_config\Tests\ConfigSourceListTest->testSimpleConfigTranslation()
Found the requested form fields at OtherConfigSourceListTest.php248Drupal\tmgmt_config\Tests\ConfigSourceListTest->testSimpleConfigTranslation()
Raw "href="/checkout/admin/tmgmt/items/1?destination=admin/tmgmt/sources/config/_simple_config" title="Active job item: Needs review"" foundOtherConfigSourceListTest.php257Drupal\tmgmt_config\Tests\ConfigSourceListTest->testSimpleConfigTranslation()
"Test translation created." foundOtherConfigSourceListTest.php259Drupal\tmgmt_config\Tests\ConfigSourceListTest->testSimpleConfigTranslation()
"The translation of System information to German is finished and can now be reviewed." foundOtherConfigSourceListTest.php260Drupal\tmgmt_config\Tests\ConfigSourceListTest->testSimpleConfigTranslation()
Undefined offset: 0Drupal\tmgmt_config\Tests\ConfigSourceListTest->testSimpleConfigTranslation() Drupal\simpletest\TestBase->run(Array) simpletest_script_run_one_test('10', 'Drupal\tmgmt_config\Tests\ConfigSourceListTest') NoticeConfigSourceListTest.php264Drupal\tmgmt_config\Tests\ConfigSourceListTest->testSimpleConfigTranslation()
Uninitialized string offset: 0Drupal\simpletest\WebTestBase->getAbsoluteUrl(NULL) Drupal\tmgmt_config\Tests\ConfigSourceListTest->testSimpleConfigTranslation() Drupal\simpletest\TestBase->run(Array) simpletest_script_run_one_test('10', 'Drupal\tmgmt_config\Tests\ConfigSourceListTest') NoticeWebTestBase.php2475Drupal\simpletest\WebTestBase->getAbsoluteUrl()
Found the Save buttonOtherConfigSourceListTest.php266Drupal\tmgmt_config\Tests\ConfigSourceListTest->testSimpleConfigTranslation()
Found the requested form fields at OtherConfigSourceListTest.php266Drupal\tmgmt_config\Tests\ConfigSourceListTest->testSimpleConfigTranslation()
Failed to set field items[entity.user.admin_form] to 1OtherConfigSourceListTest.php272Drupal\tmgmt_config\Tests\ConfigSourceListTest->testSimpleConfigTranslation()
Found the Request translation buttonOtherConfigSourceListTest.php272Drupal\tmgmt_config\Tests\ConfigSourceListTest->testSimpleConfigTranslation()
Found the requested form fields at OtherConfigSourceListTest.php272Drupal\tmgmt_config\Tests\ConfigSourceListTest->testSimpleConfigTranslation()
"One job needs to be checked out." foundOtherConfigSourceListTest.php275Drupal\tmgmt_config\Tests\ConfigSourceListTest->testSimpleConfigTranslation()
"Account settings (English to ?, Unprocessed)" foundOtherConfigSourceListTest.php276Drupal\tmgmt_config\Tests\ConfigSourceListTest->testSimpleConfigTranslation()
Found the Submit to translator buttonOtherConfigSourceListTest.php277Drupal\tmgmt_config\Tests\ConfigSourceListTest->testSimpleConfigTranslation()
Found the requested form fields at OtherConfigSourceListTest.php277Drupal\tmgmt_config\Tests\ConfigSourceListTest->testSimpleConfigTranslation()
Expected 'http://ec2-52-10-99-150.us-west-2.compute.amazonaws.com/checkout/admin/tmgmt/sources/config/_simple_config' matches current URL (http://ec2-52-10-99-150.us-west-2.compute.amazonaws.com/checkout/user/4).OtherConfigSourceListTest.php280Drupal\tmgmt_config\Tests\ConfigSourceListTest->testSimpleConfigTranslation()
Value 0 is equal to value 2.OtherConfigSourceListTest.php288Drupal\tmgmt_config\Tests\ConfigSourceListTest->testSimpleConfigTranslation()
[28-Jul-2015 14:38:52 UTC] Uncaught PHP Exception Drupal\tmgmt\TMGMTException: "Cannot get the translator." at /var/lib/drupaltestbot/sites/default/files/checkout/sites/default/modules/tmgmt/src/Entity/Job.php line 409 Fatal errorUnknown0Unknown
ExpandDrupal\tmgmt_config\Tests\ConfigSourceUiTest173520
MessageGroupFilenameLineFunctionStatus
"One job needs to be checked out." foundOtherConfigSourceUiTest.php68Drupal\tmgmt_config\Tests\ConfigSourceUiTest->testNodeTypeTranslateTabSingleCheckout()
"Article content type (English to German, Unprocessed)" foundOtherConfigSourceUiTest.php69Drupal\tmgmt_config\Tests\ConfigSourceUiTest->testNodeTypeTranslateTabSingleCheckout()
Found the Submit to translator buttonOtherConfigSourceUiTest.php72Drupal\tmgmt_config\Tests\ConfigSourceUiTest->testNodeTypeTranslateTabSingleCheckout()
Found the requested form fields at OtherConfigSourceUiTest.php72Drupal\tmgmt_config\Tests\ConfigSourceUiTest->testNodeTypeTranslateTabSingleCheckout()
Link Needs review does not exist on http://ec2-52-10-99-150.us-west-2.compute.amazonaws.com/checkout/admin/structure/types/manage/article/translateBrowserConfigSourceUiTest.php89Drupal\tmgmt_config\Tests\ConfigSourceUiTest->testNodeTypeTranslateTabSingleCheckout()
Found the Save as completed buttonOtherConfigSourceUiTest.php90Drupal\tmgmt_config\Tests\ConfigSourceUiTest->testNodeTypeTranslateTabSingleCheckout()
Found the requested form fields at OtherConfigSourceUiTest.php90Drupal\tmgmt_config\Tests\ConfigSourceUiTest->testNodeTypeTranslateTabSingleCheckout()
"One job needs to be checked out." foundOtherConfigSourceUiTest.php99Drupal\tmgmt_config\Tests\ConfigSourceUiTest->testNodeTypeTranslateTabSingleCheckout()
"Article content type (English to Spanish, Unprocessed)" foundOtherConfigSourceUiTest.php100Drupal\tmgmt_config\Tests\ConfigSourceUiTest->testNodeTypeTranslateTabSingleCheckout()
Found the Submit to translator buttonOtherConfigSourceUiTest.php101Drupal\tmgmt_config\Tests\ConfigSourceUiTest->testNodeTypeTranslateTabSingleCheckout()
Found the requested form fields at OtherConfigSourceUiTest.php101Drupal\tmgmt_config\Tests\ConfigSourceUiTest->testNodeTypeTranslateTabSingleCheckout()
Value 0 is equal to value 2.OtherConfigSourceUiTest.php115Drupal\tmgmt_config\Tests\ConfigSourceUiTest->testNodeTypeTranslateTabSingleCheckout()
[28-Jul-2015 14:37:32 UTC] Uncaught PHP Exception Drupal\tmgmt\TMGMTException: "Cannot get the translator." at /var/lib/drupaltestbot/sites/default/files/checkout/sites/default/modules/tmgmt/src/Entity/Job.php line 409 Fatal errorUnknown0Unknown
[28-Jul-2015 14:37:32 UTC] Uncaught PHP Exception Drupal\tmgmt\TMGMTException: "Cannot get the translator." at /var/lib/drupaltestbot/sites/default/files/checkout/sites/default/modules/tmgmt/src/Entity/Job.php line 409 Fatal errorUnknown0Unknown
"2 jobs need to be checked out." foundOtherConfigSourceUiTest.php145Drupal\tmgmt_config\Tests\ConfigSourceUiTest->testNodeTypeTranslateTabMultipeCheckout()
"Article content type (English to German, Unprocessed)" foundOtherConfigSourceUiTest.php148Drupal\tmgmt_config\Tests\ConfigSourceUiTest->testNodeTypeTranslateTabMultipeCheckout()
Found the Submit to translator and continue buttonOtherConfigSourceUiTest.php149Drupal\tmgmt_config\Tests\ConfigSourceUiTest->testNodeTypeTranslateTabMultipeCheckout()
Found the requested form fields at OtherConfigSourceUiTest.php149Drupal\tmgmt_config\Tests\ConfigSourceUiTest->testNodeTypeTranslateTabMultipeCheckout()
"Article content type (English to Spanish, Unprocessed)" foundOtherConfigSourceUiTest.php150Drupal\tmgmt_config\Tests\ConfigSourceUiTest->testNodeTypeTranslateTabMultipeCheckout()
Found the Submit to translator buttonOtherConfigSourceUiTest.php151Drupal\tmgmt_config\Tests\ConfigSourceUiTest->testNodeTypeTranslateTabMultipeCheckout()
Found the requested form fields at OtherConfigSourceUiTest.php151Drupal\tmgmt_config\Tests\ConfigSourceUiTest->testNodeTypeTranslateTabMultipeCheckout()
"Test translation created." foundOtherConfigSourceUiTest.php155Drupal\tmgmt_config\Tests\ConfigSourceUiTest->testNodeTypeTranslateTabMultipeCheckout()
Value 0 is equal to value 2.OtherConfigSourceUiTest.php170Drupal\tmgmt_config\Tests\ConfigSourceUiTest->testNodeTypeTranslateTabMultipeCheckout()
[28-Jul-2015 14:37:55 UTC] Uncaught PHP Exception Drupal\tmgmt\TMGMTException: "Cannot get the translator." at /var/lib/drupaltestbot/sites/default/files/checkout/sites/default/modules/tmgmt/src/Entity/Job.php line 409 Fatal errorUnknown0Unknown
"One job needs to be checked out." foundOtherConfigSourceUiTest.php193Drupal\tmgmt_config\Tests\ConfigSourceUiTest->testViewTranslateTabSingleCheckout()
"Content view (English to German, Unprocessed)" foundOtherConfigSourceUiTest.php194Drupal\tmgmt_config\Tests\ConfigSourceUiTest->testViewTranslateTabSingleCheckout()
Found the Submit to translator buttonOtherConfigSourceUiTest.php197Drupal\tmgmt_config\Tests\ConfigSourceUiTest->testViewTranslateTabSingleCheckout()
Found the requested form fields at OtherConfigSourceUiTest.php197Drupal\tmgmt_config\Tests\ConfigSourceUiTest->testViewTranslateTabSingleCheckout()
Link Needs review does not exist on http://ec2-52-10-99-150.us-west-2.compute.amazonaws.com/checkout/admin/structure/views/view/content/translateBrowserConfigSourceUiTest.php214Drupal\tmgmt_config\Tests\ConfigSourceUiTest->testViewTranslateTabSingleCheckout()
Found the Save as completed buttonOtherConfigSourceUiTest.php215Drupal\tmgmt_config\Tests\ConfigSourceUiTest->testViewTranslateTabSingleCheckout()
Found the requested form fields at OtherConfigSourceUiTest.php215Drupal\tmgmt_config\Tests\ConfigSourceUiTest->testViewTranslateTabSingleCheckout()
"One job needs to be checked out." foundOtherConfigSourceUiTest.php224Drupal\tmgmt_config\Tests\ConfigSourceUiTest->testViewTranslateTabSingleCheckout()
"Content view (English to Spanish, Unprocessed)" foundOtherConfigSourceUiTest.php225Drupal\tmgmt_config\Tests\ConfigSourceUiTest->testViewTranslateTabSingleCheckout()
Found the Submit to translator buttonOtherConfigSourceUiTest.php226Drupal\tmgmt_config\Tests\ConfigSourceUiTest->testViewTranslateTabSingleCheckout()
Found the requested form fields at OtherConfigSourceUiTest.php226Drupal\tmgmt_config\Tests\ConfigSourceUiTest->testViewTranslateTabSingleCheckout()
Value 0 is equal to value 2.OtherConfigSourceUiTest.php240Drupal\tmgmt_config\Tests\ConfigSourceUiTest->testViewTranslateTabSingleCheckout()
[28-Jul-2015 14:38:19 UTC] Uncaught PHP Exception Drupal\tmgmt\TMGMTException: "Cannot get the translator." at /var/lib/drupaltestbot/sites/default/files/checkout/sites/default/modules/tmgmt/src/Entity/Job.php line 409 Fatal errorUnknown0Unknown
[28-Jul-2015 14:38:19 UTC] Uncaught PHP Exception Drupal\tmgmt\TMGMTException: "Cannot get the translator." at /var/lib/drupaltestbot/sites/default/files/checkout/sites/default/modules/tmgmt/src/Entity/Job.php line 409 Fatal errorUnknown0Unknown
"One job needs to be checked out." foundOtherConfigSourceUiTest.php283Drupal\tmgmt_config\Tests\ConfigSourceUiTest->testSimpleConfiguration()
"System information (English to German, Unprocessed)" foundOtherConfigSourceUiTest.php284Drupal\tmgmt_config\Tests\ConfigSourceUiTest->testSimpleConfiguration()
Found the Submit to translator buttonOtherConfigSourceUiTest.php287Drupal\tmgmt_config\Tests\ConfigSourceUiTest->testSimpleConfiguration()
Found the requested form fields at OtherConfigSourceUiTest.php287Drupal\tmgmt_config\Tests\ConfigSourceUiTest->testSimpleConfiguration()
Link Needs review does not exist on http://ec2-52-10-99-150.us-west-2.compute.amazonaws.com/checkout/admin/config/system/site-information/translateBrowserConfigSourceUiTest.php304Drupal\tmgmt_config\Tests\ConfigSourceUiTest->testSimpleConfiguration()
Found the Save buttonOtherConfigSourceUiTest.php305Drupal\tmgmt_config\Tests\ConfigSourceUiTest->testSimpleConfiguration()
Found the requested form fields at OtherConfigSourceUiTest.php305Drupal\tmgmt_config\Tests\ConfigSourceUiTest->testSimpleConfiguration()
"One job needs to be checked out." foundOtherConfigSourceUiTest.php314Drupal\tmgmt_config\Tests\ConfigSourceUiTest->testSimpleConfiguration()
"System information (English to Spanish, Unprocessed)" foundOtherConfigSourceUiTest.php315Drupal\tmgmt_config\Tests\ConfigSourceUiTest->testSimpleConfiguration()
Found the Submit to translator buttonOtherConfigSourceUiTest.php316Drupal\tmgmt_config\Tests\ConfigSourceUiTest->testSimpleConfiguration()
Found the requested form fields at OtherConfigSourceUiTest.php316Drupal\tmgmt_config\Tests\ConfigSourceUiTest->testSimpleConfiguration()
Value 0 is equal to value 2.OtherConfigSourceUiTest.php330Drupal\tmgmt_config\Tests\ConfigSourceUiTest->testSimpleConfiguration()
[28-Jul-2015 14:39:07 UTC] Uncaught PHP Exception Drupal\tmgmt\TMGMTException: "Cannot get the translator." at /var/lib/drupaltestbot/sites/default/files/checkout/sites/default/modules/tmgmt/src/Entity/Job.php line 409 Fatal errorUnknown0Unknown
[28-Jul-2015 14:39:08 UTC] Uncaught PHP Exception Drupal\tmgmt\TMGMTException: "Cannot get the translator." at /var/lib/drupaltestbot/sites/default/files/checkout/sites/default/modules/tmgmt/src/Entity/Job.php line 409 Fatal errorUnknown0Unknown
LeafDrupal\tmgmt_config\Tests\ConfigSourceUnitTest3900
ExpandDrupal\tmgmt_content\Tests\ContentEntitySourceListTest14060
MessageGroupFilenameLineFunctionStatus
"One job needs to be checked out." foundOtherContentEntitySourceListTest.php180Drupal\tmgmt_content\Tests\ContentEntitySourceListTest->testTranslationSubmissions()
"One job needs to be checked out." foundOtherContentEntitySourceListTest.php189Drupal\tmgmt_content\Tests\ContentEntitySourceListTest->testTranslationSubmissions()
"3 jobs need to be checked out." foundOtherContentEntitySourceListTest.php206Drupal\tmgmt_content\Tests\ContentEntitySourceListTest->testTranslationSubmissions()
[28-Jul-2015 14:38:52 UTC] Uncaught PHP Exception Drupal\tmgmt\TMGMTException: "Cannot get the translator." at /var/lib/drupaltestbot/sites/default/files/checkout/sites/default/modules/tmgmt/src/Entity/Job.php line 409 Fatal errorUnknown0Unknown
[28-Jul-2015 14:38:53 UTC] Uncaught PHP Exception Drupal\tmgmt\TMGMTException: "Cannot get the translator." at /var/lib/drupaltestbot/sites/default/files/checkout/sites/default/modules/tmgmt/src/Entity/Job.php line 409 Fatal errorUnknown0Unknown
[28-Jul-2015 14:38:54 UTC] Uncaught PHP Exception Drupal\tmgmt\TMGMTException: "Cannot get the translator." at /var/lib/drupaltestbot/sites/default/files/checkout/sites/default/modules/tmgmt/src/Entity/Job.php line 409 Fatal errorUnknown0Unknown
ExpandDrupal\tmgmt_content\Tests\ContentEntitySourceUiTest204490
MessageGroupFilenameLineFunctionStatus
"One job needs to be checked out." foundOtherContentEntitySourceUiTest.php83Drupal\tmgmt_content\Tests\ContentEntitySourceUiTest->testNodeTranslateTabSingleCheckout()
"jZ0f8ymm" foundOtherContentEntitySourceUiTest.php84Drupal\tmgmt_content\Tests\ContentEntitySourceUiTest->testNodeTranslateTabSingleCheckout()
Found the Submit to translator buttonOtherContentEntitySourceUiTest.php87Drupal\tmgmt_content\Tests\ContentEntitySourceUiTest->testNodeTranslateTabSingleCheckout()
Found the requested form fields at OtherContentEntitySourceUiTest.php87Drupal\tmgmt_content\Tests\ContentEntitySourceUiTest->testNodeTranslateTabSingleCheckout()
"Test translation created." foundOtherContentEntitySourceUiTest.php91Drupal\tmgmt_content\Tests\ContentEntitySourceUiTest->testNodeTranslateTabSingleCheckout()
"The translation of jZ0f8ymm to German is finished and can now be reviewed." foundOtherContentEntitySourceUiTest.php95Drupal\tmgmt_content\Tests\ContentEntitySourceUiTest->testNodeTranslateTabSingleCheckout()
Link Needs review does not exist on http://ec2-52-10-99-150.us-west-2.compute.amazonaws.com/checkout/node/1/translationsBrowserContentEntitySourceUiTest.php98Drupal\tmgmt_content\Tests\ContentEntitySourceUiTest->testNodeTranslateTabSingleCheckout()
Found the Save as completed buttonOtherContentEntitySourceUiTest.php99Drupal\tmgmt_content\Tests\ContentEntitySourceUiTest->testNodeTranslateTabSingleCheckout()
Found the requested form fields at OtherContentEntitySourceUiTest.php99Drupal\tmgmt_content\Tests\ContentEntitySourceUiTest->testNodeTranslateTabSingleCheckout()
"The translation for jZ0f8ymm has been accepted." foundOtherContentEntitySourceUiTest.php101Drupal\tmgmt_content\Tests\ContentEntitySourceUiTest->testNodeTranslateTabSingleCheckout()
Link de_jZ0f8ymm does not exist on http://ec2-52-10-99-150.us-west-2.compute.amazonaws.com/checkout/node/1/translationsBrowserContentEntitySourceUiTest.php104Drupal\tmgmt_content\Tests\ContentEntitySourceUiTest->testNodeTranslateTabSingleCheckout()
"de_jZ0f8ymm" foundOtherContentEntitySourceUiTest.php105Drupal\tmgmt_content\Tests\ContentEntitySourceUiTest->testNodeTranslateTabSingleCheckout()
"de_mH3A66ERlZEhXfr3f6py" foundOtherContentEntitySourceUiTest.php106Drupal\tmgmt_content\Tests\ContentEntitySourceUiTest->testNodeTranslateTabSingleCheckout()
"One job needs to be checked out." foundOtherContentEntitySourceUiTest.php119Drupal\tmgmt_content\Tests\ContentEntitySourceUiTest->testNodeTranslateTabSingleCheckout()
"jZ0f8ymm" foundOtherContentEntitySourceUiTest.php120Drupal\tmgmt_content\Tests\ContentEntitySourceUiTest->testNodeTranslateTabSingleCheckout()
Found the Submit to translator buttonOtherContentEntitySourceUiTest.php121Drupal\tmgmt_content\Tests\ContentEntitySourceUiTest->testNodeTranslateTabSingleCheckout()
Found the requested form fields at OtherContentEntitySourceUiTest.php121Drupal\tmgmt_content\Tests\ContentEntitySourceUiTest->testNodeTranslateTabSingleCheckout()
Value 'http://ec2-52-10-99-150.us-west-2.compute.amazonaws.com/checkout/node/1' is equal to value 'http://ec2-52-10-99-150.us-west-2.compute.amazonaws.com/checkout/node/1/translations?destination=node/1'.OtherContentEntitySourceUiTest.php124Drupal\tmgmt_content\Tests\ContentEntitySourceUiTest->testNodeTranslateTabSingleCheckout()
"jZ0f8ymm" not foundOtherContentEntitySourceUiTest.php134Drupal\tmgmt_content\Tests\ContentEntitySourceUiTest->testNodeTranslateTabSingleCheckout()
[28-Jul-2015 14:37:33 UTC] Uncaught PHP Exception Drupal\tmgmt\TMGMTException: "Cannot get the translator." at /var/lib/drupaltestbot/sites/default/files/checkout/sites/default/modules/tmgmt/src/Entity/Job.php line 409 Fatal errorUnknown0Unknown
[28-Jul-2015 14:37:33 UTC] Uncaught PHP Exception Drupal\tmgmt\TMGMTException: "Cannot get the translator." at /var/lib/drupaltestbot/sites/default/files/checkout/sites/default/modules/tmgmt/src/Entity/Job.php line 409 Fatal errorUnknown0Unknown
"2 jobs need to be checked out." foundOtherContentEntitySourceUiTest.php191Drupal\tmgmt_content\Tests\ContentEntitySourceUiTest->testNodeTranslateTabMultipeCheckout()
"b5tt8cpO" foundOtherContentEntitySourceUiTest.php194Drupal\tmgmt_content\Tests\ContentEntitySourceUiTest->testNodeTranslateTabMultipeCheckout()
Found the Submit to translator and continue buttonOtherContentEntitySourceUiTest.php195Drupal\tmgmt_content\Tests\ContentEntitySourceUiTest->testNodeTranslateTabMultipeCheckout()
Found the requested form fields at OtherContentEntitySourceUiTest.php195Drupal\tmgmt_content\Tests\ContentEntitySourceUiTest->testNodeTranslateTabMultipeCheckout()
"b5tt8cpO" foundOtherContentEntitySourceUiTest.php196Drupal\tmgmt_content\Tests\ContentEntitySourceUiTest->testNodeTranslateTabMultipeCheckout()
Found the Submit to translator buttonOtherContentEntitySourceUiTest.php197Drupal\tmgmt_content\Tests\ContentEntitySourceUiTest->testNodeTranslateTabMultipeCheckout()
Found the requested form fields at OtherContentEntitySourceUiTest.php197Drupal\tmgmt_content\Tests\ContentEntitySourceUiTest->testNodeTranslateTabMultipeCheckout()
"Test translation created." foundOtherContentEntitySourceUiTest.php201Drupal\tmgmt_content\Tests\ContentEntitySourceUiTest->testNodeTranslateTabMultipeCheckout()
"The translation for b5tt8cpO has been accepted." foundOtherContentEntitySourceUiTest.php206Drupal\tmgmt_content\Tests\ContentEntitySourceUiTest->testNodeTranslateTabMultipeCheckout()
"de_b5tt8cpO" foundOtherContentEntitySourceUiTest.php211Drupal\tmgmt_content\Tests\ContentEntitySourceUiTest->testNodeTranslateTabMultipeCheckout()
"de_xfxS1P9vuUBw8EUUlM31" foundOtherContentEntitySourceUiTest.php212Drupal\tmgmt_content\Tests\ContentEntitySourceUiTest->testNodeTranslateTabMultipeCheckout()
"es_b5tt8cpO" foundOtherContentEntitySourceUiTest.php215Drupal\tmgmt_content\Tests\ContentEntitySourceUiTest->testNodeTranslateTabMultipeCheckout()
"es_xfxS1P9vuUBw8EUUlM31" foundOtherContentEntitySourceUiTest.php216Drupal\tmgmt_content\Tests\ContentEntitySourceUiTest->testNodeTranslateTabMultipeCheckout()
[28-Jul-2015 14:38:00 UTC] Uncaught PHP Exception Drupal\tmgmt\TMGMTException: "Cannot get the translator." at /var/lib/drupaltestbot/sites/default/files/checkout/sites/default/modules/tmgmt/src/Entity/Job.php line 409 Fatal errorUnknown0Unknown
"2 jobs need to be checked out." foundOtherContentEntitySourceUiTest.php286Drupal\tmgmt_content\Tests\ContentEntitySourceUiTest->testCommentTranslateTab()
"tWl5QsVY" foundOtherContentEntitySourceUiTest.php289Drupal\tmgmt_content\Tests\ContentEntitySourceUiTest->testCommentTranslateTab()
Found the Submit to translator and continue buttonOtherContentEntitySourceUiTest.php290Drupal\tmgmt_content\Tests\ContentEntitySourceUiTest->testCommentTranslateTab()
Found the requested form fields at OtherContentEntitySourceUiTest.php290Drupal\tmgmt_content\Tests\ContentEntitySourceUiTest->testCommentTranslateTab()
"tWl5QsVY" foundOtherContentEntitySourceUiTest.php291Drupal\tmgmt_content\Tests\ContentEntitySourceUiTest->testCommentTranslateTab()
Found the Submit to translator buttonOtherContentEntitySourceUiTest.php292Drupal\tmgmt_content\Tests\ContentEntitySourceUiTest->testCommentTranslateTab()
Found the requested form fields at OtherContentEntitySourceUiTest.php292Drupal\tmgmt_content\Tests\ContentEntitySourceUiTest->testCommentTranslateTab()
"Test translation created." foundOtherContentEntitySourceUiTest.php296Drupal\tmgmt_content\Tests\ContentEntitySourceUiTest->testCommentTranslateTab()
"The translation for tWl5QsVY has been accepted." foundOtherContentEntitySourceUiTest.php301Drupal\tmgmt_content\Tests\ContentEntitySourceUiTest->testCommentTranslateTab()
Link de_tWl5QsVY does not exist on http://ec2-52-10-99-150.us-west-2.compute.amazonaws.com/checkout/comment/1/translationsBrowserContentEntitySourceUiTest.php304Drupal\tmgmt_content\Tests\ContentEntitySourceUiTest->testCommentTranslateTab()
"de_gZy88QM6" foundOtherContentEntitySourceUiTest.php305Drupal\tmgmt_content\Tests\ContentEntitySourceUiTest->testCommentTranslateTab()
Link es_tWl5QsVY does not exist on http://ec2-52-10-99-150.us-west-2.compute.amazonaws.com/checkout/comment/1/translationsBrowserContentEntitySourceUiTest.php309Drupal\tmgmt_content\Tests\ContentEntitySourceUiTest->testCommentTranslateTab()
"es_gZy88QM6" foundOtherContentEntitySourceUiTest.php311Drupal\tmgmt_content\Tests\ContentEntitySourceUiTest->testCommentTranslateTab()
[28-Jul-2015 14:38:29 UTC] Uncaught PHP Exception Drupal\tmgmt\TMGMTException: "Cannot get the translator." at /var/lib/drupaltestbot/sites/default/files/checkout/sites/default/modules/tmgmt/src/Entity/Job.php line 409 Fatal errorUnknown0Unknown
LeafDrupal\tmgmt_content\Tests\ContentEntitySourceUnitTest14600
LeafDrupal\tmgmt_content\Tests\ContentEntitySuggestionsTest2400
ExpandDrupal\tmgmt_demo\Tests\TMGMTDemoTest2740
MessageGroupFilenameLineFunctionStatus
"2 jobs need to be checked out." foundOtherTMGMTDemoTest.php46Drupal\tmgmt_demo\Tests\TMGMTDemoTest->testInstalled()
"2 jobs need to be checked out." foundOtherTMGMTDemoTest.php52Drupal\tmgmt_demo\Tests\TMGMTDemoTest->testInstalled()
[28-Jul-2015 14:37:35 UTC] Uncaught PHP Exception Drupal\tmgmt\TMGMTException: "Cannot get the translator." at /var/lib/drupaltestbot/sites/default/files/checkout/sites/default/modules/tmgmt/src/Entity/Job.php line 409 Fatal errorUnknown0Unknown
[28-Jul-2015 14:37:36 UTC] Uncaught PHP Exception Drupal\tmgmt\TMGMTException: "Cannot get the translator." at /var/lib/drupaltestbot/sites/default/files/checkout/sites/default/modules/tmgmt/src/Entity/Job.php line 409 Fatal errorUnknown0Unknown
LeafDrupal\tmgmt_file\Tests\FileTranslatorTest16000
LeafDrupal\tmgmt_locale\Tests\LocaleSourceTest6300
ExpandDrupal\tmgmt_locale\Tests\LocaleSourceUiTest39140
MessageGroupFilenameLineFunctionStatus
"Hello World" foundOtherLocaleSourceUiTest.php76Drupal\tmgmt_locale\Tests\LocaleSourceUiTest->testOverview()
"Locale" foundOtherLocaleSourceUiTest.php77Drupal\tmgmt_locale\Tests\LocaleSourceUiTest->testOverview()
"2" foundOtherLocaleSourceUiTest.php78Drupal\tmgmt_locale\Tests\LocaleSourceUiTest->testOverview()
Failed to set field target_language to gsw-berneOtherLocaleSourceUiTest.php79Drupal\tmgmt_locale\Tests\LocaleSourceUiTest->testOverview()
Found the Submit to translator buttonOtherLocaleSourceUiTest.php79Drupal\tmgmt_locale\Tests\LocaleSourceUiTest->testOverview()
Found the requested form fields at OtherLocaleSourceUiTest.php79Drupal\tmgmt_locale\Tests\LocaleSourceUiTest->testOverview()
Raw "Active job item: Needs review" foundOtherLocaleSourceUiTest.php83Drupal\tmgmt_locale\Tests\LocaleSourceUiTest->testOverview()
Raw "gsw-berne_Hello World" foundOtherLocaleSourceUiTest.php88Drupal\tmgmt_locale\Tests\LocaleSourceUiTest->testOverview()
Found the Save as completed buttonOtherLocaleSourceUiTest.php89Drupal\tmgmt_locale\Tests\LocaleSourceUiTest->testOverview()
Found the requested form fields at OtherLocaleSourceUiTest.php89Drupal\tmgmt_locale\Tests\LocaleSourceUiTest->testOverview()
Value 'Not translated' is equal to value 'Translation up to date'.OtherLocaleSourceUiTest.php97Drupal\tmgmt_locale\Tests\LocaleSourceUiTest->testOverview()
"Hello World" not foundOtherLocaleSourceUiTest.php113Drupal\tmgmt_locale\Tests\LocaleSourceUiTest->testOverview()
[28-Jul-2015 14:37:28 UTC] Uncaught PHP Exception Drupal\tmgmt\TMGMTException: "Cannot get the translator." at /var/lib/drupaltestbot/sites/default/files/checkout/sites/default/modules/tmgmt/src/Entity/Job.php line 409 Fatal errorUnknown0Unknown
[28-Jul-2015 14:37:29 UTC] Uncaught PHP Exception Drupal\tmgmt\TMGMTException: "Cannot get the translator." at /var/lib/drupaltestbot/sites/default/files/checkout/sites/default/modules/tmgmt/src/Entity/Job.php line 409 Fatal errorUnknown0Unknown