2224645-49-missing_user_properties_0.patch

Test status
StatusResult
Last receivedMon, 07/27/2015 - 11:50:00
Last requestedMon, 07/27/2015 - 11:50:01
Last testedMon, 07/27/2015 - 11:51:36
Test count2
Environment status
MySQLfail
File information
File2224645-49-missing_user_properties_0.patch
BranchEntity API - 7.x-1.x
LinkIssue Link
SummaryFAILED: [[SimpleTest]]: [MySQL] 641 pass(es), 0 fail(s), and 1 exception(s).
Details

MySQL

  1. Setup environment
  2. Detect an invalid patch URL
  3. Detect invalid repository information
  4. Detect invalid patch format
  5. Detect a non-applicable patch
  6. Detect invalid PHP syntax
  7. Detect a Drupal installation failure
  8. Detect a test run failure
  9. Detect a failing test
    Review the test failures below then if necessary run them locally until the problem has been fixed.
  10. Complete test suite with all tests passing
641 pass(es), 0 fail(s), and 1 exception(s)

Non-pass

Test namePassFailException
ExpandProperty info core integration (EntityMetadataIntegrationTestCase) [Entity API]29001
MessageGroupFilenameLineFunctionStatus
EntityMetadataWrapperException: Invalid data value given. Be sure it matches the required data type and format. in EntityDrupalWrapper->set() (line 737 of /var/lib/drupaltestbot/sites/default/files/checkout/sites/default/modules/entity/includes/entity.wrapper.inc).Uncaught exceptionentity.wrapper.inc737EntityDrupalWrapper->set()

All

Test namePassFailException
LeafEntity API comment node access (EntityAPICommentNodeAccessTestCase) [Entity API]3500
LeafEntity CRUD (EntityAPITestCase) [Entity API]7900
LeafEntity CRUD i18n integration (EntityAPIi18nItegrationTestCase) [Entity API]2400
LeafEntity Metadata Node Access (EntityMetadataNodeAccessTestCase) [Entity API]3400
LeafEntity Metadata Node Create Access (EntityMetadataNodeCreateAccessTestCase) [Entity API]1500
LeafEntity Metadata Node Revision Access (EntityMetadataNodeRevisionAccessTestCase) [Entity API]2900
LeafEntity tokens (EntityTokenTestCase) [Entity API]600
LeafMetadata Wrapper (EntityMetadataTestCase) [Entity API]12900
ExpandProperty info core integration (EntityMetadataIntegrationTestCase) [Entity API]29001
MessageGroupFilenameLineFunctionStatus
EntityMetadataWrapperException: Invalid data value given. Be sure it matches the required data type and format. in EntityDrupalWrapper->set() (line 737 of /var/lib/drupaltestbot/sites/default/files/checkout/sites/default/modules/entity/includes/entity.wrapper.inc).Uncaught exceptionentity.wrapper.inc737EntityDrupalWrapper->set()