modify-2534498-8.patch

Test status
StatusResult
Last receivedFri, 07/24/2015 - 20:23:00
Last requestedFri, 07/24/2015 - 20:28:02
Last testedFri, 07/24/2015 - 20:32:57
Test count1
Environment status
PHP 5.5 MySQLfail
File information
Filemodify-2534498-8.patch
BranchMonitoring - 8.x-1.x
LinkIssue Link
SummaryFAILED: [[SimpleTest]]: [PHP 5.5 MySQL] 1,747 pass(es), 48 fail(s), and 0 exception(s).
Details

PHP 5.5 MySQL

  1. Setup environment
  2. Detect an invalid patch URL
  3. Detect invalid repository information
  4. Detect invalid patch format
  5. Detect a non-applicable patch
  6. Detect invalid PHP syntax
  7. Detect a Drupal installation failure
  8. Detect a test run failure
  9. Detect a failing test
    Review the test failures below then if necessary run them locally until the problem has been fixed.
  10. Complete test suite with all tests passing
1,747 pass(es), 48 fail(s), and 0 exception(s)

Non-pass

Test namePassFailException
ExpandDrupal\monitoring\Tests\MonitoringUITest642480
MessageGroupFilenameLineFunctionStatus
Option user for field edit-settings-entity-type is selected.BrowserMonitoringUITest.php71Drupal\monitoring\Tests\MonitoringUITest->testSensorSettingsUI()
"Sensor Plugin" foundOtherMonitoringUITest.php72Drupal\monitoring\Tests\MonitoringUITest->testSensorSettingsUI()
"Entity Aggregator" foundOtherMonitoringUITest.php73Drupal\monitoring\Tests\MonitoringUITest->testSensorSettingsUI()
[24-Jul-2015 20:29:30 UTC] Uncaught PHP Exception Drupal\Core\Entity\Exception\NoCorrespondingEntityClassException: "The Field storageContentType class does not correspond to an entity type." at /var/lib/drupaltestbot/sites/default/files/checkout/core/lib/Drupal/Core/Entity/EntityManager.php line 1199 Fatal errorUnknown0Unknown
"Sensor plugin settings" foundOtherMonitoringUITest.php104Drupal\monitoring\Tests\MonitoringUITest->testSensorCreation()
Failed to set field settings[entity_type] to nodeOtherMonitoringUITest.php105Drupal\monitoring\Tests\MonitoringUITest->testSensorCreation()
Found the Add another condition buttonOtherMonitoringUITest.php105Drupal\monitoring\Tests\MonitoringUITest->testSensorCreation()
Found the requested form fields at OtherMonitoringUITest.php105Drupal\monitoring\Tests\MonitoringUITest->testSensorCreation()
Failed to set field description to Sensor created to test UIOtherMonitoringUITest.php116Drupal\monitoring\Tests\MonitoringUITest->testSensorCreation()
Failed to set field value_label to Test ValueOtherMonitoringUITest.php116Drupal\monitoring\Tests\MonitoringUITest->testSensorCreation()
Failed to set field caching_time to 100OtherMonitoringUITest.php116Drupal\monitoring\Tests\MonitoringUITest->testSensorCreation()
Failed to set field settings[aggregation][time_interval_value] to 86400OtherMonitoringUITest.php116Drupal\monitoring\Tests\MonitoringUITest->testSensorCreation()
Failed to set field settings[entity_type] to nodeOtherMonitoringUITest.php116Drupal\monitoring\Tests\MonitoringUITest->testSensorCreation()
Failed to set field conditions[0][field] to typeOtherMonitoringUITest.php116Drupal\monitoring\Tests\MonitoringUITest->testSensorCreation()
Failed to set field conditions[0][value] to articleOtherMonitoringUITest.php116Drupal\monitoring\Tests\MonitoringUITest->testSensorCreation()
Failed to set field conditions[1][field] to stickyOtherMonitoringUITest.php116Drupal\monitoring\Tests\MonitoringUITest->testSensorCreation()
Failed to set field conditions[1][value] to 0OtherMonitoringUITest.php116Drupal\monitoring\Tests\MonitoringUITest->testSensorCreation()
Found the Save buttonOtherMonitoringUITest.php116Drupal\monitoring\Tests\MonitoringUITest->testSensorCreation()
Found the requested form fields at OtherMonitoringUITest.php116Drupal\monitoring\Tests\MonitoringUITest->testSensorCreation()
"Sensor UI created Sensor saved." foundOtherMonitoringUITest.php118Drupal\monitoring\Tests\MonitoringUITest->testSensorCreation()
Link with label UI created Sensor found.OtherMonitoringUITest.php121Drupal\monitoring\Tests\MonitoringUITest->testSensorCreation()
Link UI created Sensor does not exist on http://ec2-52-7-247-29.compute-1.amazonaws.com/checkout/admin/config/system/monitoring/sensors/addBrowserMonitoringUITest.php122Drupal\monitoring\Tests\MonitoringUITest->testSensorCreation()
Found field with name 'caching_time' and value 100BrowserMonitoringUITest.php126Drupal\monitoring\Tests\MonitoringUITest->testSensorCreation()
Found field with name 'conditions[0][field]' and value 'type'BrowserMonitoringUITest.php127Drupal\monitoring\Tests\MonitoringUITest->testSensorCreation()
Found field with name 'conditions[0][value]' and value 'article'BrowserMonitoringUITest.php128Drupal\monitoring\Tests\MonitoringUITest->testSensorCreation()
Found field with name 'conditions[1][field]' and value 'sticky'BrowserMonitoringUITest.php129Drupal\monitoring\Tests\MonitoringUITest->testSensorCreation()
Found field with name 'conditions[1][value]' and value '0'BrowserMonitoringUITest.php130Drupal\monitoring\Tests\MonitoringUITest->testSensorCreation()
"This action cannot be undone." foundOtherMonitoringUITest.php133Drupal\monitoring\Tests\MonitoringUITest->testSensorCreation()
Found the Delete buttonOtherMonitoringUITest.php134Drupal\monitoring\Tests\MonitoringUITest->testSensorCreation()
Found the requested form fields at OtherMonitoringUITest.php134Drupal\monitoring\Tests\MonitoringUITest->testSensorCreation()
"Sensor UI created Sensor has been deleted." foundOtherMonitoringUITest.php135Drupal\monitoring\Tests\MonitoringUITest->testSensorCreation()
[24-Jul-2015 20:29:48 UTC] Uncaught PHP Exception Drupal\Core\Entity\Exception\NoCorrespondingEntityClassException: "The Field storageContentType class does not correspond to an entity type." at /var/lib/drupaltestbot/sites/default/files/checkout/core/lib/Drupal/Core/Entity/EntityManager.php line 1199 Fatal errorUnknown0Unknown
Found field with name 'settings[aggregation][time_interval_field]' and value 'created'BrowserMonitoringUITest.php204Drupal\monitoring\Tests\MonitoringUITest->testAggregateSensorTimeIntervalConfig()
Found field with name 'settings[aggregation][time_interval_value]' and value 86400BrowserMonitoringUITest.php205Drupal\monitoring\Tests\MonitoringUITest->testAggregateSensorTimeIntervalConfig()
Failed to set field settings[aggregation][time_interval_value] to 0OtherMonitoringUITest.php225Drupal\monitoring\Tests\MonitoringUITest->testAggregateSensorTimeIntervalConfig()
Found the Save buttonOtherMonitoringUITest.php225Drupal\monitoring\Tests\MonitoringUITest->testAggregateSensorTimeIntervalConfig()
Found the requested form fields at admin/config/system/monitoring/sensors/entity_aggregate_testOtherMonitoringUITest.php225Drupal\monitoring\Tests\MonitoringUITest->testAggregateSensorTimeIntervalConfig()
"2 druplicons in" not foundOtherMonitoringUITest.php230Drupal\monitoring\Tests\MonitoringUITest->testAggregateSensorTimeIntervalConfig()
Failed to set field settings[aggregation][time_interval_field] to OtherMonitoringUITest.php236Drupal\monitoring\Tests\MonitoringUITest->testAggregateSensorTimeIntervalConfig()
Failed to set field settings[aggregation][time_interval_value] to 86400OtherMonitoringUITest.php236Drupal\monitoring\Tests\MonitoringUITest->testAggregateSensorTimeIntervalConfig()
Found the Save buttonOtherMonitoringUITest.php236Drupal\monitoring\Tests\MonitoringUITest->testAggregateSensorTimeIntervalConfig()
Found the requested form fields at admin/config/system/monitoring/sensors/entity_aggregate_testOtherMonitoringUITest.php236Drupal\monitoring\Tests\MonitoringUITest->testAggregateSensorTimeIntervalConfig()
"2 druplicons in" not foundOtherMonitoringUITest.php241Drupal\monitoring\Tests\MonitoringUITest->testAggregateSensorTimeIntervalConfig()
Failed to set field settings[aggregation][time_interval_field] to invalid-fieldOtherMonitoringUITest.php246Drupal\monitoring\Tests\MonitoringUITest->testAggregateSensorTimeIntervalConfig()
Found the Save buttonOtherMonitoringUITest.php246Drupal\monitoring\Tests\MonitoringUITest->testAggregateSensorTimeIntervalConfig()
Found the requested form fields at admin/config/system/monitoring/sensors/entity_aggregate_testOtherMonitoringUITest.php246Drupal\monitoring\Tests\MonitoringUITest->testAggregateSensorTimeIntervalConfig()
"The specified time interval field invalid-field does not exist or is not type timestamp." foundOtherMonitoringUITest.php248Drupal\monitoring\Tests\MonitoringUITest->testAggregateSensorTimeIntervalConfig()
[24-Jul-2015 20:31:14 UTC] Uncaught PHP Exception Drupal\Core\Entity\Exception\NoCorrespondingEntityClassException: "The Field storageContentType class does not correspond to an entity type." at /var/lib/drupaltestbot/sites/default/files/checkout/core/lib/Drupal/Core/Entity/EntityManager.php line 1199 Fatal errorUnknown0Unknown

All

Test namePassFailException
LeafDrupal\monitoring\Tests\MonitoringApiTest8100
LeafDrupal\monitoring\Tests\MonitoringCaptchaTest1900
LeafDrupal\monitoring\Tests\MonitoringCoreKernelTest15100
LeafDrupal\monitoring\Tests\MonitoringCoreWebTest12700
LeafDrupal\monitoring\Tests\MonitoringPastTest1300
LeafDrupal\monitoring\Tests\MonitoringPaymentTest900
LeafDrupal\monitoring\Tests\MonitoringSearchAPITest1100
LeafDrupal\monitoring\Tests\MonitoringServicesTest56500
ExpandDrupal\monitoring\Tests\MonitoringUITest642480
MessageGroupFilenameLineFunctionStatus
Option user for field edit-settings-entity-type is selected.BrowserMonitoringUITest.php71Drupal\monitoring\Tests\MonitoringUITest->testSensorSettingsUI()
"Sensor Plugin" foundOtherMonitoringUITest.php72Drupal\monitoring\Tests\MonitoringUITest->testSensorSettingsUI()
"Entity Aggregator" foundOtherMonitoringUITest.php73Drupal\monitoring\Tests\MonitoringUITest->testSensorSettingsUI()
[24-Jul-2015 20:29:30 UTC] Uncaught PHP Exception Drupal\Core\Entity\Exception\NoCorrespondingEntityClassException: "The Field storageContentType class does not correspond to an entity type." at /var/lib/drupaltestbot/sites/default/files/checkout/core/lib/Drupal/Core/Entity/EntityManager.php line 1199 Fatal errorUnknown0Unknown
"Sensor plugin settings" foundOtherMonitoringUITest.php104Drupal\monitoring\Tests\MonitoringUITest->testSensorCreation()
Failed to set field settings[entity_type] to nodeOtherMonitoringUITest.php105Drupal\monitoring\Tests\MonitoringUITest->testSensorCreation()
Found the Add another condition buttonOtherMonitoringUITest.php105Drupal\monitoring\Tests\MonitoringUITest->testSensorCreation()
Found the requested form fields at OtherMonitoringUITest.php105Drupal\monitoring\Tests\MonitoringUITest->testSensorCreation()
Failed to set field description to Sensor created to test UIOtherMonitoringUITest.php116Drupal\monitoring\Tests\MonitoringUITest->testSensorCreation()
Failed to set field value_label to Test ValueOtherMonitoringUITest.php116Drupal\monitoring\Tests\MonitoringUITest->testSensorCreation()
Failed to set field caching_time to 100OtherMonitoringUITest.php116Drupal\monitoring\Tests\MonitoringUITest->testSensorCreation()
Failed to set field settings[aggregation][time_interval_value] to 86400OtherMonitoringUITest.php116Drupal\monitoring\Tests\MonitoringUITest->testSensorCreation()
Failed to set field settings[entity_type] to nodeOtherMonitoringUITest.php116Drupal\monitoring\Tests\MonitoringUITest->testSensorCreation()
Failed to set field conditions[0][field] to typeOtherMonitoringUITest.php116Drupal\monitoring\Tests\MonitoringUITest->testSensorCreation()
Failed to set field conditions[0][value] to articleOtherMonitoringUITest.php116Drupal\monitoring\Tests\MonitoringUITest->testSensorCreation()
Failed to set field conditions[1][field] to stickyOtherMonitoringUITest.php116Drupal\monitoring\Tests\MonitoringUITest->testSensorCreation()
Failed to set field conditions[1][value] to 0OtherMonitoringUITest.php116Drupal\monitoring\Tests\MonitoringUITest->testSensorCreation()
Found the Save buttonOtherMonitoringUITest.php116Drupal\monitoring\Tests\MonitoringUITest->testSensorCreation()
Found the requested form fields at OtherMonitoringUITest.php116Drupal\monitoring\Tests\MonitoringUITest->testSensorCreation()
"Sensor UI created Sensor saved." foundOtherMonitoringUITest.php118Drupal\monitoring\Tests\MonitoringUITest->testSensorCreation()
Link with label UI created Sensor found.OtherMonitoringUITest.php121Drupal\monitoring\Tests\MonitoringUITest->testSensorCreation()
Link UI created Sensor does not exist on http://ec2-52-7-247-29.compute-1.amazonaws.com/checkout/admin/config/system/monitoring/sensors/addBrowserMonitoringUITest.php122Drupal\monitoring\Tests\MonitoringUITest->testSensorCreation()
Found field with name 'caching_time' and value 100BrowserMonitoringUITest.php126Drupal\monitoring\Tests\MonitoringUITest->testSensorCreation()
Found field with name 'conditions[0][field]' and value 'type'BrowserMonitoringUITest.php127Drupal\monitoring\Tests\MonitoringUITest->testSensorCreation()
Found field with name 'conditions[0][value]' and value 'article'BrowserMonitoringUITest.php128Drupal\monitoring\Tests\MonitoringUITest->testSensorCreation()
Found field with name 'conditions[1][field]' and value 'sticky'BrowserMonitoringUITest.php129Drupal\monitoring\Tests\MonitoringUITest->testSensorCreation()
Found field with name 'conditions[1][value]' and value '0'BrowserMonitoringUITest.php130Drupal\monitoring\Tests\MonitoringUITest->testSensorCreation()
"This action cannot be undone." foundOtherMonitoringUITest.php133Drupal\monitoring\Tests\MonitoringUITest->testSensorCreation()
Found the Delete buttonOtherMonitoringUITest.php134Drupal\monitoring\Tests\MonitoringUITest->testSensorCreation()
Found the requested form fields at OtherMonitoringUITest.php134Drupal\monitoring\Tests\MonitoringUITest->testSensorCreation()
"Sensor UI created Sensor has been deleted." foundOtherMonitoringUITest.php135Drupal\monitoring\Tests\MonitoringUITest->testSensorCreation()
[24-Jul-2015 20:29:48 UTC] Uncaught PHP Exception Drupal\Core\Entity\Exception\NoCorrespondingEntityClassException: "The Field storageContentType class does not correspond to an entity type." at /var/lib/drupaltestbot/sites/default/files/checkout/core/lib/Drupal/Core/Entity/EntityManager.php line 1199 Fatal errorUnknown0Unknown
Found field with name 'settings[aggregation][time_interval_field]' and value 'created'BrowserMonitoringUITest.php204Drupal\monitoring\Tests\MonitoringUITest->testAggregateSensorTimeIntervalConfig()
Found field with name 'settings[aggregation][time_interval_value]' and value 86400BrowserMonitoringUITest.php205Drupal\monitoring\Tests\MonitoringUITest->testAggregateSensorTimeIntervalConfig()
Failed to set field settings[aggregation][time_interval_value] to 0OtherMonitoringUITest.php225Drupal\monitoring\Tests\MonitoringUITest->testAggregateSensorTimeIntervalConfig()
Found the Save buttonOtherMonitoringUITest.php225Drupal\monitoring\Tests\MonitoringUITest->testAggregateSensorTimeIntervalConfig()
Found the requested form fields at admin/config/system/monitoring/sensors/entity_aggregate_testOtherMonitoringUITest.php225Drupal\monitoring\Tests\MonitoringUITest->testAggregateSensorTimeIntervalConfig()
"2 druplicons in" not foundOtherMonitoringUITest.php230Drupal\monitoring\Tests\MonitoringUITest->testAggregateSensorTimeIntervalConfig()
Failed to set field settings[aggregation][time_interval_field] to OtherMonitoringUITest.php236Drupal\monitoring\Tests\MonitoringUITest->testAggregateSensorTimeIntervalConfig()
Failed to set field settings[aggregation][time_interval_value] to 86400OtherMonitoringUITest.php236Drupal\monitoring\Tests\MonitoringUITest->testAggregateSensorTimeIntervalConfig()
Found the Save buttonOtherMonitoringUITest.php236Drupal\monitoring\Tests\MonitoringUITest->testAggregateSensorTimeIntervalConfig()
Found the requested form fields at admin/config/system/monitoring/sensors/entity_aggregate_testOtherMonitoringUITest.php236Drupal\monitoring\Tests\MonitoringUITest->testAggregateSensorTimeIntervalConfig()
"2 druplicons in" not foundOtherMonitoringUITest.php241Drupal\monitoring\Tests\MonitoringUITest->testAggregateSensorTimeIntervalConfig()
Failed to set field settings[aggregation][time_interval_field] to invalid-fieldOtherMonitoringUITest.php246Drupal\monitoring\Tests\MonitoringUITest->testAggregateSensorTimeIntervalConfig()
Found the Save buttonOtherMonitoringUITest.php246Drupal\monitoring\Tests\MonitoringUITest->testAggregateSensorTimeIntervalConfig()
Found the requested form fields at admin/config/system/monitoring/sensors/entity_aggregate_testOtherMonitoringUITest.php246Drupal\monitoring\Tests\MonitoringUITest->testAggregateSensorTimeIntervalConfig()
"The specified time interval field invalid-field does not exist or is not type timestamp." foundOtherMonitoringUITest.php248Drupal\monitoring\Tests\MonitoringUITest->testAggregateSensorTimeIntervalConfig()
[24-Jul-2015 20:31:14 UTC] Uncaught PHP Exception Drupal\Core\Entity\Exception\NoCorrespondingEntityClassException: "The Field storageContentType class does not correspond to an entity type." at /var/lib/drupaltestbot/sites/default/files/checkout/core/lib/Drupal/Core/Entity/EntityManager.php line 1199 Fatal errorUnknown0Unknown
LeafDrupal\monitoring\Tests\MonitoringViewDisplayTest2800
LeafDrupal\monitoring_demo\Tests\MonitoringDemoTest1200
LeafDrupal\monitoring_multigraph\Tests\MultigraphServicesTest2600
LeafDrupal\monitoring_multigraph\Tests\MultigraphWebTest6300