remove_add_subscriber-2539168-1.patch

Test status
StatusResult
Last receivedFri, 07/24/2015 - 19:17:34
Last requestedFri, 07/24/2015 - 19:18:11
Last testedFri, 07/24/2015 - 19:21:32
Test count1
Environment status
PHP 5.5 MySQLfail
File information
Fileremove_add_subscriber-2539168-1.patch
BranchSimplenews - 8.x-1.x
LinkIssue Link
SummaryFAILED: [[SimpleTest]]: [PHP 5.5 MySQL] 2,123 pass(es), 5 fail(s), and 2 exception(s).
Details

PHP 5.5 MySQL

  1. Setup environment
  2. Detect an invalid patch URL
  3. Detect invalid repository information
  4. Detect invalid patch format
  5. Detect a non-applicable patch
  6. Detect invalid PHP syntax
  7. Detect a Drupal installation failure
  8. Detect a test run failure
  9. Detect a failing test
    Review the test failures below then if necessary run them locally until the problem has been fixed.
  10. Complete test suite with all tests passing
2,123 pass(es), 5 fail(s), and 2 exception(s)

Non-pass

Test namePassFailException
ExpandDrupal\simplenews\Tests\SimplenewsMonitoringTest011
MessageGroupFilenameLineFunctionStatus
The test did not complete due to a fatal error.Completion checkSimplenewsMonitoringTest.php31Drupal\simplenews\Tests\SimplenewsMonitoringTest->testSensors()
Undefined index: monitoringDrupal\simpletest\KernelTestBase->enableModules(Array) Drupal\simpletest\KernelTestBase->setUp() Drupal\simpletest\TestBase->run(Array) simpletest_script_run_one_test('10', 'Drupal\simplenews\Tests\SimplenewsMonitoringTest') NoticeKernelTestBase.php500Drupal\simpletest\KernelTestBase->enableModules()
ExpandDrupal\simplenews\Tests\SimplenewsSourceTest28230
MessageGroupFilenameLineFunctionStatus
Value false is TRUE.OtherSimplenewsSourceTest.php227Drupal\simplenews\Tests\SimplenewsSourceTest->testSendHTML()
Value false is TRUE.OtherSimplenewsSourceTest.php227Drupal\simplenews\Tests\SimplenewsSourceTest->testSendHTML()
Value false is TRUE.OtherSimplenewsSourceTest.php227Drupal\simplenews\Tests\SimplenewsSourceTest->testSendHTML()
ExpandDrupal\simplenews_demo\Tests\SimplenewsDemoTest011
MessageGroupFilenameLineFunctionStatus
The test did not complete due to a fatal error.Completion checkSimplenewsDemoTest.php43Drupal\simplenews_demo\Tests\SimplenewsDemoTest->testInstalled()
Drupal\Core\Extension\MissingDependencyException: Unable to install modules: module <em class="placeholder">simplenews_demo</em> is missing its dependency module <em class="placeholder">simplenews_scheduler</em>. in Drupal\Core\Extension\ModuleInstaller->install() (line 110 of /var/lib/drupaltestbot/sites/default/files/checkout/core/lib/Drupal/Core/Extension/ModuleInstaller.php). Drupal\Core\Extension\ModuleInstaller->install(Array, 1) Drupal\Core\ProxyClass\Extension\ModuleInstaller->install(Array) Drupal\simplenews_demo\Tests\SimplenewsDemoTest->setUp() Drupal\simpletest\TestBase->run(Array) simpletest_script_run_one_test('1', 'Drupal\simplenews_demo\Tests\SimplenewsDemoTest') Uncaught exceptionModuleInstaller.php110Drupal\Core\Extension\ModuleInstaller->install()

All

Test namePassFailException
LeafDrupal\simplenews\Tests\SimplenewsAdministrationTest51700
LeafDrupal\simplenews\Tests\SimplenewsI18nTest5700
LeafDrupal\simplenews\Tests\SimplenewsKernelTest500
ExpandDrupal\simplenews\Tests\SimplenewsMonitoringTest011
MessageGroupFilenameLineFunctionStatus
The test did not complete due to a fatal error.Completion checkSimplenewsMonitoringTest.php31Drupal\simplenews\Tests\SimplenewsMonitoringTest->testSensors()
Undefined index: monitoringDrupal\simpletest\KernelTestBase->enableModules(Array) Drupal\simpletest\KernelTestBase->setUp() Drupal\simpletest\TestBase->run(Array) simpletest_script_run_one_test('10', 'Drupal\simplenews\Tests\SimplenewsMonitoringTest') NoticeKernelTestBase.php500Drupal\simpletest\KernelTestBase->enableModules()
LeafDrupal\simplenews\Tests\SimplenewsPersonalizationFormsTest15400
LeafDrupal\simplenews\Tests\SimplenewsSendTest43000
ExpandDrupal\simplenews\Tests\SimplenewsSourceTest28230
MessageGroupFilenameLineFunctionStatus
Value false is TRUE.OtherSimplenewsSourceTest.php227Drupal\simplenews\Tests\SimplenewsSourceTest->testSendHTML()
Value false is TRUE.OtherSimplenewsSourceTest.php227Drupal\simplenews\Tests\SimplenewsSourceTest->testSendHTML()
Value false is TRUE.OtherSimplenewsSourceTest.php227Drupal\simplenews\Tests\SimplenewsSourceTest->testSendHTML()
LeafDrupal\simplenews\Tests\SimplenewsSubscribeTest57000
LeafDrupal\simplenews\Tests\SimplenewsSynchronizeFieldsFormTest3200
LeafDrupal\simplenews\Tests\SimplenewsSynchronizeFieldsTest3400
LeafDrupal\simplenews\Tests\SimplenewsTestSubscriptionOutput4200
ExpandDrupal\simplenews_demo\Tests\SimplenewsDemoTest011
MessageGroupFilenameLineFunctionStatus
The test did not complete due to a fatal error.Completion checkSimplenewsDemoTest.php43Drupal\simplenews_demo\Tests\SimplenewsDemoTest->testInstalled()
Drupal\Core\Extension\MissingDependencyException: Unable to install modules: module <em class="placeholder">simplenews_demo</em> is missing its dependency module <em class="placeholder">simplenews_scheduler</em>. in Drupal\Core\Extension\ModuleInstaller->install() (line 110 of /var/lib/drupaltestbot/sites/default/files/checkout/core/lib/Drupal/Core/Extension/ModuleInstaller.php). Drupal\Core\Extension\ModuleInstaller->install(Array, 1) Drupal\Core\ProxyClass\Extension\ModuleInstaller->install(Array) Drupal\simplenews_demo\Tests\SimplenewsDemoTest->setUp() Drupal\simpletest\TestBase->run(Array) simpletest_script_run_one_test('1', 'Drupal\simplenews_demo\Tests\SimplenewsDemoTest') Uncaught exceptionModuleInstaller.php110Drupal\Core\Extension\ModuleInstaller->install()