add_max_threshold-2538328-2.patch

Test status
StatusResult
Last receivedThu, 07/23/2015 - 20:12:00
Last requestedThu, 07/23/2015 - 21:02:23
Last testedThu, 07/23/2015 - 21:17:50
Test count1
Environment status
PHP 5.5 MySQLfail
File information
Fileadd_max_threshold-2538328-2.patch
BranchMonitoring - 8.x-1.x
LinkIssue Link
SummaryFAILED: [[SimpleTest]]: [PHP 5.5 MySQL] 1,774 pass(es), 12 fail(s), and 14 exception(s).
Details

PHP 5.5 MySQL

  1. Setup environment
  2. Detect an invalid patch URL
  3. Detect invalid repository information
  4. Detect invalid patch format
  5. Detect a non-applicable patch
  6. Detect invalid PHP syntax
  7. Detect a Drupal installation failure
  8. Detect a test run failure
  9. Detect a failing test
    Review the test failures below then if necessary run them locally until the problem has been fixed.
  10. Complete test suite with all tests passing
1,774 pass(es), 12 fail(s), and 14 exception(s)

Non-pass

Test namePassFailException
ExpandDrupal\monitoring\Tests\MonitoringCoreWebTest119914
MessageGroupFilenameLineFunctionStatus
There should be two log entries: comment_new sensor added, all sensors enabled by default added.OtherMonitoringCoreWebTest.php203Drupal\monitoring\Tests\MonitoringCoreWebTest->testSensorDisappearedSensors()
Value '42 new sensor/s added: node_new_all, comment_new, core_cron_safe_threshold, core_cron_last_run_age, core_theme_default, core_maintenance_mode, test_sensor_config, twig_debug_mode, core_requirements_file, core_requirements_image, core_requirements_node, core_requirements_system, monitoring_disappeared_sensors, monitoring_git_dirty_tree, monitoring_installed_modules, entity_aggregate_test, test_sensor_integration, test_sensor, test_sensor_exceeds, test_sensor_falls, test_sensor_inner, test_sensor_outer, watchdog_aggregate_test, user_active, user_sessions_all, user_sessions_authenticated, user_failed_logins, user_new, user_integrity, user_successful_logins, user_session_logouts, dblog_image_missing_style, dblog_404, dblog_event_severity_alert, dblog_event_severity_critical, dblog_event_severity_debug, dblog_event_severity_emergency, dblog_event_severity_error, dblog_event_severity_info, dblog_event_severity_notice, dblog_event_severity_warning, test_sensor_cat_watchdog' is equal to value '1 new sensor/s added: comment_new'.OtherMonitoringCoreWebTest.php208Drupal\monitoring\Tests\MonitoringCoreWebTest->testSensorDisappearedSensors()
Undefined offset: 1Drupal\monitoring\Tests\MonitoringCoreWebTest->testSensorDisappearedSensors() Drupal\simpletest\TestBase->run(Array) simpletest_script_run_one_test('10', 'Drupal\monitoring\Tests\MonitoringCoreWebTest') NoticeMonitoringCoreWebTest.php212Drupal\monitoring\Tests\MonitoringCoreWebTest->testSensorDisappearedSensors()
Trying to get property of non-objectDrupal\monitoring\Tests\MonitoringCoreWebTest->testSensorDisappearedSensors() Drupal\simpletest\TestBase->run(Array) simpletest_script_run_one_test('10', 'Drupal\monitoring\Tests\MonitoringCoreWebTest') NoticeMonitoringCoreWebTest.php212Drupal\monitoring\Tests\MonitoringCoreWebTest->testSensorDisappearedSensors()
Undefined offset: 1Drupal\monitoring\Tests\MonitoringCoreWebTest->testSensorDisappearedSensors() Drupal\simpletest\TestBase->run(Array) simpletest_script_run_one_test('10', 'Drupal\monitoring\Tests\MonitoringCoreWebTest') NoticeMonitoringCoreWebTest.php212Drupal\monitoring\Tests\MonitoringCoreWebTest->testSensorDisappearedSensors()
Trying to get property of non-objectDrupal\monitoring\Tests\MonitoringCoreWebTest->testSensorDisappearedSensors() Drupal\simpletest\TestBase->run(Array) simpletest_script_run_one_test('10', 'Drupal\monitoring\Tests\MonitoringCoreWebTest') NoticeMonitoringCoreWebTest.php212Drupal\monitoring\Tests\MonitoringCoreWebTest->testSensorDisappearedSensors()
Argument 2 passed to Drupal\Component\Utility\SafeMarkup::format() must be of the type array, boolean given, called in /var/lib/drupaltestbot/sites/default/files/checkout/sites/default/modules/monitoring/src/Tests/MonitoringCoreWebTest.php on line 212 and definedDrupal\Component\Utility\SafeMarkup::format(NULL, ) Drupal\monitoring\Tests\MonitoringCoreWebTest->testSensorDisappearedSensors() Drupal\simpletest\TestBase->run(Array) simpletest_script_run_one_test('10', 'Drupal\monitoring\Tests\MonitoringCoreWebTest') Recoverable errorSafeMarkup.php299Drupal\Component\Utility\SafeMarkup::format()
Invalid argument supplied for foreach()Drupal\Component\Utility\SafeMarkup::format(NULL, ) Drupal\monitoring\Tests\MonitoringCoreWebTest->testSensorDisappearedSensors() Drupal\simpletest\TestBase->run(Array) simpletest_script_run_one_test('10', 'Drupal\monitoring\Tests\MonitoringCoreWebTest') WarningSafeMarkup.php303Drupal\Component\Utility\SafeMarkup::format()
strtr(): The second argument is not an arraystrtr('', ) Drupal\Component\Utility\SafeMarkup::format(NULL, ) Drupal\monitoring\Tests\MonitoringCoreWebTest->testSensorDisappearedSensors() Drupal\simpletest\TestBase->run(Array) simpletest_script_run_one_test('10', 'Drupal\monitoring\Tests\MonitoringCoreWebTest') WarningSafeMarkup.php324Drupal\Component\Utility\SafeMarkup::format()
Value false is equal to value '41 new sensor/s added: node_new_all, core_cron_safe_threshold, core_cron_last_run_age, core_theme_default, core_maintenance_mode, test_sensor_config, twig_debug_mode, core_requirements_file, core_requirements_image, core_requirements_node, core_requirements_system, monitoring_disappeared_sensors, monitoring_git_dirty_tree, monitoring_installed_modules, entity_aggregate_test, test_sensor_integration, test_sensor, test_sensor_exceeds, test_sensor_falls, test_sensor_inner, test_sensor_outer, watchdog_aggregate_test, user_active, user_sessions_all, user_sessions_authenticated, user_failed_logins, user_new, user_integrity, user_successful_logins, user_session_logouts, dblog_image_missing_style, dblog_404, dblog_event_severity_alert, dblog_event_severity_critical, dblog_event_severity_debug, dblog_event_severity_emergency, dblog_event_severity_error, dblog_event_severity_info, dblog_event_severity_notice, dblog_event_severity_warning, test_sensor_cat_watchdog'.OtherMonitoringCoreWebTest.php216Drupal\monitoring\Tests\MonitoringCoreWebTest->testSensorDisappearedSensors()
Value false is TRUE.OtherMonitoringCoreWebTest.php224Drupal\monitoring\Tests\MonitoringCoreWebTest->testSensorDisappearedSensors()
Value 'No value' is equal to value 'Missing sensor comment_new'.OtherMonitoringCoreWebTest.php225Drupal\monitoring\Tests\MonitoringCoreWebTest->testSensorDisappearedSensors()
Value 1 is equal to value 2.OtherMonitoringCoreWebTest.php227Drupal\monitoring\Tests\MonitoringCoreWebTest->testSensorDisappearedSensors()
Value 1 is equal to value 2.OtherMonitoringCoreWebTest.php237Drupal\monitoring\Tests\MonitoringCoreWebTest->testSensorDisappearedSensors()
Removal of comment_new sensor should be logged.OtherMonitoringCoreWebTest.php248Drupal\monitoring\Tests\MonitoringCoreWebTest->testSensorDisappearedSensors()
Undefined offset: 2Drupal\monitoring\Tests\MonitoringCoreWebTest->testSensorDisappearedSensors() Drupal\simpletest\TestBase->run(Array) simpletest_script_run_one_test('10', 'Drupal\monitoring\Tests\MonitoringCoreWebTest') NoticeMonitoringCoreWebTest.php249Drupal\monitoring\Tests\MonitoringCoreWebTest->testSensorDisappearedSensors()
Trying to get property of non-objectDrupal\monitoring\Tests\MonitoringCoreWebTest->testSensorDisappearedSensors() Drupal\simpletest\TestBase->run(Array) simpletest_script_run_one_test('10', 'Drupal\monitoring\Tests\MonitoringCoreWebTest') NoticeMonitoringCoreWebTest.php249Drupal\monitoring\Tests\MonitoringCoreWebTest->testSensorDisappearedSensors()
Undefined offset: 2Drupal\monitoring\Tests\MonitoringCoreWebTest->testSensorDisappearedSensors() Drupal\simpletest\TestBase->run(Array) simpletest_script_run_one_test('10', 'Drupal\monitoring\Tests\MonitoringCoreWebTest') NoticeMonitoringCoreWebTest.php249Drupal\monitoring\Tests\MonitoringCoreWebTest->testSensorDisappearedSensors()
Trying to get property of non-objectDrupal\monitoring\Tests\MonitoringCoreWebTest->testSensorDisappearedSensors() Drupal\simpletest\TestBase->run(Array) simpletest_script_run_one_test('10', 'Drupal\monitoring\Tests\MonitoringCoreWebTest') NoticeMonitoringCoreWebTest.php249Drupal\monitoring\Tests\MonitoringCoreWebTest->testSensorDisappearedSensors()
Argument 2 passed to Drupal\Component\Utility\SafeMarkup::format() must be of the type array, boolean given, called in /var/lib/drupaltestbot/sites/default/files/checkout/sites/default/modules/monitoring/src/Tests/MonitoringCoreWebTest.php on line 249 and definedDrupal\Component\Utility\SafeMarkup::format(NULL, ) Drupal\monitoring\Tests\MonitoringCoreWebTest->testSensorDisappearedSensors() Drupal\simpletest\TestBase->run(Array) simpletest_script_run_one_test('10', 'Drupal\monitoring\Tests\MonitoringCoreWebTest') Recoverable errorSafeMarkup.php299Drupal\Component\Utility\SafeMarkup::format()
Invalid argument supplied for foreach()Drupal\Component\Utility\SafeMarkup::format(NULL, ) Drupal\monitoring\Tests\MonitoringCoreWebTest->testSensorDisappearedSensors() Drupal\simpletest\TestBase->run(Array) simpletest_script_run_one_test('10', 'Drupal\monitoring\Tests\MonitoringCoreWebTest') WarningSafeMarkup.php303Drupal\Component\Utility\SafeMarkup::format()
strtr(): The second argument is not an arraystrtr('', ) Drupal\Component\Utility\SafeMarkup::format(NULL, ) Drupal\monitoring\Tests\MonitoringCoreWebTest->testSensorDisappearedSensors() Drupal\simpletest\TestBase->run(Array) simpletest_script_run_one_test('10', 'Drupal\monitoring\Tests\MonitoringCoreWebTest') WarningSafeMarkup.php324Drupal\Component\Utility\SafeMarkup::format()
Value false is equal to value '1 new sensor/s removed: comment_new'.OtherMonitoringCoreWebTest.php253Drupal\monitoring\Tests\MonitoringCoreWebTest->testSensorDisappearedSensors()
ExpandDrupal\monitoring\Tests\MonitoringUITest67330
MessageGroupFilenameLineFunctionStatus
Value true is FALSE.OtherMonitoringUITest.php176Drupal\monitoring\Tests\MonitoringUITest->testSensorCreation()
Value false is TRUE.OtherMonitoringUITest.php178Drupal\monitoring\Tests\MonitoringUITest->testSensorCreation()
[23-Jul-2015 21:15:14 UTC] Uncaught PHP Exception Drupal\Component\Plugin\Exception\PluginNotFoundException: "The "comment" entity type does not exist." at /var/lib/drupaltestbot/sites/default/files/checkout/core/lib/Drupal/Core/Entity/EntityManager.php line 277 Fatal errorUnknown0Unknown

All

Test namePassFailException
LeafDrupal\monitoring\Tests\MonitoringApiTest8100
LeafDrupal\monitoring\Tests\MonitoringCaptchaTest1900
LeafDrupal\monitoring\Tests\MonitoringCoreKernelTest14400
ExpandDrupal\monitoring\Tests\MonitoringCoreWebTest119914
MessageGroupFilenameLineFunctionStatus
There should be two log entries: comment_new sensor added, all sensors enabled by default added.OtherMonitoringCoreWebTest.php203Drupal\monitoring\Tests\MonitoringCoreWebTest->testSensorDisappearedSensors()
Value '42 new sensor/s added: node_new_all, comment_new, core_cron_safe_threshold, core_cron_last_run_age, core_theme_default, core_maintenance_mode, test_sensor_config, twig_debug_mode, core_requirements_file, core_requirements_image, core_requirements_node, core_requirements_system, monitoring_disappeared_sensors, monitoring_git_dirty_tree, monitoring_installed_modules, entity_aggregate_test, test_sensor_integration, test_sensor, test_sensor_exceeds, test_sensor_falls, test_sensor_inner, test_sensor_outer, watchdog_aggregate_test, user_active, user_sessions_all, user_sessions_authenticated, user_failed_logins, user_new, user_integrity, user_successful_logins, user_session_logouts, dblog_image_missing_style, dblog_404, dblog_event_severity_alert, dblog_event_severity_critical, dblog_event_severity_debug, dblog_event_severity_emergency, dblog_event_severity_error, dblog_event_severity_info, dblog_event_severity_notice, dblog_event_severity_warning, test_sensor_cat_watchdog' is equal to value '1 new sensor/s added: comment_new'.OtherMonitoringCoreWebTest.php208Drupal\monitoring\Tests\MonitoringCoreWebTest->testSensorDisappearedSensors()
Undefined offset: 1Drupal\monitoring\Tests\MonitoringCoreWebTest->testSensorDisappearedSensors() Drupal\simpletest\TestBase->run(Array) simpletest_script_run_one_test('10', 'Drupal\monitoring\Tests\MonitoringCoreWebTest') NoticeMonitoringCoreWebTest.php212Drupal\monitoring\Tests\MonitoringCoreWebTest->testSensorDisappearedSensors()
Trying to get property of non-objectDrupal\monitoring\Tests\MonitoringCoreWebTest->testSensorDisappearedSensors() Drupal\simpletest\TestBase->run(Array) simpletest_script_run_one_test('10', 'Drupal\monitoring\Tests\MonitoringCoreWebTest') NoticeMonitoringCoreWebTest.php212Drupal\monitoring\Tests\MonitoringCoreWebTest->testSensorDisappearedSensors()
Undefined offset: 1Drupal\monitoring\Tests\MonitoringCoreWebTest->testSensorDisappearedSensors() Drupal\simpletest\TestBase->run(Array) simpletest_script_run_one_test('10', 'Drupal\monitoring\Tests\MonitoringCoreWebTest') NoticeMonitoringCoreWebTest.php212Drupal\monitoring\Tests\MonitoringCoreWebTest->testSensorDisappearedSensors()
Trying to get property of non-objectDrupal\monitoring\Tests\MonitoringCoreWebTest->testSensorDisappearedSensors() Drupal\simpletest\TestBase->run(Array) simpletest_script_run_one_test('10', 'Drupal\monitoring\Tests\MonitoringCoreWebTest') NoticeMonitoringCoreWebTest.php212Drupal\monitoring\Tests\MonitoringCoreWebTest->testSensorDisappearedSensors()
Argument 2 passed to Drupal\Component\Utility\SafeMarkup::format() must be of the type array, boolean given, called in /var/lib/drupaltestbot/sites/default/files/checkout/sites/default/modules/monitoring/src/Tests/MonitoringCoreWebTest.php on line 212 and definedDrupal\Component\Utility\SafeMarkup::format(NULL, ) Drupal\monitoring\Tests\MonitoringCoreWebTest->testSensorDisappearedSensors() Drupal\simpletest\TestBase->run(Array) simpletest_script_run_one_test('10', 'Drupal\monitoring\Tests\MonitoringCoreWebTest') Recoverable errorSafeMarkup.php299Drupal\Component\Utility\SafeMarkup::format()
Invalid argument supplied for foreach()Drupal\Component\Utility\SafeMarkup::format(NULL, ) Drupal\monitoring\Tests\MonitoringCoreWebTest->testSensorDisappearedSensors() Drupal\simpletest\TestBase->run(Array) simpletest_script_run_one_test('10', 'Drupal\monitoring\Tests\MonitoringCoreWebTest') WarningSafeMarkup.php303Drupal\Component\Utility\SafeMarkup::format()
strtr(): The second argument is not an arraystrtr('', ) Drupal\Component\Utility\SafeMarkup::format(NULL, ) Drupal\monitoring\Tests\MonitoringCoreWebTest->testSensorDisappearedSensors() Drupal\simpletest\TestBase->run(Array) simpletest_script_run_one_test('10', 'Drupal\monitoring\Tests\MonitoringCoreWebTest') WarningSafeMarkup.php324Drupal\Component\Utility\SafeMarkup::format()
Value false is equal to value '41 new sensor/s added: node_new_all, core_cron_safe_threshold, core_cron_last_run_age, core_theme_default, core_maintenance_mode, test_sensor_config, twig_debug_mode, core_requirements_file, core_requirements_image, core_requirements_node, core_requirements_system, monitoring_disappeared_sensors, monitoring_git_dirty_tree, monitoring_installed_modules, entity_aggregate_test, test_sensor_integration, test_sensor, test_sensor_exceeds, test_sensor_falls, test_sensor_inner, test_sensor_outer, watchdog_aggregate_test, user_active, user_sessions_all, user_sessions_authenticated, user_failed_logins, user_new, user_integrity, user_successful_logins, user_session_logouts, dblog_image_missing_style, dblog_404, dblog_event_severity_alert, dblog_event_severity_critical, dblog_event_severity_debug, dblog_event_severity_emergency, dblog_event_severity_error, dblog_event_severity_info, dblog_event_severity_notice, dblog_event_severity_warning, test_sensor_cat_watchdog'.OtherMonitoringCoreWebTest.php216Drupal\monitoring\Tests\MonitoringCoreWebTest->testSensorDisappearedSensors()
Value false is TRUE.OtherMonitoringCoreWebTest.php224Drupal\monitoring\Tests\MonitoringCoreWebTest->testSensorDisappearedSensors()
Value 'No value' is equal to value 'Missing sensor comment_new'.OtherMonitoringCoreWebTest.php225Drupal\monitoring\Tests\MonitoringCoreWebTest->testSensorDisappearedSensors()
Value 1 is equal to value 2.OtherMonitoringCoreWebTest.php227Drupal\monitoring\Tests\MonitoringCoreWebTest->testSensorDisappearedSensors()
Value 1 is equal to value 2.OtherMonitoringCoreWebTest.php237Drupal\monitoring\Tests\MonitoringCoreWebTest->testSensorDisappearedSensors()
Removal of comment_new sensor should be logged.OtherMonitoringCoreWebTest.php248Drupal\monitoring\Tests\MonitoringCoreWebTest->testSensorDisappearedSensors()
Undefined offset: 2Drupal\monitoring\Tests\MonitoringCoreWebTest->testSensorDisappearedSensors() Drupal\simpletest\TestBase->run(Array) simpletest_script_run_one_test('10', 'Drupal\monitoring\Tests\MonitoringCoreWebTest') NoticeMonitoringCoreWebTest.php249Drupal\monitoring\Tests\MonitoringCoreWebTest->testSensorDisappearedSensors()
Trying to get property of non-objectDrupal\monitoring\Tests\MonitoringCoreWebTest->testSensorDisappearedSensors() Drupal\simpletest\TestBase->run(Array) simpletest_script_run_one_test('10', 'Drupal\monitoring\Tests\MonitoringCoreWebTest') NoticeMonitoringCoreWebTest.php249Drupal\monitoring\Tests\MonitoringCoreWebTest->testSensorDisappearedSensors()
Undefined offset: 2Drupal\monitoring\Tests\MonitoringCoreWebTest->testSensorDisappearedSensors() Drupal\simpletest\TestBase->run(Array) simpletest_script_run_one_test('10', 'Drupal\monitoring\Tests\MonitoringCoreWebTest') NoticeMonitoringCoreWebTest.php249Drupal\monitoring\Tests\MonitoringCoreWebTest->testSensorDisappearedSensors()
Trying to get property of non-objectDrupal\monitoring\Tests\MonitoringCoreWebTest->testSensorDisappearedSensors() Drupal\simpletest\TestBase->run(Array) simpletest_script_run_one_test('10', 'Drupal\monitoring\Tests\MonitoringCoreWebTest') NoticeMonitoringCoreWebTest.php249Drupal\monitoring\Tests\MonitoringCoreWebTest->testSensorDisappearedSensors()
Argument 2 passed to Drupal\Component\Utility\SafeMarkup::format() must be of the type array, boolean given, called in /var/lib/drupaltestbot/sites/default/files/checkout/sites/default/modules/monitoring/src/Tests/MonitoringCoreWebTest.php on line 249 and definedDrupal\Component\Utility\SafeMarkup::format(NULL, ) Drupal\monitoring\Tests\MonitoringCoreWebTest->testSensorDisappearedSensors() Drupal\simpletest\TestBase->run(Array) simpletest_script_run_one_test('10', 'Drupal\monitoring\Tests\MonitoringCoreWebTest') Recoverable errorSafeMarkup.php299Drupal\Component\Utility\SafeMarkup::format()
Invalid argument supplied for foreach()Drupal\Component\Utility\SafeMarkup::format(NULL, ) Drupal\monitoring\Tests\MonitoringCoreWebTest->testSensorDisappearedSensors() Drupal\simpletest\TestBase->run(Array) simpletest_script_run_one_test('10', 'Drupal\monitoring\Tests\MonitoringCoreWebTest') WarningSafeMarkup.php303Drupal\Component\Utility\SafeMarkup::format()
strtr(): The second argument is not an arraystrtr('', ) Drupal\Component\Utility\SafeMarkup::format(NULL, ) Drupal\monitoring\Tests\MonitoringCoreWebTest->testSensorDisappearedSensors() Drupal\simpletest\TestBase->run(Array) simpletest_script_run_one_test('10', 'Drupal\monitoring\Tests\MonitoringCoreWebTest') WarningSafeMarkup.php324Drupal\Component\Utility\SafeMarkup::format()
Value false is equal to value '1 new sensor/s removed: comment_new'.OtherMonitoringCoreWebTest.php253Drupal\monitoring\Tests\MonitoringCoreWebTest->testSensorDisappearedSensors()
LeafDrupal\monitoring\Tests\MonitoringPastTest1300
LeafDrupal\monitoring\Tests\MonitoringPaymentTest900
LeafDrupal\monitoring\Tests\MonitoringSearchAPITest1100
LeafDrupal\monitoring\Tests\MonitoringServicesTest57600
ExpandDrupal\monitoring\Tests\MonitoringUITest67330
MessageGroupFilenameLineFunctionStatus
Value true is FALSE.OtherMonitoringUITest.php176Drupal\monitoring\Tests\MonitoringUITest->testSensorCreation()
Value false is TRUE.OtherMonitoringUITest.php178Drupal\monitoring\Tests\MonitoringUITest->testSensorCreation()
[23-Jul-2015 21:15:14 UTC] Uncaught PHP Exception Drupal\Component\Plugin\Exception\PluginNotFoundException: "The "comment" entity type does not exist." at /var/lib/drupaltestbot/sites/default/files/checkout/core/lib/Drupal/Core/Entity/EntityManager.php line 277 Fatal errorUnknown0Unknown
LeafDrupal\monitoring\Tests\MonitoringViewDisplayTest2800
LeafDrupal\monitoring_demo\Tests\MonitoringDemoTest1200
LeafDrupal\monitoring_multigraph\Tests\MultigraphServicesTest2600
LeafDrupal\monitoring_multigraph\Tests\MultigraphWebTest6300