rules_terms_test.patch

Test status
StatusResult
Last receivedMon, 11/29/2010 - 12:40:49
Last requestedMon, 11/29/2010 - 12:41:20
Last testedMon, 11/29/2010 - 12:44:46
Test count1
Environment status
MySQLfail
File information
Filerules_terms_test.patch
BranchRules - 7.x-2.x
LinkIssue Link
SummaryFAILED: [[SimpleTest]]: [MySQL] 152 pass(es), 0 fail(s), and 1 exception(s).
Details

MySQL

  1. Setup environment
  2. Detect an invalid patch URL
  3. Detect invalid repository information
  4. Detect invalid patch format
  5. Detect a non-applicable patch
  6. Detect invalid PHP syntax
  7. Detect a Drupal installation failure
  8. Detect a test run failure
  9. Detect a failing test
    Review the test failures below then if necessary run them locally until the problem has been fixed.
  10. Complete test suite with all tests passing
152 pass(es), 0 fail(s), and 1 exception(s)

Non-pass

Test namePassFailException
ExpandRules Core Integration (RulesIntegrationTestCase) [Rules]6201
MessageGroupFilenameLineFunctionStatus
RulesException: <em class="placeholder">action list_add</em>: Invalid data selector <em class="placeholder">taxonomy_term:plunjzih-field-name</em> specified. in RulesPlugin->getArgumentInfo() (line 669 of /var/lib/drupaltestbot/sites/default/files/checkout/sites/default/modules/rules/rules/includes/rules.core.inc).Uncaught exceptionrules.core.inc669RulesPlugin->getArgumentInfo()

All

Test namePassFailException
LeafReaction Rules (RulesTriggerTestCase) [Rules]2100
ExpandRules Core Integration (RulesIntegrationTestCase) [Rules]6201
MessageGroupFilenameLineFunctionStatus
RulesException: <em class="placeholder">action list_add</em>: Invalid data selector <em class="placeholder">taxonomy_term:plunjzih-field-name</em> specified. in RulesPlugin->getArgumentInfo() (line 669 of /var/lib/drupaltestbot/sites/default/files/checkout/sites/default/modules/rules/rules/includes/rules.core.inc).Uncaught exceptionrules.core.inc669RulesPlugin->getArgumentInfo()
LeafRules Data tests (RulesTestDataCase) [Rules]1300
LeafRules Engine tests (RulesTestCase) [Rules]5300
LeafRules Scheduler tests (RulesSchedulerTestCase) [Rules]300