add_config_export_to-2483965-18.patch

Test status
StatusResult
Last receivedWed, 07/22/2015 - 14:26:00
Last requestedWed, 07/22/2015 - 14:50:03
Last testedWed, 07/22/2015 - 14:50:44
Test count1
Environment status
PHP 5.5 MySQLfail
File information
Fileadd_config_export_to-2483965-18.patch
BranchCurrency - 8.x-3.x
LinkIssue Link
SummaryFAILED: [[SimpleTest]]: [PHP 5.5 MySQL] 237 pass(es), 18 fail(s), and 0 exception(s).
Details

PHP 5.5 MySQL

  1. Setup environment
  2. Detect an invalid patch URL
  3. Detect invalid repository information
  4. Detect invalid patch format
  5. Detect a non-applicable patch
  6. Detect invalid PHP syntax
  7. Detect a Drupal installation failure
  8. Detect a test run failure
  9. Detect a failing test
    Review the test failures below then if necessary run them locally until the problem has been fixed.
  10. Complete test suite with all tests passing
237 pass(es), 18 fail(s), and 0 exception(s)

Non-pass

Test namePassFailException
ExpandDrupal\currency\Tests\Controller\AmountFormattingFormWebTest010
MessageGroupFilenameLineFunctionStatus
The test did not complete due to a fatal error.Completion checkAmountFormattingFormWebTest.php24Drupal\currency\Tests\Controller\AmountFormattingFormWebTest->testListing()
ExpandDrupal\currency\Tests\Controller\CurrencyLocaleWebTest010
MessageGroupFilenameLineFunctionStatus
The test did not complete due to a fatal error.Completion checkCurrencyLocaleWebTest.php35Drupal\currency\Tests\Controller\CurrencyLocaleWebTest->testUserInterface()
ExpandDrupal\currency\Tests\Controller\CurrencyWebTest010
MessageGroupFilenameLineFunctionStatus
The test did not complete due to a fatal error.Completion checkCurrencyWebTest.php35Drupal\currency\Tests\Controller\CurrencyWebTest->testUserInterface()
ExpandDrupal\currency\Tests\Controller\FixedRatesFormWebTest010
MessageGroupFilenameLineFunctionStatus
The test did not complete due to a fatal error.Completion checkFixedRatesFormWebTest.php24Drupal\currency\Tests\Controller\FixedRatesFormWebTest->testForm()
ExpandDrupal\currency\Tests\Controller\PluginBasedExchangeRateProviderFormWebTest010
MessageGroupFilenameLineFunctionStatus
The test did not complete due to a fatal error.Completion checkPluginBasedExchangeRateProviderFormWebTest.php24Drupal\currency\Tests\Controller\PluginBasedExchangeRateProviderFormWebTest->testCurrencyExchangerUI()
ExpandDrupal\currency\Tests\Element\CurrencyAmountWebTest010
MessageGroupFilenameLineFunctionStatus
The test did not complete due to a fatal error.Completion checkCurrencyAmountWebTest.php34Drupal\currency\Tests\Element\CurrencyAmountWebTest->testValidation()
ExpandDrupal\currency\Tests\Element\CurrencySignWebTest010
MessageGroupFilenameLineFunctionStatus
The test did not complete due to a fatal error.Completion checkCurrencySignWebTest.php35Drupal\currency\Tests\Element\CurrencySignWebTest->testValidation()
ExpandDrupal\currency\Tests\Entity\CurrencyLocale\CurrencyLocaleDeleteFormWebTest010
MessageGroupFilenameLineFunctionStatus
The test did not complete due to a fatal error.Completion checkCurrencyLocaleDeleteFormWebTest.php24Drupal\currency\Tests\Entity\CurrencyLocale\CurrencyLocaleDeleteFormWebTest->testForm()
ExpandDrupal\currency\Tests\Entity\CurrencyLocale\CurrencyLocaleFormWebTest010
MessageGroupFilenameLineFunctionStatus
The test did not complete due to a fatal error.Completion checkCurrencyLocaleFormWebTest.php24Drupal\currency\Tests\Entity\CurrencyLocale\CurrencyLocaleFormWebTest->testUI()
ExpandDrupal\currency\Tests\Entity\Currency\CurrencyDeleteFormWebTest010
MessageGroupFilenameLineFunctionStatus
The test did not complete due to a fatal error.Completion checkCurrencyDeleteFormWebTest.php26Drupal\currency\Tests\Entity\Currency\CurrencyDeleteFormWebTest->testForm()
ExpandDrupal\currency\Tests\Entity\Currency\CurrencyFormWebTest010
MessageGroupFilenameLineFunctionStatus
The test did not complete due to a fatal error.Completion checkCurrencyFormWebTest.php35Drupal\currency\Tests\Entity\Currency\CurrencyFormWebTest->testUI()
ExpandDrupal\currency\Tests\ModuleInstallUninstallWebTest010
MessageGroupFilenameLineFunctionStatus
The test did not complete due to a fatal error.Completion checkModuleInstallUninstallWebTest.php31Drupal\currency\Tests\ModuleInstallUninstallWebTest->testInstallationAndUninstallation()
ExpandDrupal\currency\Tests\Plugin\views\field\AmountWebTest010
MessageGroupFilenameLineFunctionStatus
The test did not complete due to a fatal error.Completion checkAmountWebTest.php39Drupal\currency\Tests\Plugin\views\field\AmountWebTest->testHandler()
ExpandDrupal\currency\Tests\Plugin\views\field\CurrencyWebTest010
MessageGroupFilenameLineFunctionStatus
The test did not complete due to a fatal error.Completion checkCurrencyWebTest.php34Drupal\currency\Tests\Plugin\views\field\CurrencyWebTest->testHandler()
ExpandDrupal\currency\Tests\Plugin\views\filter\CurrencyWebTest010
MessageGroupFilenameLineFunctionStatus
The test did not complete due to a fatal error.Completion checkCurrencyWebTest.php28Drupal\currency\Tests\Plugin\views\filter\CurrencyWebTest->testHandler()
ExpandDrupal\currency\Tests\Token010
MessageGroupFilenameLineFunctionStatus
The test did not complete due to a fatal error.Completion checkToken.php24Drupal\currency\Tests\Token->testTokenIntegration()
ExpandDrupal\currency_intl\Tests\ModuleInstallUninstallWebTest010
MessageGroupFilenameLineFunctionStatus
The test did not complete due to a fatal error.Completion checkModuleInstallUninstallWebTest.php27Drupal\currency_intl\Tests\ModuleInstallUninstallWebTest->testUninstallation()
ExpandDrupal\Tests\currency\Unit\Entity\CurrencyUnitTest1810
MessageGroupFilenameLineFunctionStatus
Drupal\Tests\currency\Unit\Entity\CurrencyUnitTest::testToArray Drupal\Core\DependencyInjection\ContainerNotInitializedException: \Drupal::$container is not initialized yet. \Drupal::setContainer() must be called with a real container. /var/lib/drupaltestbot/sites/default/files/checkout/core/lib/Drupal.php:129 /var/lib/drupaltestbot/sites/default/files/checkout/core/lib/Drupal.php:157 /var/lib/drupaltestbot/sites/default/files/checkout/core/lib/Drupal/Core/Config/Entity/ConfigEntityBase.php:312 /var/lib/drupaltestbot/sites/default/files/checkout/core/lib/Drupal/Core/Config/Entity/ConfigEntityBase.php:281 /var/lib/drupaltestbot/sites/default/files/checkout/sites/default/modules/currency/src/Entity/Currency.php:416 /var/lib/drupaltestbot/sites/default/files/checkout/sites/default/modules/currency/tests/src/Unit/Entity/CurrencyUnitTest.php:366 OtherCurrencyUnitTest.php288Drupal\Tests\currency\Unit\Entity\CurrencyUnitTest->testToArray()

All

Test namePassFailException
ExpandDrupal\currency\Tests\Controller\AmountFormattingFormWebTest010
MessageGroupFilenameLineFunctionStatus
The test did not complete due to a fatal error.Completion checkAmountFormattingFormWebTest.php24Drupal\currency\Tests\Controller\AmountFormattingFormWebTest->testListing()
ExpandDrupal\currency\Tests\Controller\CurrencyLocaleWebTest010
MessageGroupFilenameLineFunctionStatus
The test did not complete due to a fatal error.Completion checkCurrencyLocaleWebTest.php35Drupal\currency\Tests\Controller\CurrencyLocaleWebTest->testUserInterface()
ExpandDrupal\currency\Tests\Controller\CurrencyWebTest010
MessageGroupFilenameLineFunctionStatus
The test did not complete due to a fatal error.Completion checkCurrencyWebTest.php35Drupal\currency\Tests\Controller\CurrencyWebTest->testUserInterface()
ExpandDrupal\currency\Tests\Controller\FixedRatesFormWebTest010
MessageGroupFilenameLineFunctionStatus
The test did not complete due to a fatal error.Completion checkFixedRatesFormWebTest.php24Drupal\currency\Tests\Controller\FixedRatesFormWebTest->testForm()
ExpandDrupal\currency\Tests\Controller\PluginBasedExchangeRateProviderFormWebTest010
MessageGroupFilenameLineFunctionStatus
The test did not complete due to a fatal error.Completion checkPluginBasedExchangeRateProviderFormWebTest.php24Drupal\currency\Tests\Controller\PluginBasedExchangeRateProviderFormWebTest->testCurrencyExchangerUI()
ExpandDrupal\currency\Tests\Element\CurrencyAmountWebTest010
MessageGroupFilenameLineFunctionStatus
The test did not complete due to a fatal error.Completion checkCurrencyAmountWebTest.php34Drupal\currency\Tests\Element\CurrencyAmountWebTest->testValidation()
ExpandDrupal\currency\Tests\Element\CurrencySignWebTest010
MessageGroupFilenameLineFunctionStatus
The test did not complete due to a fatal error.Completion checkCurrencySignWebTest.php35Drupal\currency\Tests\Element\CurrencySignWebTest->testValidation()
ExpandDrupal\currency\Tests\Entity\CurrencyLocale\CurrencyLocaleDeleteFormWebTest010
MessageGroupFilenameLineFunctionStatus
The test did not complete due to a fatal error.Completion checkCurrencyLocaleDeleteFormWebTest.php24Drupal\currency\Tests\Entity\CurrencyLocale\CurrencyLocaleDeleteFormWebTest->testForm()
ExpandDrupal\currency\Tests\Entity\CurrencyLocale\CurrencyLocaleFormWebTest010
MessageGroupFilenameLineFunctionStatus
The test did not complete due to a fatal error.Completion checkCurrencyLocaleFormWebTest.php24Drupal\currency\Tests\Entity\CurrencyLocale\CurrencyLocaleFormWebTest->testUI()
ExpandDrupal\currency\Tests\Entity\Currency\CurrencyDeleteFormWebTest010
MessageGroupFilenameLineFunctionStatus
The test did not complete due to a fatal error.Completion checkCurrencyDeleteFormWebTest.php26Drupal\currency\Tests\Entity\Currency\CurrencyDeleteFormWebTest->testForm()
ExpandDrupal\currency\Tests\Entity\Currency\CurrencyFormWebTest010
MessageGroupFilenameLineFunctionStatus
The test did not complete due to a fatal error.Completion checkCurrencyFormWebTest.php35Drupal\currency\Tests\Entity\Currency\CurrencyFormWebTest->testUI()
ExpandDrupal\currency\Tests\ModuleInstallUninstallWebTest010
MessageGroupFilenameLineFunctionStatus
The test did not complete due to a fatal error.Completion checkModuleInstallUninstallWebTest.php31Drupal\currency\Tests\ModuleInstallUninstallWebTest->testInstallationAndUninstallation()
ExpandDrupal\currency\Tests\Plugin\views\field\AmountWebTest010
MessageGroupFilenameLineFunctionStatus
The test did not complete due to a fatal error.Completion checkAmountWebTest.php39Drupal\currency\Tests\Plugin\views\field\AmountWebTest->testHandler()
ExpandDrupal\currency\Tests\Plugin\views\field\CurrencyWebTest010
MessageGroupFilenameLineFunctionStatus
The test did not complete due to a fatal error.Completion checkCurrencyWebTest.php34Drupal\currency\Tests\Plugin\views\field\CurrencyWebTest->testHandler()
ExpandDrupal\currency\Tests\Plugin\views\filter\CurrencyWebTest010
MessageGroupFilenameLineFunctionStatus
The test did not complete due to a fatal error.Completion checkCurrencyWebTest.php28Drupal\currency\Tests\Plugin\views\filter\CurrencyWebTest->testHandler()
ExpandDrupal\currency\Tests\Token010
MessageGroupFilenameLineFunctionStatus
The test did not complete due to a fatal error.Completion checkToken.php24Drupal\currency\Tests\Token->testTokenIntegration()
ExpandDrupal\currency_intl\Tests\ModuleInstallUninstallWebTest010
MessageGroupFilenameLineFunctionStatus
The test did not complete due to a fatal error.Completion checkModuleInstallUninstallWebTest.php27Drupal\currency_intl\Tests\ModuleInstallUninstallWebTest->testUninstallation()
LeafDrupal\Tests\currency\Unit\ConfigImporterUnitTest800
LeafDrupal\Tests\currency\Unit\Controller\AddCurrencyLocaleUnitTest200
LeafDrupal\Tests\currency\Unit\Controller\AddCurrencyUnitTest200
LeafDrupal\Tests\currency\Unit\Controller\AmountFormattingFormUnitTest500
LeafDrupal\Tests\currency\Unit\Controller\CurrencyImportFormUnitTest600
LeafDrupal\Tests\currency\Unit\Controller\CurrencyLocaleImportFormUnitTest600
LeafDrupal\Tests\currency\Unit\Controller\DisableCurrencyUnitTest200
LeafDrupal\Tests\currency\Unit\Controller\EditCurrencyLocaleUnitTest200
LeafDrupal\Tests\currency\Unit\Controller\EditCurrencyUnitTest200
LeafDrupal\Tests\currency\Unit\Controller\EnableCurrencyUnitTest200
LeafDrupal\Tests\currency\Unit\Controller\FixedRatesFormUnitTest700
LeafDrupal\Tests\currency\Unit\Controller\FixedRatesOverviewUnitTest200
LeafDrupal\Tests\currency\Unit\Controller\PluginBasedExchangeRateProviderFormUnitTest400
LeafDrupal\Tests\currency\Unit\Element\CurrencyAmountUnitTest1800
LeafDrupal\Tests\currency\Unit\Element\CurrencySignUnitTest200
LeafDrupal\Tests\currency\Unit\Entity\CurrencyLocaleUnitTest800
LeafDrupal\Tests\currency\Unit\Entity\CurrencyLocale\CurrencyLocaleAccessControlHandlerUnitTest800
LeafDrupal\Tests\currency\Unit\Entity\CurrencyLocale\CurrencyLocaleDeleteFormUnitTest500
LeafDrupal\Tests\currency\Unit\Entity\CurrencyLocale\CurrencyLocaleFormUnitTest800
LeafDrupal\Tests\currency\Unit\Entity\CurrencyLocale\CurrencyLocaleListBuilderUnitTest300
ExpandDrupal\Tests\currency\Unit\Entity\CurrencyUnitTest1810
MessageGroupFilenameLineFunctionStatus
Drupal\Tests\currency\Unit\Entity\CurrencyUnitTest::testToArray Drupal\Core\DependencyInjection\ContainerNotInitializedException: \Drupal::$container is not initialized yet. \Drupal::setContainer() must be called with a real container. /var/lib/drupaltestbot/sites/default/files/checkout/core/lib/Drupal.php:129 /var/lib/drupaltestbot/sites/default/files/checkout/core/lib/Drupal.php:157 /var/lib/drupaltestbot/sites/default/files/checkout/core/lib/Drupal/Core/Config/Entity/ConfigEntityBase.php:312 /var/lib/drupaltestbot/sites/default/files/checkout/core/lib/Drupal/Core/Config/Entity/ConfigEntityBase.php:281 /var/lib/drupaltestbot/sites/default/files/checkout/sites/default/modules/currency/src/Entity/Currency.php:416 /var/lib/drupaltestbot/sites/default/files/checkout/sites/default/modules/currency/tests/src/Unit/Entity/CurrencyUnitTest.php:366 OtherCurrencyUnitTest.php288Drupal\Tests\currency\Unit\Entity\CurrencyUnitTest->testToArray()
LeafDrupal\Tests\currency\Unit\Entity\Currency\CurrencyAccessControlHandlerUnitTest1400
LeafDrupal\Tests\currency\Unit\Entity\Currency\CurrencyDeleteFormUnitTest500
LeafDrupal\Tests\currency\Unit\Entity\Currency\CurrencyFormUnitTest1200
LeafDrupal\Tests\currency\Unit\Entity\Currency\CurrencyListBuilderUnitTest300
LeafDrupal\Tests\currency\Unit\EventDispatcherUnitTest200
LeafDrupal\Tests\currency\Unit\Event\CurrencyEventsUnitTest100
LeafDrupal\Tests\currency\Unit\Event\ResolveCountryCodeUnitTest100
LeafDrupal\Tests\currency\Unit\ExchangeRateUnitTest600
LeafDrupal\Tests\currency\Unit\FormHelperUnitTest500
LeafDrupal\Tests\currency\Unit\InputUnitTest100
LeafDrupal\Tests\currency\Unit\LocaleResolverUnitTest500
LeafDrupal\Tests\currency\Unit\PluginBasedExchangeRateProviderUnitTest800
LeafDrupal\Tests\currency\Unit\Plugin\Currency\AmountFormatter\AmountFormatterManagerUnitTest500
LeafDrupal\Tests\currency\Unit\Plugin\Currency\AmountFormatter\AmountFormatterOperationsProviderTest200
LeafDrupal\Tests\currency\Unit\Plugin\Currency\AmountFormatter\BasicUnitTest200
LeafDrupal\Tests\currency\Unit\Plugin\Currency\ExchangeRateProvider\ExchangeRateProviderManagerUnitTest200
LeafDrupal\Tests\currency\Unit\Plugin\Currency\ExchangeRateProvider\ExchangeRateProviderOperationsProviderTest200
LeafDrupal\Tests\currency\Unit\Plugin\Currency\ExchangeRateProvider\FixedRatesOperationsProviderTest200
LeafDrupal\Tests\currency\Unit\Plugin\Currency\ExchangeRateProvider\FixedRatesUnitTest600
LeafDrupal\Tests\currency\Unit\Plugin\Currency\ExchangeRateProvider\HistoricalRatesUnitTest200
LeafDrupal\Tests\currency\Unit\Plugin\Filter\CurrencyExchangeUnitTest300
LeafDrupal\Tests\currency\Unit\Plugin\Filter\CurrencyLocalizeUnitTest300
LeafDrupal\Tests\currency\Unit\Plugin\views\field\AmountUnitTest1200
LeafDrupal\Tests\currency\Unit\Plugin\views\field\CurrencyUnitTest600
LeafDrupal\Tests\currency\Unit\Plugin\views\filter\CurrencyUnitTest200
LeafDrupal\Tests\currency\Unit\UsageUnitTest300
LeafDrupal\Tests\currency_intl\Unit\Plugin\Currency\AmountFormatter\IntlUnitTest200