add_config_export_to-2485569-13.patch

Test status
StatusResult
Last receivedTue, 07/21/2015 - 12:21:00
Last requestedTue, 07/21/2015 - 12:21:01
Last testedTue, 07/21/2015 - 12:22:17
Test count1
Environment status
PHP 5.5 MySQLfail
File information
Fileadd_config_export_to-2485569-13.patch
BranchPayment - 8.x-2.x
LinkIssue Link
SummaryFAILED: [[SimpleTest]]: [PHP 5.5 MySQL] 1,268 pass(es), 2 fail(s), and 2 exception(s).
Details

PHP 5.5 MySQL

  1. Setup environment
  2. Detect an invalid patch URL
  3. Detect invalid repository information
  4. Detect invalid patch format
  5. Detect a non-applicable patch
  6. Detect invalid PHP syntax
  7. Detect a Drupal installation failure
  8. Detect a test run failure
  9. Detect a failing test
    Review the test failures below then if necessary run them locally until the problem has been fixed.
  10. Complete test suite with all tests passing
1,268 pass(es), 2 fail(s), and 2 exception(s)

Non-pass

Test namePassFailException
ExpandDrupal\payment\Tests\Controller\PaymentStatusWebTest3922
MessageGroupFilenameLineFunctionStatus
Drupal\Core\Config\Schema\SchemaIncompleteException: Schema errors for payment.payment_status.ublr8e7b with the following errors: payment.payment_status.ublr8e7b:uuid missing schema in Drupal\Core\Config\Testing\ConfigSchemaChecker->onConfigSave() (line 98 of /var/lib/drupaltestbot/sites/default/files/checkout/core/lib/Drupal/Core/Config/Testing/ConfigSchemaChecker.php). Drupal\Core\Config\Testing\ConfigSchemaChecker->onConfigSave(Object, 'config.save', Object) Drupal\Component\EventDispatcher\ContainerAwareEventDispatcher->dispatch('config.save', Object) Drupal\Core\Config\Config->save() Drupal\Core\Config\Entity\ConfigEntityStorage->doSave('ublr8e7b', Object) Drupal\Core\Entity\EntityStorageBase->save(Object) Drupal\Core\Config\Entity\ConfigEntityStorage->save(Object) Drupal\Core\Entity\Entity->save() Drupal\Core\Config\Entity\ConfigEntityBase->save() Drupal\payment\Tests\Controller\PaymentStatusWebTest->testList() Drupal\simpletest\TestBase->run(Array) simpletest_script_run_one_test('24', 'Drupal\payment\Tests\Controller\PaymentStatusWebTest') Uncaught exceptionConfigSchemaChecker.php98Drupal\Core\Config\Testing\ConfigSchemaChecker->onConfigSave()
[21-Jul-2015 12:22:08 UTC] Uncaught PHP Exception Drupal\Core\Config\Schema\SchemaIncompleteException: "Schema errors for payment.payment_status.mkjzfnv6 with the following errors: payment.payment_status.mkjzfnv6:uuid missing schema" at /var/lib/drupaltestbot/sites/default/files/checkout/core/lib/Drupal/Core/Config/Testing/ConfigSchemaChecker.php line 98 Fatal errorUnknown0Unknown
[21-Jul-2015 12:22:09 UTC] Uncaught PHP Exception Drupal\Core\Config\Schema\SchemaIncompleteException: "Schema errors for payment.payment_status.mkjzfnv6 with the following errors: payment.payment_status.mkjzfnv6:uuid missing schema" at /var/lib/drupaltestbot/sites/default/files/checkout/core/lib/Drupal/Core/Config/Testing/ConfigSchemaChecker.php line 98 Fatal errorUnknown0Unknown
Drupal\Core\Config\Schema\SchemaIncompleteException: Schema errors for payment.payment_status.s63wxjgo with the following errors: payment.payment_status.s63wxjgo:uuid missing schema in Drupal\Core\Config\Testing\ConfigSchemaChecker->onConfigSave() (line 98 of /var/lib/drupaltestbot/sites/default/files/checkout/core/lib/Drupal/Core/Config/Testing/ConfigSchemaChecker.php). Drupal\Core\Config\Testing\ConfigSchemaChecker->onConfigSave(Object, 'config.save', Object) Drupal\Component\EventDispatcher\ContainerAwareEventDispatcher->dispatch('config.save', Object) Drupal\Core\Config\Config->save() Drupal\Core\Config\Entity\ConfigEntityStorage->doSave('s63wxjgo', Object) Drupal\Core\Entity\EntityStorageBase->save(Object) Drupal\Core\Config\Entity\ConfigEntityStorage->save(Object) Drupal\Core\Entity\Entity->save() Drupal\Core\Config\Entity\ConfigEntityBase->save() Drupal\payment\Tests\Controller\PaymentStatusWebTest->testDelete() Drupal\simpletest\TestBase->run(Array) simpletest_script_run_one_test('24', 'Drupal\payment\Tests\Controller\PaymentStatusWebTest') Uncaught exceptionConfigSchemaChecker.php98Drupal\Core\Config\Testing\ConfigSchemaChecker->onConfigSave()

All

Test namePassFailException
LeafDrupal\payment\Tests\Controller\PaymentMethodWebTest22800
ExpandDrupal\payment\Tests\Controller\PaymentStatusWebTest3922
MessageGroupFilenameLineFunctionStatus
Drupal\Core\Config\Schema\SchemaIncompleteException: Schema errors for payment.payment_status.ublr8e7b with the following errors: payment.payment_status.ublr8e7b:uuid missing schema in Drupal\Core\Config\Testing\ConfigSchemaChecker->onConfigSave() (line 98 of /var/lib/drupaltestbot/sites/default/files/checkout/core/lib/Drupal/Core/Config/Testing/ConfigSchemaChecker.php). Drupal\Core\Config\Testing\ConfigSchemaChecker->onConfigSave(Object, 'config.save', Object) Drupal\Component\EventDispatcher\ContainerAwareEventDispatcher->dispatch('config.save', Object) Drupal\Core\Config\Config->save() Drupal\Core\Config\Entity\ConfigEntityStorage->doSave('ublr8e7b', Object) Drupal\Core\Entity\EntityStorageBase->save(Object) Drupal\Core\Config\Entity\ConfigEntityStorage->save(Object) Drupal\Core\Entity\Entity->save() Drupal\Core\Config\Entity\ConfigEntityBase->save() Drupal\payment\Tests\Controller\PaymentStatusWebTest->testList() Drupal\simpletest\TestBase->run(Array) simpletest_script_run_one_test('24', 'Drupal\payment\Tests\Controller\PaymentStatusWebTest') Uncaught exceptionConfigSchemaChecker.php98Drupal\Core\Config\Testing\ConfigSchemaChecker->onConfigSave()
[21-Jul-2015 12:22:08 UTC] Uncaught PHP Exception Drupal\Core\Config\Schema\SchemaIncompleteException: "Schema errors for payment.payment_status.mkjzfnv6 with the following errors: payment.payment_status.mkjzfnv6:uuid missing schema" at /var/lib/drupaltestbot/sites/default/files/checkout/core/lib/Drupal/Core/Config/Testing/ConfigSchemaChecker.php line 98 Fatal errorUnknown0Unknown
[21-Jul-2015 12:22:09 UTC] Uncaught PHP Exception Drupal\Core\Config\Schema\SchemaIncompleteException: "Schema errors for payment.payment_status.mkjzfnv6 with the following errors: payment.payment_status.mkjzfnv6:uuid missing schema" at /var/lib/drupaltestbot/sites/default/files/checkout/core/lib/Drupal/Core/Config/Testing/ConfigSchemaChecker.php line 98 Fatal errorUnknown0Unknown
Drupal\Core\Config\Schema\SchemaIncompleteException: Schema errors for payment.payment_status.s63wxjgo with the following errors: payment.payment_status.s63wxjgo:uuid missing schema in Drupal\Core\Config\Testing\ConfigSchemaChecker->onConfigSave() (line 98 of /var/lib/drupaltestbot/sites/default/files/checkout/core/lib/Drupal/Core/Config/Testing/ConfigSchemaChecker.php). Drupal\Core\Config\Testing\ConfigSchemaChecker->onConfigSave(Object, 'config.save', Object) Drupal\Component\EventDispatcher\ContainerAwareEventDispatcher->dispatch('config.save', Object) Drupal\Core\Config\Config->save() Drupal\Core\Config\Entity\ConfigEntityStorage->doSave('s63wxjgo', Object) Drupal\Core\Entity\EntityStorageBase->save(Object) Drupal\Core\Config\Entity\ConfigEntityStorage->save(Object) Drupal\Core\Entity\Entity->save() Drupal\Core\Config\Entity\ConfigEntityBase->save() Drupal\payment\Tests\Controller\PaymentStatusWebTest->testDelete() Drupal\simpletest\TestBase->run(Array) simpletest_script_run_one_test('24', 'Drupal\payment\Tests\Controller\PaymentStatusWebTest') Uncaught exceptionConfigSchemaChecker.php98Drupal\Core\Config\Testing\ConfigSchemaChecker->onConfigSave()
LeafDrupal\payment\Tests\Controller\PaymentTypeWebTest14600
LeafDrupal\payment\Tests\Controller\PaymentWebTest9500
LeafDrupal\payment\Tests\DatabaseQueueWebTest1300
LeafDrupal\payment\Tests\Element\PaymentLineItemsInputWebTest5900
LeafDrupal\payment\Tests\Entity\PaymentUnitTest4000
LeafDrupal\payment\Tests\Entity\Payment\PaymentStorageWebTest2000
LeafDrupal\payment\Tests\ModuleInstallUninstallWebTest500
LeafDrupal\payment\Tests\PaymentAdministrationCategoryWebTest2300
LeafDrupal\payment\Tests\Plugin\Payment\LineItem\BasicWebTest1600
LeafDrupal\payment_form\Tests\Plugin\Field\FieldFormatter\PaymentFormWebTest1900
LeafDrupal\payment_form\Tests\Plugin\Field\FieldType\PaymentFormWebTest1300
LeafDrupal\payment_form\Tests\Plugin\Field\FieldWidget\PaymentFormWebTest3200
LeafDrupal\payment_reference\Tests\Element\PaymentReferenceWebTest3500
LeafDrupal\payment_reference\Tests\Plugin\Field\FieldType\PaymentReferenceWebTest3100
LeafDrupal\payment_reference\Tests\Plugin\Field\FieldWidget\PaymentReferenceWebTest1700
LeafDrupal\Tests\payment\Unit\Controller\AddPaymentMethodConfigurationUnitTest400
LeafDrupal\Tests\payment\Unit\Controller\AddPaymentStatusUnitTest200
LeafDrupal\Tests\payment\Unit\Controller\CompletePaymentUnitTest100
LeafDrupal\Tests\payment\Unit\Controller\ConfigurePaymentTypeUnitTest300
LeafDrupal\Tests\payment\Unit\Controller\DisablePaymentMethodConfigurationUnitTest100
LeafDrupal\Tests\payment\Unit\Controller\DuplicatePaymentMethodConfigurationUnitTest300
LeafDrupal\Tests\payment\Unit\Controller\EditPaymentMethodConfigurationUnitTest200
LeafDrupal\Tests\payment\Unit\Controller\EditPaymentStatusUnitTest200
LeafDrupal\Tests\payment\Unit\Controller\EditPaymentUnitTest200
LeafDrupal\Tests\payment\Unit\Controller\EnablePaymentMethodConfigurationUnitTest100
LeafDrupal\Tests\payment\Unit\Controller\ListPaymentMethodsUnitTest200
LeafDrupal\Tests\payment\Unit\Controller\ListPaymentStatusesUnitTest200
LeafDrupal\Tests\payment\Unit\Controller\ListPaymentTypesUnitTest200
LeafDrupal\Tests\payment\Unit\Controller\SelectPaymentMethodConfigurationUnitTest300
LeafDrupal\Tests\payment\Unit\Controller\ViewPaymentUnitTest200
LeafDrupal\Tests\payment\Unit\DatabaseQueueUnitTest400
LeafDrupal\Tests\payment\Unit\Element\PaymentLineItemsDisplayUnitTest400
LeafDrupal\Tests\payment\Unit\Element\PaymentStatusesDisplayUnitTest400
LeafDrupal\Tests\payment\Unit\Entity\PaymentMethodConfigurationUnitTest1200
LeafDrupal\Tests\payment\Unit\Entity\PaymentMethodConfiguration\PaymentMethodConfigurationAccessControlHandlerUnitTest1600
LeafDrupal\Tests\payment\Unit\Entity\PaymentMethodConfiguration\PaymentMethodConfigurationDeleteFormUnitTest500
LeafDrupal\Tests\payment\Unit\Entity\PaymentStatusUnitTest600
LeafDrupal\Tests\payment\Unit\Entity\PaymentStatus\PaymentStatusListBuilderUnitTest100
LeafDrupal\Tests\payment\Unit\Entity\Payment\PaymentAccessControlHandlerUnitTest2100
LeafDrupal\Tests\payment\Unit\Entity\Payment\PaymentCaptureFormUnitTest500
LeafDrupal\Tests\payment\Unit\Entity\Payment\PaymentRefundFormUnitTest500
LeafDrupal\Tests\payment\Unit\Entity\Payment\PaymentStatusFormUnitTest500
LeafDrupal\Tests\payment\Unit\Entity\Payment\PaymentStorageSchemaUnitTest200
LeafDrupal\Tests\payment\Unit\Entity\Payment\PaymentStorageUnitTest100
LeafDrupal\Tests\payment\Unit\EventDispatcherUnitTest800
LeafDrupal\Tests\payment\Unit\Event\PaymentEventsUnitTest100
LeafDrupal\Tests\payment\Unit\Event\PaymentExecuteAccessUnitTest700
LeafDrupal\Tests\payment\Unit\Event\PaymentPreCaptureUnitTest200
LeafDrupal\Tests\payment\Unit\Event\PaymentPreExecuteUnitTest200
LeafDrupal\Tests\payment\Unit\Event\PaymentPreRefundUnitTest200
LeafDrupal\Tests\payment\Unit\Event\PaymentQueuePaymentIdsAlterUnitTest500
LeafDrupal\Tests\payment\Unit\Event\PaymentStatusSetUnitTest300
LeafDrupal\Tests\payment\Unit\Event\PaymentTypePreResumeContextUnitTest200
LeafDrupal\Tests\payment\Unit\Hook\EntityBundleInfoUnitTest200
LeafDrupal\Tests\payment\Unit\Hook\EntityCrudUnitTest200
LeafDrupal\Tests\payment\Unit\PaymentExecutionResultUnitTest200
LeafDrupal\Tests\payment\Unit\PaymentUnitTest600
LeafDrupal\Tests\payment\Unit\PermissionsUnitTest200
LeafDrupal\Tests\payment\Unit\Plugin\Action\SetStatusUnitTest1000
LeafDrupal\Tests\payment\Unit\Plugin\Action\UnsetLineItemUnitTest900
LeafDrupal\Tests\payment\Unit\Plugin\Payment\LineItem\BasicUnitTest700
LeafDrupal\Tests\payment\Unit\Plugin\Payment\LineItem\PaymentLineItemBaseUnitTest1000
LeafDrupal\Tests\payment\Unit\Plugin\Payment\LineItem\PaymentLineItemManagerUnitTest200
LeafDrupal\Tests\payment\Unit\Plugin\Payment\MethodConfiguration\BasicUnitTest1100
LeafDrupal\Tests\payment\Unit\Plugin\Payment\MethodConfiguration\PaymentMethodConfigurationBaseUnitTest1100
LeafDrupal\Tests\payment\Unit\Plugin\Payment\MethodConfiguration\PaymentMethodConfigurationManagerUnitTest200
LeafDrupal\Tests\payment\Unit\Plugin\Payment\Method\BasicDeriverUnitTest200
LeafDrupal\Tests\payment\Unit\Plugin\Payment\Method\BasicOperationsProviderUnitTest100
LeafDrupal\Tests\payment\Unit\Plugin\Payment\Method\BasicUnitTest2000
LeafDrupal\Tests\payment\Unit\Plugin\Payment\Method\FilteredPaymentMethodManagerUnitTest400
LeafDrupal\Tests\payment\Unit\Plugin\Payment\Method\PaymentMethodBaseUnitTest3800
LeafDrupal\Tests\payment\Unit\Plugin\Payment\Method\PaymentMethodConfigurationOperationsProviderUnitTest200
LeafDrupal\Tests\payment\Unit\Plugin\Payment\Method\PaymentMethodManagerUnitTest300
LeafDrupal\Tests\payment\Unit\Plugin\Payment\Method\PaymentMethodOperationsProviderTest200
LeafDrupal\Tests\payment\Unit\Plugin\Payment\Method\SupportedCurrencyUnitTest400
LeafDrupal\Tests\payment\Unit\Plugin\Payment\Method\UnavailableUnitTest1200
LeafDrupal\Tests\payment\Unit\Plugin\Payment\Status\ConfigDeriverUnitTest200
LeafDrupal\Tests\payment\Unit\Plugin\Payment\Status\ConfigOperationsProviderUnitTest200
LeafDrupal\Tests\payment\Unit\Plugin\Payment\Status\PaymentStatusManagerUnitTest800
LeafDrupal\Tests\payment\Unit\Plugin\Payment\Status\PaymentStatusOperationsProviderTest200
LeafDrupal\Tests\payment\Unit\Plugin\Payment\Type\PaymentTypeBaseUnitTest600
LeafDrupal\Tests\payment\Unit\Plugin\Payment\Type\PaymentTypeManagerUnitTest300
LeafDrupal\Tests\payment\Unit\Plugin\Payment\Type\PaymentTypeOperationsProviderTest200
LeafDrupal\Tests\payment\Unit\Plugin\Payment\Type\UnavailableUnitTest400
LeafDrupal\Tests\payment\Unit\Plugin\views\argument_validator\ViewPaymentsByOwnerUnitTest1100
LeafDrupal\Tests\payment\Unit\Plugin\views\field\PaymentAmountUnitTest100
LeafDrupal\Tests\payment\Unit\Plugin\views\field\PaymentLineItemLabelUnitTest200
LeafDrupal\Tests\payment\Unit\Plugin\views\field\PaymentMethodLabelUnitTest200
LeafDrupal\Tests\payment\Unit\Plugin\views\field\PaymentStatusLabelUnitTest200
LeafDrupal\Tests\payment\Unit\Plugin\views\field\PaymentTypeLabelUnitTest200
LeafDrupal\Tests\payment\Unit\Plugin\views\filter\PaymentMethodUnitTest200
LeafDrupal\Tests\payment\Unit\Plugin\views\filter\PaymentStatusUnitTest200
LeafDrupal\Tests\payment\Unit\Response\ResponseUnitTest400
LeafDrupal\Tests\payment_form\Unit\Entity\Payment\PaymentFormUnitTest600
LeafDrupal\Tests\payment_form\Unit\Hook\EntityExtraFieldInfoUnitTest200
LeafDrupal\Tests\payment_form\Unit\Plugin\Field\FieldFormatter\PaymentFormUnitTest200
LeafDrupal\Tests\payment_form\Unit\Plugin\Field\FieldType\PaymentFormUnitTest200
LeafDrupal\Tests\payment_form\Unit\Plugin\Field\FieldWidget\PaymentFormUnitTest500
LeafDrupal\Tests\payment_form\Unit\Plugin\Payment\Type\PaymentFormUnitTest1000
LeafDrupal\Tests\payment_reference\Unit\Controller\ResumeContextUnitTest500
LeafDrupal\Tests\payment_reference\Unit\Element\PaymentReferenceUnitTest200
LeafDrupal\Tests\payment_reference\Unit\Hook\EntityExtraFieldInfoUnitTest200
LeafDrupal\Tests\payment_reference\Unit\PaymentFactoryUnitTest200
LeafDrupal\Tests\payment_reference\Unit\PaymentReferenceUnitTest200
LeafDrupal\Tests\payment_reference\Unit\Plugin\Field\FieldType\PaymentReferenceItemListUnitTest300
LeafDrupal\Tests\payment_reference\Unit\Plugin\Field\FieldType\PaymentReferenceUnitTest400
LeafDrupal\Tests\payment_reference\Unit\Plugin\Field\FieldWidget\PaymentReferenceUnitTest300
LeafDrupal\Tests\payment_reference\Unit\Plugin\Payment\Type\PaymentReferenceUnitTest1100