sensor_for_php_notices-2495613-23.patch

Test status
StatusResult
Last receivedTue, 07/21/2015 - 07:37:00
Last requestedTue, 07/21/2015 - 07:37:01
Last testedTue, 07/21/2015 - 07:42:49
Test count1
Environment status
PHP 5.5 MySQLfail
File information
Filesensor_for_php_notices-2495613-23.patch
BranchMonitoring - 8.x-1.x
LinkIssue Link
SummaryFAILED: [[SimpleTest]]: [PHP 5.5 MySQL] 1,776 pass(es), 5 fail(s), and 22 exception(s).
Details

PHP 5.5 MySQL

  1. Setup environment
  2. Detect an invalid patch URL
  3. Detect invalid repository information
  4. Detect invalid patch format
  5. Detect a non-applicable patch
  6. Detect invalid PHP syntax
  7. Detect a Drupal installation failure
  8. Detect a test run failure
  9. Detect a failing test
    Review the test failures below then if necessary run them locally until the problem has been fixed.
  10. Complete test suite with all tests passing
1,776 pass(es), 5 fail(s), and 22 exception(s)

Non-pass

Test namePassFailException
ExpandDrupal\monitoring\Tests\MonitoringCoreKernelTest14204
MessageGroupFilenameLineFunctionStatus
Drupal\Core\Config\Schema\SchemaIncompleteException: Schema errors for monitoring.sensor_config.monitoring_git_dirty_tree with the following errors: monitoring.sensor_config.monitoring_git_dirty_tree:settings.cmd missing schema in Drupal\Core\Config\Testing\ConfigSchemaChecker->onConfigSave() (line 98 of /var/lib/drupaltestbot/sites/default/files/checkout/core/lib/Drupal/Core/Config/Testing/ConfigSchemaChecker.php). Drupal\Core\Config\Testing\ConfigSchemaChecker->onConfigSave(Object, 'config.save', Object) Drupal\Component\EventDispatcher\ContainerAwareEventDispatcher->dispatch('config.save', Object) Drupal\Core\Config\Config->save() Drupal\Core\Config\Entity\ConfigEntityStorage->doSave('monitoring_git_dirty_tree', Object) Drupal\Core\Entity\EntityStorageBase->save(Object) Drupal\Core\Config\Entity\ConfigEntityStorage->save(Object) Drupal\Core\Entity\Entity->save() Drupal\Core\Config\Entity\ConfigEntityBase->save() Drupal\monitoring\Tests\MonitoringCoreKernelTest->testGitDirtyTreeSensorPlugin() Drupal\simpletest\TestBase->run(Array) simpletest_script_run_one_test('4', 'Drupal\monitoring\Tests\MonitoringCoreKernelTest') Uncaught exceptionConfigSchemaChecker.php98Drupal\Core\Config\Testing\ConfigSchemaChecker->onConfigSave()
Undefined offset: 0Drupal\monitoring\Plugin\monitoring\SensorPlugin\DatabaseAggregatorSensorPlugin->buildTableHeader(Array) Drupal\monitoring\Plugin\monitoring\SensorPlugin\DatabaseAggregatorSensorPlugin->verboseResultUnaggregated(Array) Drupal\monitoring\Plugin\monitoring\SensorPlugin\DatabaseAggregatorSensorPlugin->resultVerbose(Object) Drupal\monitoring\SensorRunner->runSensor(Object) Drupal\monitoring\SensorRunner->runSensors(Array, 1, 1) monitoring_sensor_run_multiple(Array, 1, 1) monitoring_sensor_run('watchdog_aggregate_test', 1, 1) Drupal\monitoring\Tests\MonitoringUnitTestBase->runSensor('watchdog_aggregate_test') Drupal\monitoring\Tests\MonitoringCoreKernelTest->testDatabaseAggregator() Drupal\simpletest\TestBase->run(Array) simpletest_script_run_one_test('4', 'Drupal\monitoring\Tests\MonitoringCoreKernelTest') NoticeDatabaseAggregatorSensorPlugin.php194Drupal\monitoring\Plugin\monitoring\SensorPlugin\DatabaseAggregatorSensorPlugin->buildTableHeader()
array_keys() expects parameter 1 to be array, null givenarray_keys(NULL) Drupal\monitoring\Plugin\monitoring\SensorPlugin\DatabaseAggregatorSensorPlugin->buildTableHeader(Array) Drupal\monitoring\Plugin\monitoring\SensorPlugin\DatabaseAggregatorSensorPlugin->verboseResultUnaggregated(Array) Drupal\monitoring\Plugin\monitoring\SensorPlugin\DatabaseAggregatorSensorPlugin->resultVerbose(Object) Drupal\monitoring\SensorRunner->runSensor(Object) Drupal\monitoring\SensorRunner->runSensors(Array, 1, 1) monitoring_sensor_run_multiple(Array, 1, 1) monitoring_sensor_run('watchdog_aggregate_test', 1, 1) Drupal\monitoring\Tests\MonitoringUnitTestBase->runSensor('watchdog_aggregate_test') Drupal\monitoring\Tests\MonitoringCoreKernelTest->testDatabaseAggregator() Drupal\simpletest\TestBase->run(Array) simpletest_script_run_one_test('4', 'Drupal\monitoring\Tests\MonitoringCoreKernelTest') WarningDatabaseAggregatorSensorPlugin.php194Drupal\monitoring\Plugin\monitoring\SensorPlugin\DatabaseAggregatorSensorPlugin->buildTableHeader()
array_combine() expects parameter 1 to be array, null givenarray_combine(NULL, NULL) Drupal\monitoring\Plugin\monitoring\SensorPlugin\DatabaseAggregatorSensorPlugin->buildTableHeader(Array) Drupal\monitoring\Plugin\monitoring\SensorPlugin\DatabaseAggregatorSensorPlugin->verboseResultUnaggregated(Array) Drupal\monitoring\Plugin\monitoring\SensorPlugin\DatabaseAggregatorSensorPlugin->resultVerbose(Object) Drupal\monitoring\SensorRunner->runSensor(Object) Drupal\monitoring\SensorRunner->runSensors(Array, 1, 1) monitoring_sensor_run_multiple(Array, 1, 1) monitoring_sensor_run('watchdog_aggregate_test', 1, 1) Drupal\monitoring\Tests\MonitoringUnitTestBase->runSensor('watchdog_aggregate_test') Drupal\monitoring\Tests\MonitoringCoreKernelTest->testDatabaseAggregator() Drupal\simpletest\TestBase->run(Array) simpletest_script_run_one_test('4', 'Drupal\monitoring\Tests\MonitoringCoreKernelTest') WarningDatabaseAggregatorSensorPlugin.php195Drupal\monitoring\Plugin\monitoring\SensorPlugin\DatabaseAggregatorSensorPlugin->buildTableHeader()
ExpandDrupal\monitoring\Tests\MonitoringCoreWebTest123518
MessageGroupFilenameLineFunctionStatus
Undefined offset: 0Drupal\monitoring\Plugin\monitoring\SensorPlugin\DatabaseAggregatorSensorPlugin->buildTableHeader(Array) Drupal\monitoring\Plugin\monitoring\SensorPlugin\DatabaseAggregatorSensorPlugin->verboseResultUnaggregated(Array) Drupal\monitoring\Plugin\monitoring\SensorPlugin\DatabaseAggregatorSensorPlugin->resultVerbose(Object) Drupal\monitoring\SensorRunner->runSensor(Object) Drupal\monitoring\SensorRunner->runSensors(Array, 1, 1) monitoring_sensor_run_multiple(Array, 1, 1) monitoring_sensor_run('user_sessions_authenticated', 1, 1) Drupal\monitoring\Tests\MonitoringTestBase->runSensor('user_sessions_authenticated') Drupal\monitoring\Tests\MonitoringCoreWebTest->doTestDatabaseAggregatorSensorPluginActiveSessions() Drupal\monitoring\Tests\MonitoringCoreWebTest->testSensors() Drupal\simpletest\TestBase->run(Array) simpletest_script_run_one_test('11', 'Drupal\monitoring\Tests\MonitoringCoreWebTest') NoticeDatabaseAggregatorSensorPlugin.php194Drupal\monitoring\Plugin\monitoring\SensorPlugin\DatabaseAggregatorSensorPlugin->buildTableHeader()
array_keys() expects parameter 1 to be array, null givenarray_keys(NULL) Drupal\monitoring\Plugin\monitoring\SensorPlugin\DatabaseAggregatorSensorPlugin->buildTableHeader(Array) Drupal\monitoring\Plugin\monitoring\SensorPlugin\DatabaseAggregatorSensorPlugin->verboseResultUnaggregated(Array) Drupal\monitoring\Plugin\monitoring\SensorPlugin\DatabaseAggregatorSensorPlugin->resultVerbose(Object) Drupal\monitoring\SensorRunner->runSensor(Object) Drupal\monitoring\SensorRunner->runSensors(Array, 1, 1) monitoring_sensor_run_multiple(Array, 1, 1) monitoring_sensor_run('user_sessions_authenticated', 1, 1) Drupal\monitoring\Tests\MonitoringTestBase->runSensor('user_sessions_authenticated') Drupal\monitoring\Tests\MonitoringCoreWebTest->doTestDatabaseAggregatorSensorPluginActiveSessions() Drupal\monitoring\Tests\MonitoringCoreWebTest->testSensors() Drupal\simpletest\TestBase->run(Array) simpletest_script_run_one_test('11', 'Drupal\monitoring\Tests\MonitoringCoreWebTest') WarningDatabaseAggregatorSensorPlugin.php194Drupal\monitoring\Plugin\monitoring\SensorPlugin\DatabaseAggregatorSensorPlugin->buildTableHeader()
array_combine() expects parameter 1 to be array, null givenarray_combine(NULL, NULL) Drupal\monitoring\Plugin\monitoring\SensorPlugin\DatabaseAggregatorSensorPlugin->buildTableHeader(Array) Drupal\monitoring\Plugin\monitoring\SensorPlugin\DatabaseAggregatorSensorPlugin->verboseResultUnaggregated(Array) Drupal\monitoring\Plugin\monitoring\SensorPlugin\DatabaseAggregatorSensorPlugin->resultVerbose(Object) Drupal\monitoring\SensorRunner->runSensor(Object) Drupal\monitoring\SensorRunner->runSensors(Array, 1, 1) monitoring_sensor_run_multiple(Array, 1, 1) monitoring_sensor_run('user_sessions_authenticated', 1, 1) Drupal\monitoring\Tests\MonitoringTestBase->runSensor('user_sessions_authenticated') Drupal\monitoring\Tests\MonitoringCoreWebTest->doTestDatabaseAggregatorSensorPluginActiveSessions() Drupal\monitoring\Tests\MonitoringCoreWebTest->testSensors() Drupal\simpletest\TestBase->run(Array) simpletest_script_run_one_test('11', 'Drupal\monitoring\Tests\MonitoringCoreWebTest') WarningDatabaseAggregatorSensorPlugin.php195Drupal\monitoring\Plugin\monitoring\SensorPlugin\DatabaseAggregatorSensorPlugin->buildTableHeader()
Undefined offset: 0Drupal\monitoring\Plugin\monitoring\SensorPlugin\DatabaseAggregatorSensorPlugin->buildTableHeader(Array) Drupal\monitoring\Plugin\monitoring\SensorPlugin\DatabaseAggregatorSensorPlugin->verboseResultUnaggregated(Array) Drupal\monitoring\Plugin\monitoring\SensorPlugin\DatabaseAggregatorSensorPlugin->resultVerbose(Object) Drupal\monitoring\SensorRunner->runSensor(Object) Drupal\monitoring\SensorRunner->runSensors(Array, 1, 1) monitoring_sensor_run_multiple(Array, 1, 1) monitoring_sensor_run('user_sessions_all', 1, 1) Drupal\monitoring\Tests\MonitoringTestBase->runSensor('user_sessions_all') Drupal\monitoring\Tests\MonitoringCoreWebTest->doTestDatabaseAggregatorSensorPluginActiveSessions() Drupal\monitoring\Tests\MonitoringCoreWebTest->testSensors() Drupal\simpletest\TestBase->run(Array) simpletest_script_run_one_test('11', 'Drupal\monitoring\Tests\MonitoringCoreWebTest') NoticeDatabaseAggregatorSensorPlugin.php194Drupal\monitoring\Plugin\monitoring\SensorPlugin\DatabaseAggregatorSensorPlugin->buildTableHeader()
array_keys() expects parameter 1 to be array, null givenarray_keys(NULL) Drupal\monitoring\Plugin\monitoring\SensorPlugin\DatabaseAggregatorSensorPlugin->buildTableHeader(Array) Drupal\monitoring\Plugin\monitoring\SensorPlugin\DatabaseAggregatorSensorPlugin->verboseResultUnaggregated(Array) Drupal\monitoring\Plugin\monitoring\SensorPlugin\DatabaseAggregatorSensorPlugin->resultVerbose(Object) Drupal\monitoring\SensorRunner->runSensor(Object) Drupal\monitoring\SensorRunner->runSensors(Array, 1, 1) monitoring_sensor_run_multiple(Array, 1, 1) monitoring_sensor_run('user_sessions_all', 1, 1) Drupal\monitoring\Tests\MonitoringTestBase->runSensor('user_sessions_all') Drupal\monitoring\Tests\MonitoringCoreWebTest->doTestDatabaseAggregatorSensorPluginActiveSessions() Drupal\monitoring\Tests\MonitoringCoreWebTest->testSensors() Drupal\simpletest\TestBase->run(Array) simpletest_script_run_one_test('11', 'Drupal\monitoring\Tests\MonitoringCoreWebTest') WarningDatabaseAggregatorSensorPlugin.php194Drupal\monitoring\Plugin\monitoring\SensorPlugin\DatabaseAggregatorSensorPlugin->buildTableHeader()
array_combine() expects parameter 1 to be array, null givenarray_combine(NULL, NULL) Drupal\monitoring\Plugin\monitoring\SensorPlugin\DatabaseAggregatorSensorPlugin->buildTableHeader(Array) Drupal\monitoring\Plugin\monitoring\SensorPlugin\DatabaseAggregatorSensorPlugin->verboseResultUnaggregated(Array) Drupal\monitoring\Plugin\monitoring\SensorPlugin\DatabaseAggregatorSensorPlugin->resultVerbose(Object) Drupal\monitoring\SensorRunner->runSensor(Object) Drupal\monitoring\SensorRunner->runSensors(Array, 1, 1) monitoring_sensor_run_multiple(Array, 1, 1) monitoring_sensor_run('user_sessions_all', 1, 1) Drupal\monitoring\Tests\MonitoringTestBase->runSensor('user_sessions_all') Drupal\monitoring\Tests\MonitoringCoreWebTest->doTestDatabaseAggregatorSensorPluginActiveSessions() Drupal\monitoring\Tests\MonitoringCoreWebTest->testSensors() Drupal\simpletest\TestBase->run(Array) simpletest_script_run_one_test('11', 'Drupal\monitoring\Tests\MonitoringCoreWebTest') WarningDatabaseAggregatorSensorPlugin.php195Drupal\monitoring\Plugin\monitoring\SensorPlugin\DatabaseAggregatorSensorPlugin->buildTableHeader()
Undefined offset: 0NoticeDatabaseAggregatorSensorPlugin.php194Drupal\monitoring\Plugin\monitoring\SensorPlugin\DatabaseAggregatorSensorPlugin->buildTableHeader()
array_keys() expects parameter 1 to be array, null givenWarningDatabaseAggregatorSensorPlugin.php194Drupal\monitoring\Plugin\monitoring\SensorPlugin\DatabaseAggregatorSensorPlugin->buildTableHeader()
array_combine() expects parameter 1 to be array, null givenWarningDatabaseAggregatorSensorPlugin.php195Drupal\monitoring\Plugin\monitoring\SensorPlugin\DatabaseAggregatorSensorPlugin->buildTableHeader()
array_key_exists() expects parameter 2 to be array, null givenWarningWatchdogAggregatorSensorPlugin.php32Drupal\monitoring\Plugin\monitoring\SensorPlugin\WatchdogAggregatorSensorPlugin->verboseResultUnaggregated()
"No results were found in the table." foundOtherMonitoringCoreWebTest.php106Drupal\monitoring\Tests\MonitoringCoreWebTest->doTestDatabaseAggregatorSensorPluginActiveSessions()
Undefined offset: 0Drupal\monitoring\Tests\MonitoringCoreWebTest->doTestWatchdogAggregatorSensorPlugin() Drupal\monitoring\Tests\MonitoringCoreWebTest->testSensors() Drupal\simpletest\TestBase->run(Array) simpletest_script_run_one_test('11', 'Drupal\monitoring\Tests\MonitoringCoreWebTest') NoticeMonitoringCoreWebTest.php50Drupal\monitoring\Tests\MonitoringCoreWebTest->doTestWatchdogAggregatorSensorPlugin()
Trying to get property of non-objectDrupal\monitoring\Tests\MonitoringCoreWebTest->doTestWatchdogAggregatorSensorPlugin() Drupal\monitoring\Tests\MonitoringCoreWebTest->testSensors() Drupal\simpletest\TestBase->run(Array) simpletest_script_run_one_test('11', 'Drupal\monitoring\Tests\MonitoringCoreWebTest') NoticeMonitoringCoreWebTest.php50Drupal\monitoring\Tests\MonitoringCoreWebTest->doTestWatchdogAggregatorSensorPlugin()
Undefined offset: 0Drupal\monitoring\Tests\MonitoringCoreWebTest->doTestWatchdogAggregatorSensorPlugin() Drupal\monitoring\Tests\MonitoringCoreWebTest->testSensors() Drupal\simpletest\TestBase->run(Array) simpletest_script_run_one_test('11', 'Drupal\monitoring\Tests\MonitoringCoreWebTest') NoticeMonitoringCoreWebTest.php51Drupal\monitoring\Tests\MonitoringCoreWebTest->doTestWatchdogAggregatorSensorPlugin()
Trying to get property of non-objectDrupal\monitoring\Tests\MonitoringCoreWebTest->doTestWatchdogAggregatorSensorPlugin() Drupal\monitoring\Tests\MonitoringCoreWebTest->testSensors() Drupal\simpletest\TestBase->run(Array) simpletest_script_run_one_test('11', 'Drupal\monitoring\Tests\MonitoringCoreWebTest') NoticeMonitoringCoreWebTest.php51Drupal\monitoring\Tests\MonitoringCoreWebTest->doTestWatchdogAggregatorSensorPlugin()
Found WID in verbose output (WID == 6)OtherMonitoringCoreWebTest.php52Drupal\monitoring\Tests\MonitoringCoreWebTest->doTestWatchdogAggregatorSensorPlugin()
Found replaced message in output.OtherMonitoringCoreWebTest.php53Drupal\monitoring\Tests\MonitoringCoreWebTest->doTestWatchdogAggregatorSensorPlugin()
Undefined offset: 0Drupal\monitoring\Tests\MonitoringCoreWebTest->doTestWatchdogAggregatorSensorPlugin() Drupal\monitoring\Tests\MonitoringCoreWebTest->testSensors() Drupal\simpletest\TestBase->run(Array) simpletest_script_run_one_test('11', 'Drupal\monitoring\Tests\MonitoringCoreWebTest') NoticeMonitoringCoreWebTest.php59Drupal\monitoring\Tests\MonitoringCoreWebTest->doTestWatchdogAggregatorSensorPlugin()
Trying to get property of non-objectDrupal\monitoring\Tests\MonitoringCoreWebTest->doTestWatchdogAggregatorSensorPlugin() Drupal\monitoring\Tests\MonitoringCoreWebTest->testSensors() Drupal\simpletest\TestBase->run(Array) simpletest_script_run_one_test('11', 'Drupal\monitoring\Tests\MonitoringCoreWebTest') NoticeMonitoringCoreWebTest.php59Drupal\monitoring\Tests\MonitoringCoreWebTest->doTestWatchdogAggregatorSensorPlugin()
Undefined offset: 0Drupal\monitoring\Tests\MonitoringCoreWebTest->doTestWatchdogAggregatorSensorPlugin() Drupal\monitoring\Tests\MonitoringCoreWebTest->testSensors() Drupal\simpletest\TestBase->run(Array) simpletest_script_run_one_test('11', 'Drupal\monitoring\Tests\MonitoringCoreWebTest') NoticeMonitoringCoreWebTest.php60Drupal\monitoring\Tests\MonitoringCoreWebTest->doTestWatchdogAggregatorSensorPlugin()
Trying to get property of non-objectDrupal\monitoring\Tests\MonitoringCoreWebTest->doTestWatchdogAggregatorSensorPlugin() Drupal\monitoring\Tests\MonitoringCoreWebTest->testSensors() Drupal\simpletest\TestBase->run(Array) simpletest_script_run_one_test('11', 'Drupal\monitoring\Tests\MonitoringCoreWebTest') NoticeMonitoringCoreWebTest.php60Drupal\monitoring\Tests\MonitoringCoreWebTest->doTestWatchdogAggregatorSensorPlugin()
Found WID in verbose output (WID == 6)OtherMonitoringCoreWebTest.php61Drupal\monitoring\Tests\MonitoringCoreWebTest->doTestWatchdogAggregatorSensorPlugin()
Found unreplaced message in output.OtherMonitoringCoreWebTest.php62Drupal\monitoring\Tests\MonitoringCoreWebTest->doTestWatchdogAggregatorSensorPlugin()

All

Test namePassFailException
LeafDrupal\monitoring\Tests\MonitoringApiTest8100
LeafDrupal\monitoring\Tests\MonitoringCaptchaTest1900
ExpandDrupal\monitoring\Tests\MonitoringCoreKernelTest14204
MessageGroupFilenameLineFunctionStatus
Drupal\Core\Config\Schema\SchemaIncompleteException: Schema errors for monitoring.sensor_config.monitoring_git_dirty_tree with the following errors: monitoring.sensor_config.monitoring_git_dirty_tree:settings.cmd missing schema in Drupal\Core\Config\Testing\ConfigSchemaChecker->onConfigSave() (line 98 of /var/lib/drupaltestbot/sites/default/files/checkout/core/lib/Drupal/Core/Config/Testing/ConfigSchemaChecker.php). Drupal\Core\Config\Testing\ConfigSchemaChecker->onConfigSave(Object, 'config.save', Object) Drupal\Component\EventDispatcher\ContainerAwareEventDispatcher->dispatch('config.save', Object) Drupal\Core\Config\Config->save() Drupal\Core\Config\Entity\ConfigEntityStorage->doSave('monitoring_git_dirty_tree', Object) Drupal\Core\Entity\EntityStorageBase->save(Object) Drupal\Core\Config\Entity\ConfigEntityStorage->save(Object) Drupal\Core\Entity\Entity->save() Drupal\Core\Config\Entity\ConfigEntityBase->save() Drupal\monitoring\Tests\MonitoringCoreKernelTest->testGitDirtyTreeSensorPlugin() Drupal\simpletest\TestBase->run(Array) simpletest_script_run_one_test('4', 'Drupal\monitoring\Tests\MonitoringCoreKernelTest') Uncaught exceptionConfigSchemaChecker.php98Drupal\Core\Config\Testing\ConfigSchemaChecker->onConfigSave()
Undefined offset: 0Drupal\monitoring\Plugin\monitoring\SensorPlugin\DatabaseAggregatorSensorPlugin->buildTableHeader(Array) Drupal\monitoring\Plugin\monitoring\SensorPlugin\DatabaseAggregatorSensorPlugin->verboseResultUnaggregated(Array) Drupal\monitoring\Plugin\monitoring\SensorPlugin\DatabaseAggregatorSensorPlugin->resultVerbose(Object) Drupal\monitoring\SensorRunner->runSensor(Object) Drupal\monitoring\SensorRunner->runSensors(Array, 1, 1) monitoring_sensor_run_multiple(Array, 1, 1) monitoring_sensor_run('watchdog_aggregate_test', 1, 1) Drupal\monitoring\Tests\MonitoringUnitTestBase->runSensor('watchdog_aggregate_test') Drupal\monitoring\Tests\MonitoringCoreKernelTest->testDatabaseAggregator() Drupal\simpletest\TestBase->run(Array) simpletest_script_run_one_test('4', 'Drupal\monitoring\Tests\MonitoringCoreKernelTest') NoticeDatabaseAggregatorSensorPlugin.php194Drupal\monitoring\Plugin\monitoring\SensorPlugin\DatabaseAggregatorSensorPlugin->buildTableHeader()
array_keys() expects parameter 1 to be array, null givenarray_keys(NULL) Drupal\monitoring\Plugin\monitoring\SensorPlugin\DatabaseAggregatorSensorPlugin->buildTableHeader(Array) Drupal\monitoring\Plugin\monitoring\SensorPlugin\DatabaseAggregatorSensorPlugin->verboseResultUnaggregated(Array) Drupal\monitoring\Plugin\monitoring\SensorPlugin\DatabaseAggregatorSensorPlugin->resultVerbose(Object) Drupal\monitoring\SensorRunner->runSensor(Object) Drupal\monitoring\SensorRunner->runSensors(Array, 1, 1) monitoring_sensor_run_multiple(Array, 1, 1) monitoring_sensor_run('watchdog_aggregate_test', 1, 1) Drupal\monitoring\Tests\MonitoringUnitTestBase->runSensor('watchdog_aggregate_test') Drupal\monitoring\Tests\MonitoringCoreKernelTest->testDatabaseAggregator() Drupal\simpletest\TestBase->run(Array) simpletest_script_run_one_test('4', 'Drupal\monitoring\Tests\MonitoringCoreKernelTest') WarningDatabaseAggregatorSensorPlugin.php194Drupal\monitoring\Plugin\monitoring\SensorPlugin\DatabaseAggregatorSensorPlugin->buildTableHeader()
array_combine() expects parameter 1 to be array, null givenarray_combine(NULL, NULL) Drupal\monitoring\Plugin\monitoring\SensorPlugin\DatabaseAggregatorSensorPlugin->buildTableHeader(Array) Drupal\monitoring\Plugin\monitoring\SensorPlugin\DatabaseAggregatorSensorPlugin->verboseResultUnaggregated(Array) Drupal\monitoring\Plugin\monitoring\SensorPlugin\DatabaseAggregatorSensorPlugin->resultVerbose(Object) Drupal\monitoring\SensorRunner->runSensor(Object) Drupal\monitoring\SensorRunner->runSensors(Array, 1, 1) monitoring_sensor_run_multiple(Array, 1, 1) monitoring_sensor_run('watchdog_aggregate_test', 1, 1) Drupal\monitoring\Tests\MonitoringUnitTestBase->runSensor('watchdog_aggregate_test') Drupal\monitoring\Tests\MonitoringCoreKernelTest->testDatabaseAggregator() Drupal\simpletest\TestBase->run(Array) simpletest_script_run_one_test('4', 'Drupal\monitoring\Tests\MonitoringCoreKernelTest') WarningDatabaseAggregatorSensorPlugin.php195Drupal\monitoring\Plugin\monitoring\SensorPlugin\DatabaseAggregatorSensorPlugin->buildTableHeader()
ExpandDrupal\monitoring\Tests\MonitoringCoreWebTest123518
MessageGroupFilenameLineFunctionStatus
Undefined offset: 0Drupal\monitoring\Plugin\monitoring\SensorPlugin\DatabaseAggregatorSensorPlugin->buildTableHeader(Array) Drupal\monitoring\Plugin\monitoring\SensorPlugin\DatabaseAggregatorSensorPlugin->verboseResultUnaggregated(Array) Drupal\monitoring\Plugin\monitoring\SensorPlugin\DatabaseAggregatorSensorPlugin->resultVerbose(Object) Drupal\monitoring\SensorRunner->runSensor(Object) Drupal\monitoring\SensorRunner->runSensors(Array, 1, 1) monitoring_sensor_run_multiple(Array, 1, 1) monitoring_sensor_run('user_sessions_authenticated', 1, 1) Drupal\monitoring\Tests\MonitoringTestBase->runSensor('user_sessions_authenticated') Drupal\monitoring\Tests\MonitoringCoreWebTest->doTestDatabaseAggregatorSensorPluginActiveSessions() Drupal\monitoring\Tests\MonitoringCoreWebTest->testSensors() Drupal\simpletest\TestBase->run(Array) simpletest_script_run_one_test('11', 'Drupal\monitoring\Tests\MonitoringCoreWebTest') NoticeDatabaseAggregatorSensorPlugin.php194Drupal\monitoring\Plugin\monitoring\SensorPlugin\DatabaseAggregatorSensorPlugin->buildTableHeader()
array_keys() expects parameter 1 to be array, null givenarray_keys(NULL) Drupal\monitoring\Plugin\monitoring\SensorPlugin\DatabaseAggregatorSensorPlugin->buildTableHeader(Array) Drupal\monitoring\Plugin\monitoring\SensorPlugin\DatabaseAggregatorSensorPlugin->verboseResultUnaggregated(Array) Drupal\monitoring\Plugin\monitoring\SensorPlugin\DatabaseAggregatorSensorPlugin->resultVerbose(Object) Drupal\monitoring\SensorRunner->runSensor(Object) Drupal\monitoring\SensorRunner->runSensors(Array, 1, 1) monitoring_sensor_run_multiple(Array, 1, 1) monitoring_sensor_run('user_sessions_authenticated', 1, 1) Drupal\monitoring\Tests\MonitoringTestBase->runSensor('user_sessions_authenticated') Drupal\monitoring\Tests\MonitoringCoreWebTest->doTestDatabaseAggregatorSensorPluginActiveSessions() Drupal\monitoring\Tests\MonitoringCoreWebTest->testSensors() Drupal\simpletest\TestBase->run(Array) simpletest_script_run_one_test('11', 'Drupal\monitoring\Tests\MonitoringCoreWebTest') WarningDatabaseAggregatorSensorPlugin.php194Drupal\monitoring\Plugin\monitoring\SensorPlugin\DatabaseAggregatorSensorPlugin->buildTableHeader()
array_combine() expects parameter 1 to be array, null givenarray_combine(NULL, NULL) Drupal\monitoring\Plugin\monitoring\SensorPlugin\DatabaseAggregatorSensorPlugin->buildTableHeader(Array) Drupal\monitoring\Plugin\monitoring\SensorPlugin\DatabaseAggregatorSensorPlugin->verboseResultUnaggregated(Array) Drupal\monitoring\Plugin\monitoring\SensorPlugin\DatabaseAggregatorSensorPlugin->resultVerbose(Object) Drupal\monitoring\SensorRunner->runSensor(Object) Drupal\monitoring\SensorRunner->runSensors(Array, 1, 1) monitoring_sensor_run_multiple(Array, 1, 1) monitoring_sensor_run('user_sessions_authenticated', 1, 1) Drupal\monitoring\Tests\MonitoringTestBase->runSensor('user_sessions_authenticated') Drupal\monitoring\Tests\MonitoringCoreWebTest->doTestDatabaseAggregatorSensorPluginActiveSessions() Drupal\monitoring\Tests\MonitoringCoreWebTest->testSensors() Drupal\simpletest\TestBase->run(Array) simpletest_script_run_one_test('11', 'Drupal\monitoring\Tests\MonitoringCoreWebTest') WarningDatabaseAggregatorSensorPlugin.php195Drupal\monitoring\Plugin\monitoring\SensorPlugin\DatabaseAggregatorSensorPlugin->buildTableHeader()
Undefined offset: 0Drupal\monitoring\Plugin\monitoring\SensorPlugin\DatabaseAggregatorSensorPlugin->buildTableHeader(Array) Drupal\monitoring\Plugin\monitoring\SensorPlugin\DatabaseAggregatorSensorPlugin->verboseResultUnaggregated(Array) Drupal\monitoring\Plugin\monitoring\SensorPlugin\DatabaseAggregatorSensorPlugin->resultVerbose(Object) Drupal\monitoring\SensorRunner->runSensor(Object) Drupal\monitoring\SensorRunner->runSensors(Array, 1, 1) monitoring_sensor_run_multiple(Array, 1, 1) monitoring_sensor_run('user_sessions_all', 1, 1) Drupal\monitoring\Tests\MonitoringTestBase->runSensor('user_sessions_all') Drupal\monitoring\Tests\MonitoringCoreWebTest->doTestDatabaseAggregatorSensorPluginActiveSessions() Drupal\monitoring\Tests\MonitoringCoreWebTest->testSensors() Drupal\simpletest\TestBase->run(Array) simpletest_script_run_one_test('11', 'Drupal\monitoring\Tests\MonitoringCoreWebTest') NoticeDatabaseAggregatorSensorPlugin.php194Drupal\monitoring\Plugin\monitoring\SensorPlugin\DatabaseAggregatorSensorPlugin->buildTableHeader()
array_keys() expects parameter 1 to be array, null givenarray_keys(NULL) Drupal\monitoring\Plugin\monitoring\SensorPlugin\DatabaseAggregatorSensorPlugin->buildTableHeader(Array) Drupal\monitoring\Plugin\monitoring\SensorPlugin\DatabaseAggregatorSensorPlugin->verboseResultUnaggregated(Array) Drupal\monitoring\Plugin\monitoring\SensorPlugin\DatabaseAggregatorSensorPlugin->resultVerbose(Object) Drupal\monitoring\SensorRunner->runSensor(Object) Drupal\monitoring\SensorRunner->runSensors(Array, 1, 1) monitoring_sensor_run_multiple(Array, 1, 1) monitoring_sensor_run('user_sessions_all', 1, 1) Drupal\monitoring\Tests\MonitoringTestBase->runSensor('user_sessions_all') Drupal\monitoring\Tests\MonitoringCoreWebTest->doTestDatabaseAggregatorSensorPluginActiveSessions() Drupal\monitoring\Tests\MonitoringCoreWebTest->testSensors() Drupal\simpletest\TestBase->run(Array) simpletest_script_run_one_test('11', 'Drupal\monitoring\Tests\MonitoringCoreWebTest') WarningDatabaseAggregatorSensorPlugin.php194Drupal\monitoring\Plugin\monitoring\SensorPlugin\DatabaseAggregatorSensorPlugin->buildTableHeader()
array_combine() expects parameter 1 to be array, null givenarray_combine(NULL, NULL) Drupal\monitoring\Plugin\monitoring\SensorPlugin\DatabaseAggregatorSensorPlugin->buildTableHeader(Array) Drupal\monitoring\Plugin\monitoring\SensorPlugin\DatabaseAggregatorSensorPlugin->verboseResultUnaggregated(Array) Drupal\monitoring\Plugin\monitoring\SensorPlugin\DatabaseAggregatorSensorPlugin->resultVerbose(Object) Drupal\monitoring\SensorRunner->runSensor(Object) Drupal\monitoring\SensorRunner->runSensors(Array, 1, 1) monitoring_sensor_run_multiple(Array, 1, 1) monitoring_sensor_run('user_sessions_all', 1, 1) Drupal\monitoring\Tests\MonitoringTestBase->runSensor('user_sessions_all') Drupal\monitoring\Tests\MonitoringCoreWebTest->doTestDatabaseAggregatorSensorPluginActiveSessions() Drupal\monitoring\Tests\MonitoringCoreWebTest->testSensors() Drupal\simpletest\TestBase->run(Array) simpletest_script_run_one_test('11', 'Drupal\monitoring\Tests\MonitoringCoreWebTest') WarningDatabaseAggregatorSensorPlugin.php195Drupal\monitoring\Plugin\monitoring\SensorPlugin\DatabaseAggregatorSensorPlugin->buildTableHeader()
Undefined offset: 0NoticeDatabaseAggregatorSensorPlugin.php194Drupal\monitoring\Plugin\monitoring\SensorPlugin\DatabaseAggregatorSensorPlugin->buildTableHeader()
array_keys() expects parameter 1 to be array, null givenWarningDatabaseAggregatorSensorPlugin.php194Drupal\monitoring\Plugin\monitoring\SensorPlugin\DatabaseAggregatorSensorPlugin->buildTableHeader()
array_combine() expects parameter 1 to be array, null givenWarningDatabaseAggregatorSensorPlugin.php195Drupal\monitoring\Plugin\monitoring\SensorPlugin\DatabaseAggregatorSensorPlugin->buildTableHeader()
array_key_exists() expects parameter 2 to be array, null givenWarningWatchdogAggregatorSensorPlugin.php32Drupal\monitoring\Plugin\monitoring\SensorPlugin\WatchdogAggregatorSensorPlugin->verboseResultUnaggregated()
"No results were found in the table." foundOtherMonitoringCoreWebTest.php106Drupal\monitoring\Tests\MonitoringCoreWebTest->doTestDatabaseAggregatorSensorPluginActiveSessions()
Undefined offset: 0Drupal\monitoring\Tests\MonitoringCoreWebTest->doTestWatchdogAggregatorSensorPlugin() Drupal\monitoring\Tests\MonitoringCoreWebTest->testSensors() Drupal\simpletest\TestBase->run(Array) simpletest_script_run_one_test('11', 'Drupal\monitoring\Tests\MonitoringCoreWebTest') NoticeMonitoringCoreWebTest.php50Drupal\monitoring\Tests\MonitoringCoreWebTest->doTestWatchdogAggregatorSensorPlugin()
Trying to get property of non-objectDrupal\monitoring\Tests\MonitoringCoreWebTest->doTestWatchdogAggregatorSensorPlugin() Drupal\monitoring\Tests\MonitoringCoreWebTest->testSensors() Drupal\simpletest\TestBase->run(Array) simpletest_script_run_one_test('11', 'Drupal\monitoring\Tests\MonitoringCoreWebTest') NoticeMonitoringCoreWebTest.php50Drupal\monitoring\Tests\MonitoringCoreWebTest->doTestWatchdogAggregatorSensorPlugin()
Undefined offset: 0Drupal\monitoring\Tests\MonitoringCoreWebTest->doTestWatchdogAggregatorSensorPlugin() Drupal\monitoring\Tests\MonitoringCoreWebTest->testSensors() Drupal\simpletest\TestBase->run(Array) simpletest_script_run_one_test('11', 'Drupal\monitoring\Tests\MonitoringCoreWebTest') NoticeMonitoringCoreWebTest.php51Drupal\monitoring\Tests\MonitoringCoreWebTest->doTestWatchdogAggregatorSensorPlugin()
Trying to get property of non-objectDrupal\monitoring\Tests\MonitoringCoreWebTest->doTestWatchdogAggregatorSensorPlugin() Drupal\monitoring\Tests\MonitoringCoreWebTest->testSensors() Drupal\simpletest\TestBase->run(Array) simpletest_script_run_one_test('11', 'Drupal\monitoring\Tests\MonitoringCoreWebTest') NoticeMonitoringCoreWebTest.php51Drupal\monitoring\Tests\MonitoringCoreWebTest->doTestWatchdogAggregatorSensorPlugin()
Found WID in verbose output (WID == 6)OtherMonitoringCoreWebTest.php52Drupal\monitoring\Tests\MonitoringCoreWebTest->doTestWatchdogAggregatorSensorPlugin()
Found replaced message in output.OtherMonitoringCoreWebTest.php53Drupal\monitoring\Tests\MonitoringCoreWebTest->doTestWatchdogAggregatorSensorPlugin()
Undefined offset: 0Drupal\monitoring\Tests\MonitoringCoreWebTest->doTestWatchdogAggregatorSensorPlugin() Drupal\monitoring\Tests\MonitoringCoreWebTest->testSensors() Drupal\simpletest\TestBase->run(Array) simpletest_script_run_one_test('11', 'Drupal\monitoring\Tests\MonitoringCoreWebTest') NoticeMonitoringCoreWebTest.php59Drupal\monitoring\Tests\MonitoringCoreWebTest->doTestWatchdogAggregatorSensorPlugin()
Trying to get property of non-objectDrupal\monitoring\Tests\MonitoringCoreWebTest->doTestWatchdogAggregatorSensorPlugin() Drupal\monitoring\Tests\MonitoringCoreWebTest->testSensors() Drupal\simpletest\TestBase->run(Array) simpletest_script_run_one_test('11', 'Drupal\monitoring\Tests\MonitoringCoreWebTest') NoticeMonitoringCoreWebTest.php59Drupal\monitoring\Tests\MonitoringCoreWebTest->doTestWatchdogAggregatorSensorPlugin()
Undefined offset: 0Drupal\monitoring\Tests\MonitoringCoreWebTest->doTestWatchdogAggregatorSensorPlugin() Drupal\monitoring\Tests\MonitoringCoreWebTest->testSensors() Drupal\simpletest\TestBase->run(Array) simpletest_script_run_one_test('11', 'Drupal\monitoring\Tests\MonitoringCoreWebTest') NoticeMonitoringCoreWebTest.php60Drupal\monitoring\Tests\MonitoringCoreWebTest->doTestWatchdogAggregatorSensorPlugin()
Trying to get property of non-objectDrupal\monitoring\Tests\MonitoringCoreWebTest->doTestWatchdogAggregatorSensorPlugin() Drupal\monitoring\Tests\MonitoringCoreWebTest->testSensors() Drupal\simpletest\TestBase->run(Array) simpletest_script_run_one_test('11', 'Drupal\monitoring\Tests\MonitoringCoreWebTest') NoticeMonitoringCoreWebTest.php60Drupal\monitoring\Tests\MonitoringCoreWebTest->doTestWatchdogAggregatorSensorPlugin()
Found WID in verbose output (WID == 6)OtherMonitoringCoreWebTest.php61Drupal\monitoring\Tests\MonitoringCoreWebTest->doTestWatchdogAggregatorSensorPlugin()
Found unreplaced message in output.OtherMonitoringCoreWebTest.php62Drupal\monitoring\Tests\MonitoringCoreWebTest->doTestWatchdogAggregatorSensorPlugin()
LeafDrupal\monitoring\Tests\MonitoringPastTest1300
LeafDrupal\monitoring\Tests\MonitoringPaymentTest900
LeafDrupal\monitoring\Tests\MonitoringSearchAPITest1100
LeafDrupal\monitoring\Tests\MonitoringServicesTest57400
LeafDrupal\monitoring\Tests\MonitoringUITest67500
LeafDrupal\monitoring\Tests\MonitoringViewDisplayTest2800
LeafDrupal\monitoring_demo\Tests\MonitoringDemoTest1200
LeafDrupal\monitoring_multigraph\Tests\MultigraphServicesTest2600
LeafDrupal\monitoring_multigraph\Tests\MultigraphWebTest6300