2531380-5.patch

Test status
StatusResult
Last receivedFri, 08/21/2015 - 06:56:00
Last requestedFri, 08/21/2015 - 06:56:01
Last testedFri, 08/21/2015 - 06:56:34
Test count2
Environment status
PHP 5.5 MySQLfail
File information
File2531380-5.patch
BranchShareMessage - 8.x-1.x
LinkIssue Link
SummaryFAILED: [[SimpleTest]]: [PHP 5.5 MySQL] 138 pass(es), 21 fail(s), and 3 exception(s).
Details

PHP 5.5 MySQL

  1. Setup environment
  2. Detect an invalid patch URL
  3. Detect invalid repository information
  4. Detect invalid patch format
  5. Detect a non-applicable patch
  6. Detect invalid PHP syntax
  7. Detect a Drupal installation failure
  8. Detect a test run failure
  9. Detect a failing test
    Review the test failures below then if necessary run them locally until the problem has been fixed.
  10. Complete test suite with all tests passing
138 pass(es), 21 fail(s), and 3 exception(s)

Non-pass

Test namePassFailException
ExpandDrupal\sharemessage\Tests\ShareMessageExposeToBlockTest2230
MessageGroupFilenameLineFunctionStatus
"ShareMessage ShareMessage Test Label has been added." foundOtherShareMessageExposeToBlockTest.php32Drupal\sharemessage\Tests\ShareMessageExposeToBlockTest->testShareMessageExposeToBlock()
"ShareMessage Test Label" foundOtherShareMessageExposeToBlockTest.php33Drupal\sharemessage\Tests\ShareMessageExposeToBlockTest->testShareMessageExposeToBlock()
[21-Aug-2015 16:56:26 Australia/Sydney] Uncaught PHP Exception Symfony\Component\Routing\Exception\RouteNotFoundException: "Route "sharemessage.sharemessage_list" does not exist." at /var/lib/drupaltestbot/sites/default/files/checkout/core/lib/Drupal/Core/Routing/RouteProvider.php line 193 Fatal errorUnknown0Unknown
ExpandDrupal\sharemessage\Tests\ShareMessageSettingsTest51153
MessageGroupFilenameLineFunctionStatus
Array to string conversionDrupal\Component\Utility\SafeMarkup::isSafe(Array) Drupal\Component\Utility\SafeMarkup::escape(Array) Drupal\Component\Utility\SafeMarkup::format('Failed to set field @name to @value', Array) Drupal\simpletest\WebTestBase->drupalPostForm(NULL, Array, 'Save configuration') Drupal\sharemessage\Tests\ShareMessageSettingsTest->testShareMessageSettings() Drupal\simpletest\TestBase->run(Array) simpletest_script_run_one_test('3', 'Drupal\sharemessage\Tests\ShareMessageSettingsTest') NoticeSafeMarkup.php96Drupal\Component\Utility\SafeMarkup::isSafe()
Array to string conversionDrupal\Component\Utility\SafeMarkup::isSafe(Array) Drupal\Component\Utility\SafeMarkup::escape(Array) Drupal\Component\Utility\SafeMarkup::format('Failed to set field @name to @value', Array) Drupal\simpletest\WebTestBase->drupalPostForm(NULL, Array, 'Save configuration') Drupal\sharemessage\Tests\ShareMessageSettingsTest->testShareMessageSettings() Drupal\simpletest\TestBase->run(Array) simpletest_script_run_one_test('3', 'Drupal\sharemessage\Tests\ShareMessageSettingsTest') NoticeSafeMarkup.php97Drupal\Component\Utility\SafeMarkup::isSafe()
htmlspecialchars() expects parameter 1 to be string, array givenhtmlspecialchars(Array, 11, 'UTF-8') Drupal\Component\Utility\Html::escape(Array) Drupal\Component\Utility\SafeMarkup::checkPlain(Array) Drupal\Component\Utility\SafeMarkup::escape(Array) Drupal\Component\Utility\SafeMarkup::format('Failed to set field @name to @value', Array) Drupal\simpletest\WebTestBase->drupalPostForm(NULL, Array, 'Save configuration') Drupal\sharemessage\Tests\ShareMessageSettingsTest->testShareMessageSettings() Drupal\simpletest\TestBase->run(Array) simpletest_script_run_one_test('3', 'Drupal\sharemessage\Tests\ShareMessageSettingsTest') WarningHtml.php389Drupal\Component\Utility\Html::escape()
Failed to set field default_services[] to OtherShareMessageSettingsTest.php31Drupal\sharemessage\Tests\ShareMessageSettingsTest->testShareMessageSettings()
Failed to set field default_additional_services to OtherShareMessageSettingsTest.php31Drupal\sharemessage\Tests\ShareMessageSettingsTest->testShareMessageSettings()
Failed to set field default_icon_style to addthis_16x16_styleOtherShareMessageSettingsTest.php31Drupal\sharemessage\Tests\ShareMessageSettingsTest->testShareMessageSettings()
Found the Save configuration buttonOtherShareMessageSettingsTest.php31Drupal\sharemessage\Tests\ShareMessageSettingsTest->testShareMessageSettings()
Found the requested form fields at OtherShareMessageSettingsTest.php31Drupal\sharemessage\Tests\ShareMessageSettingsTest->testShareMessageSettings()
"ShareMessage ShareMessage Test Label has been added." foundOtherShareMessageSettingsTest.php46Drupal\sharemessage\Tests\ShareMessageSettingsTest->testShareMessageSettings()
"ShareMessage ShareMessage Test Label has been updated." foundOtherShareMessageSettingsTest.php70Drupal\sharemessage\Tests\ShareMessageSettingsTest->testShareMessageSettings()
Facebook like button is displayed as it is globally configured.OtherShareMessageSettingsTest.php76Drupal\sharemessage\Tests\ShareMessageSettingsTest->testShareMessageSettings()
Additional services buttion is not displayed as it is globally configured.OtherShareMessageSettingsTest.php79Drupal\sharemessage\Tests\ShareMessageSettingsTest->testShareMessageSettings()
[21-Aug-2015 16:56:26 Australia/Sydney] Uncaught PHP Exception Symfony\Component\Routing\Exception\RouteNotFoundException: "Route "sharemessage.sharemessage_list" does not exist." at /var/lib/drupaltestbot/sites/default/files/checkout/core/lib/Drupal/Core/Routing/RouteProvider.php line 193 Fatal errorUnknown0Unknown
[21-Aug-2015 16:56:26 Australia/Sydney] Uncaught PHP Exception Symfony\Component\Routing\Exception\RouteNotFoundException: "Route "sharemessage.sharemessage_list" does not exist." at /var/lib/drupaltestbot/sites/default/files/checkout/core/lib/Drupal/Core/Routing/RouteProvider.php line 193 Fatal errorUnknown0Unknown
[21-Aug-2015 16:56:26 Australia/Sydney] Uncaught PHP Exception Symfony\Component\Routing\Exception\RouteNotFoundException: "Route "sharemessage.sharemessage_list" does not exist." at /var/lib/drupaltestbot/sites/default/files/checkout/core/lib/Drupal/Core/Routing/RouteProvider.php line 193 Fatal errorUnknown0Unknown
"Are you sure you want to delete ShareMessage Test Label?" foundOtherShareMessageSettingsTest.php114Drupal\sharemessage\Tests\ShareMessageSettingsTest->testShareMessageDeleteCancel()
"ShareMessage ShareMessage Test Label has been deleted." foundOtherShareMessageSettingsTest.php121Drupal\sharemessage\Tests\ShareMessageSettingsTest->testShareMessageDeleteCancel()
[21-Aug-2015 16:56:32 Australia/Sydney] Uncaught PHP Exception Symfony\Component\Routing\Exception\RouteNotFoundException: "Route "sharemessage.sharemessage_list" does not exist." at /var/lib/drupaltestbot/sites/default/files/checkout/core/lib/Drupal/Core/Routing/RouteProvider.php line 193 Fatal errorUnknown0Unknown
ExpandDrupal\sharemessage\Tests\ShareMessageWorkflowTest3430
MessageGroupFilenameLineFunctionStatus
ShareMessage is successfully saved.OtherShareMessageWorkflowTest.php35Drupal\sharemessage\Tests\ShareMessageWorkflowTest->testShareMessageWorkflow()
[21-Aug-2015 16:56:26 Australia/Sydney] Uncaught PHP Exception Symfony\Component\Routing\Exception\RouteNotFoundException: "Route "sharemessage.sharemessage_list" does not exist." at /var/lib/drupaltestbot/sites/default/files/checkout/core/lib/Drupal/Core/Routing/RouteProvider.php line 193 Fatal errorUnknown0Unknown
[21-Aug-2015 16:56:26 Australia/Sydney] Uncaught PHP Exception Symfony\Component\Routing\Exception\RouteNotFoundException: "Route "sharemessage.sharemessage_list" does not exist." at /var/lib/drupaltestbot/sites/default/files/checkout/core/lib/Drupal/Core/Routing/RouteProvider.php line 193 Fatal errorUnknown0Unknown

All

Test namePassFailException
ExpandDrupal\sharemessage\Tests\ShareMessageExposeToBlockTest2230
MessageGroupFilenameLineFunctionStatus
"ShareMessage ShareMessage Test Label has been added." foundOtherShareMessageExposeToBlockTest.php32Drupal\sharemessage\Tests\ShareMessageExposeToBlockTest->testShareMessageExposeToBlock()
"ShareMessage Test Label" foundOtherShareMessageExposeToBlockTest.php33Drupal\sharemessage\Tests\ShareMessageExposeToBlockTest->testShareMessageExposeToBlock()
[21-Aug-2015 16:56:26 Australia/Sydney] Uncaught PHP Exception Symfony\Component\Routing\Exception\RouteNotFoundException: "Route "sharemessage.sharemessage_list" does not exist." at /var/lib/drupaltestbot/sites/default/files/checkout/core/lib/Drupal/Core/Routing/RouteProvider.php line 193 Fatal errorUnknown0Unknown
ExpandDrupal\sharemessage\Tests\ShareMessageSettingsTest51153
MessageGroupFilenameLineFunctionStatus
Array to string conversionDrupal\Component\Utility\SafeMarkup::isSafe(Array) Drupal\Component\Utility\SafeMarkup::escape(Array) Drupal\Component\Utility\SafeMarkup::format('Failed to set field @name to @value', Array) Drupal\simpletest\WebTestBase->drupalPostForm(NULL, Array, 'Save configuration') Drupal\sharemessage\Tests\ShareMessageSettingsTest->testShareMessageSettings() Drupal\simpletest\TestBase->run(Array) simpletest_script_run_one_test('3', 'Drupal\sharemessage\Tests\ShareMessageSettingsTest') NoticeSafeMarkup.php96Drupal\Component\Utility\SafeMarkup::isSafe()
Array to string conversionDrupal\Component\Utility\SafeMarkup::isSafe(Array) Drupal\Component\Utility\SafeMarkup::escape(Array) Drupal\Component\Utility\SafeMarkup::format('Failed to set field @name to @value', Array) Drupal\simpletest\WebTestBase->drupalPostForm(NULL, Array, 'Save configuration') Drupal\sharemessage\Tests\ShareMessageSettingsTest->testShareMessageSettings() Drupal\simpletest\TestBase->run(Array) simpletest_script_run_one_test('3', 'Drupal\sharemessage\Tests\ShareMessageSettingsTest') NoticeSafeMarkup.php97Drupal\Component\Utility\SafeMarkup::isSafe()
htmlspecialchars() expects parameter 1 to be string, array givenhtmlspecialchars(Array, 11, 'UTF-8') Drupal\Component\Utility\Html::escape(Array) Drupal\Component\Utility\SafeMarkup::checkPlain(Array) Drupal\Component\Utility\SafeMarkup::escape(Array) Drupal\Component\Utility\SafeMarkup::format('Failed to set field @name to @value', Array) Drupal\simpletest\WebTestBase->drupalPostForm(NULL, Array, 'Save configuration') Drupal\sharemessage\Tests\ShareMessageSettingsTest->testShareMessageSettings() Drupal\simpletest\TestBase->run(Array) simpletest_script_run_one_test('3', 'Drupal\sharemessage\Tests\ShareMessageSettingsTest') WarningHtml.php389Drupal\Component\Utility\Html::escape()
Failed to set field default_services[] to OtherShareMessageSettingsTest.php31Drupal\sharemessage\Tests\ShareMessageSettingsTest->testShareMessageSettings()
Failed to set field default_additional_services to OtherShareMessageSettingsTest.php31Drupal\sharemessage\Tests\ShareMessageSettingsTest->testShareMessageSettings()
Failed to set field default_icon_style to addthis_16x16_styleOtherShareMessageSettingsTest.php31Drupal\sharemessage\Tests\ShareMessageSettingsTest->testShareMessageSettings()
Found the Save configuration buttonOtherShareMessageSettingsTest.php31Drupal\sharemessage\Tests\ShareMessageSettingsTest->testShareMessageSettings()
Found the requested form fields at OtherShareMessageSettingsTest.php31Drupal\sharemessage\Tests\ShareMessageSettingsTest->testShareMessageSettings()
"ShareMessage ShareMessage Test Label has been added." foundOtherShareMessageSettingsTest.php46Drupal\sharemessage\Tests\ShareMessageSettingsTest->testShareMessageSettings()
"ShareMessage ShareMessage Test Label has been updated." foundOtherShareMessageSettingsTest.php70Drupal\sharemessage\Tests\ShareMessageSettingsTest->testShareMessageSettings()
Facebook like button is displayed as it is globally configured.OtherShareMessageSettingsTest.php76Drupal\sharemessage\Tests\ShareMessageSettingsTest->testShareMessageSettings()
Additional services buttion is not displayed as it is globally configured.OtherShareMessageSettingsTest.php79Drupal\sharemessage\Tests\ShareMessageSettingsTest->testShareMessageSettings()
[21-Aug-2015 16:56:26 Australia/Sydney] Uncaught PHP Exception Symfony\Component\Routing\Exception\RouteNotFoundException: "Route "sharemessage.sharemessage_list" does not exist." at /var/lib/drupaltestbot/sites/default/files/checkout/core/lib/Drupal/Core/Routing/RouteProvider.php line 193 Fatal errorUnknown0Unknown
[21-Aug-2015 16:56:26 Australia/Sydney] Uncaught PHP Exception Symfony\Component\Routing\Exception\RouteNotFoundException: "Route "sharemessage.sharemessage_list" does not exist." at /var/lib/drupaltestbot/sites/default/files/checkout/core/lib/Drupal/Core/Routing/RouteProvider.php line 193 Fatal errorUnknown0Unknown
[21-Aug-2015 16:56:26 Australia/Sydney] Uncaught PHP Exception Symfony\Component\Routing\Exception\RouteNotFoundException: "Route "sharemessage.sharemessage_list" does not exist." at /var/lib/drupaltestbot/sites/default/files/checkout/core/lib/Drupal/Core/Routing/RouteProvider.php line 193 Fatal errorUnknown0Unknown
"Are you sure you want to delete ShareMessage Test Label?" foundOtherShareMessageSettingsTest.php114Drupal\sharemessage\Tests\ShareMessageSettingsTest->testShareMessageDeleteCancel()
"ShareMessage ShareMessage Test Label has been deleted." foundOtherShareMessageSettingsTest.php121Drupal\sharemessage\Tests\ShareMessageSettingsTest->testShareMessageDeleteCancel()
[21-Aug-2015 16:56:32 Australia/Sydney] Uncaught PHP Exception Symfony\Component\Routing\Exception\RouteNotFoundException: "Route "sharemessage.sharemessage_list" does not exist." at /var/lib/drupaltestbot/sites/default/files/checkout/core/lib/Drupal/Core/Routing/RouteProvider.php line 193 Fatal errorUnknown0Unknown
ExpandDrupal\sharemessage\Tests\ShareMessageWorkflowTest3430
MessageGroupFilenameLineFunctionStatus
ShareMessage is successfully saved.OtherShareMessageWorkflowTest.php35Drupal\sharemessage\Tests\ShareMessageWorkflowTest->testShareMessageWorkflow()
[21-Aug-2015 16:56:26 Australia/Sydney] Uncaught PHP Exception Symfony\Component\Routing\Exception\RouteNotFoundException: "Route "sharemessage.sharemessage_list" does not exist." at /var/lib/drupaltestbot/sites/default/files/checkout/core/lib/Drupal/Core/Routing/RouteProvider.php line 193 Fatal errorUnknown0Unknown
[21-Aug-2015 16:56:26 Australia/Sydney] Uncaught PHP Exception Symfony\Component\Routing\Exception\RouteNotFoundException: "Route "sharemessage.sharemessage_list" does not exist." at /var/lib/drupaltestbot/sites/default/files/checkout/core/lib/Drupal/Core/Routing/RouteProvider.php line 193 Fatal errorUnknown0Unknown
LeafDrupal\sharemessage_demo\Tests\SharemessageDemoTest3100