beta2beta-update-2431329-08.patch

Test status
StatusResult
Last receivedMon, 07/20/2015 - 17:46:00
Last requestedMon, 07/20/2015 - 17:46:01
Last testedMon, 07/20/2015 - 17:47:43
Test count1
Environment status
PHP 5.5 MySQLfail
File information
Filebeta2beta-update-2431329-08.patch
BranchHEAD to HEAD - 8.x-1.x
LinkIssue Link
SummaryFAILED: [[SimpleTest]]: [PHP 5.5 MySQL] 299 pass(es), 4 fail(s), and 23 exception(s).
Details

PHP 5.5 MySQL

  1. Setup environment
  2. Detect an invalid patch URL
  3. Detect invalid repository information
  4. Detect invalid patch format
  5. Detect a non-applicable patch
  6. Detect invalid PHP syntax
  7. Detect a Drupal installation failure
  8. Detect a test run failure
  9. Detect a failing test
    Review the test failures below then if necessary run them locally until the problem has been fixed.
  10. Complete test suite with all tests passing
299 pass(es), 4 fail(s), and 23 exception(s)

Non-pass

Test namePassFailException
ExpandDrupal\beta2beta\Tests\Update\Update2431329Test29423
MessageGroupFilenameLineFunctionStatus
Undefined index: default_langcodeDrupal\language\LanguageServiceProvider->getDefaultLanguageValues() Drupal\language\LanguageServiceProvider->alter(Object) Drupal\Core\DependencyInjection\Compiler\ModifyServiceDefinitionsPass->process(Object) Symfony\Component\DependencyInjection\Compiler\Compiler->compile(Object) Symfony\Component\DependencyInjection\ContainerBuilder->compile() Drupal\Core\DrupalKernel->compileContainer() Drupal\Core\DrupalKernel->initializeContainer() Drupal\Core\DrupalKernel->boot() Drupal\Core\DrupalKernel->prepareLegacyRequest(Object) Drupal\simpletest\WebTestBase->initKernel(Object) Drupal\system\Tests\Update\UpdatePathTestBase->setUp() Drupal\beta2beta\Tests\Update\Beta2BetaUpdateTestBase->setUp() Drupal\simpletest\TestBase->run(Array) simpletest_script_run_one_test('1', 'Drupal\beta2beta\Tests\Update\Update2431329Test') NoticeLanguageServiceProvider.php100Drupal\language\LanguageServiceProvider->getDefaultLanguageValues()
Undefined index: default_langcodeDrupal\language\LanguageServiceProvider->getDefaultLanguageValues() Drupal\language\LanguageServiceProvider->alter(Object) Drupal\Core\DependencyInjection\Compiler\ModifyServiceDefinitionsPass->process(Object) Symfony\Component\DependencyInjection\Compiler\Compiler->compile(Object) Symfony\Component\DependencyInjection\ContainerBuilder->compile() Drupal\Core\DrupalKernel->compileContainer() Drupal\Core\DrupalKernel->initializeContainer() Drupal\Core\DrupalKernel->rebuildContainer() Drupal\simpletest\WebTestBase->initKernel(Object) Drupal\system\Tests\Update\UpdatePathTestBase->setUp() Drupal\beta2beta\Tests\Update\Beta2BetaUpdateTestBase->setUp() Drupal\simpletest\TestBase->run(Array) simpletest_script_run_one_test('1', 'Drupal\beta2beta\Tests\Update\Update2431329Test') NoticeLanguageServiceProvider.php100Drupal\language\LanguageServiceProvider->getDefaultLanguageValues()
Undefined index: default_langcodeDrupal\language\LanguageServiceProvider->getDefaultLanguageValues() Drupal\language\LanguageServiceProvider->alter(Object) Drupal\Core\DependencyInjection\Compiler\ModifyServiceDefinitionsPass->process(Object) Symfony\Component\DependencyInjection\Compiler\Compiler->compile(Object) Symfony\Component\DependencyInjection\ContainerBuilder->compile() Drupal\Core\DrupalKernel->compileContainer() Drupal\Core\DrupalKernel->initializeContainer() Drupal\Core\DrupalKernel->updateModules(Array, Array) Drupal\Core\Extension\ModuleInstaller->updateKernel(Array) Drupal\Core\Extension\ModuleInstaller->install(Array, 1) Drupal\Core\ProxyClass\Extension\ModuleInstaller->install(Array, 1) Drupal\simpletest\WebTestBase->installModulesFromClassProperty(Object) Drupal\system\Tests\Update\UpdatePathTestBase->setUp() Drupal\beta2beta\Tests\Update\Beta2BetaUpdateTestBase->setUp() Drupal\simpletest\TestBase->run(Array) simpletest_script_run_one_test('1', 'Drupal\beta2beta\Tests\Update\Update2431329Test') NoticeLanguageServiceProvider.php100Drupal\language\LanguageServiceProvider->getDefaultLanguageValues()
Undefined index: default_langcodeDrupal\language\LanguageServiceProvider->getDefaultLanguageValues() Drupal\language\LanguageServiceProvider->alter(Object) Drupal\Core\DependencyInjection\Compiler\ModifyServiceDefinitionsPass->process(Object) Symfony\Component\DependencyInjection\Compiler\Compiler->compile(Object) Symfony\Component\DependencyInjection\ContainerBuilder->compile() Drupal\Core\DrupalKernel->compileContainer() Drupal\Core\DrupalKernel->initializeContainer() Drupal\Core\DrupalKernel->updateModules(Array, Array) Drupal\Core\Extension\ModuleInstaller->updateKernel(Array) Drupal\Core\Extension\ModuleInstaller->install(Array, 1) Drupal\Core\ProxyClass\Extension\ModuleInstaller->install(Array, 1) Drupal\simpletest\WebTestBase->installModulesFromClassProperty(Object) Drupal\system\Tests\Update\UpdatePathTestBase->setUp() Drupal\beta2beta\Tests\Update\Beta2BetaUpdateTestBase->setUp() Drupal\simpletest\TestBase->run(Array) simpletest_script_run_one_test('1', 'Drupal\beta2beta\Tests\Update\Update2431329Test') NoticeLanguageServiceProvider.php100Drupal\language\LanguageServiceProvider->getDefaultLanguageValues()
Undefined index: default_langcodeDrupal\language\LanguageServiceProvider->getDefaultLanguageValues() Drupal\language\LanguageServiceProvider->alter(Object) Drupal\Core\DependencyInjection\Compiler\ModifyServiceDefinitionsPass->process(Object) Symfony\Component\DependencyInjection\Compiler\Compiler->compile(Object) Symfony\Component\DependencyInjection\ContainerBuilder->compile() Drupal\Core\DrupalKernel->compileContainer() Drupal\Core\DrupalKernel->initializeContainer() Drupal\Core\DrupalKernel->rebuildContainer() Drupal\simpletest\WebTestBase->rebuildContainer() Drupal\simpletest\WebTestBase->installModulesFromClassProperty(Object) Drupal\system\Tests\Update\UpdatePathTestBase->setUp() Drupal\beta2beta\Tests\Update\Beta2BetaUpdateTestBase->setUp() Drupal\simpletest\TestBase->run(Array) simpletest_script_run_one_test('1', 'Drupal\beta2beta\Tests\Update\Update2431329Test') NoticeLanguageServiceProvider.php100Drupal\language\LanguageServiceProvider->getDefaultLanguageValues()
Undefined index: default_langcodeDrupal\language\LanguageServiceProvider->getDefaultLanguageValues() Drupal\language\LanguageServiceProvider->alter(Object) Drupal\Core\DependencyInjection\Compiler\ModifyServiceDefinitionsPass->process(Object) Symfony\Component\DependencyInjection\Compiler\Compiler->compile(Object) Symfony\Component\DependencyInjection\ContainerBuilder->compile() Drupal\Core\DrupalKernel->compileContainer() Drupal\Core\DrupalKernel->initializeContainer() Drupal\Core\DrupalKernel->updateModules(Array, Array) drupal_flush_all_caches() Drupal\simpletest\WebTestBase->resetAll() Drupal\simpletest\WebTestBase->rebuildAll() Drupal\system\Tests\Update\UpdatePathTestBase->setUp() Drupal\beta2beta\Tests\Update\Beta2BetaUpdateTestBase->setUp() Drupal\simpletest\TestBase->run(Array) simpletest_script_run_one_test('1', 'Drupal\beta2beta\Tests\Update\Update2431329Test') NoticeLanguageServiceProvider.php100Drupal\language\LanguageServiceProvider->getDefaultLanguageValues()
The langcode field was added to the node table.OtherUpdate2431329Test.php61Drupal\beta2beta\Tests\Update\Update2431329Test->testUpdate2431329()
Undefined index: revision_translation_affectedNoticeSqlContentEntityStorage.php554Drupal\Core\Entity\Sql\SqlContentEntityStorage->loadFromSharedTables()
Undefined index: revision_translation_affectedNoticeSqlContentEntityStorage.php554Drupal\Core\Entity\Sql\SqlContentEntityStorage->loadFromSharedTables()
"Test article 1 (Afrikaans)" foundOtherUpdate2431329Test.php64Drupal\beta2beta\Tests\Update\Update2431329Test->testUpdate2431329()
Drupal\Core\Database\DatabaseExceptionWrapper: SQLSTATE[42S22]: Column not found: 1054 Unknown column 'n.langcode' in 'field list': SELECT n.nid AS nid, n.langcode AS langcode FROM {node} n ORDER BY nid ASC; Array ( ) in Drupal\beta2beta\Tests\Update\Update2431329Test->testUpdate2431329() (line 67 of /var/lib/drupaltestbot/sites/default/files/checkout/sites/default/modules/head2head/beta2beta/src/Tests/Update/Update2431329Test.php). Drupal\Core\Database\Connection->handleQueryException(Object, 'SELECT n.nid AS nid, n.langcode AS langcode FROM {node} n ORDER BY nid ASC', Array, Array) Drupal\Core\Database\Connection->query('SELECT n.nid AS nid, n.langcode AS langcode FROM {node} n ORDER BY nid ASC', Array, Array) Drupal\Core\Database\Query\Select->execute() Drupal\beta2beta\Tests\Update\Update2431329Test->testUpdate2431329() Drupal\simpletest\TestBase->run(Array) simpletest_script_run_one_test('1', 'Drupal\beta2beta\Tests\Update\Update2431329Test') Uncaught exceptionConnection.php609Drupal\Core\Database\Connection->handleQueryException()
[20-Jul-2015 10:46:31 America/Los_Angeles] Uncaught PHP Exception Drupal\Component\Plugin\Exception\PluginNotFoundException: "The "published-notpublished" plugin does not exist." at /var/lib/drupaltestbot/sites/default/files/checkout/core/lib/Drupal/Component/Plugin/Discovery/DiscoveryTrait.php line 57 Fatal errorUnknown0Unknown
[20-Jul-2015 10:46:32 America/Los_Angeles] Uncaught PHP Exception Exception: "The Taxonomy term reference field has been removed in Drupal 8.0.0-beta10. You should run the database update script immediately in order to automatically convert to Entity reference." at /var/lib/drupaltestbot/sites/default/files/checkout/sites/default/modules/head2head/beta2beta/src/PluginOverride/Field/FieldType/TaxonomyTermReferenceItem.php line 22 Fatal errorUnknown0Unknown
Undefined index: default_langcodeDrupal\language\LanguageServiceProvider->getDefaultLanguageValues() Drupal\language\LanguageServiceProvider->alter(Object) Drupal\Core\DependencyInjection\Compiler\ModifyServiceDefinitionsPass->process(Object) Symfony\Component\DependencyInjection\Compiler\Compiler->compile(Object) Symfony\Component\DependencyInjection\ContainerBuilder->compile() Drupal\Core\DrupalKernel->compileContainer() Drupal\Core\DrupalKernel->initializeContainer() Drupal\Core\DrupalKernel->boot() Drupal\Core\DrupalKernel->prepareLegacyRequest(Object) Drupal\simpletest\WebTestBase->initKernel(Object) Drupal\system\Tests\Update\UpdatePathTestBase->setUp() Drupal\beta2beta\Tests\Update\Beta2BetaUpdateTestBase->setUp() Drupal\simpletest\TestBase->run(Array) simpletest_script_run_one_test('1', 'Drupal\beta2beta\Tests\Update\Update2431329Test') NoticeLanguageServiceProvider.php100Drupal\language\LanguageServiceProvider->getDefaultLanguageValues()
Undefined index: default_langcodeDrupal\language\LanguageServiceProvider->getDefaultLanguageValues() Drupal\language\LanguageServiceProvider->alter(Object) Drupal\Core\DependencyInjection\Compiler\ModifyServiceDefinitionsPass->process(Object) Symfony\Component\DependencyInjection\Compiler\Compiler->compile(Object) Symfony\Component\DependencyInjection\ContainerBuilder->compile() Drupal\Core\DrupalKernel->compileContainer() Drupal\Core\DrupalKernel->initializeContainer() Drupal\Core\DrupalKernel->rebuildContainer() Drupal\simpletest\WebTestBase->initKernel(Object) Drupal\system\Tests\Update\UpdatePathTestBase->setUp() Drupal\beta2beta\Tests\Update\Beta2BetaUpdateTestBase->setUp() Drupal\simpletest\TestBase->run(Array) simpletest_script_run_one_test('1', 'Drupal\beta2beta\Tests\Update\Update2431329Test') NoticeLanguageServiceProvider.php100Drupal\language\LanguageServiceProvider->getDefaultLanguageValues()
Undefined index: default_langcodeDrupal\language\LanguageServiceProvider->getDefaultLanguageValues() Drupal\language\LanguageServiceProvider->alter(Object) Drupal\Core\DependencyInjection\Compiler\ModifyServiceDefinitionsPass->process(Object) Symfony\Component\DependencyInjection\Compiler\Compiler->compile(Object) Symfony\Component\DependencyInjection\ContainerBuilder->compile() Drupal\Core\DrupalKernel->compileContainer() Drupal\Core\DrupalKernel->initializeContainer() Drupal\Core\DrupalKernel->updateModules(Array, Array) Drupal\Core\Extension\ModuleInstaller->updateKernel(Array) Drupal\Core\Extension\ModuleInstaller->install(Array, 1) Drupal\Core\ProxyClass\Extension\ModuleInstaller->install(Array, 1) Drupal\simpletest\WebTestBase->installModulesFromClassProperty(Object) Drupal\system\Tests\Update\UpdatePathTestBase->setUp() Drupal\beta2beta\Tests\Update\Beta2BetaUpdateTestBase->setUp() Drupal\simpletest\TestBase->run(Array) simpletest_script_run_one_test('1', 'Drupal\beta2beta\Tests\Update\Update2431329Test') NoticeLanguageServiceProvider.php100Drupal\language\LanguageServiceProvider->getDefaultLanguageValues()
Undefined index: default_langcodeDrupal\language\LanguageServiceProvider->getDefaultLanguageValues() Drupal\language\LanguageServiceProvider->alter(Object) Drupal\Core\DependencyInjection\Compiler\ModifyServiceDefinitionsPass->process(Object) Symfony\Component\DependencyInjection\Compiler\Compiler->compile(Object) Symfony\Component\DependencyInjection\ContainerBuilder->compile() Drupal\Core\DrupalKernel->compileContainer() Drupal\Core\DrupalKernel->initializeContainer() Drupal\Core\DrupalKernel->updateModules(Array, Array) Drupal\Core\Extension\ModuleInstaller->updateKernel(Array) Drupal\Core\Extension\ModuleInstaller->install(Array, 1) Drupal\Core\ProxyClass\Extension\ModuleInstaller->install(Array, 1) Drupal\simpletest\WebTestBase->installModulesFromClassProperty(Object) Drupal\system\Tests\Update\UpdatePathTestBase->setUp() Drupal\beta2beta\Tests\Update\Beta2BetaUpdateTestBase->setUp() Drupal\simpletest\TestBase->run(Array) simpletest_script_run_one_test('1', 'Drupal\beta2beta\Tests\Update\Update2431329Test') NoticeLanguageServiceProvider.php100Drupal\language\LanguageServiceProvider->getDefaultLanguageValues()
Undefined index: default_langcodeDrupal\language\LanguageServiceProvider->getDefaultLanguageValues() Drupal\language\LanguageServiceProvider->alter(Object) Drupal\Core\DependencyInjection\Compiler\ModifyServiceDefinitionsPass->process(Object) Symfony\Component\DependencyInjection\Compiler\Compiler->compile(Object) Symfony\Component\DependencyInjection\ContainerBuilder->compile() Drupal\Core\DrupalKernel->compileContainer() Drupal\Core\DrupalKernel->initializeContainer() Drupal\Core\DrupalKernel->rebuildContainer() Drupal\simpletest\WebTestBase->rebuildContainer() Drupal\simpletest\WebTestBase->installModulesFromClassProperty(Object) Drupal\system\Tests\Update\UpdatePathTestBase->setUp() Drupal\beta2beta\Tests\Update\Beta2BetaUpdateTestBase->setUp() Drupal\simpletest\TestBase->run(Array) simpletest_script_run_one_test('1', 'Drupal\beta2beta\Tests\Update\Update2431329Test') NoticeLanguageServiceProvider.php100Drupal\language\LanguageServiceProvider->getDefaultLanguageValues()
Undefined index: default_langcodeDrupal\language\LanguageServiceProvider->getDefaultLanguageValues() Drupal\language\LanguageServiceProvider->alter(Object) Drupal\Core\DependencyInjection\Compiler\ModifyServiceDefinitionsPass->process(Object) Symfony\Component\DependencyInjection\Compiler\Compiler->compile(Object) Symfony\Component\DependencyInjection\ContainerBuilder->compile() Drupal\Core\DrupalKernel->compileContainer() Drupal\Core\DrupalKernel->initializeContainer() Drupal\Core\DrupalKernel->updateModules(Array, Array) drupal_flush_all_caches() Drupal\simpletest\WebTestBase->resetAll() Drupal\simpletest\WebTestBase->rebuildAll() Drupal\system\Tests\Update\UpdatePathTestBase->setUp() Drupal\beta2beta\Tests\Update\Beta2BetaUpdateTestBase->setUp() Drupal\simpletest\TestBase->run(Array) simpletest_script_run_one_test('1', 'Drupal\beta2beta\Tests\Update\Update2431329Test') NoticeLanguageServiceProvider.php100Drupal\language\LanguageServiceProvider->getDefaultLanguageValues()
Drupal\Core\Database\DatabaseExceptionWrapper: SQLSTATE[HY000]: General error: failed to instantiate user-supplied statement class: CREATE TABLE {cache_config} ( `cid` VARCHAR(255) BINARY CHARACTER SET ascii COLLATE ascii_general_ci NOT NULL DEFAULT '' COMMENT 'Primary Key: Unique cache ID.', `data` LONGBLOB NULL DEFAULT NULL COMMENT 'A collection of data to cache.', `expire` INT NOT NULL DEFAULT 0 COMMENT 'A Unix timestamp indicating when the cache entry should expire, or -1 for never.', `created` DECIMAL(14, 3) NOT NULL DEFAULT 0 COMMENT 'A timestamp with millisecond precision indicating when the cache entry was created.', `serialized` SMALLINT NOT NULL DEFAULT 0 COMMENT 'A flag to indicate whether content is serialized (1) or not (0).', `tags` LONGTEXT NULL DEFAULT NULL COMMENT 'Space-separated list of cache tags for this entry.', `checksum` VARCHAR(255) CHARACTER SET ascii COLLATE ascii_general_ci NOT NULL COMMENT 'The tag invalidation checksum when this entry was saved.', PRIMARY KEY (`cid`), INDEX `expire` (`expire`) ) ENGINE = InnoDB DEFAULT CHARACTER SET utf8mb4 COMMENT 'Storage for the cache API.'; Array ( ) in Drupal\Core\Cache\ChainedFastBackend->setMultiple() (line 187 of /var/lib/drupaltestbot/sites/default/files/checkout/core/lib/Drupal/Core/Cache/ChainedFastBackend.php). Drupal\Core\Database\Connection->handleQueryException(Object, 'CREATE TABLE {cache_config} ( `cid` VARCHAR(255) BINARY CHARACTER SET ascii COLLATE ascii_general_ci NOT NULL DEFAULT '' COMMENT 'Primary Key: Unique cache ID.', `data` LONGBLOB NULL DEFAULT NULL COMMENT 'A collection of data to cache.', `expire` INT NOT NULL DEFAULT 0 COMMENT 'A Unix timestamp indicating when the cache entry should expire, or -1 for never.', `created` DECIMAL(14, 3) NOT NULL DEFAULT 0 COMMENT 'A timestamp with millisecond precision indicating when the cache entry was created.', `serialized` SMALLINT NOT NULL DEFAULT 0 COMMENT 'A flag to indicate whether content is serialized (1) or not (0).', `tags` LONGTEXT NULL DEFAULT NULL COMMENT 'Space-separated list of cache tags for this entry.', `checksum` VARCHAR(255) CHARACTER SET ascii COLLATE ascii_general_ci NOT NULL COMMENT 'The tag invalidation checksum when this entry was saved.', PRIMARY KEY (`cid`), INDEX `expire` (`expire`) ) ENGINE = InnoDB DEFAULT CHARACTER SET utf8mb4 COMMENT 'Storage for the cache API.'', Array, Array) Drupal\Core\Database\Connection->query('CREATE TABLE {cache_config} ( `cid` VARCHAR(255) BINARY CHARACTER SET ascii COLLATE ascii_general_ci NOT NULL DEFAULT '' COMMENT 'Primary Key: Unique cache ID.', `data` LONGBLOB NULL DEFAULT NULL COMMENT 'A collection of data to cache.', `expire` INT NOT NULL DEFAULT 0 COMMENT 'A Unix timestamp indicating when the cache entry should expire, or -1 for never.', `created` DECIMAL(14, 3) NOT NULL DEFAULT 0 COMMENT 'A timestamp with millisecond precision indicating when the cache entry was created.', `serialized` SMALLINT NOT NULL DEFAULT 0 COMMENT 'A flag to indicate whether content is serialized (1) or not (0).', `tags` LONGTEXT NULL DEFAULT NULL COMMENT 'Space-separated list of cache tags for this entry.', `checksum` VARCHAR(255) CHARACTER SET ascii COLLATE ascii_general_ci NOT NULL COMMENT 'The tag invalidation checksum when this entry was saved.', PRIMARY KEY (`cid`), INDEX `expire` (`expire`) ) ENGINE = InnoDB DEFAULT CHARACTER SET utf8mb4 COMMENT 'Storage for the cache API.'') Drupal\Core\Database\Schema->createTable('cache_config', Array) Drupal\Core\Cache\DatabaseBackend->ensureBinExists() Drupal\Core\Cache\DatabaseBackend->deleteMultiple(Array) Drupal\Core\Cache\DatabaseBackend->setMultiple(Array) Drupal\Core\Cache\ChainedFastBackend->setMultiple(Array) Drupal\Core\Config\CachedStorage->readMultiple(Array) Drupal\Core\Config\ConfigFactory->doLoadMultiple(Array, 1) Drupal\Core\Config\ConfigFactory->doGet('language.negotiation') Drupal\Core\Config\ConfigFactory->get('language.negotiation') Drupal\language\Plugin\LanguageNegotiation\LanguageNegotiationUrl->processOutbound('/update.php', Array, Object, Object) Drupal\language\HttpKernel\PathProcessorLanguage->processOutbound('/update.php', Array, Object, Object) Drupal\Core\PathProcessor\PathProcessorManager->processOutbound('/update.php', Array, Object, Object) Drupal\Core\Routing\UrlGenerator->processPath('/update.php', Array, Object) Drupal\Core\Routing\UrlGenerator->generateFromRoute('system.db_update', Array, Array, 1) Drupal\Core\Render\MetadataBubblingUrlGenerator->generateFromRoute('system.db_update', Array, Array, ) Drupal\Core\Url->toString() Drupal\simpletest\WebTestBase->buildUrl(Object, Array) Drupal\simpletest\WebTestBase->drupalGet(Object) Drupal\system\Tests\Update\UpdatePathTestBase->runUpdates() Drupal\beta2beta\Tests\Update\Beta2BetaUpdateTestBase->runUpdates() Drupal\beta2beta\Tests\Update\Update2431329Test->testUpgrade() Drupal\simpletest\TestBase->run(Array) simpletest_script_run_one_test('1', 'Drupal\beta2beta\Tests\Update\Update2431329Test') Uncaught exceptionConnection.php609Drupal\Core\Database\Connection->handleQueryException()
Undefined index: default_langcodeDrupal\language\LanguageServiceProvider->getDefaultLanguageValues() Drupal\language\LanguageServiceProvider->alter(Object) Drupal\Core\DependencyInjection\Compiler\ModifyServiceDefinitionsPass->process(Object) Symfony\Component\DependencyInjection\Compiler\Compiler->compile(Object) Symfony\Component\DependencyInjection\ContainerBuilder->compile() Drupal\Core\DrupalKernel->compileContainer() Drupal\Core\DrupalKernel->initializeContainer() Drupal\Core\DrupalKernel->boot() Drupal\Core\DrupalKernel->prepareLegacyRequest(Object) Drupal\simpletest\WebTestBase->initKernel(Object) Drupal\system\Tests\Update\UpdatePathTestBase->setUp() Drupal\beta2beta\Tests\Update\Beta2BetaUpdateTestBase->setUp() Drupal\simpletest\TestBase->run(Array) simpletest_script_run_one_test('1', 'Drupal\beta2beta\Tests\Update\Update2431329Test') NoticeLanguageServiceProvider.php100Drupal\language\LanguageServiceProvider->getDefaultLanguageValues()
Undefined index: default_langcodeDrupal\language\LanguageServiceProvider->getDefaultLanguageValues() Drupal\language\LanguageServiceProvider->alter(Object) Drupal\Core\DependencyInjection\Compiler\ModifyServiceDefinitionsPass->process(Object) Symfony\Component\DependencyInjection\Compiler\Compiler->compile(Object) Symfony\Component\DependencyInjection\ContainerBuilder->compile() Drupal\Core\DrupalKernel->compileContainer() Drupal\Core\DrupalKernel->initializeContainer() Drupal\Core\DrupalKernel->rebuildContainer() Drupal\simpletest\WebTestBase->initKernel(Object) Drupal\system\Tests\Update\UpdatePathTestBase->setUp() Drupal\beta2beta\Tests\Update\Beta2BetaUpdateTestBase->setUp() Drupal\simpletest\TestBase->run(Array) simpletest_script_run_one_test('1', 'Drupal\beta2beta\Tests\Update\Update2431329Test') NoticeLanguageServiceProvider.php100Drupal\language\LanguageServiceProvider->getDefaultLanguageValues()
Undefined index: default_langcodeDrupal\language\LanguageServiceProvider->getDefaultLanguageValues() Drupal\language\LanguageServiceProvider->alter(Object) Drupal\Core\DependencyInjection\Compiler\ModifyServiceDefinitionsPass->process(Object) Symfony\Component\DependencyInjection\Compiler\Compiler->compile(Object) Symfony\Component\DependencyInjection\ContainerBuilder->compile() Drupal\Core\DrupalKernel->compileContainer() Drupal\Core\DrupalKernel->initializeContainer() Drupal\Core\DrupalKernel->updateModules(Array, Array) Drupal\Core\Extension\ModuleInstaller->updateKernel(Array) Drupal\Core\Extension\ModuleInstaller->install(Array, 1) Drupal\Core\ProxyClass\Extension\ModuleInstaller->install(Array, 1) Drupal\simpletest\WebTestBase->installModulesFromClassProperty(Object) Drupal\system\Tests\Update\UpdatePathTestBase->setUp() Drupal\beta2beta\Tests\Update\Beta2BetaUpdateTestBase->setUp() Drupal\simpletest\TestBase->run(Array) simpletest_script_run_one_test('1', 'Drupal\beta2beta\Tests\Update\Update2431329Test') NoticeLanguageServiceProvider.php100Drupal\language\LanguageServiceProvider->getDefaultLanguageValues()
Undefined index: default_langcodeDrupal\language\LanguageServiceProvider->getDefaultLanguageValues() Drupal\language\LanguageServiceProvider->alter(Object) Drupal\Core\DependencyInjection\Compiler\ModifyServiceDefinitionsPass->process(Object) Symfony\Component\DependencyInjection\Compiler\Compiler->compile(Object) Symfony\Component\DependencyInjection\ContainerBuilder->compile() Drupal\Core\DrupalKernel->compileContainer() Drupal\Core\DrupalKernel->initializeContainer() Drupal\Core\DrupalKernel->updateModules(Array, Array) Drupal\Core\Extension\ModuleInstaller->updateKernel(Array) Drupal\Core\Extension\ModuleInstaller->install(Array, 1) Drupal\Core\ProxyClass\Extension\ModuleInstaller->install(Array, 1) Drupal\simpletest\WebTestBase->installModulesFromClassProperty(Object) Drupal\system\Tests\Update\UpdatePathTestBase->setUp() Drupal\beta2beta\Tests\Update\Beta2BetaUpdateTestBase->setUp() Drupal\simpletest\TestBase->run(Array) simpletest_script_run_one_test('1', 'Drupal\beta2beta\Tests\Update\Update2431329Test') NoticeLanguageServiceProvider.php100Drupal\language\LanguageServiceProvider->getDefaultLanguageValues()
Undefined index: default_langcodeDrupal\language\LanguageServiceProvider->getDefaultLanguageValues() Drupal\language\LanguageServiceProvider->alter(Object) Drupal\Core\DependencyInjection\Compiler\ModifyServiceDefinitionsPass->process(Object) Symfony\Component\DependencyInjection\Compiler\Compiler->compile(Object) Symfony\Component\DependencyInjection\ContainerBuilder->compile() Drupal\Core\DrupalKernel->compileContainer() Drupal\Core\DrupalKernel->initializeContainer() Drupal\Core\DrupalKernel->rebuildContainer() Drupal\simpletest\WebTestBase->rebuildContainer() Drupal\simpletest\WebTestBase->installModulesFromClassProperty(Object) Drupal\system\Tests\Update\UpdatePathTestBase->setUp() Drupal\beta2beta\Tests\Update\Beta2BetaUpdateTestBase->setUp() Drupal\simpletest\TestBase->run(Array) simpletest_script_run_one_test('1', 'Drupal\beta2beta\Tests\Update\Update2431329Test') NoticeLanguageServiceProvider.php100Drupal\language\LanguageServiceProvider->getDefaultLanguageValues()
Undefined index: default_langcodeDrupal\language\LanguageServiceProvider->getDefaultLanguageValues() Drupal\language\LanguageServiceProvider->alter(Object) Drupal\Core\DependencyInjection\Compiler\ModifyServiceDefinitionsPass->process(Object) Symfony\Component\DependencyInjection\Compiler\Compiler->compile(Object) Symfony\Component\DependencyInjection\ContainerBuilder->compile() Drupal\Core\DrupalKernel->compileContainer() Drupal\Core\DrupalKernel->initializeContainer() Drupal\Core\DrupalKernel->updateModules(Array, Array) drupal_flush_all_caches() Drupal\simpletest\WebTestBase->resetAll() Drupal\simpletest\WebTestBase->rebuildAll() Drupal\system\Tests\Update\UpdatePathTestBase->setUp() Drupal\beta2beta\Tests\Update\Beta2BetaUpdateTestBase->setUp() Drupal\simpletest\TestBase->run(Array) simpletest_script_run_one_test('1', 'Drupal\beta2beta\Tests\Update\Update2431329Test') NoticeLanguageServiceProvider.php100Drupal\language\LanguageServiceProvider->getDefaultLanguageValues()
Drupal\Core\Database\DatabaseExceptionWrapper: SQLSTATE[HY000]: General error: failed to instantiate user-supplied statement class: CREATE TABLE {cache_config} ( `cid` VARCHAR(255) BINARY CHARACTER SET ascii COLLATE ascii_general_ci NOT NULL DEFAULT '' COMMENT 'Primary Key: Unique cache ID.', `data` LONGBLOB NULL DEFAULT NULL COMMENT 'A collection of data to cache.', `expire` INT NOT NULL DEFAULT 0 COMMENT 'A Unix timestamp indicating when the cache entry should expire, or -1 for never.', `created` DECIMAL(14, 3) NOT NULL DEFAULT 0 COMMENT 'A timestamp with millisecond precision indicating when the cache entry was created.', `serialized` SMALLINT NOT NULL DEFAULT 0 COMMENT 'A flag to indicate whether content is serialized (1) or not (0).', `tags` LONGTEXT NULL DEFAULT NULL COMMENT 'Space-separated list of cache tags for this entry.', `checksum` VARCHAR(255) CHARACTER SET ascii COLLATE ascii_general_ci NOT NULL COMMENT 'The tag invalidation checksum when this entry was saved.', PRIMARY KEY (`cid`), INDEX `expire` (`expire`) ) ENGINE = InnoDB DEFAULT CHARACTER SET utf8mb4 COMMENT 'Storage for the cache API.'; Array ( ) in Drupal\Core\Cache\ChainedFastBackend->setMultiple() (line 187 of /var/lib/drupaltestbot/sites/default/files/checkout/core/lib/Drupal/Core/Cache/ChainedFastBackend.php). Drupal\Core\Database\Connection->handleQueryException(Object, 'CREATE TABLE {cache_config} ( `cid` VARCHAR(255) BINARY CHARACTER SET ascii COLLATE ascii_general_ci NOT NULL DEFAULT '' COMMENT 'Primary Key: Unique cache ID.', `data` LONGBLOB NULL DEFAULT NULL COMMENT 'A collection of data to cache.', `expire` INT NOT NULL DEFAULT 0 COMMENT 'A Unix timestamp indicating when the cache entry should expire, or -1 for never.', `created` DECIMAL(14, 3) NOT NULL DEFAULT 0 COMMENT 'A timestamp with millisecond precision indicating when the cache entry was created.', `serialized` SMALLINT NOT NULL DEFAULT 0 COMMENT 'A flag to indicate whether content is serialized (1) or not (0).', `tags` LONGTEXT NULL DEFAULT NULL COMMENT 'Space-separated list of cache tags for this entry.', `checksum` VARCHAR(255) CHARACTER SET ascii COLLATE ascii_general_ci NOT NULL COMMENT 'The tag invalidation checksum when this entry was saved.', PRIMARY KEY (`cid`), INDEX `expire` (`expire`) ) ENGINE = InnoDB DEFAULT CHARACTER SET utf8mb4 COMMENT 'Storage for the cache API.'', Array, Array) Drupal\Core\Database\Connection->query('CREATE TABLE {cache_config} ( `cid` VARCHAR(255) BINARY CHARACTER SET ascii COLLATE ascii_general_ci NOT NULL DEFAULT '' COMMENT 'Primary Key: Unique cache ID.', `data` LONGBLOB NULL DEFAULT NULL COMMENT 'A collection of data to cache.', `expire` INT NOT NULL DEFAULT 0 COMMENT 'A Unix timestamp indicating when the cache entry should expire, or -1 for never.', `created` DECIMAL(14, 3) NOT NULL DEFAULT 0 COMMENT 'A timestamp with millisecond precision indicating when the cache entry was created.', `serialized` SMALLINT NOT NULL DEFAULT 0 COMMENT 'A flag to indicate whether content is serialized (1) or not (0).', `tags` LONGTEXT NULL DEFAULT NULL COMMENT 'Space-separated list of cache tags for this entry.', `checksum` VARCHAR(255) CHARACTER SET ascii COLLATE ascii_general_ci NOT NULL COMMENT 'The tag invalidation checksum when this entry was saved.', PRIMARY KEY (`cid`), INDEX `expire` (`expire`) ) ENGINE = InnoDB DEFAULT CHARACTER SET utf8mb4 COMMENT 'Storage for the cache API.'') Drupal\Core\Database\Schema->createTable('cache_config', Array) Drupal\Core\Cache\DatabaseBackend->ensureBinExists() Drupal\Core\Cache\DatabaseBackend->deleteMultiple(Array) Drupal\Core\Cache\DatabaseBackend->setMultiple(Array) Drupal\Core\Cache\ChainedFastBackend->setMultiple(Array) Drupal\Core\Config\CachedStorage->readMultiple(Array) Drupal\Core\Config\ConfigFactory->doLoadMultiple(Array, 1) Drupal\Core\Config\ConfigFactory->doGet('language.negotiation') Drupal\Core\Config\ConfigFactory->get('language.negotiation') Drupal\language\Plugin\LanguageNegotiation\LanguageNegotiationUrl->processOutbound('/update.php', Array, Object, Object) Drupal\language\HttpKernel\PathProcessorLanguage->processOutbound('/update.php', Array, Object, Object) Drupal\Core\PathProcessor\PathProcessorManager->processOutbound('/update.php', Array, Object, Object) Drupal\Core\Routing\UrlGenerator->processPath('/update.php', Array, Object) Drupal\Core\Routing\UrlGenerator->generateFromRoute('system.db_update', Array, Array, 1) Drupal\Core\Render\MetadataBubblingUrlGenerator->generateFromRoute('system.db_update', Array, Array, ) Drupal\Core\Url->toString() Drupal\simpletest\WebTestBase->buildUrl(Object, Array) Drupal\simpletest\WebTestBase->drupalGet(Object) Drupal\system\Tests\Update\UpdatePathTestBase->runUpdates() Drupal\beta2beta\Tests\Update\Beta2BetaUpdateTestBase->runUpdates() Drupal\beta2beta\Tests\Update\Update2431329Test->testNewNode() Drupal\simpletest\TestBase->run(Array) simpletest_script_run_one_test('1', 'Drupal\beta2beta\Tests\Update\Update2431329Test') Uncaught exceptionConnection.php609Drupal\Core\Database\Connection->handleQueryException()

All

Test namePassFailException
LeafDrupal\beta2beta\Tests\Update\Beta10UpdatePath10800
LeafDrupal\beta2beta\Tests\Update\Beta11Beta12UpdatePath6400
ExpandDrupal\beta2beta\Tests\Update\Update2431329Test29423
MessageGroupFilenameLineFunctionStatus
Undefined index: default_langcodeDrupal\language\LanguageServiceProvider->getDefaultLanguageValues() Drupal\language\LanguageServiceProvider->alter(Object) Drupal\Core\DependencyInjection\Compiler\ModifyServiceDefinitionsPass->process(Object) Symfony\Component\DependencyInjection\Compiler\Compiler->compile(Object) Symfony\Component\DependencyInjection\ContainerBuilder->compile() Drupal\Core\DrupalKernel->compileContainer() Drupal\Core\DrupalKernel->initializeContainer() Drupal\Core\DrupalKernel->boot() Drupal\Core\DrupalKernel->prepareLegacyRequest(Object) Drupal\simpletest\WebTestBase->initKernel(Object) Drupal\system\Tests\Update\UpdatePathTestBase->setUp() Drupal\beta2beta\Tests\Update\Beta2BetaUpdateTestBase->setUp() Drupal\simpletest\TestBase->run(Array) simpletest_script_run_one_test('1', 'Drupal\beta2beta\Tests\Update\Update2431329Test') NoticeLanguageServiceProvider.php100Drupal\language\LanguageServiceProvider->getDefaultLanguageValues()
Undefined index: default_langcodeDrupal\language\LanguageServiceProvider->getDefaultLanguageValues() Drupal\language\LanguageServiceProvider->alter(Object) Drupal\Core\DependencyInjection\Compiler\ModifyServiceDefinitionsPass->process(Object) Symfony\Component\DependencyInjection\Compiler\Compiler->compile(Object) Symfony\Component\DependencyInjection\ContainerBuilder->compile() Drupal\Core\DrupalKernel->compileContainer() Drupal\Core\DrupalKernel->initializeContainer() Drupal\Core\DrupalKernel->rebuildContainer() Drupal\simpletest\WebTestBase->initKernel(Object) Drupal\system\Tests\Update\UpdatePathTestBase->setUp() Drupal\beta2beta\Tests\Update\Beta2BetaUpdateTestBase->setUp() Drupal\simpletest\TestBase->run(Array) simpletest_script_run_one_test('1', 'Drupal\beta2beta\Tests\Update\Update2431329Test') NoticeLanguageServiceProvider.php100Drupal\language\LanguageServiceProvider->getDefaultLanguageValues()
Undefined index: default_langcodeDrupal\language\LanguageServiceProvider->getDefaultLanguageValues() Drupal\language\LanguageServiceProvider->alter(Object) Drupal\Core\DependencyInjection\Compiler\ModifyServiceDefinitionsPass->process(Object) Symfony\Component\DependencyInjection\Compiler\Compiler->compile(Object) Symfony\Component\DependencyInjection\ContainerBuilder->compile() Drupal\Core\DrupalKernel->compileContainer() Drupal\Core\DrupalKernel->initializeContainer() Drupal\Core\DrupalKernel->updateModules(Array, Array) Drupal\Core\Extension\ModuleInstaller->updateKernel(Array) Drupal\Core\Extension\ModuleInstaller->install(Array, 1) Drupal\Core\ProxyClass\Extension\ModuleInstaller->install(Array, 1) Drupal\simpletest\WebTestBase->installModulesFromClassProperty(Object) Drupal\system\Tests\Update\UpdatePathTestBase->setUp() Drupal\beta2beta\Tests\Update\Beta2BetaUpdateTestBase->setUp() Drupal\simpletest\TestBase->run(Array) simpletest_script_run_one_test('1', 'Drupal\beta2beta\Tests\Update\Update2431329Test') NoticeLanguageServiceProvider.php100Drupal\language\LanguageServiceProvider->getDefaultLanguageValues()
Undefined index: default_langcodeDrupal\language\LanguageServiceProvider->getDefaultLanguageValues() Drupal\language\LanguageServiceProvider->alter(Object) Drupal\Core\DependencyInjection\Compiler\ModifyServiceDefinitionsPass->process(Object) Symfony\Component\DependencyInjection\Compiler\Compiler->compile(Object) Symfony\Component\DependencyInjection\ContainerBuilder->compile() Drupal\Core\DrupalKernel->compileContainer() Drupal\Core\DrupalKernel->initializeContainer() Drupal\Core\DrupalKernel->updateModules(Array, Array) Drupal\Core\Extension\ModuleInstaller->updateKernel(Array) Drupal\Core\Extension\ModuleInstaller->install(Array, 1) Drupal\Core\ProxyClass\Extension\ModuleInstaller->install(Array, 1) Drupal\simpletest\WebTestBase->installModulesFromClassProperty(Object) Drupal\system\Tests\Update\UpdatePathTestBase->setUp() Drupal\beta2beta\Tests\Update\Beta2BetaUpdateTestBase->setUp() Drupal\simpletest\TestBase->run(Array) simpletest_script_run_one_test('1', 'Drupal\beta2beta\Tests\Update\Update2431329Test') NoticeLanguageServiceProvider.php100Drupal\language\LanguageServiceProvider->getDefaultLanguageValues()
Undefined index: default_langcodeDrupal\language\LanguageServiceProvider->getDefaultLanguageValues() Drupal\language\LanguageServiceProvider->alter(Object) Drupal\Core\DependencyInjection\Compiler\ModifyServiceDefinitionsPass->process(Object) Symfony\Component\DependencyInjection\Compiler\Compiler->compile(Object) Symfony\Component\DependencyInjection\ContainerBuilder->compile() Drupal\Core\DrupalKernel->compileContainer() Drupal\Core\DrupalKernel->initializeContainer() Drupal\Core\DrupalKernel->rebuildContainer() Drupal\simpletest\WebTestBase->rebuildContainer() Drupal\simpletest\WebTestBase->installModulesFromClassProperty(Object) Drupal\system\Tests\Update\UpdatePathTestBase->setUp() Drupal\beta2beta\Tests\Update\Beta2BetaUpdateTestBase->setUp() Drupal\simpletest\TestBase->run(Array) simpletest_script_run_one_test('1', 'Drupal\beta2beta\Tests\Update\Update2431329Test') NoticeLanguageServiceProvider.php100Drupal\language\LanguageServiceProvider->getDefaultLanguageValues()
Undefined index: default_langcodeDrupal\language\LanguageServiceProvider->getDefaultLanguageValues() Drupal\language\LanguageServiceProvider->alter(Object) Drupal\Core\DependencyInjection\Compiler\ModifyServiceDefinitionsPass->process(Object) Symfony\Component\DependencyInjection\Compiler\Compiler->compile(Object) Symfony\Component\DependencyInjection\ContainerBuilder->compile() Drupal\Core\DrupalKernel->compileContainer() Drupal\Core\DrupalKernel->initializeContainer() Drupal\Core\DrupalKernel->updateModules(Array, Array) drupal_flush_all_caches() Drupal\simpletest\WebTestBase->resetAll() Drupal\simpletest\WebTestBase->rebuildAll() Drupal\system\Tests\Update\UpdatePathTestBase->setUp() Drupal\beta2beta\Tests\Update\Beta2BetaUpdateTestBase->setUp() Drupal\simpletest\TestBase->run(Array) simpletest_script_run_one_test('1', 'Drupal\beta2beta\Tests\Update\Update2431329Test') NoticeLanguageServiceProvider.php100Drupal\language\LanguageServiceProvider->getDefaultLanguageValues()
The langcode field was added to the node table.OtherUpdate2431329Test.php61Drupal\beta2beta\Tests\Update\Update2431329Test->testUpdate2431329()
Undefined index: revision_translation_affectedNoticeSqlContentEntityStorage.php554Drupal\Core\Entity\Sql\SqlContentEntityStorage->loadFromSharedTables()
Undefined index: revision_translation_affectedNoticeSqlContentEntityStorage.php554Drupal\Core\Entity\Sql\SqlContentEntityStorage->loadFromSharedTables()
"Test article 1 (Afrikaans)" foundOtherUpdate2431329Test.php64Drupal\beta2beta\Tests\Update\Update2431329Test->testUpdate2431329()
Drupal\Core\Database\DatabaseExceptionWrapper: SQLSTATE[42S22]: Column not found: 1054 Unknown column 'n.langcode' in 'field list': SELECT n.nid AS nid, n.langcode AS langcode FROM {node} n ORDER BY nid ASC; Array ( ) in Drupal\beta2beta\Tests\Update\Update2431329Test->testUpdate2431329() (line 67 of /var/lib/drupaltestbot/sites/default/files/checkout/sites/default/modules/head2head/beta2beta/src/Tests/Update/Update2431329Test.php). Drupal\Core\Database\Connection->handleQueryException(Object, 'SELECT n.nid AS nid, n.langcode AS langcode FROM {node} n ORDER BY nid ASC', Array, Array) Drupal\Core\Database\Connection->query('SELECT n.nid AS nid, n.langcode AS langcode FROM {node} n ORDER BY nid ASC', Array, Array) Drupal\Core\Database\Query\Select->execute() Drupal\beta2beta\Tests\Update\Update2431329Test->testUpdate2431329() Drupal\simpletest\TestBase->run(Array) simpletest_script_run_one_test('1', 'Drupal\beta2beta\Tests\Update\Update2431329Test') Uncaught exceptionConnection.php609Drupal\Core\Database\Connection->handleQueryException()
[20-Jul-2015 10:46:31 America/Los_Angeles] Uncaught PHP Exception Drupal\Component\Plugin\Exception\PluginNotFoundException: "The "published-notpublished" plugin does not exist." at /var/lib/drupaltestbot/sites/default/files/checkout/core/lib/Drupal/Component/Plugin/Discovery/DiscoveryTrait.php line 57 Fatal errorUnknown0Unknown
[20-Jul-2015 10:46:32 America/Los_Angeles] Uncaught PHP Exception Exception: "The Taxonomy term reference field has been removed in Drupal 8.0.0-beta10. You should run the database update script immediately in order to automatically convert to Entity reference." at /var/lib/drupaltestbot/sites/default/files/checkout/sites/default/modules/head2head/beta2beta/src/PluginOverride/Field/FieldType/TaxonomyTermReferenceItem.php line 22 Fatal errorUnknown0Unknown
Undefined index: default_langcodeDrupal\language\LanguageServiceProvider->getDefaultLanguageValues() Drupal\language\LanguageServiceProvider->alter(Object) Drupal\Core\DependencyInjection\Compiler\ModifyServiceDefinitionsPass->process(Object) Symfony\Component\DependencyInjection\Compiler\Compiler->compile(Object) Symfony\Component\DependencyInjection\ContainerBuilder->compile() Drupal\Core\DrupalKernel->compileContainer() Drupal\Core\DrupalKernel->initializeContainer() Drupal\Core\DrupalKernel->boot() Drupal\Core\DrupalKernel->prepareLegacyRequest(Object) Drupal\simpletest\WebTestBase->initKernel(Object) Drupal\system\Tests\Update\UpdatePathTestBase->setUp() Drupal\beta2beta\Tests\Update\Beta2BetaUpdateTestBase->setUp() Drupal\simpletest\TestBase->run(Array) simpletest_script_run_one_test('1', 'Drupal\beta2beta\Tests\Update\Update2431329Test') NoticeLanguageServiceProvider.php100Drupal\language\LanguageServiceProvider->getDefaultLanguageValues()
Undefined index: default_langcodeDrupal\language\LanguageServiceProvider->getDefaultLanguageValues() Drupal\language\LanguageServiceProvider->alter(Object) Drupal\Core\DependencyInjection\Compiler\ModifyServiceDefinitionsPass->process(Object) Symfony\Component\DependencyInjection\Compiler\Compiler->compile(Object) Symfony\Component\DependencyInjection\ContainerBuilder->compile() Drupal\Core\DrupalKernel->compileContainer() Drupal\Core\DrupalKernel->initializeContainer() Drupal\Core\DrupalKernel->rebuildContainer() Drupal\simpletest\WebTestBase->initKernel(Object) Drupal\system\Tests\Update\UpdatePathTestBase->setUp() Drupal\beta2beta\Tests\Update\Beta2BetaUpdateTestBase->setUp() Drupal\simpletest\TestBase->run(Array) simpletest_script_run_one_test('1', 'Drupal\beta2beta\Tests\Update\Update2431329Test') NoticeLanguageServiceProvider.php100Drupal\language\LanguageServiceProvider->getDefaultLanguageValues()
Undefined index: default_langcodeDrupal\language\LanguageServiceProvider->getDefaultLanguageValues() Drupal\language\LanguageServiceProvider->alter(Object) Drupal\Core\DependencyInjection\Compiler\ModifyServiceDefinitionsPass->process(Object) Symfony\Component\DependencyInjection\Compiler\Compiler->compile(Object) Symfony\Component\DependencyInjection\ContainerBuilder->compile() Drupal\Core\DrupalKernel->compileContainer() Drupal\Core\DrupalKernel->initializeContainer() Drupal\Core\DrupalKernel->updateModules(Array, Array) Drupal\Core\Extension\ModuleInstaller->updateKernel(Array) Drupal\Core\Extension\ModuleInstaller->install(Array, 1) Drupal\Core\ProxyClass\Extension\ModuleInstaller->install(Array, 1) Drupal\simpletest\WebTestBase->installModulesFromClassProperty(Object) Drupal\system\Tests\Update\UpdatePathTestBase->setUp() Drupal\beta2beta\Tests\Update\Beta2BetaUpdateTestBase->setUp() Drupal\simpletest\TestBase->run(Array) simpletest_script_run_one_test('1', 'Drupal\beta2beta\Tests\Update\Update2431329Test') NoticeLanguageServiceProvider.php100Drupal\language\LanguageServiceProvider->getDefaultLanguageValues()
Undefined index: default_langcodeDrupal\language\LanguageServiceProvider->getDefaultLanguageValues() Drupal\language\LanguageServiceProvider->alter(Object) Drupal\Core\DependencyInjection\Compiler\ModifyServiceDefinitionsPass->process(Object) Symfony\Component\DependencyInjection\Compiler\Compiler->compile(Object) Symfony\Component\DependencyInjection\ContainerBuilder->compile() Drupal\Core\DrupalKernel->compileContainer() Drupal\Core\DrupalKernel->initializeContainer() Drupal\Core\DrupalKernel->updateModules(Array, Array) Drupal\Core\Extension\ModuleInstaller->updateKernel(Array) Drupal\Core\Extension\ModuleInstaller->install(Array, 1) Drupal\Core\ProxyClass\Extension\ModuleInstaller->install(Array, 1) Drupal\simpletest\WebTestBase->installModulesFromClassProperty(Object) Drupal\system\Tests\Update\UpdatePathTestBase->setUp() Drupal\beta2beta\Tests\Update\Beta2BetaUpdateTestBase->setUp() Drupal\simpletest\TestBase->run(Array) simpletest_script_run_one_test('1', 'Drupal\beta2beta\Tests\Update\Update2431329Test') NoticeLanguageServiceProvider.php100Drupal\language\LanguageServiceProvider->getDefaultLanguageValues()
Undefined index: default_langcodeDrupal\language\LanguageServiceProvider->getDefaultLanguageValues() Drupal\language\LanguageServiceProvider->alter(Object) Drupal\Core\DependencyInjection\Compiler\ModifyServiceDefinitionsPass->process(Object) Symfony\Component\DependencyInjection\Compiler\Compiler->compile(Object) Symfony\Component\DependencyInjection\ContainerBuilder->compile() Drupal\Core\DrupalKernel->compileContainer() Drupal\Core\DrupalKernel->initializeContainer() Drupal\Core\DrupalKernel->rebuildContainer() Drupal\simpletest\WebTestBase->rebuildContainer() Drupal\simpletest\WebTestBase->installModulesFromClassProperty(Object) Drupal\system\Tests\Update\UpdatePathTestBase->setUp() Drupal\beta2beta\Tests\Update\Beta2BetaUpdateTestBase->setUp() Drupal\simpletest\TestBase->run(Array) simpletest_script_run_one_test('1', 'Drupal\beta2beta\Tests\Update\Update2431329Test') NoticeLanguageServiceProvider.php100Drupal\language\LanguageServiceProvider->getDefaultLanguageValues()
Undefined index: default_langcodeDrupal\language\LanguageServiceProvider->getDefaultLanguageValues() Drupal\language\LanguageServiceProvider->alter(Object) Drupal\Core\DependencyInjection\Compiler\ModifyServiceDefinitionsPass->process(Object) Symfony\Component\DependencyInjection\Compiler\Compiler->compile(Object) Symfony\Component\DependencyInjection\ContainerBuilder->compile() Drupal\Core\DrupalKernel->compileContainer() Drupal\Core\DrupalKernel->initializeContainer() Drupal\Core\DrupalKernel->updateModules(Array, Array) drupal_flush_all_caches() Drupal\simpletest\WebTestBase->resetAll() Drupal\simpletest\WebTestBase->rebuildAll() Drupal\system\Tests\Update\UpdatePathTestBase->setUp() Drupal\beta2beta\Tests\Update\Beta2BetaUpdateTestBase->setUp() Drupal\simpletest\TestBase->run(Array) simpletest_script_run_one_test('1', 'Drupal\beta2beta\Tests\Update\Update2431329Test') NoticeLanguageServiceProvider.php100Drupal\language\LanguageServiceProvider->getDefaultLanguageValues()
Drupal\Core\Database\DatabaseExceptionWrapper: SQLSTATE[HY000]: General error: failed to instantiate user-supplied statement class: CREATE TABLE {cache_config} ( `cid` VARCHAR(255) BINARY CHARACTER SET ascii COLLATE ascii_general_ci NOT NULL DEFAULT '' COMMENT 'Primary Key: Unique cache ID.', `data` LONGBLOB NULL DEFAULT NULL COMMENT 'A collection of data to cache.', `expire` INT NOT NULL DEFAULT 0 COMMENT 'A Unix timestamp indicating when the cache entry should expire, or -1 for never.', `created` DECIMAL(14, 3) NOT NULL DEFAULT 0 COMMENT 'A timestamp with millisecond precision indicating when the cache entry was created.', `serialized` SMALLINT NOT NULL DEFAULT 0 COMMENT 'A flag to indicate whether content is serialized (1) or not (0).', `tags` LONGTEXT NULL DEFAULT NULL COMMENT 'Space-separated list of cache tags for this entry.', `checksum` VARCHAR(255) CHARACTER SET ascii COLLATE ascii_general_ci NOT NULL COMMENT 'The tag invalidation checksum when this entry was saved.', PRIMARY KEY (`cid`), INDEX `expire` (`expire`) ) ENGINE = InnoDB DEFAULT CHARACTER SET utf8mb4 COMMENT 'Storage for the cache API.'; Array ( ) in Drupal\Core\Cache\ChainedFastBackend->setMultiple() (line 187 of /var/lib/drupaltestbot/sites/default/files/checkout/core/lib/Drupal/Core/Cache/ChainedFastBackend.php). Drupal\Core\Database\Connection->handleQueryException(Object, 'CREATE TABLE {cache_config} ( `cid` VARCHAR(255) BINARY CHARACTER SET ascii COLLATE ascii_general_ci NOT NULL DEFAULT '' COMMENT 'Primary Key: Unique cache ID.', `data` LONGBLOB NULL DEFAULT NULL COMMENT 'A collection of data to cache.', `expire` INT NOT NULL DEFAULT 0 COMMENT 'A Unix timestamp indicating when the cache entry should expire, or -1 for never.', `created` DECIMAL(14, 3) NOT NULL DEFAULT 0 COMMENT 'A timestamp with millisecond precision indicating when the cache entry was created.', `serialized` SMALLINT NOT NULL DEFAULT 0 COMMENT 'A flag to indicate whether content is serialized (1) or not (0).', `tags` LONGTEXT NULL DEFAULT NULL COMMENT 'Space-separated list of cache tags for this entry.', `checksum` VARCHAR(255) CHARACTER SET ascii COLLATE ascii_general_ci NOT NULL COMMENT 'The tag invalidation checksum when this entry was saved.', PRIMARY KEY (`cid`), INDEX `expire` (`expire`) ) ENGINE = InnoDB DEFAULT CHARACTER SET utf8mb4 COMMENT 'Storage for the cache API.'', Array, Array) Drupal\Core\Database\Connection->query('CREATE TABLE {cache_config} ( `cid` VARCHAR(255) BINARY CHARACTER SET ascii COLLATE ascii_general_ci NOT NULL DEFAULT '' COMMENT 'Primary Key: Unique cache ID.', `data` LONGBLOB NULL DEFAULT NULL COMMENT 'A collection of data to cache.', `expire` INT NOT NULL DEFAULT 0 COMMENT 'A Unix timestamp indicating when the cache entry should expire, or -1 for never.', `created` DECIMAL(14, 3) NOT NULL DEFAULT 0 COMMENT 'A timestamp with millisecond precision indicating when the cache entry was created.', `serialized` SMALLINT NOT NULL DEFAULT 0 COMMENT 'A flag to indicate whether content is serialized (1) or not (0).', `tags` LONGTEXT NULL DEFAULT NULL COMMENT 'Space-separated list of cache tags for this entry.', `checksum` VARCHAR(255) CHARACTER SET ascii COLLATE ascii_general_ci NOT NULL COMMENT 'The tag invalidation checksum when this entry was saved.', PRIMARY KEY (`cid`), INDEX `expire` (`expire`) ) ENGINE = InnoDB DEFAULT CHARACTER SET utf8mb4 COMMENT 'Storage for the cache API.'') Drupal\Core\Database\Schema->createTable('cache_config', Array) Drupal\Core\Cache\DatabaseBackend->ensureBinExists() Drupal\Core\Cache\DatabaseBackend->deleteMultiple(Array) Drupal\Core\Cache\DatabaseBackend->setMultiple(Array) Drupal\Core\Cache\ChainedFastBackend->setMultiple(Array) Drupal\Core\Config\CachedStorage->readMultiple(Array) Drupal\Core\Config\ConfigFactory->doLoadMultiple(Array, 1) Drupal\Core\Config\ConfigFactory->doGet('language.negotiation') Drupal\Core\Config\ConfigFactory->get('language.negotiation') Drupal\language\Plugin\LanguageNegotiation\LanguageNegotiationUrl->processOutbound('/update.php', Array, Object, Object) Drupal\language\HttpKernel\PathProcessorLanguage->processOutbound('/update.php', Array, Object, Object) Drupal\Core\PathProcessor\PathProcessorManager->processOutbound('/update.php', Array, Object, Object) Drupal\Core\Routing\UrlGenerator->processPath('/update.php', Array, Object) Drupal\Core\Routing\UrlGenerator->generateFromRoute('system.db_update', Array, Array, 1) Drupal\Core\Render\MetadataBubblingUrlGenerator->generateFromRoute('system.db_update', Array, Array, ) Drupal\Core\Url->toString() Drupal\simpletest\WebTestBase->buildUrl(Object, Array) Drupal\simpletest\WebTestBase->drupalGet(Object) Drupal\system\Tests\Update\UpdatePathTestBase->runUpdates() Drupal\beta2beta\Tests\Update\Beta2BetaUpdateTestBase->runUpdates() Drupal\beta2beta\Tests\Update\Update2431329Test->testUpgrade() Drupal\simpletest\TestBase->run(Array) simpletest_script_run_one_test('1', 'Drupal\beta2beta\Tests\Update\Update2431329Test') Uncaught exceptionConnection.php609Drupal\Core\Database\Connection->handleQueryException()
Undefined index: default_langcodeDrupal\language\LanguageServiceProvider->getDefaultLanguageValues() Drupal\language\LanguageServiceProvider->alter(Object) Drupal\Core\DependencyInjection\Compiler\ModifyServiceDefinitionsPass->process(Object) Symfony\Component\DependencyInjection\Compiler\Compiler->compile(Object) Symfony\Component\DependencyInjection\ContainerBuilder->compile() Drupal\Core\DrupalKernel->compileContainer() Drupal\Core\DrupalKernel->initializeContainer() Drupal\Core\DrupalKernel->boot() Drupal\Core\DrupalKernel->prepareLegacyRequest(Object) Drupal\simpletest\WebTestBase->initKernel(Object) Drupal\system\Tests\Update\UpdatePathTestBase->setUp() Drupal\beta2beta\Tests\Update\Beta2BetaUpdateTestBase->setUp() Drupal\simpletest\TestBase->run(Array) simpletest_script_run_one_test('1', 'Drupal\beta2beta\Tests\Update\Update2431329Test') NoticeLanguageServiceProvider.php100Drupal\language\LanguageServiceProvider->getDefaultLanguageValues()
Undefined index: default_langcodeDrupal\language\LanguageServiceProvider->getDefaultLanguageValues() Drupal\language\LanguageServiceProvider->alter(Object) Drupal\Core\DependencyInjection\Compiler\ModifyServiceDefinitionsPass->process(Object) Symfony\Component\DependencyInjection\Compiler\Compiler->compile(Object) Symfony\Component\DependencyInjection\ContainerBuilder->compile() Drupal\Core\DrupalKernel->compileContainer() Drupal\Core\DrupalKernel->initializeContainer() Drupal\Core\DrupalKernel->rebuildContainer() Drupal\simpletest\WebTestBase->initKernel(Object) Drupal\system\Tests\Update\UpdatePathTestBase->setUp() Drupal\beta2beta\Tests\Update\Beta2BetaUpdateTestBase->setUp() Drupal\simpletest\TestBase->run(Array) simpletest_script_run_one_test('1', 'Drupal\beta2beta\Tests\Update\Update2431329Test') NoticeLanguageServiceProvider.php100Drupal\language\LanguageServiceProvider->getDefaultLanguageValues()
Undefined index: default_langcodeDrupal\language\LanguageServiceProvider->getDefaultLanguageValues() Drupal\language\LanguageServiceProvider->alter(Object) Drupal\Core\DependencyInjection\Compiler\ModifyServiceDefinitionsPass->process(Object) Symfony\Component\DependencyInjection\Compiler\Compiler->compile(Object) Symfony\Component\DependencyInjection\ContainerBuilder->compile() Drupal\Core\DrupalKernel->compileContainer() Drupal\Core\DrupalKernel->initializeContainer() Drupal\Core\DrupalKernel->updateModules(Array, Array) Drupal\Core\Extension\ModuleInstaller->updateKernel(Array) Drupal\Core\Extension\ModuleInstaller->install(Array, 1) Drupal\Core\ProxyClass\Extension\ModuleInstaller->install(Array, 1) Drupal\simpletest\WebTestBase->installModulesFromClassProperty(Object) Drupal\system\Tests\Update\UpdatePathTestBase->setUp() Drupal\beta2beta\Tests\Update\Beta2BetaUpdateTestBase->setUp() Drupal\simpletest\TestBase->run(Array) simpletest_script_run_one_test('1', 'Drupal\beta2beta\Tests\Update\Update2431329Test') NoticeLanguageServiceProvider.php100Drupal\language\LanguageServiceProvider->getDefaultLanguageValues()
Undefined index: default_langcodeDrupal\language\LanguageServiceProvider->getDefaultLanguageValues() Drupal\language\LanguageServiceProvider->alter(Object) Drupal\Core\DependencyInjection\Compiler\ModifyServiceDefinitionsPass->process(Object) Symfony\Component\DependencyInjection\Compiler\Compiler->compile(Object) Symfony\Component\DependencyInjection\ContainerBuilder->compile() Drupal\Core\DrupalKernel->compileContainer() Drupal\Core\DrupalKernel->initializeContainer() Drupal\Core\DrupalKernel->updateModules(Array, Array) Drupal\Core\Extension\ModuleInstaller->updateKernel(Array) Drupal\Core\Extension\ModuleInstaller->install(Array, 1) Drupal\Core\ProxyClass\Extension\ModuleInstaller->install(Array, 1) Drupal\simpletest\WebTestBase->installModulesFromClassProperty(Object) Drupal\system\Tests\Update\UpdatePathTestBase->setUp() Drupal\beta2beta\Tests\Update\Beta2BetaUpdateTestBase->setUp() Drupal\simpletest\TestBase->run(Array) simpletest_script_run_one_test('1', 'Drupal\beta2beta\Tests\Update\Update2431329Test') NoticeLanguageServiceProvider.php100Drupal\language\LanguageServiceProvider->getDefaultLanguageValues()
Undefined index: default_langcodeDrupal\language\LanguageServiceProvider->getDefaultLanguageValues() Drupal\language\LanguageServiceProvider->alter(Object) Drupal\Core\DependencyInjection\Compiler\ModifyServiceDefinitionsPass->process(Object) Symfony\Component\DependencyInjection\Compiler\Compiler->compile(Object) Symfony\Component\DependencyInjection\ContainerBuilder->compile() Drupal\Core\DrupalKernel->compileContainer() Drupal\Core\DrupalKernel->initializeContainer() Drupal\Core\DrupalKernel->rebuildContainer() Drupal\simpletest\WebTestBase->rebuildContainer() Drupal\simpletest\WebTestBase->installModulesFromClassProperty(Object) Drupal\system\Tests\Update\UpdatePathTestBase->setUp() Drupal\beta2beta\Tests\Update\Beta2BetaUpdateTestBase->setUp() Drupal\simpletest\TestBase->run(Array) simpletest_script_run_one_test('1', 'Drupal\beta2beta\Tests\Update\Update2431329Test') NoticeLanguageServiceProvider.php100Drupal\language\LanguageServiceProvider->getDefaultLanguageValues()
Undefined index: default_langcodeDrupal\language\LanguageServiceProvider->getDefaultLanguageValues() Drupal\language\LanguageServiceProvider->alter(Object) Drupal\Core\DependencyInjection\Compiler\ModifyServiceDefinitionsPass->process(Object) Symfony\Component\DependencyInjection\Compiler\Compiler->compile(Object) Symfony\Component\DependencyInjection\ContainerBuilder->compile() Drupal\Core\DrupalKernel->compileContainer() Drupal\Core\DrupalKernel->initializeContainer() Drupal\Core\DrupalKernel->updateModules(Array, Array) drupal_flush_all_caches() Drupal\simpletest\WebTestBase->resetAll() Drupal\simpletest\WebTestBase->rebuildAll() Drupal\system\Tests\Update\UpdatePathTestBase->setUp() Drupal\beta2beta\Tests\Update\Beta2BetaUpdateTestBase->setUp() Drupal\simpletest\TestBase->run(Array) simpletest_script_run_one_test('1', 'Drupal\beta2beta\Tests\Update\Update2431329Test') NoticeLanguageServiceProvider.php100Drupal\language\LanguageServiceProvider->getDefaultLanguageValues()
Drupal\Core\Database\DatabaseExceptionWrapper: SQLSTATE[HY000]: General error: failed to instantiate user-supplied statement class: CREATE TABLE {cache_config} ( `cid` VARCHAR(255) BINARY CHARACTER SET ascii COLLATE ascii_general_ci NOT NULL DEFAULT '' COMMENT 'Primary Key: Unique cache ID.', `data` LONGBLOB NULL DEFAULT NULL COMMENT 'A collection of data to cache.', `expire` INT NOT NULL DEFAULT 0 COMMENT 'A Unix timestamp indicating when the cache entry should expire, or -1 for never.', `created` DECIMAL(14, 3) NOT NULL DEFAULT 0 COMMENT 'A timestamp with millisecond precision indicating when the cache entry was created.', `serialized` SMALLINT NOT NULL DEFAULT 0 COMMENT 'A flag to indicate whether content is serialized (1) or not (0).', `tags` LONGTEXT NULL DEFAULT NULL COMMENT 'Space-separated list of cache tags for this entry.', `checksum` VARCHAR(255) CHARACTER SET ascii COLLATE ascii_general_ci NOT NULL COMMENT 'The tag invalidation checksum when this entry was saved.', PRIMARY KEY (`cid`), INDEX `expire` (`expire`) ) ENGINE = InnoDB DEFAULT CHARACTER SET utf8mb4 COMMENT 'Storage for the cache API.'; Array ( ) in Drupal\Core\Cache\ChainedFastBackend->setMultiple() (line 187 of /var/lib/drupaltestbot/sites/default/files/checkout/core/lib/Drupal/Core/Cache/ChainedFastBackend.php). Drupal\Core\Database\Connection->handleQueryException(Object, 'CREATE TABLE {cache_config} ( `cid` VARCHAR(255) BINARY CHARACTER SET ascii COLLATE ascii_general_ci NOT NULL DEFAULT '' COMMENT 'Primary Key: Unique cache ID.', `data` LONGBLOB NULL DEFAULT NULL COMMENT 'A collection of data to cache.', `expire` INT NOT NULL DEFAULT 0 COMMENT 'A Unix timestamp indicating when the cache entry should expire, or -1 for never.', `created` DECIMAL(14, 3) NOT NULL DEFAULT 0 COMMENT 'A timestamp with millisecond precision indicating when the cache entry was created.', `serialized` SMALLINT NOT NULL DEFAULT 0 COMMENT 'A flag to indicate whether content is serialized (1) or not (0).', `tags` LONGTEXT NULL DEFAULT NULL COMMENT 'Space-separated list of cache tags for this entry.', `checksum` VARCHAR(255) CHARACTER SET ascii COLLATE ascii_general_ci NOT NULL COMMENT 'The tag invalidation checksum when this entry was saved.', PRIMARY KEY (`cid`), INDEX `expire` (`expire`) ) ENGINE = InnoDB DEFAULT CHARACTER SET utf8mb4 COMMENT 'Storage for the cache API.'', Array, Array) Drupal\Core\Database\Connection->query('CREATE TABLE {cache_config} ( `cid` VARCHAR(255) BINARY CHARACTER SET ascii COLLATE ascii_general_ci NOT NULL DEFAULT '' COMMENT 'Primary Key: Unique cache ID.', `data` LONGBLOB NULL DEFAULT NULL COMMENT 'A collection of data to cache.', `expire` INT NOT NULL DEFAULT 0 COMMENT 'A Unix timestamp indicating when the cache entry should expire, or -1 for never.', `created` DECIMAL(14, 3) NOT NULL DEFAULT 0 COMMENT 'A timestamp with millisecond precision indicating when the cache entry was created.', `serialized` SMALLINT NOT NULL DEFAULT 0 COMMENT 'A flag to indicate whether content is serialized (1) or not (0).', `tags` LONGTEXT NULL DEFAULT NULL COMMENT 'Space-separated list of cache tags for this entry.', `checksum` VARCHAR(255) CHARACTER SET ascii COLLATE ascii_general_ci NOT NULL COMMENT 'The tag invalidation checksum when this entry was saved.', PRIMARY KEY (`cid`), INDEX `expire` (`expire`) ) ENGINE = InnoDB DEFAULT CHARACTER SET utf8mb4 COMMENT 'Storage for the cache API.'') Drupal\Core\Database\Schema->createTable('cache_config', Array) Drupal\Core\Cache\DatabaseBackend->ensureBinExists() Drupal\Core\Cache\DatabaseBackend->deleteMultiple(Array) Drupal\Core\Cache\DatabaseBackend->setMultiple(Array) Drupal\Core\Cache\ChainedFastBackend->setMultiple(Array) Drupal\Core\Config\CachedStorage->readMultiple(Array) Drupal\Core\Config\ConfigFactory->doLoadMultiple(Array, 1) Drupal\Core\Config\ConfigFactory->doGet('language.negotiation') Drupal\Core\Config\ConfigFactory->get('language.negotiation') Drupal\language\Plugin\LanguageNegotiation\LanguageNegotiationUrl->processOutbound('/update.php', Array, Object, Object) Drupal\language\HttpKernel\PathProcessorLanguage->processOutbound('/update.php', Array, Object, Object) Drupal\Core\PathProcessor\PathProcessorManager->processOutbound('/update.php', Array, Object, Object) Drupal\Core\Routing\UrlGenerator->processPath('/update.php', Array, Object) Drupal\Core\Routing\UrlGenerator->generateFromRoute('system.db_update', Array, Array, 1) Drupal\Core\Render\MetadataBubblingUrlGenerator->generateFromRoute('system.db_update', Array, Array, ) Drupal\Core\Url->toString() Drupal\simpletest\WebTestBase->buildUrl(Object, Array) Drupal\simpletest\WebTestBase->drupalGet(Object) Drupal\system\Tests\Update\UpdatePathTestBase->runUpdates() Drupal\beta2beta\Tests\Update\Beta2BetaUpdateTestBase->runUpdates() Drupal\beta2beta\Tests\Update\Update2431329Test->testNewNode() Drupal\simpletest\TestBase->run(Array) simpletest_script_run_one_test('1', 'Drupal\beta2beta\Tests\Update\Update2431329Test') Uncaught exceptionConnection.php609Drupal\Core\Database\Connection->handleQueryException()
LeafDrupal\beta2beta\Tests\Update\Update2509300Test9800