rules_term_reference_test.patch

Test status
StatusResult
Last receivedSun, 11/28/2010 - 13:01:44
Last requestedSun, 11/28/2010 - 13:02:01
Last testedSun, 11/28/2010 - 13:05:13
Test count1
Environment status
MySQLfail
File information
Filerules_term_reference_test.patch
BranchRules - 7.x-2.x
LinkIssue Link
SummaryFAILED: [[SimpleTest]]: [MySQL] 152 pass(es), 0 fail(s), and 1 exception(s).
Details

MySQL

  1. Setup environment
  2. Detect an invalid patch URL
  3. Detect invalid repository information
  4. Detect invalid patch format
  5. Detect a non-applicable patch
  6. Detect invalid PHP syntax
  7. Detect a Drupal installation failure
  8. Detect a test run failure
  9. Detect a failing test
    Review the test failures below then if necessary run them locally until the problem has been fixed.
  10. Complete test suite with all tests passing
152 pass(es), 0 fail(s), and 1 exception(s)

Non-pass

Test namePassFailException
ExpandRules Core Integration (RulesIntegrationTestCase) [Rules]6201
MessageGroupFilenameLineFunctionStatus
EntityMetadataWrapperException: Unknown data property h. in EntityStructureWrapper->getPropertyInfo() (line 291 of /var/lib/drupaltestbot/sites/default/files/checkout/sites/default/modules/entity/entity_metadata/entity_metadata.wrapper.inc).Uncaught exceptionentity_metadata.wrapper.inc291EntityStructureWrapper->getPropertyInfo()

All

Test namePassFailException
LeafReaction Rules (RulesTriggerTestCase) [Rules]2100
ExpandRules Core Integration (RulesIntegrationTestCase) [Rules]6201
MessageGroupFilenameLineFunctionStatus
EntityMetadataWrapperException: Unknown data property h. in EntityStructureWrapper->getPropertyInfo() (line 291 of /var/lib/drupaltestbot/sites/default/files/checkout/sites/default/modules/entity/entity_metadata/entity_metadata.wrapper.inc).Uncaught exceptionentity_metadata.wrapper.inc291EntityStructureWrapper->getPropertyInfo()
LeafRules Data tests (RulesTestDataCase) [Rules]1300
LeafRules Engine tests (RulesTestCase) [Rules]5300
LeafRules Scheduler tests (RulesSchedulerTestCase) [Rules]300