drupal.field-hook-info.6.patch

Test status
StatusResult
Last receivedMon, 11/22/2010 - 01:01:33
Last requestedMon, 11/22/2010 - 01:12:50
Last testedMon, 11/22/2010 - 01:43:18
Test count1
Environment status
MySQLfail
File information
Filedrupal.field-hook-info.6.patch
BranchDrupal core - 7.x
LinkIssue Link
SummaryFAILED: [[SimpleTest]]: [MySQL] 27,369 pass(es), 180 fail(s), and 265 exception(s).
Details

MySQL

  1. Setup environment
  2. Detect an invalid patch URL
  3. Detect invalid repository information
  4. Detect invalid patch format
  5. Detect a non-applicable patch
  6. Detect invalid PHP syntax
  7. Detect a Drupal installation failure
  8. Detect a test run failure
  9. Detect a failing test
    Review the test failures below then if necessary run them locally until the problem has been fixed.
  10. Complete test suite with all tests passing
27,369 pass(es), 180 fail(s), and 265 exception(s)

Non-pass

Test namePassFailException
ExpandComment language (LocaleCommentLanguageFunctionalTest) [Locale]4589
MessageGroupFilenameLineFunctionStatus
Trying to get property of non-objectNoticelocale.test2218LocaleCommentLanguageFunctionalTest->testCommentLanguage()
Failed to set field comment_body[und][0][value] to qjGCA875Otherlocale.test2218LocaleCommentLanguageFunctionalTest->testCommentLanguage()
Found the Save buttonOtherlocale.test2218LocaleCommentLanguageFunctionalTest->testCommentLanguage()
Found the requested form fields at node/Otherlocale.test2218LocaleCommentLanguageFunctionalTest->testCommentLanguage()
Trying to get property of non-objectNoticelocale.test2223LocaleCommentLanguageFunctionalTest->testCommentLanguage()
Trying to get property of non-objectNoticelocale.test2227LocaleCommentLanguageFunctionalTest->testCommentLanguage()
Trying to get property of non-objectNoticelocale.test2228LocaleCommentLanguageFunctionalTest->testCommentLanguage()
The comment posted with content language en and belonging to the node with language en has language Otherlocale.test2228LocaleCommentLanguageFunctionalTest->testCommentLanguage()
Trying to get property of non-objectNoticelocale.test2218LocaleCommentLanguageFunctionalTest->testCommentLanguage()
Failed to set field comment_body[und][0][value] to e8Z043upOtherlocale.test2218LocaleCommentLanguageFunctionalTest->testCommentLanguage()
Found the Save buttonOtherlocale.test2218LocaleCommentLanguageFunctionalTest->testCommentLanguage()
Found the requested form fields at fr/node/Otherlocale.test2218LocaleCommentLanguageFunctionalTest->testCommentLanguage()
Trying to get property of non-objectNoticelocale.test2223LocaleCommentLanguageFunctionalTest->testCommentLanguage()
Trying to get property of non-objectNoticelocale.test2227LocaleCommentLanguageFunctionalTest->testCommentLanguage()
Trying to get property of non-objectNoticelocale.test2228LocaleCommentLanguageFunctionalTest->testCommentLanguage()
The comment posted with content language fr and belonging to the node with language en has language Otherlocale.test2228LocaleCommentLanguageFunctionalTest->testCommentLanguage()
Undefined property: stdClass::$field_imageNoticelocale.module410locale_field_node_form_submit()
ExpandDBLog functionality (DBLogTestCase) [DBLog]427134
MessageGroupFilenameLineFunctionStatus
HTTP response expected 200, actual 500Browserdblog.test275DBLogTestCase->doNode()
Node b0ETAHbv was loadedOtherdblog.test278DBLogTestCase->doNode()
Trying to get property of non-objectNoticedblog.test281DBLogTestCase->doNode()
Failed to set field body[und][0][value] to jT9rAhEky37CCyTJn7IOsWqypnwAPTouOtherdblog.test281DBLogTestCase->doNode()
Found the Save buttonOtherdblog.test281DBLogTestCase->doNode()
Found the requested form fields at node//editOtherdblog.test281DBLogTestCase->doNode()
HTTP response expected 200, actual 404Browserdblog.test282DBLogTestCase->doNode()
Trying to get property of non-objectNoticedblog.test284DBLogTestCase->doNode()
Found the Delete buttonOtherdblog.test284DBLogTestCase->doNode()
Found the requested form fields at node//deleteOtherdblog.test284DBLogTestCase->doNode()
HTTP response expected 200, actual 404Browserdblog.test285DBLogTestCase->doNode()
Trying to get property of non-objectNoticedblog.test287DBLogTestCase->doNode()
HTTP response expected 404, actual 200Browserdblog.test288DBLogTestCase->doNode()
DBLog event was recorded: [content added]Otherdblog.test301DBLogTestCase->doNode()
DBLog event was recorded: [content updated]Otherdblog.test303DBLogTestCase->doNode()
DBLog event was recorded: [content deleted]Otherdblog.test305DBLogTestCase->doNode()
Trying to get property of non-objectNoticedblog.test317DBLogTestCase->doNode()
ExpandFile field display tests (FileFieldDisplayTestCase) [File]16413
MessageGroupFilenameLineFunctionStatus
array_flip(): Can only flip STRING and INTEGER values!Warningentity.inc167DrupalDefaultEntityController->load()
Trying to get property of non-objectNoticefile.test717FileFieldDisplayTestCase->testNodeDisplay()
Undefined property: stdClass::$uriNoticefile.module693theme_file_link()
Undefined property: stdClass::$filemimeNoticefile.module731theme_file_icon()
Undefined property: stdClass::$filemimeNoticefile.module773file_icon_path()
Undefined property: stdClass::$filemimeNoticefile.module815file_icon_map()
Undefined property: stdClass::$filemimeNoticefile.module788file_icon_path()
Undefined property: stdClass::$filemimeNoticefile.module788file_icon_path()
Undefined property: stdClass::$filemimeNoticefile.module788file_icon_path()
Undefined property: stdClass::$filemimeNoticefile.module788file_icon_path()
Undefined property: stdClass::$filemimeNoticefile.module700theme_file_link()
Undefined property: stdClass::$filesizeNoticefile.module700theme_file_link()
Undefined property: stdClass::$filenameNoticefile.module706theme_file_link()
Default formatter displaying correctly on full node view.Otherfile.test719FileFieldDisplayTestCase->testNodeDisplay()
Failed to set field shuubsvv[und][0][display] to Otherfile.test723FileFieldDisplayTestCase->testNodeDisplay()
Found the Save buttonOtherfile.test723FileFieldDisplayTestCase->testNodeDisplay()
Found the requested form fields at node//editOtherfile.test723FileFieldDisplayTestCase->testNodeDisplay()
ExpandFile field file path tests (FileFieldPathTestCase) [File]17312
MessageGroupFilenameLineFunctionStatus
array_flip(): Can only flip STRING and INTEGER values!Warningentity.inc167DrupalDefaultEntityController->load()
Trying to get property of non-objectNoticefile.test917FileFieldPathTestCase->testUploadPath()
Undefined property: stdClass::$uriNoticefile.test918FileFieldPathTestCase->testUploadPath()
Undefined property: stdClass::$uriNoticefile.test918FileFieldPathTestCase->testUploadPath()
The file was uploaded to the correct path.Otherfile.test918FileFieldPathTestCase->testUploadPath()
array_flip(): Can only flip STRING and INTEGER values!Warningentity.inc167DrupalDefaultEntityController->load()
Trying to get property of non-objectNoticefile.test928FileFieldPathTestCase->testUploadPath()
Undefined property: stdClass::$uriNoticefile.test929FileFieldPathTestCase->testUploadPath()
Undefined property: stdClass::$uriNoticefile.test929FileFieldPathTestCase->testUploadPath()
The file was uploaded to the correct path.Otherfile.test929FileFieldPathTestCase->testUploadPath()
array_flip(): Can only flip STRING and INTEGER values!Warningentity.inc167DrupalDefaultEntityController->load()
Trying to get property of non-objectNoticefile.test940FileFieldPathTestCase->testUploadPath()
Undefined property: stdClass::$uriNoticefile.test943FileFieldPathTestCase->testUploadPath()
Undefined property: stdClass::$uriNoticefile.test943FileFieldPathTestCase->testUploadPath()
The file was uploaded to the correct path with token replacements.Otherfile.test943FileFieldPathTestCase->testUploadPath()
ExpandFile field revision test (FileFieldRevisionTestCase) [File]292348
MessageGroupFilenameLineFunctionStatus
array_flip(): Can only flip STRING and INTEGER values!Warningentity.inc167DrupalDefaultEntityController->load()
Trying to get property of non-objectNoticefile.test604FileFieldRevisionTestCase->testRevisions()
Trying to get property of non-objectNoticefile.test605FileFieldRevisionTestCase->testRevisions()
Undefined property: stdClass::$uriNoticefile.test172FileFieldTestCase->assertFileExists()
New file saved to disk on node creation.Otherfile.test606FileFieldRevisionTestCase->testRevisions()
Undefined property: stdClass::$fidNoticefile.test180FileFieldTestCase->assertFileEntryExists()
array_flip(): Can only flip STRING and INTEGER values!Warningentity.inc167DrupalDefaultEntityController->load()
Trying to get property of non-objectNoticefile.test182FileFieldTestCase->assertFileEntryExists()
Undefined property: stdClass::$uriNoticefile.test182FileFieldTestCase->assertFileEntryExists()
Undefined property: stdClass::$statusNoticefile.test207FileFieldTestCase->assertFileIsPermanent()
File is permanent.Otherfile.test608FileFieldRevisionTestCase->testRevisions()
Found the Remove buttonOtherfile.test163FileFieldTestCase->replaceNodeFile()
Found the requested form fields at node//editOtherfile.test163FileFieldTestCase->replaceNodeFile()
Failed to set field files[tzqjpqx8_und_0] to /var/lib/drupaltestbot/sites/default/files/checkout/sites/default/files/simpletest/987487/text-0.txtOtherfile.test164FileFieldTestCase->replaceNodeFile()
Failed to set field revision to 1Otherfile.test164FileFieldTestCase->replaceNodeFile()
Found the Save buttonOtherfile.test164FileFieldTestCase->replaceNodeFile()
Found the requested form fields at Otherfile.test164FileFieldTestCase->replaceNodeFile()
array_flip(): Can only flip STRING and INTEGER values!Warningentity.inc167DrupalDefaultEntityController->load()
Trying to get property of non-objectNoticefile.test613FileFieldRevisionTestCase->testRevisions()
Trying to get property of non-objectNoticefile.test614FileFieldRevisionTestCase->testRevisions()
Undefined property: stdClass::$uriNoticefile.test172FileFieldTestCase->assertFileExists()
Replacement file exists on disk after creating new revision.Otherfile.test615FileFieldRevisionTestCase->testRevisions()
Undefined property: stdClass::$fidNoticefile.test180FileFieldTestCase->assertFileEntryExists()
array_flip(): Can only flip STRING and INTEGER values!Warningentity.inc167DrupalDefaultEntityController->load()
Trying to get property of non-objectNoticefile.test182FileFieldTestCase->assertFileEntryExists()
Undefined property: stdClass::$uriNoticefile.test182FileFieldTestCase->assertFileEntryExists()
Undefined property: stdClass::$statusNoticefile.test207FileFieldTestCase->assertFileIsPermanent()
Replacement file is permanent.Otherfile.test617FileFieldRevisionTestCase->testRevisions()
array_flip(): Can only flip STRING and INTEGER values!Warningentity.inc167DrupalDefaultEntityController->load()
Trying to get property of non-objectNoticefile.test621FileFieldRevisionTestCase->testRevisions()
Undefined property: stdClass::$uriNoticefile.test172FileFieldTestCase->assertFileExists()
Original file still in place after replacing file in new revision.Otherfile.test622FileFieldRevisionTestCase->testRevisions()
Undefined property: stdClass::$fidNoticefile.test180FileFieldTestCase->assertFileEntryExists()
array_flip(): Can only flip STRING and INTEGER values!Warningentity.inc167DrupalDefaultEntityController->load()
Trying to get property of non-objectNoticefile.test182FileFieldTestCase->assertFileEntryExists()
Undefined property: stdClass::$uriNoticefile.test182FileFieldTestCase->assertFileEntryExists()
Undefined property: stdClass::$statusNoticefile.test207FileFieldTestCase->assertFileIsPermanent()
Original file is still permanent.Otherfile.test624FileFieldRevisionTestCase->testRevisions()
Failed to set field revision to 1Otherfile.test628FileFieldRevisionTestCase->testRevisions()
Found the Save buttonOtherfile.test628FileFieldRevisionTestCase->testRevisions()
Found the requested form fields at node//editOtherfile.test628FileFieldRevisionTestCase->testRevisions()
array_flip(): Can only flip STRING and INTEGER values!Warningentity.inc167DrupalDefaultEntityController->load()
Trying to get property of non-objectNoticefile.test630FileFieldRevisionTestCase->testRevisions()
Trying to get property of non-objectNoticefile.test631FileFieldRevisionTestCase->testRevisions()
Undefined property: stdClass::$statusNoticefile.test207FileFieldTestCase->assertFileIsPermanent()
New revision file is permanent.Otherfile.test633FileFieldRevisionTestCase->testRevisions()
Found the Revert buttonOtherfile.test636FileFieldRevisionTestCase->testRevisions()
Found the requested form fields at node//revisions//revertOtherfile.test636FileFieldRevisionTestCase->testRevisions()
array_flip(): Can only flip STRING and INTEGER values!Warningentity.inc167DrupalDefaultEntityController->load()
Trying to get property of non-objectNoticefile.test638FileFieldRevisionTestCase->testRevisions()
Trying to get property of non-objectNoticefile.test639FileFieldRevisionTestCase->testRevisions()
Undefined property: stdClass::$statusNoticefile.test207FileFieldTestCase->assertFileIsPermanent()
Original revision file still permanent after reverting to the original revision.Otherfile.test641FileFieldRevisionTestCase->testRevisions()
Found the Delete buttonOtherfile.test645FileFieldRevisionTestCase->testRevisions()
Found the requested form fields at node//revisions//deleteOtherfile.test645FileFieldRevisionTestCase->testRevisions()
Undefined property: stdClass::$uriNoticefile.test172FileFieldTestCase->assertFileExists()
Second file is still available after deleting second revision, since it is being used by the third revision.Otherfile.test646FileFieldRevisionTestCase->testRevisions()
Undefined property: stdClass::$fidNoticefile.test180FileFieldTestCase->assertFileEntryExists()
array_flip(): Can only flip STRING and INTEGER values!Warningentity.inc167DrupalDefaultEntityController->load()
Trying to get property of non-objectNoticefile.test182FileFieldTestCase->assertFileEntryExists()
Undefined property: stdClass::$uriNoticefile.test182FileFieldTestCase->assertFileEntryExists()
Undefined property: stdClass::$statusNoticefile.test207FileFieldTestCase->assertFileIsPermanent()
Second file entry is still permanent after deleting second revision, since it is being used by the third revision.Otherfile.test648FileFieldRevisionTestCase->testRevisions()
Undefined index: fidNoticefile.field.inc223file_field_presave()
array_flip(): Can only flip STRING and INTEGER values!Warningentity.inc167DrupalDefaultEntityController->load()
Trying to get property of non-objectNoticefile.field.inc224file_field_presave()
Undefined property: stdClass::$uriNoticefile.inc575file_save()
Undefined index: fidNoticefile.field.inc265file_field_update()
Undefined index: fidNoticefile.field.inc286file_field_update()
Undefined property: stdClass::$fidNoticefile.inc649file_usage_add()
PDOException: SQLSTATE[23000]: Integrity constraint violation: 1048 Column 'fid' cannot be null: INSERT INTO {file_usage} (fid, module, type, id, count) VALUES (:db_insert_placeholder_0, :db_insert_placeholder_1, :db_insert_placeholder_2, :db_insert_placeholder_3, :db_insert_placeholder_4); Array ( [:db_insert_placeholder_0] => [:db_insert_placeholder_1] => file [:db_insert_placeholder_2] => user [:db_insert_placeholder_3] => 3 [:db_insert_placeholder_4] => 1 ) in file_usage_add() (line 656 of /var/lib/drupaltestbot/sites/default/files/checkout/includes/file.inc).Uncaught exceptiondatabase.inc1970PDOStatement->execute()
ExpandFile field validation tests (FileFieldValidateTestCase) [File]742956
MessageGroupFilenameLineFunctionStatus
Node save failed when required file field was empty.Otherfile.test761FileFieldValidateTestCase->testRequired()
Failed to set field files[xdh60d8g_und_0] to /var/lib/drupaltestbot/sites/default/files/checkout/sites/default/files/simpletest/352993/text-0.txtOtherfile.test132FileFieldTestCase->uploadNodeFile()
Found the requested form fields at node/add/articleOtherfile.test132FileFieldTestCase->uploadNodeFile()
uploadNodeFile(public://text-0.txt, xdh60d8g, article) succeededOtherfile.test765FileFieldValidateTestCase->testRequired()
array_flip(): Can only flip STRING and INTEGER values!Warningentity.inc167DrupalDefaultEntityController->load()
Trying to get property of non-objectNoticefile.test769FileFieldValidateTestCase->testRequired()
Undefined property: stdClass::$uriNoticefile.test172FileFieldTestCase->assertFileExists()
File exists after uploading to the required field.Otherfile.test770FileFieldValidateTestCase->testRequired()
Undefined property: stdClass::$fidNoticefile.test180FileFieldTestCase->assertFileEntryExists()
array_flip(): Can only flip STRING and INTEGER values!Warningentity.inc167DrupalDefaultEntityController->load()
Trying to get property of non-objectNoticefile.test182FileFieldTestCase->assertFileEntryExists()
Undefined property: stdClass::$uriNoticefile.test182FileFieldTestCase->assertFileEntryExists()
Node save failed when required multiple value file field was empty.Otherfile.test780FileFieldValidateTestCase->testRequired()
Failed to set field files[xdh60d8g_und_0] to /var/lib/drupaltestbot/sites/default/files/checkout/sites/default/files/simpletest/352993/text-0.txtOtherfile.test132FileFieldTestCase->uploadNodeFile()
Found the requested form fields at node/add/articleOtherfile.test132FileFieldTestCase->uploadNodeFile()
array_flip(): Can only flip STRING and INTEGER values!Warningentity.inc167DrupalDefaultEntityController->load()
Trying to get property of non-objectNoticefile.test785FileFieldValidateTestCase->testRequired()
Undefined property: stdClass::$uriNoticefile.test172FileFieldTestCase->assertFileExists()
File exists after uploading to the required multiple value field.Otherfile.test786FileFieldValidateTestCase->testRequired()
Undefined property: stdClass::$fidNoticefile.test180FileFieldTestCase->assertFileEntryExists()
array_flip(): Can only flip STRING and INTEGER values!Warningentity.inc167DrupalDefaultEntityController->load()
Trying to get property of non-objectNoticefile.test182FileFieldTestCase->assertFileEntryExists()
Undefined property: stdClass::$uriNoticefile.test182FileFieldTestCase->assertFileEntryExists()
array_flip(): Can only flip STRING and INTEGER values!Warningentity.inc167DrupalDefaultEntityController->load()
Trying to get property of non-objectNoticefile.test821FileFieldValidateTestCase->testFileMaxSize()
Undefined property: stdClass::$uriNoticefile.test172FileFieldTestCase->assertFileExists()
File exists after uploading a file (128 KB) under the max limit (1M).Otherfile.test822FileFieldValidateTestCase->testFileMaxSize()
Undefined property: stdClass::$fidNoticefile.test180FileFieldTestCase->assertFileEntryExists()
array_flip(): Can only flip STRING and INTEGER values!Warningentity.inc167DrupalDefaultEntityController->load()
Trying to get property of non-objectNoticefile.test182FileFieldTestCase->assertFileEntryExists()
Undefined property: stdClass::$uriNoticefile.test182FileFieldTestCase->assertFileEntryExists()
Failed to set field files[mhwabdc9_und_0] to /var/lib/drupaltestbot/sites/default/files/checkout/sites/default/files/simpletest/326735/text-4.txtOtherfile.test132FileFieldTestCase->uploadNodeFile()
Found the requested form fields at node/add/articleOtherfile.test132FileFieldTestCase->uploadNodeFile()
Node save failed when file (1.25 MB) exceeded the max upload size (1M).Otherfile.test828FileFieldValidateTestCase->testFileMaxSize()
Failed to set field files[mhwabdc9_und_0] to /var/lib/drupaltestbot/sites/default/files/checkout/sites/default/files/simpletest/326735/text-3.txtOtherfile.test132FileFieldTestCase->uploadNodeFile()
Found the requested form fields at node/add/articleOtherfile.test132FileFieldTestCase->uploadNodeFile()
array_flip(): Can only flip STRING and INTEGER values!Warningentity.inc167DrupalDefaultEntityController->load()
Trying to get property of non-objectNoticefile.test821FileFieldValidateTestCase->testFileMaxSize()
Undefined property: stdClass::$uriNoticefile.test172FileFieldTestCase->assertFileExists()
File exists after uploading a file (128 KB) under the max limit (1024K).Otherfile.test822FileFieldValidateTestCase->testFileMaxSize()
Undefined property: stdClass::$fidNoticefile.test180FileFieldTestCase->assertFileEntryExists()
array_flip(): Can only flip STRING and INTEGER values!Warningentity.inc167DrupalDefaultEntityController->load()
Trying to get property of non-objectNoticefile.test182FileFieldTestCase->assertFileEntryExists()
Undefined property: stdClass::$uriNoticefile.test182FileFieldTestCase->assertFileEntryExists()
Failed to set field files[mhwabdc9_und_0] to /var/lib/drupaltestbot/sites/default/files/checkout/sites/default/files/simpletest/326735/text-4.txtOtherfile.test132FileFieldTestCase->uploadNodeFile()
Found the requested form fields at node/add/articleOtherfile.test132FileFieldTestCase->uploadNodeFile()
Node save failed when file (1.25 MB) exceeded the max upload size (1024K).Otherfile.test828FileFieldValidateTestCase->testFileMaxSize()
Failed to set field files[mhwabdc9_und_0] to /var/lib/drupaltestbot/sites/default/files/checkout/sites/default/files/simpletest/326735/text-3.txtOtherfile.test132FileFieldTestCase->uploadNodeFile()
Found the requested form fields at node/add/articleOtherfile.test132FileFieldTestCase->uploadNodeFile()
array_flip(): Can only flip STRING and INTEGER values!Warningentity.inc167DrupalDefaultEntityController->load()
Trying to get property of non-objectNoticefile.test821FileFieldValidateTestCase->testFileMaxSize()
Undefined property: stdClass::$uriNoticefile.test172FileFieldTestCase->assertFileExists()
File exists after uploading a file (128 KB) under the max limit (1048576).Otherfile.test822FileFieldValidateTestCase->testFileMaxSize()
Undefined property: stdClass::$fidNoticefile.test180FileFieldTestCase->assertFileEntryExists()
array_flip(): Can only flip STRING and INTEGER values!Warningentity.inc167DrupalDefaultEntityController->load()
Trying to get property of non-objectNoticefile.test182FileFieldTestCase->assertFileEntryExists()
Undefined property: stdClass::$uriNoticefile.test182FileFieldTestCase->assertFileEntryExists()
Failed to set field files[mhwabdc9_und_0] to /var/lib/drupaltestbot/sites/default/files/checkout/sites/default/files/simpletest/326735/text-4.txtOtherfile.test132FileFieldTestCase->uploadNodeFile()
Found the requested form fields at node/add/articleOtherfile.test132FileFieldTestCase->uploadNodeFile()
Node save failed when file (1.25 MB) exceeded the max upload size (1048576).Otherfile.test828FileFieldValidateTestCase->testFileMaxSize()
array_flip(): Can only flip STRING and INTEGER values!Warningentity.inc167DrupalDefaultEntityController->load()
Trying to get property of non-objectNoticefile.test837FileFieldValidateTestCase->testFileMaxSize()
Undefined property: stdClass::$uriNoticefile.test172FileFieldTestCase->assertFileExists()
File exists after uploading a file (1.25 MB) with no max limit.Otherfile.test838FileFieldValidateTestCase->testFileMaxSize()
Undefined property: stdClass::$fidNoticefile.test180FileFieldTestCase->assertFileEntryExists()
array_flip(): Can only flip STRING and INTEGER values!Warningentity.inc167DrupalDefaultEntityController->load()
Trying to get property of non-objectNoticefile.test182FileFieldTestCase->assertFileEntryExists()
Undefined property: stdClass::$uriNoticefile.test182FileFieldTestCase->assertFileEntryExists()
array_flip(): Can only flip STRING and INTEGER values!Warningentity.inc167DrupalDefaultEntityController->load()
Trying to get property of non-objectNoticefile.test864FileFieldValidateTestCase->testFileExtension()
Undefined property: stdClass::$uriNoticefile.test172FileFieldTestCase->assertFileExists()
File exists after uploading a file with no extension checking.Otherfile.test865FileFieldValidateTestCase->testFileExtension()
Undefined property: stdClass::$fidNoticefile.test180FileFieldTestCase->assertFileEntryExists()
array_flip(): Can only flip STRING and INTEGER values!Warningentity.inc167DrupalDefaultEntityController->load()
Trying to get property of non-objectNoticefile.test182FileFieldTestCase->assertFileEntryExists()
Undefined property: stdClass::$uriNoticefile.test182FileFieldTestCase->assertFileEntryExists()
Node save failed when file uploaded with the wrong extension.Otherfile.test874FileFieldValidateTestCase->testFileExtension()
array_flip(): Can only flip STRING and INTEGER values!Warningentity.inc167DrupalDefaultEntityController->load()
Trying to get property of non-objectNoticefile.test882FileFieldValidateTestCase->testFileExtension()
Undefined property: stdClass::$uriNoticefile.test172FileFieldTestCase->assertFileExists()
File exists after uploading a file with extension checking.Otherfile.test883FileFieldValidateTestCase->testFileExtension()
Undefined property: stdClass::$fidNoticefile.test180FileFieldTestCase->assertFileEntryExists()
array_flip(): Can only flip STRING and INTEGER values!Warningentity.inc167DrupalDefaultEntityController->load()
Trying to get property of non-objectNoticefile.test182FileFieldTestCase->assertFileEntryExists()
Undefined property: stdClass::$uriNoticefile.test182FileFieldTestCase->assertFileEntryExists()
ExpandFile field widget test (FileFieldWidgetTestCase) [File]1455554
MessageGroupFilenameLineFunctionStatus
array_flip(): Can only flip STRING and INTEGER values!Warningentity.inc167DrupalDefaultEntityController->load()
Trying to get property of non-objectNoticefile.test336FileFieldWidgetTestCase->testSingleValuedWidget()
Undefined property: stdClass::$uriNoticefile.test172FileFieldTestCase->assertFileExists()
New file saved to disk on node creation.Otherfile.test337FileFieldWidgetTestCase->testSingleValuedWidget()
Undefined property: stdClass::$uriNoticefile.test340FileFieldWidgetTestCase->testSingleValuedWidget()
Node with file displays the "Remove" button.Otherfile.test346FileFieldWidgetTestCase->testSingleValuedWidget()
Found the Remove buttonOtherfile.test351FileFieldWidgetTestCase->testSingleValuedWidget()
Found the requested form fields at Otherfile.test351FileFieldWidgetTestCase->testSingleValuedWidget()
After clicking the "Remove" button, the "Upload" button is displayed.Otherfile.test361FileFieldWidgetTestCase->testSingleValuedWidget()
Found the Save buttonOtherfile.test364FileFieldWidgetTestCase->testSingleValuedWidget()
Found the requested form fields at Otherfile.test364FileFieldWidgetTestCase->testSingleValuedWidget()
array_flip(): Can only flip STRING and INTEGER values!Warningentity.inc167DrupalDefaultEntityController->load()
Failed to set field files[ertrmkzs_und_0] to /var/lib/drupaltestbot/sites/default/files/checkout/sites/default/files/simpletest/272210/text-0.txtOtherfile.test132FileFieldTestCase->uploadNodeFile()
Found the requested form fields at node/add/pageOtherfile.test132FileFieldTestCase->uploadNodeFile()
array_flip(): Can only flip STRING and INTEGER values!Warningentity.inc167DrupalDefaultEntityController->load()
Trying to get property of non-objectNoticefile.test336FileFieldWidgetTestCase->testSingleValuedWidget()
Undefined property: stdClass::$uriNoticefile.test172FileFieldTestCase->assertFileExists()
New file saved to disk on node creation.Otherfile.test337FileFieldWidgetTestCase->testSingleValuedWidget()
Undefined property: stdClass::$uriNoticefile.test340FileFieldWidgetTestCase->testSingleValuedWidget()
Node with file displays the "Remove" button.Otherfile.test346FileFieldWidgetTestCase->testSingleValuedWidget()
Undefined offset: 0Noticefile.test355FileFieldWidgetTestCase->testSingleValuedWidget()
Undefined offset: 0Noticefile.test355FileFieldWidgetTestCase->testSingleValuedWidget()
Undefined offset: 0Noticedrupal_web_test_case.php1826DrupalWebTestCase->drupalPostAJAX()
Undefined index: ajaxNoticedrupal_web_test_case.php1827DrupalWebTestCase->drupalPostAJAX()
Found the requested form fields at Otherfile.test355FileFieldWidgetTestCase->testSingleValuedWidget()
After clicking the "Remove" button, the "Upload" button is displayed.Otherfile.test361FileFieldWidgetTestCase->testSingleValuedWidget()
Found the Save buttonOtherfile.test364FileFieldWidgetTestCase->testSingleValuedWidget()
Found the requested form fields at Otherfile.test364FileFieldWidgetTestCase->testSingleValuedWidget()
array_flip(): Can only flip STRING and INTEGER values!Warningentity.inc167DrupalDefaultEntityController->load()
simplexml_import_dom(): Invalid Nodetype to importWarningdrupal_web_test_case.php1593DrupalWebTestCase->parse()
Parsed page successfully.Browserfile.test397FileFieldWidgetTestCase->testMultiValuedWidget()
simplexml_import_dom(): Invalid Nodetype to importWarningdrupal_web_test_case.php1593DrupalWebTestCase->parse()
Parsed page successfully.Browserfile.test397FileFieldWidgetTestCase->testMultiValuedWidget()
simplexml_import_dom(): Invalid Nodetype to importWarningdrupal_web_test_case.php1593DrupalWebTestCase->parse()
Parsed page successfully.Browserfile.test399FileFieldWidgetTestCase->testMultiValuedWidget()
simplexml_import_dom(): Invalid Nodetype to importWarningdrupal_web_test_case.php1593DrupalWebTestCase->parse()
Parsed page successfully.Browserfile.test411FileFieldWidgetTestCase->testMultiValuedWidget()
There are 3 "Remove" buttons displayed (JSMode=nojs).Otherfile.test412FileFieldWidgetTestCase->testMultiValuedWidget()
Invalid argument supplied for foreach()Warningfile.test413FileFieldWidgetTestCase->testMultiValuedWidget()
Invalid argument supplied for foreach()Warningfile.test428FileFieldWidgetTestCase->testMultiValuedWidget()
simplexml_import_dom(): Invalid Nodetype to importWarningdrupal_web_test_case.php1593DrupalWebTestCase->parse()
Parsed page successfully.Browserfile.test433FileFieldWidgetTestCase->testMultiValuedWidget()
simplexml_import_dom(): Invalid Nodetype to importWarningdrupal_web_test_case.php1593DrupalWebTestCase->parse()
Parsed page successfully.Browserfile.test445FileFieldWidgetTestCase->testMultiValuedWidget()
After removing a file, an "Upload" button is displayed (JSMode=%type).Otherfile.test446FileFieldWidgetTestCase->testMultiValuedWidget()
simplexml_import_dom(): Invalid Nodetype to importWarningdrupal_web_test_case.php1593DrupalWebTestCase->parse()
Parsed page successfully.Browserfile.test411FileFieldWidgetTestCase->testMultiValuedWidget()
There are 2 "Remove" buttons displayed (JSMode=nojs).Otherfile.test412FileFieldWidgetTestCase->testMultiValuedWidget()
Invalid argument supplied for foreach()Warningfile.test413FileFieldWidgetTestCase->testMultiValuedWidget()
Invalid argument supplied for foreach()Warningfile.test428FileFieldWidgetTestCase->testMultiValuedWidget()
simplexml_import_dom(): Invalid Nodetype to importWarningdrupal_web_test_case.php1593DrupalWebTestCase->parse()
Parsed page successfully.Browserfile.test433FileFieldWidgetTestCase->testMultiValuedWidget()
simplexml_import_dom(): Invalid Nodetype to importWarningdrupal_web_test_case.php1593DrupalWebTestCase->parse()
Parsed page successfully.Browserfile.test445FileFieldWidgetTestCase->testMultiValuedWidget()
After removing a file, an "Upload" button is displayed (JSMode=%type).Otherfile.test446FileFieldWidgetTestCase->testMultiValuedWidget()
simplexml_import_dom(): Invalid Nodetype to importWarningdrupal_web_test_case.php1593DrupalWebTestCase->parse()
Parsed page successfully.Browserfile.test411FileFieldWidgetTestCase->testMultiValuedWidget()
There are 1 "Remove" buttons displayed (JSMode=nojs).Otherfile.test412FileFieldWidgetTestCase->testMultiValuedWidget()
Invalid argument supplied for foreach()Warningfile.test413FileFieldWidgetTestCase->testMultiValuedWidget()
Invalid argument supplied for foreach()Warningfile.test428FileFieldWidgetTestCase->testMultiValuedWidget()
simplexml_import_dom(): Invalid Nodetype to importWarningdrupal_web_test_case.php1593DrupalWebTestCase->parse()
Parsed page successfully.Browserfile.test433FileFieldWidgetTestCase->testMultiValuedWidget()
simplexml_import_dom(): Invalid Nodetype to importWarningdrupal_web_test_case.php1593DrupalWebTestCase->parse()
Parsed page successfully.Browserfile.test445FileFieldWidgetTestCase->testMultiValuedWidget()
After removing a file, an "Upload" button is displayed (JSMode=%type).Otherfile.test446FileFieldWidgetTestCase->testMultiValuedWidget()
simplexml_import_dom(): Invalid Nodetype to importWarningdrupal_web_test_case.php1593DrupalWebTestCase->parse()
Parsed page successfully.Browserfile.test450FileFieldWidgetTestCase->testMultiValuedWidget()
simplexml_import_dom(): Invalid Nodetype to importWarningdrupal_web_test_case.php1593DrupalWebTestCase->parse()
Parsed page successfully.Browserfile.test453FileFieldWidgetTestCase->testMultiValuedWidget()
Undefined offset: 1Noticefile.test456FileFieldWidgetTestCase->testMultiValuedWidget()
Failed to set field files[nji6saxr_und_0] to /var/lib/drupaltestbot/sites/default/files/checkout/sites/default/files/simpletest/814519/text-0.txtOtherfile.test397FileFieldWidgetTestCase->testMultiValuedWidget()
Found the Upload buttonOtherfile.test397FileFieldWidgetTestCase->testMultiValuedWidget()
Found the requested form fields at Otherfile.test397FileFieldWidgetTestCase->testMultiValuedWidget()
Failed to set field files[nji6saxr_und_1] to /var/lib/drupaltestbot/sites/default/files/checkout/sites/default/files/simpletest/814519/text-0.txtOtherfile.test397FileFieldWidgetTestCase->testMultiValuedWidget()
Found the Upload buttonOtherfile.test397FileFieldWidgetTestCase->testMultiValuedWidget()
Found the requested form fields at Otherfile.test397FileFieldWidgetTestCase->testMultiValuedWidget()
Failed to set field files[nji6saxr_und_2] to /var/lib/drupaltestbot/sites/default/files/checkout/sites/default/files/simpletest/814519/text-0.txtOtherfile.test397FileFieldWidgetTestCase->testMultiValuedWidget()
Found the Upload buttonOtherfile.test397FileFieldWidgetTestCase->testMultiValuedWidget()
Found the requested form fields at Otherfile.test397FileFieldWidgetTestCase->testMultiValuedWidget()
There are 3 "Remove" buttons displayed (JSMode=js).Otherfile.test412FileFieldWidgetTestCase->testMultiValuedWidget()
Undefined offset: 0Noticedrupal_web_test_case.php1826DrupalWebTestCase->drupalPostAJAX()
Undefined index: ajaxNoticedrupal_web_test_case.php1827DrupalWebTestCase->drupalPostAJAX()
After removing a file, an "Upload" button is displayed (JSMode=%type).Otherfile.test446FileFieldWidgetTestCase->testMultiValuedWidget()
There are 2 "Remove" buttons displayed (JSMode=js).Otherfile.test412FileFieldWidgetTestCase->testMultiValuedWidget()
Undefined offset: 0Noticedrupal_web_test_case.php1826DrupalWebTestCase->drupalPostAJAX()
Undefined index: ajaxNoticedrupal_web_test_case.php1827DrupalWebTestCase->drupalPostAJAX()
After removing a file, an "Upload" button is displayed (JSMode=%type).Otherfile.test446FileFieldWidgetTestCase->testMultiValuedWidget()
There are 1 "Remove" buttons displayed (JSMode=js).Otherfile.test412FileFieldWidgetTestCase->testMultiValuedWidget()
Undefined offset: 0Noticedrupal_web_test_case.php1826DrupalWebTestCase->drupalPostAJAX()
Undefined index: ajaxNoticedrupal_web_test_case.php1827DrupalWebTestCase->drupalPostAJAX()
After removing a file, an "Upload" button is displayed (JSMode=%type).Otherfile.test446FileFieldWidgetTestCase->testMultiValuedWidget()
array_flip(): Can only flip STRING and INTEGER values!Warningentity.inc167DrupalDefaultEntityController->load()
Trying to get property of non-objectNoticefile.test483FileFieldWidgetTestCase->testPrivateFileSetting()
Undefined property: stdClass::$uriNoticefile.test172FileFieldTestCase->assertFileExists()
New file saved to disk on node creation.Otherfile.test484FileFieldWidgetTestCase->testPrivateFileSetting()
Undefined property: stdClass::$uriNoticefile.test487FileFieldWidgetTestCase->testPrivateFileSetting()
Upload destination setting disabled.Otherfile.test493FileFieldWidgetTestCase->testPrivateFileSetting()
array_flip(): Can only flip STRING and INTEGER values!Warningentity.inc167DrupalDefaultEntityController->load()
simplexml_import_dom(): Invalid Nodetype to importWarningdrupal_web_test_case.php1593DrupalWebTestCase->parse()
Parsed page successfully.Browserfile.test538FileFieldWidgetTestCase->testPrivateFileComment()
Undefined offset: 1Noticefile.test542FileFieldWidgetTestCase->testPrivateFileComment()
array_flip(): Can only flip STRING and INTEGER values!Warningentity.inc167DrupalDefaultEntityController->load()
Trying to get property of non-objectNoticefile.test548FileFieldWidgetTestCase->testPrivateFileComment()
Undefined property: stdClass::$uriNoticefile.test172FileFieldTestCase->assertFileExists()
New file saved to disk on node creation.Otherfile.test549FileFieldWidgetTestCase->testPrivateFileComment()
Undefined property: stdClass::$uriNoticefile.test551FileFieldWidgetTestCase->testPrivateFileComment()
Undefined property: stdClass::$uriNoticefile.test553FileFieldWidgetTestCase->testPrivateFileComment()
Undefined property: stdClass::$uriNoticefile.test558FileFieldWidgetTestCase->testPrivateFileComment()
Confirmed that access is denied for the file without the needed permission.Browserfile.test559FileFieldWidgetTestCase->testPrivateFileComment()
ExpandFile token replacement (FileTokenReplaceTestCase) [File]27753
MessageGroupFilenameLineFunctionStatus
array_flip(): Can only flip STRING and INTEGER values!Warningentity.inc167DrupalDefaultEntityController->load()
Trying to get property of non-objectNoticefile.test1005FileTokenReplaceTestCase->testFileTokenReplacement()
Undefined property: stdClass::$fidNoticefile.test1010FileTokenReplaceTestCase->testFileTokenReplacement()
Undefined property: stdClass::$filenameNoticefile.test1011FileTokenReplaceTestCase->testFileTokenReplacement()
Undefined property: stdClass::$uriNoticefile.test1013FileTokenReplaceTestCase->testFileTokenReplacement()
Undefined property: stdClass::$filemimeNoticefile.test1014FileTokenReplaceTestCase->testFileTokenReplacement()
Undefined property: stdClass::$filesizeNoticefile.test1015FileTokenReplaceTestCase->testFileTokenReplacement()
Undefined property: stdClass::$uriNoticefile.test1016FileTokenReplaceTestCase->testFileTokenReplacement()
Undefined property: stdClass::$timestampNoticefile.test1017FileTokenReplaceTestCase->testFileTokenReplacement()
date_timezone_set() expects parameter 1 to be DateTime, boolean givenWarningcommon.inc1882format_date()
date_format() expects parameter 1 to be DateTime, boolean givenWarningcommon.inc1892format_date()
Undefined property: stdClass::$timestampNoticefile.test1018FileTokenReplaceTestCase->testFileTokenReplacement()
date_timezone_set() expects parameter 1 to be DateTime, boolean givenWarningcommon.inc1882format_date()
date_format() expects parameter 1 to be DateTime, boolean givenWarningcommon.inc1892format_date()
Undefined property: stdClass::$uidNoticefile.test1020FileTokenReplaceTestCase->testFileTokenReplacement()
No empty tokens generated.Otherfile.test1023FileTokenReplaceTestCase->testFileTokenReplacement()
Undefined property: stdClass::$fidNoticesystem.tokens.inc224system_tokens()
Undefined property: stdClass::$filenameNoticesystem.tokens.inc229system_tokens()
Undefined property: stdClass::$uriNoticesystem.tokens.inc237system_tokens()
Undefined property: stdClass::$filemimeNoticesystem.tokens.inc241system_tokens()
Undefined property: stdClass::$filesizeNoticesystem.tokens.inc245system_tokens()
Undefined property: stdClass::$uriNoticesystem.tokens.inc249system_tokens()
Undefined property: stdClass::$timestampNoticesystem.tokens.inc254system_tokens()
date_timezone_set() expects parameter 1 to be DateTime, boolean givenWarningcommon.inc1882format_date()
date_format() expects parameter 1 to be DateTime, boolean givenWarningcommon.inc1892format_date()
Undefined property: stdClass::$timestampNoticesystem.tokens.inc265system_tokens()
Sanitized file token [file:timestamp:short] replaced.Otherfile.test1027FileTokenReplaceTestCase->testFileTokenReplacement()
Undefined property: stdClass::$uidNoticesystem.tokens.inc258system_tokens()
array_flip(): Can only flip STRING and INTEGER values!Warningentity.inc167DrupalDefaultEntityController->load()
array_flip(): Can only flip STRING and INTEGER values!Warningentity.inc343DrupalDefaultEntityController->cacheGet()
Trying to get property of non-objectNoticesystem.tokens.inc259system_tokens()
Sanitized file token [file:owner] replaced.Otherfile.test1027FileTokenReplaceTestCase->testFileTokenReplacement()
Undefined property: stdClass::$uidNoticesystem.tokens.inc268system_tokens()
array_flip(): Can only flip STRING and INTEGER values!Warningentity.inc167DrupalDefaultEntityController->load()
array_flip(): Can only flip STRING and INTEGER values!Warningentity.inc343DrupalDefaultEntityController->cacheGet()
Sanitized file token [file:owner:uid] replaced.Otherfile.test1027FileTokenReplaceTestCase->testFileTokenReplacement()
Undefined property: stdClass::$filenameNoticefile.test1031FileTokenReplaceTestCase->testFileTokenReplacement()
Undefined property: stdClass::$uriNoticefile.test1033FileTokenReplaceTestCase->testFileTokenReplacement()
Undefined property: stdClass::$filemimeNoticefile.test1034FileTokenReplaceTestCase->testFileTokenReplacement()
Undefined property: stdClass::$filesizeNoticefile.test1035FileTokenReplaceTestCase->testFileTokenReplacement()
Undefined property: stdClass::$fidNoticesystem.tokens.inc224system_tokens()
Undefined property: stdClass::$filenameNoticesystem.tokens.inc229system_tokens()
Undefined property: stdClass::$uriNoticesystem.tokens.inc237system_tokens()
Undefined property: stdClass::$filemimeNoticesystem.tokens.inc241system_tokens()
Undefined property: stdClass::$filesizeNoticesystem.tokens.inc245system_tokens()
Undefined property: stdClass::$uriNoticesystem.tokens.inc249system_tokens()
Undefined property: stdClass::$timestampNoticesystem.tokens.inc254system_tokens()
date_timezone_set() expects parameter 1 to be DateTime, boolean givenWarningcommon.inc1882format_date()
date_format() expects parameter 1 to be DateTime, boolean givenWarningcommon.inc1892format_date()
Undefined property: stdClass::$timestampNoticesystem.tokens.inc265system_tokens()
Unsanitized file token [file:timestamp:short] replaced.Otherfile.test1039FileTokenReplaceTestCase->testFileTokenReplacement()
Undefined property: stdClass::$uidNoticesystem.tokens.inc258system_tokens()
array_flip(): Can only flip STRING and INTEGER values!Warningentity.inc167DrupalDefaultEntityController->load()
array_flip(): Can only flip STRING and INTEGER values!Warningentity.inc343DrupalDefaultEntityController->cacheGet()
Trying to get property of non-objectNoticesystem.tokens.inc259system_tokens()
Unsanitized file token [file:owner] replaced.Otherfile.test1039FileTokenReplaceTestCase->testFileTokenReplacement()
Undefined property: stdClass::$uidNoticesystem.tokens.inc268system_tokens()
array_flip(): Can only flip STRING and INTEGER values!Warningentity.inc167DrupalDefaultEntityController->load()
array_flip(): Can only flip STRING and INTEGER values!Warningentity.inc343DrupalDefaultEntityController->cacheGet()
Unsanitized file token [file:owner:uid] replaced.Otherfile.test1039FileTokenReplaceTestCase->testFileTokenReplacement()
ExpandImage field display tests (ImageFieldDisplayTestCase) [Image]1752
MessageGroupFilenameLineFunctionStatus
The test did not complete due to a fatal error.Completion checkimage.test625ImageFieldDisplayTestCase->testImageFieldFormattersPublic()
array_flip(): Can only flip STRING and INTEGER values!Warningentity.inc167DrupalDefaultEntityController->load()
Trying to get property of non-objectNoticeimage.test650ImageFieldDisplayTestCase->_testImageFieldFormatters()
Default formatter displaying correctly on full node view.Otherimage.test655ImageFieldDisplayTestCase->_testImageFieldFormatters()
Image linked to file formatter displaying correctly on full node view.Otherimage.test664ImageFieldDisplayTestCase->_testImageFieldFormatters()
File was downloaded successfully.Otherimage.test666ImageFieldDisplayTestCase->_testImageFieldFormatters()
Image linked to content formatter displaying correctly on full node view.Otherimage.test688ImageFieldDisplayTestCase->_testImageFieldFormatters()
ExpandImage field validation tests (ImageFieldValidateTestCase) [Image]1440
MessageGroupFilenameLineFunctionStatus
Node save failed when minimum image resolution was not met.Otherimage.test863ImageFieldValidateTestCase->testResolution()
Failed to set field files[wdxbwihh_und_0] to /var/lib/drupaltestbot/sites/default/files/checkout/sites/default/files/simpletest/492469/image-1.pngOtherimage.test98ImageFieldTestCase->uploadNodeImage()
Found the requested form fields at node/add/articleOtherimage.test98ImageFieldTestCase->uploadNodeImage()
Image exceeding max resolution was properly resized.Otherimage.test865ImageFieldValidateTestCase->testResolution()
ExpandImage styles and effects UI configuration (ImageAdminStylesUnitTest) [Image]14912
MessageGroupFilenameLineFunctionStatus
The test did not complete due to a fatal error.Completion checkimage.test565ImageAdminStylesUnitTest->testStyleReplacement()
array_flip(): Can only flip STRING and INTEGER values!Warningentity.inc167DrupalDefaultEntityController->load()
Trying to get property of non-objectNoticeimage.test585ImageAdminStylesUnitTest->testStyleReplacement()
ExpandMain content rendering fallback (SystemMainContentFallback) [System]6603
MessageGroupFilenameLineFunctionStatus
Undefined index: moduleNoticefield.info.inc385_field_info_prepare_instance_widget()
Undefined index: moduleNoticefield.info.inc353_field_info_prepare_instance_display()
Undefined index: moduleNoticefield.info.inc353_field_info_prepare_instance_display()
ExpandRDFa markup (RdfRdfaMarkupTestCase) [RDF]1820
MessageGroupFilenameLineFunctionStatus
Attribute 'rel' set on file field. Attribute 'resource' is also set.Otherrdf.test183RdfRdfaMarkupTestCase->testAttributesInMarkupFile()
Attribute 'rel' set on image field. Attribute 'resource' is also set.Otherrdf.test189RdfRdfaMarkupTestCase->testAttributesInMarkupFile()
ExpandTaxonomy term functions and forms. (TaxonomyTermTestCase) [Taxonomy]157165
MessageGroupFilenameLineFunctionStatus
Trying to get property of non-objectNoticetaxonomy.test485TaxonomyTermTestCase->testTaxonomyNode()
Term is displayed when viewing the node.Othertaxonomy.test486TaxonomyTermTestCase->testTaxonomyNode()
Trying to get property of non-objectNoticetaxonomy.test490TaxonomyTermTestCase->testTaxonomyNode()
Failed to set field title to rRg4irNVOthertaxonomy.test490TaxonomyTermTestCase->testTaxonomyNode()
Failed to set field body[und][0][value] to yNM9SXAMOthertaxonomy.test490TaxonomyTermTestCase->testTaxonomyNode()
Failed to set field taxonomy_qikiajry[und][] to 2Othertaxonomy.test490TaxonomyTermTestCase->testTaxonomyNode()
Found the Save buttonOthertaxonomy.test490TaxonomyTermTestCase->testTaxonomyNode()
Found the requested form fields at node//editOthertaxonomy.test490TaxonomyTermTestCase->testTaxonomyNode()
Trying to get property of non-objectNoticetaxonomy.test492TaxonomyTermTestCase->testTaxonomyNode()
Term is displayed when viewing the node.Othertaxonomy.test493TaxonomyTermTestCase->testTaxonomyNode()
Trying to get property of non-objectNoticetaxonomy.test496TaxonomyTermTestCase->testTaxonomyNode()
Failed to set field title to rRg4irNVOthertaxonomy.test496TaxonomyTermTestCase->testTaxonomyNode()
Failed to set field body[und][0][value] to yNM9SXAMOthertaxonomy.test496TaxonomyTermTestCase->testTaxonomyNode()
Failed to set field taxonomy_qikiajry[und][] to 2Othertaxonomy.test496TaxonomyTermTestCase->testTaxonomyNode()
Found the Preview buttonOthertaxonomy.test496TaxonomyTermTestCase->testTaxonomyNode()
Found the requested form fields at node//editOthertaxonomy.test496TaxonomyTermTestCase->testTaxonomyNode()
Term is displayed when previewing the node.Othertaxonomy.test497TaxonomyTermTestCase->testTaxonomyNode()
Invalid argument supplied for foreach()Warningdrupal_web_test_case.php1786DrupalWebTestCase->drupalPost()
Found the Preview buttonOthertaxonomy.test498TaxonomyTermTestCase->testTaxonomyNode()
Found the requested form fields at Othertaxonomy.test498TaxonomyTermTestCase->testTaxonomyNode()
Term is displayed when previewing the node again.Othertaxonomy.test499TaxonomyTermTestCase->testTaxonomyNode()
ExpandTaxonomy token replacement (TaxonomyTokenReplaceTestCase) [Taxonomy]4840
MessageGroupFilenameLineFunctionStatus
Sanitized taxonomy term token [term:node-count] replaced.Othertaxonomy.test1094TaxonomyTokenReplaceTestCase->testTaxonomyTokenReplacement()
Unsanitized taxonomy term token [term:node-count] replaced.Othertaxonomy.test1105TaxonomyTokenReplaceTestCase->testTaxonomyTokenReplacement()
Sanitized taxonomy vocabulary token [vocabulary:node-count] replaced.Othertaxonomy.test1121TaxonomyTokenReplaceTestCase->testTaxonomyTokenReplacement()
Unsanitized taxonomy vocabulary token [vocabulary:node-count] replaced.Othertaxonomy.test1130TaxonomyTokenReplaceTestCase->testTaxonomyTokenReplacement()
ExpandText summary (TextSummaryTestCase) [Field types]13611
MessageGroupFilenameLineFunctionStatus
Trying to get property of non-objectNoticetext.test400TextSummaryTestCase->testOnlyTextSummary()
Article with with summary and no body has been submitted.Othertext.test400TextSummaryTestCase->testOnlyTextSummary()
ExpandText translation (TextTranslationTestCase) [Field types]9923
MessageGroupFilenameLineFunctionStatus
Trying to get property of non-objectNoticetext.test461TextTranslationTestCase->testTextField()
Undefined variable: url_targetNoticedrupal_web_test_case.php2330DrupalWebTestCase->clickLink()
Clicked link add translation () from http://201011081733-pifr-mysql/checkout/?q=node//translateBrowsertext.test462TextTranslationTestCase->testTextField()
The textfield widget is populated.Othertext.test463TextTranslationTestCase->testTextField()
Undefined property: stdClass::$field_imageNoticelocale.module410locale_field_node_form_submit()
ExpandUpdate on cron functionality (AggregatorCronTestCase) [Aggregator]4930
MessageGroupFilenameLineFunctionStatus
Expected number of items in database.Otheraggregator.test725AggregatorCronTestCase->testCron()
Expected number of items in database.Otheraggregator.test729AggregatorCronTestCase->testCron()
Expected number of items in database.Otheraggregator.test748AggregatorCronTestCase->testCron()

All

Test namePassFailException
Leaf403 functionality (AccessDeniedTestCase) [System]7500
Leaf404 functionality (PageNotFoundTestCase) [System]1800
LeafActions configuration (ActionsConfigurationTestCase) [Actions]3800
LeafActions executing in a potentially infinite loop (ActionLoopTestCase) [Actions]2600
LeafAdd feed functionality (AddFeedTestCase) [Aggregator]2800
LeafAdmin theme block admin accessibility (BlockAdminThemeTestCase) [Block]1800
LeafAdministrative pages (SystemAdminTestCase) [System]19100
LeafAdvanced search form (SearchAdvancedSearchForm) [Search]3100
LeafAJAX command form values (AJAXFormValuesTestCase) [AJAX]2800
LeafAJAX commands (AJAXCommandsTestCase) [AJAX]6400
LeafAJAX framework (AJAXFrameworkTestCase) [AJAX]1000
LeafAJAX multi form (AJAXMultiFormTestCase) [AJAX]3500
LeafAnonymous comments (CommentAnonymous) [Comment]15600
LeafAuthmap assignment (UserAuthmapAssignmentTestCase) [User]800
LeafAutocompletion (ProfileTestAutocomplete) [Profile]5400
LeafBasic SQL syntax tests (DatabaseBasicSyntaxTestCase) [Database]2600
LeafBasic upgrade path (BasicUpgradePath) [Upgrade path]7400
LeafBatch percentages (BatchPercentagesUnitTestCase) [Batch API]1300
LeafBatch processing (BatchProcessingTestCase) [Batch API]15400
LeafBatch progress page (BatchPageTestCase) [Batch API]700
LeafBlock availability (NodeBlockTestCase) [Node]1800
LeafBlock availability (PollBlockTestCase) [Poll]11800
LeafBlock availability (ProfileBlockTestCase) [Profile]9000
LeafBlock availability (SearchBlockTestCase) [Search]5100
LeafBlock caching (BlockCacheTestCase) [Block]22800
LeafBlock functionality (BlockTestCase) [Block]26800
LeafBlock functionality (SystemBlockTestCase) [System]3400
LeafBlock HTML id (BlockHTMLIdTestCase) [Block]1500
LeafBlog functionality (BlogTestCase) [Blog]24100
LeafBook functionality (BookTestCase) [Book]34600
LeafBoot and exit hook invocation (HookBootExitTestCase) [Bootstrap]1800
LeafBreadcrumbs (MenuBreadcrumbTestCase) [Menu]41000
LeafCache clear test (CacheClearCase) [Cache]1300
LeafCache emptiness test (CacheIsEmptyCase) [Cache]500
LeafCache saving test (CacheSavingCase) [Cache]500
LeafCancel account (UserCancelTestCase) [User]23700
LeafCascading stylesheets (CascadingStylesheetsTestCase) [System]2500
LeafCategorize feed functionality (CategorizeFeedTestCase) [Aggregator]1900
LeafCategorize feed item functionality (CategorizeFeedItemTestCase) [Aggregator]5200
LeafChecks display of aggregator items (AggregatorRenderingTestCase) [Aggregator]6700
LeafCJK tokenizer (SearchTokenizerTestCase) [Search]300
LeafColor functionality (ColorTestCase) [Color]6700
LeafComment approval (CommentApprovalTest) [Comment]15400
LeafComment blocks (CommentBlockFunctionalTest) [Comment]11500
LeafComment count toggle (SearchCommentCountToggleTestCase) [Search]3000
LeafComment interface (CommentInterfaceTest) [Comment]32300
ExpandComment language (LocaleCommentLanguageFunctionalTest) [Locale]4589
MessageGroupFilenameLineFunctionStatus
Trying to get property of non-objectNoticelocale.test2218LocaleCommentLanguageFunctionalTest->testCommentLanguage()
Failed to set field comment_body[und][0][value] to qjGCA875Otherlocale.test2218LocaleCommentLanguageFunctionalTest->testCommentLanguage()
Found the Save buttonOtherlocale.test2218LocaleCommentLanguageFunctionalTest->testCommentLanguage()
Found the requested form fields at node/Otherlocale.test2218LocaleCommentLanguageFunctionalTest->testCommentLanguage()
Trying to get property of non-objectNoticelocale.test2223LocaleCommentLanguageFunctionalTest->testCommentLanguage()
Trying to get property of non-objectNoticelocale.test2227LocaleCommentLanguageFunctionalTest->testCommentLanguage()
Trying to get property of non-objectNoticelocale.test2228LocaleCommentLanguageFunctionalTest->testCommentLanguage()
The comment posted with content language en and belonging to the node with language en has language Otherlocale.test2228LocaleCommentLanguageFunctionalTest->testCommentLanguage()
Trying to get property of non-objectNoticelocale.test2218LocaleCommentLanguageFunctionalTest->testCommentLanguage()
Failed to set field comment_body[und][0][value] to e8Z043upOtherlocale.test2218LocaleCommentLanguageFunctionalTest->testCommentLanguage()
Found the Save buttonOtherlocale.test2218LocaleCommentLanguageFunctionalTest->testCommentLanguage()
Found the requested form fields at fr/node/Otherlocale.test2218LocaleCommentLanguageFunctionalTest->testCommentLanguage()
Trying to get property of non-objectNoticelocale.test2223LocaleCommentLanguageFunctionalTest->testCommentLanguage()
Trying to get property of non-objectNoticelocale.test2227LocaleCommentLanguageFunctionalTest->testCommentLanguage()
Trying to get property of non-objectNoticelocale.test2228LocaleCommentLanguageFunctionalTest->testCommentLanguage()
The comment posted with content language fr and belonging to the node with language en has language Otherlocale.test2228LocaleCommentLanguageFunctionalTest->testCommentLanguage()
Undefined property: stdClass::$field_imageNoticelocale.module410locale_field_node_form_submit()
LeafComment paging settings (CommentPagerTest) [Comment]20800
LeafComment preview (CommentPreviewTest) [Comment]7200
LeafComment Rebuild (CommentContentRebuild) [Comment]3200
LeafComment RSS (CommentRSSUnitTest) [Comment]2400
LeafComment Search tests (SearchCommentTestCase) [Search]13900
LeafComment token replacement (CommentTokenReplaceTestCase) [Comment]6400
LeafComment upgrade path (CommentUpgradePathTestCase) [Upgrade path]2800
LeafConfig settings form (SearchConfigSettingsForm) [Search]11600
LeafConnection tests (DatabaseConnectionTestCase) [Database]3400
LeafContent language settings (LocaleContentFunctionalTest) [Locale]6400
LeafCron run (CronRunTestCase) [System]4500
LeafCSS Unit Tests (CascadingStylesheetsUnitTest) [System]1200
LeafCustom query syntax tests (DatabaseQueryTestCase) [Database]600
LeafDashboard blocks (DashboardBlocksTestCase) [Dashboard]10900
LeafData API functions (DrupalDataApiTest) [System]3200
LeafDate and time (DateTimeFunctionalTest) [System]9600
ExpandDBLog functionality (DBLogTestCase) [DBLog]427134
MessageGroupFilenameLineFunctionStatus
HTTP response expected 200, actual 500Browserdblog.test275DBLogTestCase->doNode()
Node b0ETAHbv was loadedOtherdblog.test278DBLogTestCase->doNode()
Trying to get property of non-objectNoticedblog.test281DBLogTestCase->doNode()
Failed to set field body[und][0][value] to jT9rAhEky37CCyTJn7IOsWqypnwAPTouOtherdblog.test281DBLogTestCase->doNode()
Found the Save buttonOtherdblog.test281DBLogTestCase->doNode()
Found the requested form fields at node//editOtherdblog.test281DBLogTestCase->doNode()
HTTP response expected 200, actual 404Browserdblog.test282DBLogTestCase->doNode()
Trying to get property of non-objectNoticedblog.test284DBLogTestCase->doNode()
Found the Delete buttonOtherdblog.test284DBLogTestCase->doNode()
Found the requested form fields at node//deleteOtherdblog.test284DBLogTestCase->doNode()
HTTP response expected 200, actual 404Browserdblog.test285DBLogTestCase->doNode()
Trying to get property of non-objectNoticedblog.test287DBLogTestCase->doNode()
HTTP response expected 404, actual 200Browserdblog.test288DBLogTestCase->doNode()
DBLog event was recorded: [content added]Otherdblog.test301DBLogTestCase->doNode()
DBLog event was recorded: [content updated]Otherdblog.test303DBLogTestCase->doNode()
DBLog event was recorded: [content deleted]Otherdblog.test305DBLogTestCase->doNode()
Trying to get property of non-objectNoticedblog.test317DBLogTestCase->doNode()
LeafDefault text format functionality (FilterDefaultFormatTestCase) [Filter]3300
LeafDelete/Truncate tests (DatabaseDeleteTruncateTestCase) [Database]2000
LeafDrupal error handlers (DrupalErrorHandlerUnitTest) [System]2800
LeafDrupal goto (DrupalGotoTest) [System]1800
LeafDrupal HTTP request (DrupalHTTPRequestTestCase) [System]2700
LeafDrupal match path (DrupalMatchPathTestCase) [Path API]4100
LeafDrupal set/get regions (DrupalSetContentTestCase) [System]4000
LeafDrupal system listing (DrupalSystemListingTestCase) [System]600
LeafDrupal tags handling (DrupalTagsHandlingTestCase) [System]800
Leafdrupal_alter() tests (DrupalAlterTestCase) [System]500
Leafdrupal_render() (DrupalRenderTestCase) [System]3300
LeafElement processing (FormElementTestCase) [Form API]4400
LeafEmbedded forms (SearchEmbedForm) [Search]2900
LeafEmpty statement (DatabaseEmptyStatementTestCase) [Database]400
LeafEnable/disable modules (EnableDisableTestCase) [Module]5600
LeafEntity CRUD hooks (EntityCrudHookTestCase) [Entity API]4800
LeafEntity properties (EntityPropertiesTestCase) [Entity API]300
LeafEntity query (EntityFieldQueryTestCase) [Entity API]10000
LeafFeed parser functionality (FeedParserTestCase) [Aggregator]4000
LeafFetch tests (DatabaseFetchTestCase) [Database]3300
LeafFetch tests, part 2 (DatabaseFetch2TestCase) [Database]2600
LeafFetching multiple cache items (CacheGetMultipleUnitTest) [Cache]700
LeafField attach tests (other) (FieldAttachOtherTestCase) [Field API]4400
LeafField attach tests (storage-related) (FieldAttachStorageTestCase) [Field API]8300
LeafField bulk delete tests (FieldBulkDeleteTestCase) [Field API]4000
LeafField CRUD tests (FieldCrudTestCase) [Field API]5900
LeafField Display API tests (FieldDisplayAPITestCase) [Field API]4200
LeafField form tests (FieldFormTestCase) [Field API]23700
LeafField info tests (FieldInfoTestCase) [Field API]7900
LeafField instance CRUD tests (FieldInstanceCrudTestCase) [Field API]3200
LeafField SQL storage tests (FieldSqlStorageTestCase) [Field API]8800
LeafField translations tests (FieldTranslationsTestCase) [Field API]5200
LeafFile copying (FileCopyTest) [File API]10600
LeafFile delete (FileDeleteTest) [File API]1800
LeafFile download (FileDownloadTest) [File API]3500
ExpandFile field display tests (FileFieldDisplayTestCase) [File]16413
MessageGroupFilenameLineFunctionStatus
array_flip(): Can only flip STRING and INTEGER values!Warningentity.inc167DrupalDefaultEntityController->load()
Trying to get property of non-objectNoticefile.test717FileFieldDisplayTestCase->testNodeDisplay()
Undefined property: stdClass::$uriNoticefile.module693theme_file_link()
Undefined property: stdClass::$filemimeNoticefile.module731theme_file_icon()
Undefined property: stdClass::$filemimeNoticefile.module773file_icon_path()
Undefined property: stdClass::$filemimeNoticefile.module815file_icon_map()
Undefined property: stdClass::$filemimeNoticefile.module788file_icon_path()
Undefined property: stdClass::$filemimeNoticefile.module788file_icon_path()
Undefined property: stdClass::$filemimeNoticefile.module788file_icon_path()
Undefined property: stdClass::$filemimeNoticefile.module788file_icon_path()
Undefined property: stdClass::$filemimeNoticefile.module700theme_file_link()
Undefined property: stdClass::$filesizeNoticefile.module700theme_file_link()
Undefined property: stdClass::$filenameNoticefile.module706theme_file_link()
Default formatter displaying correctly on full node view.Otherfile.test719FileFieldDisplayTestCase->testNodeDisplay()
Failed to set field shuubsvv[und][0][display] to Otherfile.test723FileFieldDisplayTestCase->testNodeDisplay()
Found the Save buttonOtherfile.test723FileFieldDisplayTestCase->testNodeDisplay()
Found the requested form fields at node//editOtherfile.test723FileFieldDisplayTestCase->testNodeDisplay()
ExpandFile field file path tests (FileFieldPathTestCase) [File]17312
MessageGroupFilenameLineFunctionStatus
array_flip(): Can only flip STRING and INTEGER values!Warningentity.inc167DrupalDefaultEntityController->load()
Trying to get property of non-objectNoticefile.test917FileFieldPathTestCase->testUploadPath()
Undefined property: stdClass::$uriNoticefile.test918FileFieldPathTestCase->testUploadPath()
Undefined property: stdClass::$uriNoticefile.test918FileFieldPathTestCase->testUploadPath()
The file was uploaded to the correct path.Otherfile.test918FileFieldPathTestCase->testUploadPath()
array_flip(): Can only flip STRING and INTEGER values!Warningentity.inc167DrupalDefaultEntityController->load()
Trying to get property of non-objectNoticefile.test928FileFieldPathTestCase->testUploadPath()
Undefined property: stdClass::$uriNoticefile.test929FileFieldPathTestCase->testUploadPath()
Undefined property: stdClass::$uriNoticefile.test929FileFieldPathTestCase->testUploadPath()
The file was uploaded to the correct path.Otherfile.test929FileFieldPathTestCase->testUploadPath()
array_flip(): Can only flip STRING and INTEGER values!Warningentity.inc167DrupalDefaultEntityController->load()
Trying to get property of non-objectNoticefile.test940FileFieldPathTestCase->testUploadPath()
Undefined property: stdClass::$uriNoticefile.test943FileFieldPathTestCase->testUploadPath()
Undefined property: stdClass::$uriNoticefile.test943FileFieldPathTestCase->testUploadPath()
The file was uploaded to the correct path with token replacements.Otherfile.test943FileFieldPathTestCase->testUploadPath()
ExpandFile field revision test (FileFieldRevisionTestCase) [File]292348
MessageGroupFilenameLineFunctionStatus
array_flip(): Can only flip STRING and INTEGER values!Warningentity.inc167DrupalDefaultEntityController->load()
Trying to get property of non-objectNoticefile.test604FileFieldRevisionTestCase->testRevisions()
Trying to get property of non-objectNoticefile.test605FileFieldRevisionTestCase->testRevisions()
Undefined property: stdClass::$uriNoticefile.test172FileFieldTestCase->assertFileExists()
New file saved to disk on node creation.Otherfile.test606FileFieldRevisionTestCase->testRevisions()
Undefined property: stdClass::$fidNoticefile.test180FileFieldTestCase->assertFileEntryExists()
array_flip(): Can only flip STRING and INTEGER values!Warningentity.inc167DrupalDefaultEntityController->load()
Trying to get property of non-objectNoticefile.test182FileFieldTestCase->assertFileEntryExists()
Undefined property: stdClass::$uriNoticefile.test182FileFieldTestCase->assertFileEntryExists()
Undefined property: stdClass::$statusNoticefile.test207FileFieldTestCase->assertFileIsPermanent()
File is permanent.Otherfile.test608FileFieldRevisionTestCase->testRevisions()
Found the Remove buttonOtherfile.test163FileFieldTestCase->replaceNodeFile()
Found the requested form fields at node//editOtherfile.test163FileFieldTestCase->replaceNodeFile()
Failed to set field files[tzqjpqx8_und_0] to /var/lib/drupaltestbot/sites/default/files/checkout/sites/default/files/simpletest/987487/text-0.txtOtherfile.test164FileFieldTestCase->replaceNodeFile()
Failed to set field revision to 1Otherfile.test164FileFieldTestCase->replaceNodeFile()
Found the Save buttonOtherfile.test164FileFieldTestCase->replaceNodeFile()
Found the requested form fields at Otherfile.test164FileFieldTestCase->replaceNodeFile()
array_flip(): Can only flip STRING and INTEGER values!Warningentity.inc167DrupalDefaultEntityController->load()
Trying to get property of non-objectNoticefile.test613FileFieldRevisionTestCase->testRevisions()
Trying to get property of non-objectNoticefile.test614FileFieldRevisionTestCase->testRevisions()
Undefined property: stdClass::$uriNoticefile.test172FileFieldTestCase->assertFileExists()
Replacement file exists on disk after creating new revision.Otherfile.test615FileFieldRevisionTestCase->testRevisions()
Undefined property: stdClass::$fidNoticefile.test180FileFieldTestCase->assertFileEntryExists()
array_flip(): Can only flip STRING and INTEGER values!Warningentity.inc167DrupalDefaultEntityController->load()
Trying to get property of non-objectNoticefile.test182FileFieldTestCase->assertFileEntryExists()
Undefined property: stdClass::$uriNoticefile.test182FileFieldTestCase->assertFileEntryExists()
Undefined property: stdClass::$statusNoticefile.test207FileFieldTestCase->assertFileIsPermanent()
Replacement file is permanent.Otherfile.test617FileFieldRevisionTestCase->testRevisions()
array_flip(): Can only flip STRING and INTEGER values!Warningentity.inc167DrupalDefaultEntityController->load()
Trying to get property of non-objectNoticefile.test621FileFieldRevisionTestCase->testRevisions()
Undefined property: stdClass::$uriNoticefile.test172FileFieldTestCase->assertFileExists()
Original file still in place after replacing file in new revision.Otherfile.test622FileFieldRevisionTestCase->testRevisions()
Undefined property: stdClass::$fidNoticefile.test180FileFieldTestCase->assertFileEntryExists()
array_flip(): Can only flip STRING and INTEGER values!Warningentity.inc167DrupalDefaultEntityController->load()
Trying to get property of non-objectNoticefile.test182FileFieldTestCase->assertFileEntryExists()
Undefined property: stdClass::$uriNoticefile.test182FileFieldTestCase->assertFileEntryExists()
Undefined property: stdClass::$statusNoticefile.test207FileFieldTestCase->assertFileIsPermanent()
Original file is still permanent.Otherfile.test624FileFieldRevisionTestCase->testRevisions()
Failed to set field revision to 1Otherfile.test628FileFieldRevisionTestCase->testRevisions()
Found the Save buttonOtherfile.test628FileFieldRevisionTestCase->testRevisions()
Found the requested form fields at node//editOtherfile.test628FileFieldRevisionTestCase->testRevisions()
array_flip(): Can only flip STRING and INTEGER values!Warningentity.inc167DrupalDefaultEntityController->load()
Trying to get property of non-objectNoticefile.test630FileFieldRevisionTestCase->testRevisions()
Trying to get property of non-objectNoticefile.test631FileFieldRevisionTestCase->testRevisions()
Undefined property: stdClass::$statusNoticefile.test207FileFieldTestCase->assertFileIsPermanent()
New revision file is permanent.Otherfile.test633FileFieldRevisionTestCase->testRevisions()
Found the Revert buttonOtherfile.test636FileFieldRevisionTestCase->testRevisions()
Found the requested form fields at node//revisions//revertOtherfile.test636FileFieldRevisionTestCase->testRevisions()
array_flip(): Can only flip STRING and INTEGER values!Warningentity.inc167DrupalDefaultEntityController->load()
Trying to get property of non-objectNoticefile.test638FileFieldRevisionTestCase->testRevisions()
Trying to get property of non-objectNoticefile.test639FileFieldRevisionTestCase->testRevisions()
Undefined property: stdClass::$statusNoticefile.test207FileFieldTestCase->assertFileIsPermanent()
Original revision file still permanent after reverting to the original revision.Otherfile.test641FileFieldRevisionTestCase->testRevisions()
Found the Delete buttonOtherfile.test645FileFieldRevisionTestCase->testRevisions()
Found the requested form fields at node//revisions//deleteOtherfile.test645FileFieldRevisionTestCase->testRevisions()
Undefined property: stdClass::$uriNoticefile.test172FileFieldTestCase->assertFileExists()
Second file is still available after deleting second revision, since it is being used by the third revision.Otherfile.test646FileFieldRevisionTestCase->testRevisions()
Undefined property: stdClass::$fidNoticefile.test180FileFieldTestCase->assertFileEntryExists()
array_flip(): Can only flip STRING and INTEGER values!Warningentity.inc167DrupalDefaultEntityController->load()
Trying to get property of non-objectNoticefile.test182FileFieldTestCase->assertFileEntryExists()
Undefined property: stdClass::$uriNoticefile.test182FileFieldTestCase->assertFileEntryExists()
Undefined property: stdClass::$statusNoticefile.test207FileFieldTestCase->assertFileIsPermanent()
Second file entry is still permanent after deleting second revision, since it is being used by the third revision.Otherfile.test648FileFieldRevisionTestCase->testRevisions()
Undefined index: fidNoticefile.field.inc223file_field_presave()
array_flip(): Can only flip STRING and INTEGER values!Warningentity.inc167DrupalDefaultEntityController->load()
Trying to get property of non-objectNoticefile.field.inc224file_field_presave()
Undefined property: stdClass::$uriNoticefile.inc575file_save()
Undefined index: fidNoticefile.field.inc265file_field_update()
Undefined index: fidNoticefile.field.inc286file_field_update()
Undefined property: stdClass::$fidNoticefile.inc649file_usage_add()
PDOException: SQLSTATE[23000]: Integrity constraint violation: 1048 Column 'fid' cannot be null: INSERT INTO {file_usage} (fid, module, type, id, count) VALUES (:db_insert_placeholder_0, :db_insert_placeholder_1, :db_insert_placeholder_2, :db_insert_placeholder_3, :db_insert_placeholder_4); Array ( [:db_insert_placeholder_0] => [:db_insert_placeholder_1] => file [:db_insert_placeholder_2] => user [:db_insert_placeholder_3] => 3 [:db_insert_placeholder_4] => 1 ) in file_usage_add() (line 656 of /var/lib/drupaltestbot/sites/default/files/checkout/includes/file.inc).Uncaught exceptiondatabase.inc1970PDOStatement->execute()
ExpandFile field validation tests (FileFieldValidateTestCase) [File]742956
MessageGroupFilenameLineFunctionStatus
Node save failed when required file field was empty.Otherfile.test761FileFieldValidateTestCase->testRequired()
Failed to set field files[xdh60d8g_und_0] to /var/lib/drupaltestbot/sites/default/files/checkout/sites/default/files/simpletest/352993/text-0.txtOtherfile.test132FileFieldTestCase->uploadNodeFile()
Found the requested form fields at node/add/articleOtherfile.test132FileFieldTestCase->uploadNodeFile()
uploadNodeFile(public://text-0.txt, xdh60d8g, article) succeededOtherfile.test765FileFieldValidateTestCase->testRequired()
array_flip(): Can only flip STRING and INTEGER values!Warningentity.inc167DrupalDefaultEntityController->load()
Trying to get property of non-objectNoticefile.test769FileFieldValidateTestCase->testRequired()
Undefined property: stdClass::$uriNoticefile.test172FileFieldTestCase->assertFileExists()
File exists after uploading to the required field.Otherfile.test770FileFieldValidateTestCase->testRequired()
Undefined property: stdClass::$fidNoticefile.test180FileFieldTestCase->assertFileEntryExists()
array_flip(): Can only flip STRING and INTEGER values!Warningentity.inc167DrupalDefaultEntityController->load()
Trying to get property of non-objectNoticefile.test182FileFieldTestCase->assertFileEntryExists()
Undefined property: stdClass::$uriNoticefile.test182FileFieldTestCase->assertFileEntryExists()
Node save failed when required multiple value file field was empty.Otherfile.test780FileFieldValidateTestCase->testRequired()
Failed to set field files[xdh60d8g_und_0] to /var/lib/drupaltestbot/sites/default/files/checkout/sites/default/files/simpletest/352993/text-0.txtOtherfile.test132FileFieldTestCase->uploadNodeFile()
Found the requested form fields at node/add/articleOtherfile.test132FileFieldTestCase->uploadNodeFile()
array_flip(): Can only flip STRING and INTEGER values!Warningentity.inc167DrupalDefaultEntityController->load()
Trying to get property of non-objectNoticefile.test785FileFieldValidateTestCase->testRequired()
Undefined property: stdClass::$uriNoticefile.test172FileFieldTestCase->assertFileExists()
File exists after uploading to the required multiple value field.Otherfile.test786FileFieldValidateTestCase->testRequired()
Undefined property: stdClass::$fidNoticefile.test180FileFieldTestCase->assertFileEntryExists()
array_flip(): Can only flip STRING and INTEGER values!Warningentity.inc167DrupalDefaultEntityController->load()
Trying to get property of non-objectNoticefile.test182FileFieldTestCase->assertFileEntryExists()
Undefined property: stdClass::$uriNoticefile.test182FileFieldTestCase->assertFileEntryExists()
array_flip(): Can only flip STRING and INTEGER values!Warningentity.inc167DrupalDefaultEntityController->load()
Trying to get property of non-objectNoticefile.test821FileFieldValidateTestCase->testFileMaxSize()
Undefined property: stdClass::$uriNoticefile.test172FileFieldTestCase->assertFileExists()
File exists after uploading a file (128 KB) under the max limit (1M).Otherfile.test822FileFieldValidateTestCase->testFileMaxSize()
Undefined property: stdClass::$fidNoticefile.test180FileFieldTestCase->assertFileEntryExists()
array_flip(): Can only flip STRING and INTEGER values!Warningentity.inc167DrupalDefaultEntityController->load()
Trying to get property of non-objectNoticefile.test182FileFieldTestCase->assertFileEntryExists()
Undefined property: stdClass::$uriNoticefile.test182FileFieldTestCase->assertFileEntryExists()
Failed to set field files[mhwabdc9_und_0] to /var/lib/drupaltestbot/sites/default/files/checkout/sites/default/files/simpletest/326735/text-4.txtOtherfile.test132FileFieldTestCase->uploadNodeFile()
Found the requested form fields at node/add/articleOtherfile.test132FileFieldTestCase->uploadNodeFile()
Node save failed when file (1.25 MB) exceeded the max upload size (1M).Otherfile.test828FileFieldValidateTestCase->testFileMaxSize()
Failed to set field files[mhwabdc9_und_0] to /var/lib/drupaltestbot/sites/default/files/checkout/sites/default/files/simpletest/326735/text-3.txtOtherfile.test132FileFieldTestCase->uploadNodeFile()
Found the requested form fields at node/add/articleOtherfile.test132FileFieldTestCase->uploadNodeFile()
array_flip(): Can only flip STRING and INTEGER values!Warningentity.inc167DrupalDefaultEntityController->load()
Trying to get property of non-objectNoticefile.test821FileFieldValidateTestCase->testFileMaxSize()
Undefined property: stdClass::$uriNoticefile.test172FileFieldTestCase->assertFileExists()
File exists after uploading a file (128 KB) under the max limit (1024K).Otherfile.test822FileFieldValidateTestCase->testFileMaxSize()
Undefined property: stdClass::$fidNoticefile.test180FileFieldTestCase->assertFileEntryExists()
array_flip(): Can only flip STRING and INTEGER values!Warningentity.inc167DrupalDefaultEntityController->load()
Trying to get property of non-objectNoticefile.test182FileFieldTestCase->assertFileEntryExists()
Undefined property: stdClass::$uriNoticefile.test182FileFieldTestCase->assertFileEntryExists()
Failed to set field files[mhwabdc9_und_0] to /var/lib/drupaltestbot/sites/default/files/checkout/sites/default/files/simpletest/326735/text-4.txtOtherfile.test132FileFieldTestCase->uploadNodeFile()
Found the requested form fields at node/add/articleOtherfile.test132FileFieldTestCase->uploadNodeFile()
Node save failed when file (1.25 MB) exceeded the max upload size (1024K).Otherfile.test828FileFieldValidateTestCase->testFileMaxSize()
Failed to set field files[mhwabdc9_und_0] to /var/lib/drupaltestbot/sites/default/files/checkout/sites/default/files/simpletest/326735/text-3.txtOtherfile.test132FileFieldTestCase->uploadNodeFile()
Found the requested form fields at node/add/articleOtherfile.test132FileFieldTestCase->uploadNodeFile()
array_flip(): Can only flip STRING and INTEGER values!Warningentity.inc167DrupalDefaultEntityController->load()
Trying to get property of non-objectNoticefile.test821FileFieldValidateTestCase->testFileMaxSize()
Undefined property: stdClass::$uriNoticefile.test172FileFieldTestCase->assertFileExists()
File exists after uploading a file (128 KB) under the max limit (1048576).Otherfile.test822FileFieldValidateTestCase->testFileMaxSize()
Undefined property: stdClass::$fidNoticefile.test180FileFieldTestCase->assertFileEntryExists()
array_flip(): Can only flip STRING and INTEGER values!Warningentity.inc167DrupalDefaultEntityController->load()
Trying to get property of non-objectNoticefile.test182FileFieldTestCase->assertFileEntryExists()
Undefined property: stdClass::$uriNoticefile.test182FileFieldTestCase->assertFileEntryExists()
Failed to set field files[mhwabdc9_und_0] to /var/lib/drupaltestbot/sites/default/files/checkout/sites/default/files/simpletest/326735/text-4.txtOtherfile.test132FileFieldTestCase->uploadNodeFile()
Found the requested form fields at node/add/articleOtherfile.test132FileFieldTestCase->uploadNodeFile()
Node save failed when file (1.25 MB) exceeded the max upload size (1048576).Otherfile.test828FileFieldValidateTestCase->testFileMaxSize()
array_flip(): Can only flip STRING and INTEGER values!Warningentity.inc167DrupalDefaultEntityController->load()
Trying to get property of non-objectNoticefile.test837FileFieldValidateTestCase->testFileMaxSize()
Undefined property: stdClass::$uriNoticefile.test172FileFieldTestCase->assertFileExists()
File exists after uploading a file (1.25 MB) with no max limit.Otherfile.test838FileFieldValidateTestCase->testFileMaxSize()
Undefined property: stdClass::$fidNoticefile.test180FileFieldTestCase->assertFileEntryExists()
array_flip(): Can only flip STRING and INTEGER values!Warningentity.inc167DrupalDefaultEntityController->load()
Trying to get property of non-objectNoticefile.test182FileFieldTestCase->assertFileEntryExists()
Undefined property: stdClass::$uriNoticefile.test182FileFieldTestCase->assertFileEntryExists()
array_flip(): Can only flip STRING and INTEGER values!Warningentity.inc167DrupalDefaultEntityController->load()
Trying to get property of non-objectNoticefile.test864FileFieldValidateTestCase->testFileExtension()
Undefined property: stdClass::$uriNoticefile.test172FileFieldTestCase->assertFileExists()
File exists after uploading a file with no extension checking.Otherfile.test865FileFieldValidateTestCase->testFileExtension()
Undefined property: stdClass::$fidNoticefile.test180FileFieldTestCase->assertFileEntryExists()
array_flip(): Can only flip STRING and INTEGER values!Warningentity.inc167DrupalDefaultEntityController->load()
Trying to get property of non-objectNoticefile.test182FileFieldTestCase->assertFileEntryExists()
Undefined property: stdClass::$uriNoticefile.test182FileFieldTestCase->assertFileEntryExists()
Node save failed when file uploaded with the wrong extension.Otherfile.test874FileFieldValidateTestCase->testFileExtension()
array_flip(): Can only flip STRING and INTEGER values!Warningentity.inc167DrupalDefaultEntityController->load()
Trying to get property of non-objectNoticefile.test882FileFieldValidateTestCase->testFileExtension()
Undefined property: stdClass::$uriNoticefile.test172FileFieldTestCase->assertFileExists()
File exists after uploading a file with extension checking.Otherfile.test883FileFieldValidateTestCase->testFileExtension()
Undefined property: stdClass::$fidNoticefile.test180FileFieldTestCase->assertFileEntryExists()
array_flip(): Can only flip STRING and INTEGER values!Warningentity.inc167DrupalDefaultEntityController->load()
Trying to get property of non-objectNoticefile.test182FileFieldTestCase->assertFileEntryExists()
Undefined property: stdClass::$uriNoticefile.test182FileFieldTestCase->assertFileEntryExists()
ExpandFile field widget test (FileFieldWidgetTestCase) [File]1455554
MessageGroupFilenameLineFunctionStatus
array_flip(): Can only flip STRING and INTEGER values!Warningentity.inc167DrupalDefaultEntityController->load()
Trying to get property of non-objectNoticefile.test336FileFieldWidgetTestCase->testSingleValuedWidget()
Undefined property: stdClass::$uriNoticefile.test172FileFieldTestCase->assertFileExists()
New file saved to disk on node creation.Otherfile.test337FileFieldWidgetTestCase->testSingleValuedWidget()
Undefined property: stdClass::$uriNoticefile.test340FileFieldWidgetTestCase->testSingleValuedWidget()
Node with file displays the "Remove" button.Otherfile.test346FileFieldWidgetTestCase->testSingleValuedWidget()
Found the Remove buttonOtherfile.test351FileFieldWidgetTestCase->testSingleValuedWidget()
Found the requested form fields at Otherfile.test351FileFieldWidgetTestCase->testSingleValuedWidget()
After clicking the "Remove" button, the "Upload" button is displayed.Otherfile.test361FileFieldWidgetTestCase->testSingleValuedWidget()
Found the Save buttonOtherfile.test364FileFieldWidgetTestCase->testSingleValuedWidget()
Found the requested form fields at Otherfile.test364FileFieldWidgetTestCase->testSingleValuedWidget()
array_flip(): Can only flip STRING and INTEGER values!Warningentity.inc167DrupalDefaultEntityController->load()
Failed to set field files[ertrmkzs_und_0] to /var/lib/drupaltestbot/sites/default/files/checkout/sites/default/files/simpletest/272210/text-0.txtOtherfile.test132FileFieldTestCase->uploadNodeFile()
Found the requested form fields at node/add/pageOtherfile.test132FileFieldTestCase->uploadNodeFile()
array_flip(): Can only flip STRING and INTEGER values!Warningentity.inc167DrupalDefaultEntityController->load()
Trying to get property of non-objectNoticefile.test336FileFieldWidgetTestCase->testSingleValuedWidget()
Undefined property: stdClass::$uriNoticefile.test172FileFieldTestCase->assertFileExists()
New file saved to disk on node creation.Otherfile.test337FileFieldWidgetTestCase->testSingleValuedWidget()
Undefined property: stdClass::$uriNoticefile.test340FileFieldWidgetTestCase->testSingleValuedWidget()
Node with file displays the "Remove" button.Otherfile.test346FileFieldWidgetTestCase->testSingleValuedWidget()
Undefined offset: 0Noticefile.test355FileFieldWidgetTestCase->testSingleValuedWidget()
Undefined offset: 0Noticefile.test355FileFieldWidgetTestCase->testSingleValuedWidget()
Undefined offset: 0Noticedrupal_web_test_case.php1826DrupalWebTestCase->drupalPostAJAX()
Undefined index: ajaxNoticedrupal_web_test_case.php1827DrupalWebTestCase->drupalPostAJAX()
Found the requested form fields at Otherfile.test355FileFieldWidgetTestCase->testSingleValuedWidget()
After clicking the "Remove" button, the "Upload" button is displayed.Otherfile.test361FileFieldWidgetTestCase->testSingleValuedWidget()
Found the Save buttonOtherfile.test364FileFieldWidgetTestCase->testSingleValuedWidget()
Found the requested form fields at Otherfile.test364FileFieldWidgetTestCase->testSingleValuedWidget()
array_flip(): Can only flip STRING and INTEGER values!Warningentity.inc167DrupalDefaultEntityController->load()
simplexml_import_dom(): Invalid Nodetype to importWarningdrupal_web_test_case.php1593DrupalWebTestCase->parse()
Parsed page successfully.Browserfile.test397FileFieldWidgetTestCase->testMultiValuedWidget()
simplexml_import_dom(): Invalid Nodetype to importWarningdrupal_web_test_case.php1593DrupalWebTestCase->parse()
Parsed page successfully.Browserfile.test397FileFieldWidgetTestCase->testMultiValuedWidget()
simplexml_import_dom(): Invalid Nodetype to importWarningdrupal_web_test_case.php1593DrupalWebTestCase->parse()
Parsed page successfully.Browserfile.test399FileFieldWidgetTestCase->testMultiValuedWidget()
simplexml_import_dom(): Invalid Nodetype to importWarningdrupal_web_test_case.php1593DrupalWebTestCase->parse()
Parsed page successfully.Browserfile.test411FileFieldWidgetTestCase->testMultiValuedWidget()
There are 3 "Remove" buttons displayed (JSMode=nojs).Otherfile.test412FileFieldWidgetTestCase->testMultiValuedWidget()
Invalid argument supplied for foreach()Warningfile.test413FileFieldWidgetTestCase->testMultiValuedWidget()
Invalid argument supplied for foreach()Warningfile.test428FileFieldWidgetTestCase->testMultiValuedWidget()
simplexml_import_dom(): Invalid Nodetype to importWarningdrupal_web_test_case.php1593DrupalWebTestCase->parse()
Parsed page successfully.Browserfile.test433FileFieldWidgetTestCase->testMultiValuedWidget()
simplexml_import_dom(): Invalid Nodetype to importWarningdrupal_web_test_case.php1593DrupalWebTestCase->parse()
Parsed page successfully.Browserfile.test445FileFieldWidgetTestCase->testMultiValuedWidget()
After removing a file, an "Upload" button is displayed (JSMode=%type).Otherfile.test446FileFieldWidgetTestCase->testMultiValuedWidget()
simplexml_import_dom(): Invalid Nodetype to importWarningdrupal_web_test_case.php1593DrupalWebTestCase->parse()
Parsed page successfully.Browserfile.test411FileFieldWidgetTestCase->testMultiValuedWidget()
There are 2 "Remove" buttons displayed (JSMode=nojs).Otherfile.test412FileFieldWidgetTestCase->testMultiValuedWidget()
Invalid argument supplied for foreach()Warningfile.test413FileFieldWidgetTestCase->testMultiValuedWidget()
Invalid argument supplied for foreach()Warningfile.test428FileFieldWidgetTestCase->testMultiValuedWidget()
simplexml_import_dom(): Invalid Nodetype to importWarningdrupal_web_test_case.php1593DrupalWebTestCase->parse()
Parsed page successfully.Browserfile.test433FileFieldWidgetTestCase->testMultiValuedWidget()
simplexml_import_dom(): Invalid Nodetype to importWarningdrupal_web_test_case.php1593DrupalWebTestCase->parse()
Parsed page successfully.Browserfile.test445FileFieldWidgetTestCase->testMultiValuedWidget()
After removing a file, an "Upload" button is displayed (JSMode=%type).Otherfile.test446FileFieldWidgetTestCase->testMultiValuedWidget()
simplexml_import_dom(): Invalid Nodetype to importWarningdrupal_web_test_case.php1593DrupalWebTestCase->parse()
Parsed page successfully.Browserfile.test411FileFieldWidgetTestCase->testMultiValuedWidget()
There are 1 "Remove" buttons displayed (JSMode=nojs).Otherfile.test412FileFieldWidgetTestCase->testMultiValuedWidget()
Invalid argument supplied for foreach()Warningfile.test413FileFieldWidgetTestCase->testMultiValuedWidget()
Invalid argument supplied for foreach()Warningfile.test428FileFieldWidgetTestCase->testMultiValuedWidget()
simplexml_import_dom(): Invalid Nodetype to importWarningdrupal_web_test_case.php1593DrupalWebTestCase->parse()
Parsed page successfully.Browserfile.test433FileFieldWidgetTestCase->testMultiValuedWidget()
simplexml_import_dom(): Invalid Nodetype to importWarningdrupal_web_test_case.php1593DrupalWebTestCase->parse()
Parsed page successfully.Browserfile.test445FileFieldWidgetTestCase->testMultiValuedWidget()
After removing a file, an "Upload" button is displayed (JSMode=%type).Otherfile.test446FileFieldWidgetTestCase->testMultiValuedWidget()
simplexml_import_dom(): Invalid Nodetype to importWarningdrupal_web_test_case.php1593DrupalWebTestCase->parse()
Parsed page successfully.Browserfile.test450FileFieldWidgetTestCase->testMultiValuedWidget()
simplexml_import_dom(): Invalid Nodetype to importWarningdrupal_web_test_case.php1593DrupalWebTestCase->parse()
Parsed page successfully.Browserfile.test453FileFieldWidgetTestCase->testMultiValuedWidget()
Undefined offset: 1Noticefile.test456FileFieldWidgetTestCase->testMultiValuedWidget()
Failed to set field files[nji6saxr_und_0] to /var/lib/drupaltestbot/sites/default/files/checkout/sites/default/files/simpletest/814519/text-0.txtOtherfile.test397FileFieldWidgetTestCase->testMultiValuedWidget()
Found the Upload buttonOtherfile.test397FileFieldWidgetTestCase->testMultiValuedWidget()
Found the requested form fields at Otherfile.test397FileFieldWidgetTestCase->testMultiValuedWidget()
Failed to set field files[nji6saxr_und_1] to /var/lib/drupaltestbot/sites/default/files/checkout/sites/default/files/simpletest/814519/text-0.txtOtherfile.test397FileFieldWidgetTestCase->testMultiValuedWidget()
Found the Upload buttonOtherfile.test397FileFieldWidgetTestCase->testMultiValuedWidget()
Found the requested form fields at Otherfile.test397FileFieldWidgetTestCase->testMultiValuedWidget()
Failed to set field files[nji6saxr_und_2] to /var/lib/drupaltestbot/sites/default/files/checkout/sites/default/files/simpletest/814519/text-0.txtOtherfile.test397FileFieldWidgetTestCase->testMultiValuedWidget()
Found the Upload buttonOtherfile.test397FileFieldWidgetTestCase->testMultiValuedWidget()
Found the requested form fields at Otherfile.test397FileFieldWidgetTestCase->testMultiValuedWidget()
There are 3 "Remove" buttons displayed (JSMode=js).Otherfile.test412FileFieldWidgetTestCase->testMultiValuedWidget()
Undefined offset: 0Noticedrupal_web_test_case.php1826DrupalWebTestCase->drupalPostAJAX()
Undefined index: ajaxNoticedrupal_web_test_case.php1827DrupalWebTestCase->drupalPostAJAX()
After removing a file, an "Upload" button is displayed (JSMode=%type).Otherfile.test446FileFieldWidgetTestCase->testMultiValuedWidget()
There are 2 "Remove" buttons displayed (JSMode=js).Otherfile.test412FileFieldWidgetTestCase->testMultiValuedWidget()
Undefined offset: 0Noticedrupal_web_test_case.php1826DrupalWebTestCase->drupalPostAJAX()
Undefined index: ajaxNoticedrupal_web_test_case.php1827DrupalWebTestCase->drupalPostAJAX()
After removing a file, an "Upload" button is displayed (JSMode=%type).Otherfile.test446FileFieldWidgetTestCase->testMultiValuedWidget()
There are 1 "Remove" buttons displayed (JSMode=js).Otherfile.test412FileFieldWidgetTestCase->testMultiValuedWidget()
Undefined offset: 0Noticedrupal_web_test_case.php1826DrupalWebTestCase->drupalPostAJAX()
Undefined index: ajaxNoticedrupal_web_test_case.php1827DrupalWebTestCase->drupalPostAJAX()
After removing a file, an "Upload" button is displayed (JSMode=%type).Otherfile.test446FileFieldWidgetTestCase->testMultiValuedWidget()
array_flip(): Can only flip STRING and INTEGER values!Warningentity.inc167DrupalDefaultEntityController->load()
Trying to get property of non-objectNoticefile.test483FileFieldWidgetTestCase->testPrivateFileSetting()
Undefined property: stdClass::$uriNoticefile.test172FileFieldTestCase->assertFileExists()
New file saved to disk on node creation.Otherfile.test484FileFieldWidgetTestCase->testPrivateFileSetting()
Undefined property: stdClass::$uriNoticefile.test487FileFieldWidgetTestCase->testPrivateFileSetting()
Upload destination setting disabled.Otherfile.test493FileFieldWidgetTestCase->testPrivateFileSetting()
array_flip(): Can only flip STRING and INTEGER values!Warningentity.inc167DrupalDefaultEntityController->load()
simplexml_import_dom(): Invalid Nodetype to importWarningdrupal_web_test_case.php1593DrupalWebTestCase->parse()
Parsed page successfully.Browserfile.test538FileFieldWidgetTestCase->testPrivateFileComment()
Undefined offset: 1Noticefile.test542FileFieldWidgetTestCase->testPrivateFileComment()
array_flip(): Can only flip STRING and INTEGER values!Warningentity.inc167DrupalDefaultEntityController->load()
Trying to get property of non-objectNoticefile.test548FileFieldWidgetTestCase->testPrivateFileComment()
Undefined property: stdClass::$uriNoticefile.test172FileFieldTestCase->assertFileExists()
New file saved to disk on node creation.Otherfile.test549FileFieldWidgetTestCase->testPrivateFileComment()
Undefined property: stdClass::$uriNoticefile.test551FileFieldWidgetTestCase->testPrivateFileComment()
Undefined property: stdClass::$uriNoticefile.test553FileFieldWidgetTestCase->testPrivateFileComment()
Undefined property: stdClass::$uriNoticefile.test558FileFieldWidgetTestCase->testPrivateFileComment()
Confirmed that access is denied for the file without the needed permission.Browserfile.test559FileFieldWidgetTestCase->testPrivateFileComment()
LeafFile loading (FileLoadTest) [File API]2900
LeafFile mimetypes (FileMimeTypeTest) [File API]3800
LeafFile moving (FileMoveTest) [File API]10500
LeafFile naming (FileNameMungingTest) [File API]500
LeafFile paths and directories (FileDirectoryTest) [File API]2000
LeafFile save data (FileSaveDataTest) [File API]8800
LeafFile saving (FileSaveTest) [File API]1400
LeafFile scan directory (FileScanDirectoryTest) [File API]2300
LeafFile space used tests (FileSpaceUsedTest) [File API]1100
ExpandFile token replacement (FileTokenReplaceTestCase) [File]27753
MessageGroupFilenameLineFunctionStatus
array_flip(): Can only flip STRING and INTEGER values!Warningentity.inc167DrupalDefaultEntityController->load()
Trying to get property of non-objectNoticefile.test1005FileTokenReplaceTestCase->testFileTokenReplacement()
Undefined property: stdClass::$fidNoticefile.test1010FileTokenReplaceTestCase->testFileTokenReplacement()
Undefined property: stdClass::$filenameNoticefile.test1011FileTokenReplaceTestCase->testFileTokenReplacement()
Undefined property: stdClass::$uriNoticefile.test1013FileTokenReplaceTestCase->testFileTokenReplacement()
Undefined property: stdClass::$filemimeNoticefile.test1014FileTokenReplaceTestCase->testFileTokenReplacement()
Undefined property: stdClass::$filesizeNoticefile.test1015FileTokenReplaceTestCase->testFileTokenReplacement()
Undefined property: stdClass::$uriNoticefile.test1016FileTokenReplaceTestCase->testFileTokenReplacement()
Undefined property: stdClass::$timestampNoticefile.test1017FileTokenReplaceTestCase->testFileTokenReplacement()
date_timezone_set() expects parameter 1 to be DateTime, boolean givenWarningcommon.inc1882format_date()
date_format() expects parameter 1 to be DateTime, boolean givenWarningcommon.inc1892format_date()
Undefined property: stdClass::$timestampNoticefile.test1018FileTokenReplaceTestCase->testFileTokenReplacement()
date_timezone_set() expects parameter 1 to be DateTime, boolean givenWarningcommon.inc1882format_date()
date_format() expects parameter 1 to be DateTime, boolean givenWarningcommon.inc1892format_date()
Undefined property: stdClass::$uidNoticefile.test1020FileTokenReplaceTestCase->testFileTokenReplacement()
No empty tokens generated.Otherfile.test1023FileTokenReplaceTestCase->testFileTokenReplacement()
Undefined property: stdClass::$fidNoticesystem.tokens.inc224system_tokens()
Undefined property: stdClass::$filenameNoticesystem.tokens.inc229system_tokens()
Undefined property: stdClass::$uriNoticesystem.tokens.inc237system_tokens()
Undefined property: stdClass::$filemimeNoticesystem.tokens.inc241system_tokens()
Undefined property: stdClass::$filesizeNoticesystem.tokens.inc245system_tokens()
Undefined property: stdClass::$uriNoticesystem.tokens.inc249system_tokens()
Undefined property: stdClass::$timestampNoticesystem.tokens.inc254system_tokens()
date_timezone_set() expects parameter 1 to be DateTime, boolean givenWarningcommon.inc1882format_date()
date_format() expects parameter 1 to be DateTime, boolean givenWarningcommon.inc1892format_date()
Undefined property: stdClass::$timestampNoticesystem.tokens.inc265system_tokens()
Sanitized file token [file:timestamp:short] replaced.Otherfile.test1027FileTokenReplaceTestCase->testFileTokenReplacement()
Undefined property: stdClass::$uidNoticesystem.tokens.inc258system_tokens()
array_flip(): Can only flip STRING and INTEGER values!Warningentity.inc167DrupalDefaultEntityController->load()
array_flip(): Can only flip STRING and INTEGER values!Warningentity.inc343DrupalDefaultEntityController->cacheGet()
Trying to get property of non-objectNoticesystem.tokens.inc259system_tokens()
Sanitized file token [file:owner] replaced.Otherfile.test1027FileTokenReplaceTestCase->testFileTokenReplacement()
Undefined property: stdClass::$uidNoticesystem.tokens.inc268system_tokens()
array_flip(): Can only flip STRING and INTEGER values!Warningentity.inc167DrupalDefaultEntityController->load()
array_flip(): Can only flip STRING and INTEGER values!Warningentity.inc343DrupalDefaultEntityController->cacheGet()
Sanitized file token [file:owner:uid] replaced.Otherfile.test1027FileTokenReplaceTestCase->testFileTokenReplacement()
Undefined property: stdClass::$filenameNoticefile.test1031FileTokenReplaceTestCase->testFileTokenReplacement()
Undefined property: stdClass::$uriNoticefile.test1033FileTokenReplaceTestCase->testFileTokenReplacement()
Undefined property: stdClass::$filemimeNoticefile.test1034FileTokenReplaceTestCase->testFileTokenReplacement()
Undefined property: stdClass::$filesizeNoticefile.test1035FileTokenReplaceTestCase->testFileTokenReplacement()
Undefined property: stdClass::$fidNoticesystem.tokens.inc224system_tokens()
Undefined property: stdClass::$filenameNoticesystem.tokens.inc229system_tokens()
Undefined property: stdClass::$uriNoticesystem.tokens.inc237system_tokens()
Undefined property: stdClass::$filemimeNoticesystem.tokens.inc241system_tokens()
Undefined property: stdClass::$filesizeNoticesystem.tokens.inc245system_tokens()
Undefined property: stdClass::$uriNoticesystem.tokens.inc249system_tokens()
Undefined property: stdClass::$timestampNoticesystem.tokens.inc254system_tokens()
date_timezone_set() expects parameter 1 to be DateTime, boolean givenWarningcommon.inc1882format_date()
date_format() expects parameter 1 to be DateTime, boolean givenWarningcommon.inc1892format_date()
Undefined property: stdClass::$timestampNoticesystem.tokens.inc265system_tokens()
Unsanitized file token [file:timestamp:short] replaced.Otherfile.test1039FileTokenReplaceTestCase->testFileTokenReplacement()
Undefined property: stdClass::$uidNoticesystem.tokens.inc258system_tokens()
array_flip(): Can only flip STRING and INTEGER values!Warningentity.inc167DrupalDefaultEntityController->load()
array_flip(): Can only flip STRING and INTEGER values!Warningentity.inc343DrupalDefaultEntityController->cacheGet()
Trying to get property of non-objectNoticesystem.tokens.inc259system_tokens()
Unsanitized file token [file:owner] replaced.Otherfile.test1039FileTokenReplaceTestCase->testFileTokenReplacement()
Undefined property: stdClass::$uidNoticesystem.tokens.inc268system_tokens()
array_flip(): Can only flip STRING and INTEGER values!Warningentity.inc167DrupalDefaultEntityController->load()
array_flip(): Can only flip STRING and INTEGER values!Warningentity.inc343DrupalDefaultEntityController->cacheGet()
Unsanitized file token [file:owner:uid] replaced.Otherfile.test1039FileTokenReplaceTestCase->testFileTokenReplacement()
LeafFile uploading (FileSaveUploadTest) [File API]28100
LeafFile URL rewriting (FileURLRewritingTest) [File]1500
LeafFile usage (FileUsageTest) [File]2100
LeafFile validate (FileValidateTest) [File API]1100
LeafFile validator tests (FileValidatorTest) [File API]4000
LeafFileTransfer unit tests (FileTranferTest) [System]200
LeafFilter administration functionality (FilterAdminTestCase) [Filter]15500
LeafFilter CRUD operations (FilterCRUDTestCase) [Filter]21400
LeafFilter format access (FilterFormatAccessTestCase) [Filter]28300
LeafFilter format hooks (FilterHooksTestCase) [Filter]5600
LeafFilter format upgrade path (FilterFormatUpgradePathTestCase) [Upgrade path]3600
LeafFilter module filters (FilterUnitTestCase) [Filter]39500
LeafFingerprinting meta tag (AdminMetaTagTestCase) [System]300
LeafFlood control mechanism (FloodFunctionalTest) [System]600
LeafForm alter hooks (FormAlterTestCase) [Form API]600
LeafForm API checkbox (FormCheckboxTestCase) [Form API]15700
LeafForm API file inclusion (FormsFileInclusionTestCase) [Form API]900
LeafForm element and label output test (FormsElementsLabelsTestCase) [Form API]1500
LeafForm element validation (FormsTestCase) [Form API]27000
LeafForm rebuilding (FormsRebuildTestCase) [Form API]5000
LeafForm state values clearance (FormStateValuesCleanTestCase) [Form API]1300
LeafForm triggering element determination (FormsTriggeringElementTestCase) [Form API]4800
LeafForm validation handlers (FormValidationTestCase) [Form API]4700
LeafForm wrapper callback (FormsFormWrapperTestCase) [Form API]400
LeafFormat date (FormatDateUnitTest) [System]4300
LeafForum functionality (ForumTestCase) [Forum]60800
LeafFront page (FrontPageTestCase) [System]3600
LeafGet filename test (BootstrapGetFilenameTestCase) [Bootstrap]400
LeafGraph (GraphUnitTest) [System]2800
LeafHelp functionality (HelpTestCase) [Help]30800
LeafHTML Attributes (DrupalAttributesUnitTest) [System]600
LeafHTML identifiers (DrupalHTMLIdentifierTestCase) [System]1000
LeafHTML in page titles (PageTitleFiltering) [System]4000
LeafHTTP file retrieval (RetrieveFileTestCase) [System]700
LeafImage effects (ImageEffectsUnitTest) [Image]3300
ExpandImage field display tests (ImageFieldDisplayTestCase) [Image]1752
MessageGroupFilenameLineFunctionStatus
The test did not complete due to a fatal error.Completion checkimage.test625ImageFieldDisplayTestCase->testImageFieldFormattersPublic()
array_flip(): Can only flip STRING and INTEGER values!Warningentity.inc167DrupalDefaultEntityController->load()
Trying to get property of non-objectNoticeimage.test650ImageFieldDisplayTestCase->_testImageFieldFormatters()
Default formatter displaying correctly on full node view.Otherimage.test655ImageFieldDisplayTestCase->_testImageFieldFormatters()
Image linked to file formatter displaying correctly on full node view.Otherimage.test664ImageFieldDisplayTestCase->_testImageFieldFormatters()
File was downloaded successfully.Otherimage.test666ImageFieldDisplayTestCase->_testImageFieldFormatters()
Image linked to content formatter displaying correctly on full node view.Otherimage.test688ImageFieldDisplayTestCase->_testImageFieldFormatters()
ExpandImage field validation tests (ImageFieldValidateTestCase) [Image]1440
MessageGroupFilenameLineFunctionStatus
Node save failed when minimum image resolution was not met.Otherimage.test863ImageFieldValidateTestCase->testResolution()
Failed to set field files[wdxbwihh_und_0] to /var/lib/drupaltestbot/sites/default/files/checkout/sites/default/files/simpletest/492469/image-1.pngOtherimage.test98ImageFieldTestCase->uploadNodeImage()
Found the requested form fields at node/add/articleOtherimage.test98ImageFieldTestCase->uploadNodeImage()
Image exceeding max resolution was properly resized.Otherimage.test865ImageFieldValidateTestCase->testResolution()
LeafImage GD manipulation tests (ImageToolkitGdTestCase) [Image]100
ExpandImage styles and effects UI configuration (ImageAdminStylesUnitTest) [Image]14912
MessageGroupFilenameLineFunctionStatus
The test did not complete due to a fatal error.Completion checkimage.test565ImageAdminStylesUnitTest->testStyleReplacement()
array_flip(): Can only flip STRING and INTEGER values!Warningentity.inc167DrupalDefaultEntityController->load()
Trying to get property of non-objectNoticeimage.test585ImageAdminStylesUnitTest->testStyleReplacement()
LeafImage styles path and URL functions (ImageStylesPathAndUrlUnitTest) [Image]2100
LeafImage toolkit tests (ImageToolkitUnitTest) [Image]4400
LeafImport feeds from OPML functionality (ImportOPMLTestCase) [Aggregator]5300
LeafInfo file format parser (InfoFileParserTestCase) [System]900
LeafInsert tests (DatabaseInsertTestCase) [Database]4500
LeafInsert tests, default fields (DatabaseInsertDefaultsTestCase) [Database]1900
LeafInsert tests, LOB fields (DatabaseInsertLOBTestCase) [Database]1300
LeafInvalid data (DatabaseInvalidDataTestCase) [Database]700
LeafIP address and HTTP_HOST test (BootstrapIPAddressTestCase) [Bootstrap]1100
LeafIP address blocking (IPAddressBlockingTestCase) [System]4200
LeafJavaScript (JavaScriptTestCase) [System]3800
LeafJSON (DrupalJSONTest) [System]1400
LeafKeywords and conditions (SearchKeywordsConditions) [Search]2500
LeafLanguage configuration (LocaleConfigurationTest) [Locale]8100
LeafLanguage switching (LocaleLanguageSwitchingFunctionalTest) [Locale]2500
LeafLinks (ThemeLinksUnitTest) [Theme]1700
LeafList field (ListFieldTestCase) [Field types]1400
LeafList field UI (ListFieldUITestCase) [Field types]3600
LeafLoad multiple nodes (NodeLoadMultipleUnitTest) [Node]3600
LeafLocale uninstall (EN) (LocaleUninstallFunctionalTest) [Locale]3100
LeafLocale uninstall (FR) (LocaleUninstallFrenchFunctionalTest) [Locale]3100
LeafLocale upgrade path (LocaleUpgradePathTestCase) [Upgrade path]16700
LeafLocalize date formats (LocaleDateFormatsFunctionalTest) [Locale]3500
LeafLocking framework tests (LockFunctionalTest) [System]1700
LeafMail system (MailTestCase) [System]100
ExpandMain content rendering fallback (SystemMainContentFallback) [System]6603
MessageGroupFilenameLineFunctionStatus
Undefined index: moduleNoticefield.info.inc385_field_info_prepare_instance_widget()
Undefined index: moduleNoticefield.info.inc353_field_info_prepare_instance_display()
Undefined index: moduleNoticefield.info.inc353_field_info_prepare_instance_display()
LeafManage display (FieldUIManageDisplayTestCase) [Field UI]8100
LeafManage fields (FieldUIManageFieldsTestCase) [Field UI]15000
LeafManaged file element test (FileManagedFileElementTestCase) [File]26400
LeafMenu link creation/deletion (MenuTestCase) [Menu]64400
LeafMenu links (MenuLinksUnitTestCase) [Menu]5000
LeafMenu rebuild test (MenuRebuildTestCase) [Menu]500
LeafMenu router (MenuRouterTestCase) [Menu]20900
LeafMenu settings for nodes (MenuNodeTestCase) [Menu]4700
LeafMenu tree generation (MenuTreeDataTestCase) [Menu]400
LeafMerge tests (DatabaseMergeTestCase) [Database]7500
LeafMiscellaneous AJAX tests (AJAXElementValidation) [AJAX]800
LeafMiscellaneous bootstrap unit tests (BootstrapMiscTestCase) [Bootstrap]100
LeafMissing update dependencies (UpdateDependencyMissingTestCase) [Update API]300
LeafModule API (ModuleUnitTest) [Module]5800
LeafModule dependencies (ModuleDependencyTestCase) [Module]15800
LeafModule installation (ModuleInstallTestCase) [Module]200
LeafModule uninstallation (ModuleUninstallTestCase) [Module]100
LeafModule versions (ModuleVersionTestCase) [Module]5000
LeafMultilingual fields (LocaleMultilingualFieldsFunctionalTest) [Locale]6000
LeafMultistep form using form storage (FormsFormStorageTestCase) [Form API]11500
LeafMultistep node form basic options (MultiStepNodeFormBasicOptionsTest) [Node]1500
LeafNew default theme blocks (NewDefaultThemeBlocks) [Block]2400
LeafNo help (NoHelpTestCase) [Help]1100
LeafNode access (NodeAccessUnitTest) [Node]3100
LeafNode access rebuild (NodeAccessRebuildTestCase) [Node]1600
LeafNode access records (NodeAccessRecordsUnitTest) [Node]2300
LeafNode administration (NodeAdminTestCase) [Node]13900
LeafNode blocks (NodeBlockFunctionalTest) [Node]8300
LeafNode body upgrade path (NodeBodyUpgradePathTestCase) [Upgrade path]3700
LeafNode creation (NodeCreationTestCase) [Node]2500
LeafNode edit (PageEditTestCase) [Node]9300
LeafNode edit permissions (PageViewTestCase) [Node]3200
LeafNode entity query alter (NodeEntityFieldQueryAlter) [Node]3000
LeafNode feed (NodeFeedTestCase) [Node]100
LeafNode post information display (NodePostSettingsTestCase) [Node]3400
LeafNode preview (PagePreviewTestCase) [Node]3500
LeafNode query alter (NodeQueryAlter) [Node]7900
LeafNode revisions (NodeRevisionsTestCase) [Node]4400
LeafNode RSS Content (NodeRSSContentTestCase) [Node]1600
LeafNode save (NodeSaveTestCase) [Node]2800
LeafNode title (NodeTitleTestCase) [Node]2000
LeafNode title XSS filtering (NodeTitleXSSTestCase) [Node]2000
LeafNode token replacement (NodeTokenReplaceTestCase) [Node]3400
LeafNode type persist (NodeTypePersistenceTestCase) [Node]6200
LeafNode types (NodeTypeTestCase) [Node]8400
LeafNon default theme admin (NonDefaultBlockAdmin) [Block]1000
LeafNumber field (NumberFieldTestCase) [Field types]1500
LeafOpenID account registration (OpenIDRegistrationTestCase) [OpenID]13100
LeafOpenID discovery and login (OpenIDFunctionalTestCase) [OpenID]24800
LeafOpenID helper functions (OpenIDUnitTest) [OpenID]3200
LeafOptions widgets (OptionsWidgetsTestCase) [Field types]25600
LeafPage cache test (BootstrapPageCacheTestCase) [Bootstrap]7800
LeafPager query tests (DatabaseSelectPagerDefaultTestCase) [Database]4200
LeafParsing .info files (ParseInfoFilesTestCase) [System]300
LeafPath alias functionality (PathTestCase) [Path]10200
LeafPath aliases with languages (PathLanguageUITestCase) [Path]6900
LeafPath aliases with translated nodes (PathLanguageTestCase) [Path]6300
LeafPath language settings (LocalePathFunctionalTest) [Locale]4300
LeafPaths on non-English monolingual sites (PathMonolingualTestCase) [Path]3400
LeafPersonal contact form (ContactPersonalTestCase) [Contact]14200
LeafPHP filter access check (PHPAccessTestCase) [PHP]3700
LeafPHP filter functionality (PHPFilterTestCase) [PHP]4100
LeafPoll add choice (PollJSAddChoice) [Poll]1500
LeafPoll create (PollCreateTestCase) [Poll]14300
LeafPoll expiration (PollExpirationTestCase) [Poll]3200
LeafPoll token replacement (PollTokenReplaceTestCase) [Poll]11000
LeafPoll upgrade path (PollUpgradePathTestCase) [Upgrade path]21600
LeafPoll vote (PollVoteTestCase) [Poll]8400
LeafProfile browsing (ProfileTestBrowsing) [Profile]3200
LeafProgrammatic form submissions (FormsProgrammaticTestCase) [Form API]1800
LeafQuery altering tests (DatabaseAlterTestCase) [Database]5500
LeafQuery logging (DatabaseLoggingTestCase) [Database]3800
LeafQuery tagging tests (DatabaseTaggingTestCase) [Database]2800
LeafQueue functionality (QueueTestCase) [System]700
LeafRange query test (DatabaseRangeQueryTestCase) [Database]200
LeafRDF comment mapping (RdfCommentAttributesTestCase) [RDF]20400
LeafRDF mapping CRUD functions (RdfCrudTestCase) [RDF]900
LeafRDF mapping definition functionality (RdfMappingDefinitionTestCase) [RDF]5800
LeafRDF mapping hook (RdfMappingHookTestCase) [RDF]500
LeafRDF namespaces (RdfGetRdfNamespacesTestCase) [RDF]400
LeafRDF namespaces XML serialization tests (DrupalGetRdfNamespacesTestCase) [System]600
LeafRDF tracker page mapping (RdfTrackerAttributesTestCase) [RDF]3200
ExpandRDFa markup (RdfRdfaMarkupTestCase) [RDF]1820
MessageGroupFilenameLineFunctionStatus
Attribute 'rel' set on file field. Attribute 'resource' is also set.Otherrdf.test183RdfRdfaMarkupTestCase->testAttributesInMarkupFile()
Attribute 'rel' set on image field. Attribute 'resource' is also set.Otherrdf.test189RdfRdfaMarkupTestCase->testAttributesInMarkupFile()
LeafRebuild arbitrary forms (FormsArbitraryRebuildTestCase) [Form API]1400
LeafRebuild content (NodeBuildContent) [Node]100
LeafRegistry parse file test (RegistryParseFileTestCase) [System]200
LeafRegistry parse files test (RegistryParseFilesTestCase) [System]600
LeafRegression tests (DatabaseRegressionTestCase) [Database]2700
LeafRemove feed functionality (RemoveFeedTestCase) [Aggregator]2300
LeafRemove feed item functionality (RemoveFeedItemTestCase) [Aggregator]19600
LeafRequired modules (ModuleRequiredTestCase) [Module]1800
LeafRequirements hook failure (HookRequirementsTestCase) [Module]1500
LeafResettable static variables test (BootstrapResettableStaticTestCase) [Bootstrap]500
LeafRole assignment (UserRolesAssignmentTestCase) [User]5300
LeafRole permissions (UserPermissionsTestCase) [User]5000
LeafSchema API (SchemaTestCase) [Database]2800
LeafSearch engine phrase queries (SearchExactTestCase) [Search]2200
LeafSearch engine queries (SearchMatchTestCase) [Search]14400
LeafSearch engine ranking (SearchRankingTestCase) [Search]8100
LeafSearch excerpt extraction (SearchExcerptTestCase) [Search]500
LeafSearch expression insert/extract (SearchExpressionInsertExtractTestCase) [Search]2400
LeafSearch page override (SearchPageOverride) [Search]1200
LeafSearch page text (SearchPageText) [Search]2600
LeafSearch simplify (SearchSimplifyTestCase) [Search]34200
LeafSecurity (FilterSecurityTestCase) [Filter]5200
LeafSelect tests (DatabaseSelectTestCase) [Database]11700
LeafSelect tests, complex (DatabaseSelectComplexTestCase) [Database]11500
LeafSelect tests, complex 2 (DatabaseSelectComplexTestCase2) [Database]1400
LeafSelect tests, ordered (DatabaseSelectOrderedTestCase) [Database]2600
LeafSelect tests, subqueries (DatabaseSelectSubqueryTestCase) [Database]2400
LeafSequences API (DatabaseNextIdCase) [Database]200
LeafSession https handling (SessionHttpsTestCase) [Session]13900
LeafSession tests (SessionTestCase) [Session]28600
LeafShortcut link functionality (ShortcutLinksTestCase) [Shortcut]15100
LeafShortcut set functionality (ShortcutSetsTestCase) [Shortcut]16800
LeafShutdown functions (ShutdownFunctionsTest) [System]400
LeafSimpleTest browser (SimpleTestBrowserTestCase) [SimpleTest]2100
LeafSimpleTest e-mail capturing (SimpleTestMailCaptureTestCase) [SimpleTest]1300
LeafSimpleTest error collector (DrupalErrorCollectionUnitTest) [SimpleTest]3000
LeafSimpleTest functionality (SimpleTestFunctionalTest) [SimpleTest]11400
LeafSite maintenance mode functionality (SiteMaintenanceTestCase) [System]8000
LeafSite-wide contact form (ContactSitewideTestCase) [Contact]23700
LeafSize parsing test (CommonSizeTestCase) [System]3500
LeafStatistics logging tests (StatisticsLoggingTestCase) [Statistics]1200
LeafStatistics reports tests (StatisticsReportsTestCase) [Statistics]8000
LeafStatistics token replacement (StatisticsTokenReplaceTestCase) [Statistics]2900
LeafStream wrappers (StreamWrapperTest) [File API]2300
LeafString filtering tests (CommonXssUnitTest) [System]900
LeafString translate, search and validate (LocaleTranslationFunctionalTest) [Locale]25000
LeafString translation using st() (LocaleInstallTest) [Locale]100
LeafSummary length (SummaryLengthTestCase) [Node]1500
LeafSyslog functionality (SyslogTestCase) [Syslog]1600
LeafSystem info alter (SystemInfoAlterTestCase) [System]1000
LeafTableselect form element type test (FormsElementsTableSelectFunctionalTest) [Form API]5200
LeafTablesort query tests (DatabaseSelectTableSortDefaultTestCase) [Database]4100
ExpandTaxonomy term functions and forms. (TaxonomyTermTestCase) [Taxonomy]157165
MessageGroupFilenameLineFunctionStatus
Trying to get property of non-objectNoticetaxonomy.test485TaxonomyTermTestCase->testTaxonomyNode()
Term is displayed when viewing the node.Othertaxonomy.test486TaxonomyTermTestCase->testTaxonomyNode()
Trying to get property of non-objectNoticetaxonomy.test490TaxonomyTermTestCase->testTaxonomyNode()
Failed to set field title to rRg4irNVOthertaxonomy.test490TaxonomyTermTestCase->testTaxonomyNode()
Failed to set field body[und][0][value] to yNM9SXAMOthertaxonomy.test490TaxonomyTermTestCase->testTaxonomyNode()
Failed to set field taxonomy_qikiajry[und][] to 2Othertaxonomy.test490TaxonomyTermTestCase->testTaxonomyNode()
Found the Save buttonOthertaxonomy.test490TaxonomyTermTestCase->testTaxonomyNode()
Found the requested form fields at node//editOthertaxonomy.test490TaxonomyTermTestCase->testTaxonomyNode()
Trying to get property of non-objectNoticetaxonomy.test492TaxonomyTermTestCase->testTaxonomyNode()
Term is displayed when viewing the node.Othertaxonomy.test493TaxonomyTermTestCase->testTaxonomyNode()
Trying to get property of non-objectNoticetaxonomy.test496TaxonomyTermTestCase->testTaxonomyNode()
Failed to set field title to rRg4irNVOthertaxonomy.test496TaxonomyTermTestCase->testTaxonomyNode()
Failed to set field body[und][0][value] to yNM9SXAMOthertaxonomy.test496TaxonomyTermTestCase->testTaxonomyNode()
Failed to set field taxonomy_qikiajry[und][] to 2Othertaxonomy.test496TaxonomyTermTestCase->testTaxonomyNode()
Found the Preview buttonOthertaxonomy.test496TaxonomyTermTestCase->testTaxonomyNode()
Found the requested form fields at node//editOthertaxonomy.test496TaxonomyTermTestCase->testTaxonomyNode()
Term is displayed when previewing the node.Othertaxonomy.test497TaxonomyTermTestCase->testTaxonomyNode()
Invalid argument supplied for foreach()Warningdrupal_web_test_case.php1786DrupalWebTestCase->drupalPost()
Found the Preview buttonOthertaxonomy.test498TaxonomyTermTestCase->testTaxonomyNode()
Found the requested form fields at Othertaxonomy.test498TaxonomyTermTestCase->testTaxonomyNode()
Term is displayed when previewing the node again.Othertaxonomy.test499TaxonomyTermTestCase->testTaxonomyNode()
LeafTaxonomy term hooks (TaxonomyHooksTestCase) [Taxonomy]1900
LeafTaxonomy term multiple loading (TaxonomyLoadMultipleUnitTest) [Taxonomy]1700
LeafTaxonomy term reference field (TaxonomyTermFieldTestCase) [Taxonomy]3600
LeafTaxonomy term unit tests (TaxonomyTermUnitTest) [Taxonomy]100
LeafTaxonomy term URL aliases (PathTaxonomyTermTestCase) [Path]3400
LeafTaxonomy theme switching (TaxonomyThemeTestCase) [Taxonomy]1700
ExpandTaxonomy token replacement (TaxonomyTokenReplaceTestCase) [Taxonomy]4840
MessageGroupFilenameLineFunctionStatus
Sanitized taxonomy term token [term:node-count] replaced.Othertaxonomy.test1094TaxonomyTokenReplaceTestCase->testTaxonomyTokenReplacement()
Unsanitized taxonomy term token [term:node-count] replaced.Othertaxonomy.test1105TaxonomyTokenReplaceTestCase->testTaxonomyTokenReplacement()
Sanitized taxonomy vocabulary token [vocabulary:node-count] replaced.Othertaxonomy.test1121TaxonomyTokenReplaceTestCase->testTaxonomyTokenReplacement()
Unsanitized taxonomy vocabulary token [vocabulary:node-count] replaced.Othertaxonomy.test1130TaxonomyTokenReplaceTestCase->testTaxonomyTokenReplacement()
LeafTaxonomy upgrade path (UpgradePathTaxonomyTestCase) [Upgrade path]126500
LeafTaxonomy vocabularies (TaxonomyVocabularyUnitTest) [Taxonomy]6100
LeafTaxonomy vocabulary interface (TaxonomyVocabularyFunctionalTest) [Taxonomy]9700
LeafTemporary query test (DatabaseTemporaryQueryTestCase) [Database]500
LeafTest date field (ProfileTestDate) [Profile]4900
LeafTest field weights (ProfileTestWeights) [Profile]5300
LeafTest select field (ProfileTestSelect) [Profile]4500
LeafTest single fields (ProfileTestFields) [Profile]18000
LeafTest statistics admin. (StatisticsAdminTestCase) [Statistics]10400
LeafTest user actions (TriggerUserActionTestCase) [Trigger]6500
LeafTest user triggers (TriggerUserTokenTestCase) [Trigger]18500
LeafTesting SimpleTest setUp (SimpleTestFolderTestCase) [SimpleTest]100
LeafText field (TextFieldTestCase) [Field types]19700
ExpandText summary (TextSummaryTestCase) [Field types]13611
MessageGroupFilenameLineFunctionStatus
Trying to get property of non-objectNoticetext.test400TextSummaryTestCase->testOnlyTextSummary()
Article with with summary and no body has been submitted.Othertext.test400TextSummaryTestCase->testOnlyTextSummary()
ExpandText translation (TextTranslationTestCase) [Field types]9923
MessageGroupFilenameLineFunctionStatus
Trying to get property of non-objectNoticetext.test461TextTranslationTestCase->testTextField()
Undefined variable: url_targetNoticedrupal_web_test_case.php2330DrupalWebTestCase->clickLink()
Clicked link add translation () from http://201011081733-pifr-mysql/checkout/?q=node//translateBrowsertext.test462TextTranslationTestCase->testTextField()
The textfield widget is populated.Othertext.test463TextTranslationTestCase->testTextField()
Undefined property: stdClass::$field_imageNoticelocale.module410locale_field_node_form_submit()
LeafTheme API (ThemeUnitTest) [Theme]1600
LeafTheme fast initialization (ThemeFastTestCase) [Theme]1000
LeafTheme initialization in hook_init() (ThemeHookInitUnitTest) [Theme]400
LeafTheme interface functionality (SystemThemeFunctionalTest) [System]6600
LeafTheme item list (ThemeItemListUnitTest) [Theme]100
LeafTheme Table (ThemeTableUnitTest) [Theme]600
LeafTimer test (BootstrapTimerTestCase) [Bootstrap]500
LeafToken replacement (TokenReplaceTestCase) [System]2700
LeafTop visitor blocking (StatisticsBlockVisitorsTestCase) [Statistics]4500
LeafTracker (TrackerTest) [Tracker]21900
LeafTransaction tests (DatabaseTransactionTestCase) [Database]3100
LeafTranslation export (LocaleExportFunctionalTest) [Locale]2900
LeafTranslation functionality (TranslationTestCase) [Translation]16900
LeafTranslation import (LocaleImportFunctionalTest) [Locale]11600
LeafTrigger content (node) actions (TriggerContentTestCase) [Trigger]35300
LeafTrigger cron (system) actions (TriggerCronTestCase) [Trigger]3300
LeafTrigger orphaned actions (TriggerOrphanedActionsTestCase) [Trigger]3700
LeafTrigger other actions (TriggerOtherTestCase) [Trigger]11200
LeafUI language negotiation (LocaleUILanguageNegotiationTest) [Locale]7300
LeafUnassigned text format functionality (FilterNoFormatTestCase) [Filter]200
LeafUnicode handling (UnicodeUnitTest) [System]17600
LeafUnmanaged file copying (FileUnmanagedCopyTest) [File API]3100
LeafUnmanaged file delete (FileUnmanagedDeleteTest) [File API]800
LeafUnmanaged file moving (FileUnmanagedMoveTest) [File API]2200
LeafUnmanaged file save data (FileUnmanagedSaveDataTest) [File API]700
LeafUnmanaged recursive file delete (FileUnmanagedDeleteRecursiveTest) [File API]1700
LeafUpdate contrib functionality (UpdateTestContribCase) [Update]18100
LeafUpdate core functionality (UpdateCoreTestCase) [Update]16000
LeafUpdate dependency hook invocation (UpdateDependencyHookInvocationTestCase) [Update API]300
LeafUpdate dependency ordering (UpdateDependencyOrderingTestCase) [Update API]300
LeafUpdate feed functionality (UpdateFeedTestCase) [Aggregator]7400
LeafUpdate feed item functionality (UpdateFeedItemTestCase) [Aggregator]6000
LeafUpdate functionality (UpdateScriptFunctionalTest) [System]5600
ExpandUpdate on cron functionality (AggregatorCronTestCase) [Aggregator]4930
MessageGroupFilenameLineFunctionStatus
Expected number of items in database.Otheraggregator.test725AggregatorCronTestCase->testCron()
Expected number of items in database.Otheraggregator.test729AggregatorCronTestCase->testCron()
Expected number of items in database.Otheraggregator.test748AggregatorCronTestCase->testCron()
LeafUpdate tests (DatabaseUpdateTestCase) [Database]3500
LeafUpdate tests, Complex (DatabaseUpdateComplexTestCase) [Database]5200
LeafUpdate tests, LOB (DatabaseUpdateLOBTestCase) [Database]1300
LeafUpload and extract module functionality (UpdateTestUploadCase) [Update]6100
LeafUpload upgrade path (UploadUpgradePathTestCase) [Upgrade path]3700
LeafUpload user picture (UserPictureTestCase) [User]8900
LeafURL altering (UrlAlterFunctionalTest) [Path API]2800
LeafURL generation tests (CommonURLUnitTest) [System]5600
LeafURL rewriting (LocaleUrlRewritingTest) [Locale]3200
LeafUser account links (UserAccountLinksUnitTests) [User]2100
LeafUser administration (UserAdminTestCase) [User]6500
LeafUser autocompletion (UserAutocompleteTestCase) [User]2800
LeafUser blocks (UserBlocksUnitTests) [User]4300
LeafUser create (UserCreateTestCase) [User]2700
LeafUser creation (LocaleUserCreationTest) [Locale]6800
LeafUser edit (UserEditTestCase) [User]6800
LeafUser edited own account (UserEditedOwnAccountTestCase) [User]2300
LeafUser language settings (LocaleUserLanguageFunctionalTest) [Locale]5100
LeafUser login (UserLoginTestCase) [User]13200
LeafUser poll vote capability. (PollVoteCheckHostname) [Poll]12400
LeafUser registration (UserRegistrationTestCase) [User]8100
LeafUser role administration (UserRoleAdminTestCase) [User]5300
LeafUser save test (UserSaveTestCase) [User]300
LeafUser search (UserUserSearchTestCase) [User]3800
LeafUser signatures (UserSignatureTestCase) [User]4500
LeafUser time zones (UserTimeZoneFunctionalTest) [User]3100
LeafUser token replacement (UserTokenReplaceTestCase) [User]4300
LeafUsername/e-mail validation (UserValidationTestCase) [User]1900
LeafValid Url (ValidUrlTestCase) [System]7900
LeafVariable test (BootstrapVariableTestCase) [Bootstrap]700
LeafXML-RPC basic (XMLRPCBasicTestCase) [XML-RPC]500
LeafXML-RPC message and alteration (XMLRPCMessagesTestCase) [XML-RPC]500
LeafXML-RPC validator (XMLRPCValidator1IncTestCase) [XML-RPC]900