drupal.field-hook-info.2.patch

Test status
StatusResult
Last receivedSat, 11/20/2010 - 02:01:09
Last requestedSat, 11/20/2010 - 02:02:01
Last testedSat, 11/20/2010 - 02:32:49
Test count1
Environment status
MySQLfail
File information
Filedrupal.field-hook-info.2.patch
BranchDrupal core - 7.x
LinkIssue Link
SummaryFAILED: [[SimpleTest]]: [MySQL] 27,035 pass(es), 204 fail(s), and 783 exception(s).
Details

MySQL

  1. Setup environment
  2. Detect an invalid patch URL
  3. Detect invalid repository information
  4. Detect invalid patch format
  5. Detect a non-applicable patch
  6. Detect invalid PHP syntax
  7. Detect a Drupal installation failure
  8. Detect a test run failure
  9. Detect a failing test
    Review the test failures below then if necessary run them locally until the problem has been fixed.
  10. Complete test suite with all tests passing
27,035 pass(es), 204 fail(s), and 783 exception(s)

Non-pass

Test namePassFailException
ExpandBreadcrumbs (MenuBreadcrumbTestCase) [Menu]410019
MessageGroupFilenameLineFunctionStatus
Undefined index: moduleNoticefield.info.inc385_field_info_prepare_instance_widget()
Undefined index: moduleNoticefield.info.inc353_field_info_prepare_instance_display()
Undefined index: moduleNoticefield.info.inc353_field_info_prepare_instance_display()
Undefined index: imageNoticefield_ui.admin.inc1491field_ui_existing_field_options()
Undefined index: moduleNoticefield.info.inc385_field_info_prepare_instance_widget()
Undefined index: moduleNoticefield.info.inc353_field_info_prepare_instance_display()
Undefined index: moduleNoticefield.info.inc353_field_info_prepare_instance_display()
Undefined index: imageNoticefield_ui.admin.inc356field_ui_field_overview_form()
Undefined index: Noticefield_ui.admin.inc362field_ui_field_overview_form()
Undefined index: imageNoticefield_ui.admin.inc904field_ui_display_overview_form()
Undefined index: moduleNoticefield_ui.admin.inc977field_ui_display_overview_form()
Undefined index: moduleNoticefield_ui.admin.inc1036field_ui_display_overview_form()
Undefined index: imageNoticefield_ui.admin.inc904field_ui_display_overview_form()
Undefined index: moduleNoticefield_ui.admin.inc977field_ui_display_overview_form()
Undefined index: moduleNoticefield_ui.admin.inc1036field_ui_display_overview_form()
Undefined index: moduleNoticefield.info.inc385_field_info_prepare_instance_widget()
Undefined index: moduleNoticefield.info.inc353_field_info_prepare_instance_display()
Undefined index: moduleNoticefield.info.inc353_field_info_prepare_instance_display()
Undefined index: imageNoticefield_ui.admin.inc1491field_ui_existing_field_options()
ExpandComment language (LocaleCommentLanguageFunctionalTest) [Locale]5205
MessageGroupFilenameLineFunctionStatus
Undefined index: moduleNoticefield.info.inc385_field_info_prepare_instance_widget()
Undefined index: moduleNoticefield.info.inc353_field_info_prepare_instance_display()
Undefined index: moduleNoticefield.info.inc353_field_info_prepare_instance_display()
Undefined property: stdClass::$field_imageNoticelocale.module410locale_field_node_form_submit()
Undefined property: stdClass::$field_imageNoticelocale.module410locale_field_node_form_submit()
ExpandComment Search tests (SearchCommentTestCase) [Search]15003
MessageGroupFilenameLineFunctionStatus
Undefined index: moduleNoticefield.info.inc385_field_info_prepare_instance_widget()
Undefined index: moduleNoticefield.info.inc353_field_info_prepare_instance_display()
Undefined index: moduleNoticefield.info.inc353_field_info_prepare_instance_display()
ExpandContent language settings (LocaleContentFunctionalTest) [Locale]6403
MessageGroupFilenameLineFunctionStatus
Undefined index: moduleNoticefield.info.inc385_field_info_prepare_instance_widget()
Undefined index: moduleNoticefield.info.inc353_field_info_prepare_instance_display()
Undefined index: moduleNoticefield.info.inc353_field_info_prepare_instance_display()
ExpandField form tests (FieldFormTestCase) [Field API]166018
MessageGroupFilenameLineFunctionStatus
Undefined index: moduleNoticefield.info.inc385_field_info_prepare_instance_widget()
Undefined index: moduleNoticefield.info.inc353_field_info_prepare_instance_display()
Undefined index: moduleNoticefield.info.inc353_field_info_prepare_instance_display()
Undefined index: moduleNoticefield.info.inc385_field_info_prepare_instance_widget()
Undefined index: moduleNoticefield.info.inc353_field_info_prepare_instance_display()
Undefined index: moduleNoticefield.info.inc353_field_info_prepare_instance_display()
Undefined index: moduleNoticefield.info.inc385_field_info_prepare_instance_widget()
Undefined index: moduleNoticefield.info.inc353_field_info_prepare_instance_display()
Undefined index: moduleNoticefield.info.inc353_field_info_prepare_instance_display()
Undefined index: moduleNoticefield.info.inc385_field_info_prepare_instance_widget()
Undefined index: moduleNoticefield.info.inc353_field_info_prepare_instance_display()
Undefined index: moduleNoticefield.info.inc353_field_info_prepare_instance_display()
Undefined index: moduleNoticefield.info.inc385_field_info_prepare_instance_widget()
Undefined index: moduleNoticefield.info.inc353_field_info_prepare_instance_display()
Undefined index: moduleNoticefield.info.inc353_field_info_prepare_instance_display()
Undefined index: moduleNoticefield.info.inc385_field_info_prepare_instance_widget()
Undefined index: moduleNoticefield.info.inc353_field_info_prepare_instance_display()
Undefined index: moduleNoticefield.info.inc353_field_info_prepare_instance_display()
ExpandFile field display tests (FileFieldDisplayTestCase) [File]16613
MessageGroupFilenameLineFunctionStatus
Failed to set field files[b5tttyny_und_0] to /var/lib/drupaltestbot/sites/default/files/checkout/sites/default/files/simpletest/757930/text-0.txtOtherfile.test132FileFieldTestCase->uploadNodeFile()
Found the requested form fields at node/add/articleOtherfile.test132FileFieldTestCase->uploadNodeFile()
array_flip(): Can only flip STRING and INTEGER values!Warningentity.inc167DrupalDefaultEntityController->load()
Trying to get property of non-objectNoticefile.test717FileFieldDisplayTestCase->testNodeDisplay()
Undefined property: stdClass::$uriNoticefile.module693theme_file_link()
Undefined property: stdClass::$filemimeNoticefile.module731theme_file_icon()
Undefined property: stdClass::$filemimeNoticefile.module773file_icon_path()
Undefined property: stdClass::$filemimeNoticefile.module815file_icon_map()
Undefined property: stdClass::$filemimeNoticefile.module788file_icon_path()
Undefined property: stdClass::$filemimeNoticefile.module788file_icon_path()
Undefined property: stdClass::$filemimeNoticefile.module788file_icon_path()
Undefined property: stdClass::$filemimeNoticefile.module788file_icon_path()
Undefined property: stdClass::$filemimeNoticefile.module700theme_file_link()
Undefined property: stdClass::$filesizeNoticefile.module700theme_file_link()
Undefined property: stdClass::$filenameNoticefile.module706theme_file_link()
Default formatter displaying correctly on full node view.Otherfile.test719FileFieldDisplayTestCase->testNodeDisplay()
Failed to set field b5tttyny[und][0][display] to Otherfile.test723FileFieldDisplayTestCase->testNodeDisplay()
Found the Save buttonOtherfile.test723FileFieldDisplayTestCase->testNodeDisplay()
Found the requested form fields at node//editOtherfile.test723FileFieldDisplayTestCase->testNodeDisplay()
ExpandFile field file path tests (FileFieldPathTestCase) [File]17931
MessageGroupFilenameLineFunctionStatus
Undefined index: moduleNoticefield.info.inc385_field_info_prepare_instance_widget()
Undefined index: moduleNoticefield.info.inc353_field_info_prepare_instance_display()
Undefined index: moduleNoticefield.info.inc353_field_info_prepare_instance_display()
Undefined index: moduleNoticefield.info.inc385_field_info_prepare_instance_widget()
Undefined index: moduleNoticefield.info.inc353_field_info_prepare_instance_display()
Failed to set field files[raydgep8_und_0] to /var/lib/drupaltestbot/sites/default/files/checkout/sites/default/files/simpletest/382644/text-0.txtOtherfile.test132FileFieldTestCase->uploadNodeFile()
Found the requested form fields at node/add/articleOtherfile.test132FileFieldTestCase->uploadNodeFile()
array_flip(): Can only flip STRING and INTEGER values!Warningentity.inc167DrupalDefaultEntityController->load()
Trying to get property of non-objectNoticefile.test917FileFieldPathTestCase->testUploadPath()
Undefined property: stdClass::$uriNoticefile.test918FileFieldPathTestCase->testUploadPath()
Undefined property: stdClass::$uriNoticefile.test918FileFieldPathTestCase->testUploadPath()
The file was uploaded to the correct path.Otherfile.test918FileFieldPathTestCase->testUploadPath()
Undefined index: moduleNoticefield.crud.inc779_field_write_instance()
Undefined index: moduleNoticefield.crud.inc795_field_write_instance()
Undefined index: moduleNoticefield.info.inc385_field_info_prepare_instance_widget()
Undefined index: moduleNoticefield.info.inc353_field_info_prepare_instance_display()
Undefined index: moduleNoticefield.info.inc353_field_info_prepare_instance_display()
Undefined index: moduleNoticefield.info.inc385_field_info_prepare_instance_widget()
Undefined index: moduleNoticefield.info.inc353_field_info_prepare_instance_display()
Failed to set field files[raydgep8_und_0] to /var/lib/drupaltestbot/sites/default/files/checkout/sites/default/files/simpletest/382644/text-0.txtOtherfile.test132FileFieldTestCase->uploadNodeFile()
Found the requested form fields at node/add/articleOtherfile.test132FileFieldTestCase->uploadNodeFile()
array_flip(): Can only flip STRING and INTEGER values!Warningentity.inc167DrupalDefaultEntityController->load()
Trying to get property of non-objectNoticefile.test928FileFieldPathTestCase->testUploadPath()
Undefined property: stdClass::$uriNoticefile.test929FileFieldPathTestCase->testUploadPath()
Undefined property: stdClass::$uriNoticefile.test929FileFieldPathTestCase->testUploadPath()
The file was uploaded to the correct path.Otherfile.test929FileFieldPathTestCase->testUploadPath()
Undefined index: moduleNoticefield.crud.inc779_field_write_instance()
Undefined index: moduleNoticefield.crud.inc795_field_write_instance()
Undefined index: moduleNoticefield.info.inc385_field_info_prepare_instance_widget()
Undefined index: moduleNoticefield.info.inc353_field_info_prepare_instance_display()
Undefined index: moduleNoticefield.info.inc353_field_info_prepare_instance_display()
Undefined index: moduleNoticefield.info.inc385_field_info_prepare_instance_widget()
Undefined index: moduleNoticefield.info.inc353_field_info_prepare_instance_display()
Failed to set field files[raydgep8_und_0] to /var/lib/drupaltestbot/sites/default/files/checkout/sites/default/files/simpletest/382644/text-0.txtOtherfile.test132FileFieldTestCase->uploadNodeFile()
Found the requested form fields at node/add/articleOtherfile.test132FileFieldTestCase->uploadNodeFile()
array_flip(): Can only flip STRING and INTEGER values!Warningentity.inc167DrupalDefaultEntityController->load()
Trying to get property of non-objectNoticefile.test940FileFieldPathTestCase->testUploadPath()
Undefined property: stdClass::$uriNoticefile.test943FileFieldPathTestCase->testUploadPath()
Undefined property: stdClass::$uriNoticefile.test943FileFieldPathTestCase->testUploadPath()
The file was uploaded to the correct path with token replacements.Otherfile.test943FileFieldPathTestCase->testUploadPath()
ExpandFile field revision test (FileFieldRevisionTestCase) [File]292555
MessageGroupFilenameLineFunctionStatus
Undefined index: moduleNoticefield.info.inc385_field_info_prepare_instance_widget()
Undefined index: moduleNoticefield.info.inc353_field_info_prepare_instance_display()
Undefined index: moduleNoticefield.info.inc353_field_info_prepare_instance_display()
Undefined index: moduleNoticefield.info.inc385_field_info_prepare_instance_widget()
Undefined index: moduleNoticefield.info.inc353_field_info_prepare_instance_display()
Undefined index: moduleNoticefield.info.inc385_field_info_prepare_instance_widget()
Undefined index: moduleNoticefield.info.inc353_field_info_prepare_instance_display()
Failed to set field files[uioyt6zv_und_0] to /var/lib/drupaltestbot/sites/default/files/checkout/sites/default/files/simpletest/643346/text-0.txtOtherfile.test132FileFieldTestCase->uploadNodeFile()
Found the requested form fields at node/add/articleOtherfile.test132FileFieldTestCase->uploadNodeFile()
array_flip(): Can only flip STRING and INTEGER values!Warningentity.inc167DrupalDefaultEntityController->load()
Trying to get property of non-objectNoticefile.test604FileFieldRevisionTestCase->testRevisions()
Trying to get property of non-objectNoticefile.test605FileFieldRevisionTestCase->testRevisions()
Undefined property: stdClass::$uriNoticefile.test172FileFieldTestCase->assertFileExists()
New file saved to disk on node creation.Otherfile.test606FileFieldRevisionTestCase->testRevisions()
Undefined property: stdClass::$fidNoticefile.test180FileFieldTestCase->assertFileEntryExists()
array_flip(): Can only flip STRING and INTEGER values!Warningentity.inc167DrupalDefaultEntityController->load()
Trying to get property of non-objectNoticefile.test182FileFieldTestCase->assertFileEntryExists()
Undefined property: stdClass::$uriNoticefile.test182FileFieldTestCase->assertFileEntryExists()
Undefined property: stdClass::$statusNoticefile.test207FileFieldTestCase->assertFileIsPermanent()
File is permanent.Otherfile.test608FileFieldRevisionTestCase->testRevisions()
Found the Remove buttonOtherfile.test163FileFieldTestCase->replaceNodeFile()
Found the requested form fields at node//editOtherfile.test163FileFieldTestCase->replaceNodeFile()
Failed to set field files[uioyt6zv_und_0] to /var/lib/drupaltestbot/sites/default/files/checkout/sites/default/files/simpletest/643346/text-0.txtOtherfile.test164FileFieldTestCase->replaceNodeFile()
Failed to set field revision to 1Otherfile.test164FileFieldTestCase->replaceNodeFile()
Found the Save buttonOtherfile.test164FileFieldTestCase->replaceNodeFile()
Found the requested form fields at Otherfile.test164FileFieldTestCase->replaceNodeFile()
array_flip(): Can only flip STRING and INTEGER values!Warningentity.inc167DrupalDefaultEntityController->load()
Trying to get property of non-objectNoticefile.test613FileFieldRevisionTestCase->testRevisions()
Trying to get property of non-objectNoticefile.test614FileFieldRevisionTestCase->testRevisions()
Undefined property: stdClass::$uriNoticefile.test172FileFieldTestCase->assertFileExists()
Replacement file exists on disk after creating new revision.Otherfile.test615FileFieldRevisionTestCase->testRevisions()
Undefined property: stdClass::$fidNoticefile.test180FileFieldTestCase->assertFileEntryExists()
array_flip(): Can only flip STRING and INTEGER values!Warningentity.inc167DrupalDefaultEntityController->load()
Trying to get property of non-objectNoticefile.test182FileFieldTestCase->assertFileEntryExists()
Undefined property: stdClass::$uriNoticefile.test182FileFieldTestCase->assertFileEntryExists()
Undefined property: stdClass::$statusNoticefile.test207FileFieldTestCase->assertFileIsPermanent()
Replacement file is permanent.Otherfile.test617FileFieldRevisionTestCase->testRevisions()
array_flip(): Can only flip STRING and INTEGER values!Warningentity.inc167DrupalDefaultEntityController->load()
Trying to get property of non-objectNoticefile.test621FileFieldRevisionTestCase->testRevisions()
Undefined property: stdClass::$uriNoticefile.test172FileFieldTestCase->assertFileExists()
Original file still in place after replacing file in new revision.Otherfile.test622FileFieldRevisionTestCase->testRevisions()
Undefined property: stdClass::$fidNoticefile.test180FileFieldTestCase->assertFileEntryExists()
array_flip(): Can only flip STRING and INTEGER values!Warningentity.inc167DrupalDefaultEntityController->load()
Trying to get property of non-objectNoticefile.test182FileFieldTestCase->assertFileEntryExists()
Undefined property: stdClass::$uriNoticefile.test182FileFieldTestCase->assertFileEntryExists()
Undefined property: stdClass::$statusNoticefile.test207FileFieldTestCase->assertFileIsPermanent()
Original file is still permanent.Otherfile.test624FileFieldRevisionTestCase->testRevisions()
Failed to set field revision to 1Otherfile.test628FileFieldRevisionTestCase->testRevisions()
Found the Save buttonOtherfile.test628FileFieldRevisionTestCase->testRevisions()
Found the requested form fields at node//editOtherfile.test628FileFieldRevisionTestCase->testRevisions()
array_flip(): Can only flip STRING and INTEGER values!Warningentity.inc167DrupalDefaultEntityController->load()
Trying to get property of non-objectNoticefile.test630FileFieldRevisionTestCase->testRevisions()
Trying to get property of non-objectNoticefile.test631FileFieldRevisionTestCase->testRevisions()
Undefined property: stdClass::$statusNoticefile.test207FileFieldTestCase->assertFileIsPermanent()
New revision file is permanent.Otherfile.test633FileFieldRevisionTestCase->testRevisions()
Found the Revert buttonOtherfile.test636FileFieldRevisionTestCase->testRevisions()
Found the requested form fields at node//revisions//revertOtherfile.test636FileFieldRevisionTestCase->testRevisions()
array_flip(): Can only flip STRING and INTEGER values!Warningentity.inc167DrupalDefaultEntityController->load()
Trying to get property of non-objectNoticefile.test638FileFieldRevisionTestCase->testRevisions()
Trying to get property of non-objectNoticefile.test639FileFieldRevisionTestCase->testRevisions()
Undefined property: stdClass::$statusNoticefile.test207FileFieldTestCase->assertFileIsPermanent()
Original revision file still permanent after reverting to the original revision.Otherfile.test641FileFieldRevisionTestCase->testRevisions()
Found the Delete buttonOtherfile.test645FileFieldRevisionTestCase->testRevisions()
Found the requested form fields at node//revisions//deleteOtherfile.test645FileFieldRevisionTestCase->testRevisions()
Undefined property: stdClass::$uriNoticefile.test172FileFieldTestCase->assertFileExists()
Second file is still available after deleting second revision, since it is being used by the third revision.Otherfile.test646FileFieldRevisionTestCase->testRevisions()
Undefined property: stdClass::$fidNoticefile.test180FileFieldTestCase->assertFileEntryExists()
array_flip(): Can only flip STRING and INTEGER values!Warningentity.inc167DrupalDefaultEntityController->load()
Trying to get property of non-objectNoticefile.test182FileFieldTestCase->assertFileEntryExists()
Undefined property: stdClass::$uriNoticefile.test182FileFieldTestCase->assertFileEntryExists()
Undefined property: stdClass::$statusNoticefile.test207FileFieldTestCase->assertFileIsPermanent()
Second file entry is still permanent after deleting second revision, since it is being used by the third revision.Otherfile.test648FileFieldRevisionTestCase->testRevisions()
Undefined index: fidNoticefile.field.inc220file_field_presave()
array_flip(): Can only flip STRING and INTEGER values!Warningentity.inc167DrupalDefaultEntityController->load()
Trying to get property of non-objectNoticefile.field.inc221file_field_presave()
Undefined property: stdClass::$uriNoticefile.inc569file_save()
Undefined index: fidNoticefile.field.inc262file_field_update()
Undefined index: fidNoticefile.field.inc283file_field_update()
Undefined property: stdClass::$fidNoticefile.inc643file_usage_add()
PDOException: SQLSTATE[23000]: Integrity constraint violation: 1048 Column 'fid' cannot be null: INSERT INTO {file_usage} (fid, module, type, id, count) VALUES (:db_insert_placeholder_0, :db_insert_placeholder_1, :db_insert_placeholder_2, :db_insert_placeholder_3, :db_insert_placeholder_4); Array ( [:db_insert_placeholder_0] => [:db_insert_placeholder_1] => file [:db_insert_placeholder_2] => user [:db_insert_placeholder_3] => 3 [:db_insert_placeholder_4] => 1 ) in file_usage_add() (line 650 of /var/lib/drupaltestbot/sites/default/files/checkout/includes/file.inc).Uncaught exceptiondatabase.inc1970PDOStatement->execute()
ExpandFile field validation tests (FileFieldValidateTestCase) [File]763985
MessageGroupFilenameLineFunctionStatus
Node save failed when required file field was empty.Otherfile.test761FileFieldValidateTestCase->testRequired()
Failed to set field files[lxloxs8j_und_0] to /var/lib/drupaltestbot/sites/default/files/checkout/sites/default/files/simpletest/763530/text-0.txtOtherfile.test132FileFieldTestCase->uploadNodeFile()
Found the requested form fields at node/add/articleOtherfile.test132FileFieldTestCase->uploadNodeFile()
uploadNodeFile(public://text-0.txt, lxloxs8j, article) succeededOtherfile.test765FileFieldValidateTestCase->testRequired()
array_flip(): Can only flip STRING and INTEGER values!Warningentity.inc167DrupalDefaultEntityController->load()
Trying to get property of non-objectNoticefile.test769FileFieldValidateTestCase->testRequired()
Undefined property: stdClass::$uriNoticefile.test172FileFieldTestCase->assertFileExists()
File exists after uploading to the required field.Otherfile.test770FileFieldValidateTestCase->testRequired()
Undefined property: stdClass::$fidNoticefile.test180FileFieldTestCase->assertFileEntryExists()
array_flip(): Can only flip STRING and INTEGER values!Warningentity.inc167DrupalDefaultEntityController->load()
Trying to get property of non-objectNoticefile.test182FileFieldTestCase->assertFileEntryExists()
Undefined property: stdClass::$uriNoticefile.test182FileFieldTestCase->assertFileEntryExists()
Undefined index: moduleNoticefield.info.inc385_field_info_prepare_instance_widget()
Undefined index: moduleNoticefield.info.inc353_field_info_prepare_instance_display()
Undefined index: moduleNoticefield.info.inc353_field_info_prepare_instance_display()
Undefined index: moduleNoticefield.info.inc385_field_info_prepare_instance_widget()
Undefined index: moduleNoticefield.info.inc353_field_info_prepare_instance_display()
Node save failed when required multiple value file field was empty.Otherfile.test780FileFieldValidateTestCase->testRequired()
Failed to set field files[lxloxs8j_und_0] to /var/lib/drupaltestbot/sites/default/files/checkout/sites/default/files/simpletest/763530/text-0.txtOtherfile.test132FileFieldTestCase->uploadNodeFile()
Found the requested form fields at node/add/articleOtherfile.test132FileFieldTestCase->uploadNodeFile()
array_flip(): Can only flip STRING and INTEGER values!Warningentity.inc167DrupalDefaultEntityController->load()
Trying to get property of non-objectNoticefile.test785FileFieldValidateTestCase->testRequired()
Undefined property: stdClass::$uriNoticefile.test172FileFieldTestCase->assertFileExists()
File exists after uploading to the required multiple value field.Otherfile.test786FileFieldValidateTestCase->testRequired()
Undefined property: stdClass::$fidNoticefile.test180FileFieldTestCase->assertFileEntryExists()
array_flip(): Can only flip STRING and INTEGER values!Warningentity.inc167DrupalDefaultEntityController->load()
Trying to get property of non-objectNoticefile.test182FileFieldTestCase->assertFileEntryExists()
Undefined property: stdClass::$uriNoticefile.test182FileFieldTestCase->assertFileEntryExists()
ExpandFile field widget test (FileFieldWidgetTestCase) [File]1267236
MessageGroupFilenameLineFunctionStatus
Failed to set field files[ktvytriq_und_0] to /var/lib/drupaltestbot/sites/default/files/checkout/sites/default/files/simpletest/720185/text-0.txtOtherfile.test132FileFieldTestCase->uploadNodeFile()
Found the requested form fields at node/add/pageOtherfile.test132FileFieldTestCase->uploadNodeFile()
array_flip(): Can only flip STRING and INTEGER values!Warningentity.inc167DrupalDefaultEntityController->load()
Trying to get property of non-objectNoticefile.test336FileFieldWidgetTestCase->testSingleValuedWidget()
Undefined property: stdClass::$uriNoticefile.test172FileFieldTestCase->assertFileExists()
New file saved to disk on node creation.Otherfile.test337FileFieldWidgetTestCase->testSingleValuedWidget()
Undefined property: stdClass::$uriNoticefile.test340FileFieldWidgetTestCase->testSingleValuedWidget()
Node with file displays the "Remove" button.Otherfile.test346FileFieldWidgetTestCase->testSingleValuedWidget()
Found the Remove buttonOtherfile.test351FileFieldWidgetTestCase->testSingleValuedWidget()
Found the requested form fields at Otherfile.test351FileFieldWidgetTestCase->testSingleValuedWidget()
After clicking the "Remove" button, the "Upload" button is displayed.Otherfile.test361FileFieldWidgetTestCase->testSingleValuedWidget()
Found the Save buttonOtherfile.test364FileFieldWidgetTestCase->testSingleValuedWidget()
Found the requested form fields at Otherfile.test364FileFieldWidgetTestCase->testSingleValuedWidget()
array_flip(): Can only flip STRING and INTEGER values!Warningentity.inc167DrupalDefaultEntityController->load()
Failed to set field files[ktvytriq_und_0] to /var/lib/drupaltestbot/sites/default/files/checkout/sites/default/files/simpletest/720185/text-0.txtOtherfile.test132FileFieldTestCase->uploadNodeFile()
Found the requested form fields at node/add/pageOtherfile.test132FileFieldTestCase->uploadNodeFile()
array_flip(): Can only flip STRING and INTEGER values!Warningentity.inc167DrupalDefaultEntityController->load()
Trying to get property of non-objectNoticefile.test336FileFieldWidgetTestCase->testSingleValuedWidget()
Undefined property: stdClass::$uriNoticefile.test172FileFieldTestCase->assertFileExists()
New file saved to disk on node creation.Otherfile.test337FileFieldWidgetTestCase->testSingleValuedWidget()
Undefined property: stdClass::$uriNoticefile.test340FileFieldWidgetTestCase->testSingleValuedWidget()
Node with file displays the "Remove" button.Otherfile.test346FileFieldWidgetTestCase->testSingleValuedWidget()
Undefined offset: 0Noticefile.test355FileFieldWidgetTestCase->testSingleValuedWidget()
Undefined offset: 0Noticefile.test355FileFieldWidgetTestCase->testSingleValuedWidget()
Undefined offset: 0Noticedrupal_web_test_case.php1826DrupalWebTestCase->drupalPostAJAX()
Undefined index: ajaxNoticedrupal_web_test_case.php1827DrupalWebTestCase->drupalPostAJAX()
Found the requested form fields at Otherfile.test355FileFieldWidgetTestCase->testSingleValuedWidget()
After clicking the "Remove" button, the "Upload" button is displayed.Otherfile.test361FileFieldWidgetTestCase->testSingleValuedWidget()
Found the Save buttonOtherfile.test364FileFieldWidgetTestCase->testSingleValuedWidget()
Found the requested form fields at Otherfile.test364FileFieldWidgetTestCase->testSingleValuedWidget()
array_flip(): Can only flip STRING and INTEGER values!Warningentity.inc167DrupalDefaultEntityController->load()
ExpandFile token replacement (FileTokenReplaceTestCase) [File]27953
MessageGroupFilenameLineFunctionStatus
Failed to set field files[field_alvg9eel_und_0] to /var/lib/drupaltestbot/sites/default/files/checkout/sites/default/files/simpletest/463960/text-0.txtOtherfile.test132FileFieldTestCase->uploadNodeFile()
Found the requested form fields at node/add/articleOtherfile.test132FileFieldTestCase->uploadNodeFile()
array_flip(): Can only flip STRING and INTEGER values!Warningentity.inc167DrupalDefaultEntityController->load()
Trying to get property of non-objectNoticefile.test1005FileTokenReplaceTestCase->testFileTokenReplacement()
Undefined property: stdClass::$fidNoticefile.test1010FileTokenReplaceTestCase->testFileTokenReplacement()
Undefined property: stdClass::$filenameNoticefile.test1011FileTokenReplaceTestCase->testFileTokenReplacement()
Undefined property: stdClass::$uriNoticefile.test1013FileTokenReplaceTestCase->testFileTokenReplacement()
Undefined property: stdClass::$filemimeNoticefile.test1014FileTokenReplaceTestCase->testFileTokenReplacement()
Undefined property: stdClass::$filesizeNoticefile.test1015FileTokenReplaceTestCase->testFileTokenReplacement()
Undefined property: stdClass::$uriNoticefile.test1016FileTokenReplaceTestCase->testFileTokenReplacement()
Undefined property: stdClass::$timestampNoticefile.test1017FileTokenReplaceTestCase->testFileTokenReplacement()
date_timezone_set() expects parameter 1 to be DateTime, boolean givenWarningcommon.inc1882format_date()
date_format() expects parameter 1 to be DateTime, boolean givenWarningcommon.inc1892format_date()
Undefined property: stdClass::$timestampNoticefile.test1018FileTokenReplaceTestCase->testFileTokenReplacement()
date_timezone_set() expects parameter 1 to be DateTime, boolean givenWarningcommon.inc1882format_date()
date_format() expects parameter 1 to be DateTime, boolean givenWarningcommon.inc1892format_date()
Undefined property: stdClass::$uidNoticefile.test1020FileTokenReplaceTestCase->testFileTokenReplacement()
No empty tokens generated.Otherfile.test1023FileTokenReplaceTestCase->testFileTokenReplacement()
Undefined property: stdClass::$fidNoticesystem.tokens.inc224system_tokens()
Undefined property: stdClass::$filenameNoticesystem.tokens.inc229system_tokens()
Undefined property: stdClass::$uriNoticesystem.tokens.inc237system_tokens()
Undefined property: stdClass::$filemimeNoticesystem.tokens.inc241system_tokens()
Undefined property: stdClass::$filesizeNoticesystem.tokens.inc245system_tokens()
Undefined property: stdClass::$uriNoticesystem.tokens.inc249system_tokens()
Undefined property: stdClass::$timestampNoticesystem.tokens.inc254system_tokens()
date_timezone_set() expects parameter 1 to be DateTime, boolean givenWarningcommon.inc1882format_date()
date_format() expects parameter 1 to be DateTime, boolean givenWarningcommon.inc1892format_date()
Undefined property: stdClass::$timestampNoticesystem.tokens.inc265system_tokens()
Sanitized file token [file:timestamp:short] replaced.Otherfile.test1027FileTokenReplaceTestCase->testFileTokenReplacement()
Undefined property: stdClass::$uidNoticesystem.tokens.inc258system_tokens()
array_flip(): Can only flip STRING and INTEGER values!Warningentity.inc167DrupalDefaultEntityController->load()
array_flip(): Can only flip STRING and INTEGER values!Warningentity.inc343DrupalDefaultEntityController->cacheGet()
Trying to get property of non-objectNoticesystem.tokens.inc259system_tokens()
Sanitized file token [file:owner] replaced.Otherfile.test1027FileTokenReplaceTestCase->testFileTokenReplacement()
Undefined property: stdClass::$uidNoticesystem.tokens.inc268system_tokens()
array_flip(): Can only flip STRING and INTEGER values!Warningentity.inc167DrupalDefaultEntityController->load()
array_flip(): Can only flip STRING and INTEGER values!Warningentity.inc343DrupalDefaultEntityController->cacheGet()
Sanitized file token [file:owner:uid] replaced.Otherfile.test1027FileTokenReplaceTestCase->testFileTokenReplacement()
Undefined property: stdClass::$filenameNoticefile.test1031FileTokenReplaceTestCase->testFileTokenReplacement()
Undefined property: stdClass::$uriNoticefile.test1033FileTokenReplaceTestCase->testFileTokenReplacement()
Undefined property: stdClass::$filemimeNoticefile.test1034FileTokenReplaceTestCase->testFileTokenReplacement()
Undefined property: stdClass::$filesizeNoticefile.test1035FileTokenReplaceTestCase->testFileTokenReplacement()
Undefined property: stdClass::$fidNoticesystem.tokens.inc224system_tokens()
ExpandFilter administration functionality (FilterAdminTestCase) [Filter]21203
MessageGroupFilenameLineFunctionStatus
Undefined index: moduleNoticefield.info.inc385_field_info_prepare_instance_widget()
Undefined index: moduleNoticefield.info.inc353_field_info_prepare_instance_display()
Undefined index: moduleNoticefield.info.inc353_field_info_prepare_instance_display()
ExpandFilter format access (FilterFormatAccessTestCase) [Filter]29006
MessageGroupFilenameLineFunctionStatus
Undefined index: moduleNoticefield.info.inc385_field_info_prepare_instance_widget()
Undefined index: moduleNoticefield.info.inc353_field_info_prepare_instance_display()
Undefined index: moduleNoticefield.info.inc353_field_info_prepare_instance_display()
Undefined index: moduleNoticefield.info.inc385_field_info_prepare_instance_widget()
Undefined index: moduleNoticefield.info.inc353_field_info_prepare_instance_display()
Undefined index: moduleNoticefield.info.inc353_field_info_prepare_instance_display()
ExpandFormat date (FormatDateUnitTest) [System]4303
MessageGroupFilenameLineFunctionStatus
Undefined index: moduleNoticefield.info.inc385_field_info_prepare_instance_widget()
Undefined index: moduleNoticefield.info.inc353_field_info_prepare_instance_display()
Undefined index: moduleNoticefield.info.inc353_field_info_prepare_instance_display()
ExpandForum functionality (ForumTestCase) [Forum]60803
MessageGroupFilenameLineFunctionStatus
Undefined index: moduleNoticefield.info.inc385_field_info_prepare_instance_widget()
Undefined index: moduleNoticefield.info.inc353_field_info_prepare_instance_display()
Undefined index: moduleNoticefield.info.inc353_field_info_prepare_instance_display()
ExpandImage field display tests (ImageFieldDisplayTestCase) [Image]17710
MessageGroupFilenameLineFunctionStatus
The test did not complete due to a fatal error.Completion checkimage.test625ImageFieldDisplayTestCase->testImageFieldFormattersPublic()
Undefined index: moduleNoticefield.info.inc385_field_info_prepare_instance_widget()
Undefined index: moduleNoticefield.info.inc353_field_info_prepare_instance_display()
Undefined index: moduleNoticefield.info.inc353_field_info_prepare_instance_display()
Undefined index: moduleNoticefield.info.inc385_field_info_prepare_instance_widget()
Undefined index: moduleNoticefield.info.inc353_field_info_prepare_instance_display()
Failed to set field files[fg4ad1wx_und_0] to /var/lib/drupaltestbot/sites/default/files/checkout/sites/default/files/simpletest/283669/image-test.pngOtherimage.test98ImageFieldTestCase->uploadNodeImage()
Found the requested form fields at node/add/articleOtherimage.test98ImageFieldTestCase->uploadNodeImage()
array_flip(): Can only flip STRING and INTEGER values!Warningentity.inc167DrupalDefaultEntityController->load()
Trying to get property of non-objectNoticeimage.test650ImageFieldDisplayTestCase->_testImageFieldFormatters()
Default formatter displaying correctly on full node view.Otherimage.test655ImageFieldDisplayTestCase->_testImageFieldFormatters()
Undefined index: moduleNoticefield.crud.inc779_field_write_instance()
Image linked to file formatter displaying correctly on full node view.Otherimage.test664ImageFieldDisplayTestCase->_testImageFieldFormatters()
File was downloaded successfully.Otherimage.test666ImageFieldDisplayTestCase->_testImageFieldFormatters()
Undefined index: moduleNoticefield.crud.inc779_field_write_instance()
Image linked to content formatter displaying correctly on full node view.Otherimage.test688ImageFieldDisplayTestCase->_testImageFieldFormatters()
Undefined index: moduleNoticefield.crud.inc779_field_write_instance()
ExpandImage field validation tests (ImageFieldValidateTestCase) [Image]1465
MessageGroupFilenameLineFunctionStatus
Undefined index: moduleNoticefield.info.inc385_field_info_prepare_instance_widget()
Undefined index: moduleNoticefield.info.inc353_field_info_prepare_instance_display()
Undefined index: moduleNoticefield.info.inc353_field_info_prepare_instance_display()
Undefined index: moduleNoticefield.info.inc385_field_info_prepare_instance_widget()
Undefined index: moduleNoticefield.info.inc353_field_info_prepare_instance_display()
Failed to set field files[vz8qq66y_und_0] to /var/lib/drupaltestbot/sites/default/files/checkout/sites/default/files/simpletest/971262/image-test.jpgOtherimage.test98ImageFieldTestCase->uploadNodeImage()
Found the requested form fields at node/add/articleOtherimage.test98ImageFieldTestCase->uploadNodeImage()
Node save failed when minimum image resolution was not met.Otherimage.test863ImageFieldValidateTestCase->testResolution()
Failed to set field files[vz8qq66y_und_0] to /var/lib/drupaltestbot/sites/default/files/checkout/sites/default/files/simpletest/971262/image-1.pngOtherimage.test98ImageFieldTestCase->uploadNodeImage()
Found the requested form fields at node/add/articleOtherimage.test98ImageFieldTestCase->uploadNodeImage()
Image exceeding max resolution was properly resized.Otherimage.test865ImageFieldValidateTestCase->testResolution()
ExpandImage styles and effects UI configuration (ImageAdminStylesUnitTest) [Image]14937
MessageGroupFilenameLineFunctionStatus
The test did not complete due to a fatal error.Completion checkimage.test565ImageAdminStylesUnitTest->testStyleReplacement()
Undefined index: moduleNoticefield.info.inc385_field_info_prepare_instance_widget()
Undefined index: moduleNoticefield.info.inc353_field_info_prepare_instance_display()
Undefined index: moduleNoticefield.info.inc353_field_info_prepare_instance_display()
Undefined index: moduleNoticefield.info.inc385_field_info_prepare_instance_widget()
Undefined index: moduleNoticefield.info.inc353_field_info_prepare_instance_display()
Failed to set field files[gbb8fkfumc_und_0] to /var/lib/drupaltestbot/sites/default/files/checkout/sites/default/files/simpletest/997585/image-test.pngOtherimage.test98ImageFieldTestCase->uploadNodeImage()
Found the requested form fields at node/add/articleOtherimage.test98ImageFieldTestCase->uploadNodeImage()
array_flip(): Can only flip STRING and INTEGER values!Warningentity.inc167DrupalDefaultEntityController->load()
Trying to get property of non-objectNoticeimage.test585ImageAdminStylesUnitTest->testStyleReplacement()
ExpandList field UI (ListFieldUITestCase) [Field types]36019
MessageGroupFilenameLineFunctionStatus
Undefined index: moduleNoticefield.info.inc385_field_info_prepare_instance_widget()
Undefined index: moduleNoticefield.info.inc353_field_info_prepare_instance_display()
Undefined index: moduleNoticefield.info.inc353_field_info_prepare_instance_display()
Undefined index: moduleNoticefield.info.inc385_field_info_prepare_instance_widget()
Undefined index: moduleNoticefield.info.inc353_field_info_prepare_instance_display()
Undefined index: moduleNoticefield.info.inc353_field_info_prepare_instance_display()
Undefined index: moduleNoticefield.info.inc385_field_info_prepare_instance_widget()
Undefined index: moduleNoticefield.info.inc353_field_info_prepare_instance_display()
Undefined index: moduleNoticefield.info.inc353_field_info_prepare_instance_display()
Undefined index: moduleNoticefield.info.inc385_field_info_prepare_instance_widget()
Undefined index: moduleNoticefield.info.inc353_field_info_prepare_instance_display()
Undefined index: moduleNoticefield.info.inc353_field_info_prepare_instance_display()
Undefined index: moduleNoticefield.info.inc385_field_info_prepare_instance_widget()
Undefined index: moduleNoticefield.info.inc353_field_info_prepare_instance_display()
Undefined index: moduleNoticefield.info.inc353_field_info_prepare_instance_display()
Undefined index: moduleNoticefield.info.inc385_field_info_prepare_instance_widget()
Undefined index: moduleNoticefield.info.inc353_field_info_prepare_instance_display()
Undefined index: moduleNoticefield.info.inc353_field_info_prepare_instance_display()
Undefined index: imageNoticefield_ui.admin.inc1491field_ui_existing_field_options()
ExpandLocalize date formats (LocaleDateFormatsFunctionalTest) [Locale]3503
MessageGroupFilenameLineFunctionStatus
Undefined index: moduleNoticefield.info.inc385_field_info_prepare_instance_widget()
Undefined index: moduleNoticefield.info.inc353_field_info_prepare_instance_display()
Undefined index: moduleNoticefield.info.inc353_field_info_prepare_instance_display()
ExpandMain content rendering fallback (SystemMainContentFallback) [System]6603
MessageGroupFilenameLineFunctionStatus
Undefined index: moduleNoticefield.info.inc385_field_info_prepare_instance_widget()
Undefined index: moduleNoticefield.info.inc353_field_info_prepare_instance_display()
Undefined index: moduleNoticefield.info.inc353_field_info_prepare_instance_display()
ExpandManage display (FieldUIManageDisplayTestCase) [Field UI]81072
MessageGroupFilenameLineFunctionStatus
Undefined index: moduleNoticefield.info.inc385_field_info_prepare_instance_widget()
Undefined index: moduleNoticefield.info.inc353_field_info_prepare_instance_display()
Undefined index: moduleNoticefield.info.inc353_field_info_prepare_instance_display()
Undefined index: moduleNoticefield.info.inc385_field_info_prepare_instance_widget()
Undefined index: moduleNoticefield.info.inc353_field_info_prepare_instance_display()
Undefined index: moduleNoticefield.info.inc353_field_info_prepare_instance_display()
Undefined index: imageNoticefield_ui.admin.inc1491field_ui_existing_field_options()
Undefined index: moduleNoticefield.info.inc385_field_info_prepare_instance_widget()
Undefined index: moduleNoticefield.info.inc353_field_info_prepare_instance_display()
Undefined index: moduleNoticefield.info.inc353_field_info_prepare_instance_display()
Undefined index: imageNoticefield_ui.admin.inc1491field_ui_existing_field_options()
Undefined index: moduleNoticefield.info.inc385_field_info_prepare_instance_widget()
Undefined index: moduleNoticefield.info.inc353_field_info_prepare_instance_display()
Undefined index: moduleNoticefield.info.inc353_field_info_prepare_instance_display()
Undefined index: moduleNoticefield.info.inc385_field_info_prepare_instance_widget()
Undefined index: moduleNoticefield.info.inc353_field_info_prepare_instance_display()
Undefined index: moduleNoticefield.info.inc353_field_info_prepare_instance_display()
Undefined index: moduleNoticefield.info.inc385_field_info_prepare_instance_widget()
Undefined index: moduleNoticefield.info.inc353_field_info_prepare_instance_display()
Undefined index: moduleNoticefield.info.inc353_field_info_prepare_instance_display()
Undefined index: moduleNoticefield.info.inc385_field_info_prepare_instance_widget()
Undefined index: moduleNoticefield.info.inc353_field_info_prepare_instance_display()
Undefined index: moduleNoticefield.info.inc353_field_info_prepare_instance_display()
Undefined index: moduleNoticefield.info.inc385_field_info_prepare_instance_widget()
Undefined index: moduleNoticefield.info.inc353_field_info_prepare_instance_display()
Undefined index: moduleNoticefield.info.inc353_field_info_prepare_instance_display()
Undefined index: imageNoticefield_ui.admin.inc1491field_ui_existing_field_options()
Undefined index: moduleNoticefield.info.inc385_field_info_prepare_instance_widget()
Undefined index: moduleNoticefield.info.inc353_field_info_prepare_instance_display()
Undefined index: moduleNoticefield.info.inc353_field_info_prepare_instance_display()
Undefined index: moduleNoticefield.info.inc385_field_info_prepare_instance_widget()
Undefined index: moduleNoticefield.info.inc353_field_info_prepare_instance_display()
Undefined index: moduleNoticefield.info.inc353_field_info_prepare_instance_display()
Undefined index: moduleNoticefield.info.inc385_field_info_prepare_instance_widget()
Undefined index: moduleNoticefield.info.inc353_field_info_prepare_instance_display()
Undefined index: moduleNoticefield.info.inc353_field_info_prepare_instance_display()
Undefined index: imageNoticefield_ui.admin.inc1491field_ui_existing_field_options()
Undefined index: moduleNoticefield.info.inc385_field_info_prepare_instance_widget()
Undefined index: moduleNoticefield.info.inc353_field_info_prepare_instance_display()
Undefined index: moduleNoticefield.info.inc353_field_info_prepare_instance_display()
Undefined index: imageNoticefield_ui.admin.inc1491field_ui_existing_field_options()
Undefined index: moduleNoticefield.info.inc385_field_info_prepare_instance_widget()
Undefined index: moduleNoticefield.info.inc353_field_info_prepare_instance_display()
Undefined index: moduleNoticefield.info.inc353_field_info_prepare_instance_display()
Undefined index: moduleNoticefield.info.inc385_field_info_prepare_instance_widget()
Undefined index: moduleNoticefield.info.inc353_field_info_prepare_instance_display()
Undefined index: moduleNoticefield.info.inc353_field_info_prepare_instance_display()
Undefined index: moduleNoticefield.info.inc385_field_info_prepare_instance_widget()
Undefined index: moduleNoticefield.info.inc353_field_info_prepare_instance_display()
Undefined index: moduleNoticefield.info.inc353_field_info_prepare_instance_display()
Undefined index: moduleNoticefield.info.inc385_field_info_prepare_instance_widget()
Undefined index: moduleNoticefield.info.inc353_field_info_prepare_instance_display()
Undefined index: moduleNoticefield.info.inc353_field_info_prepare_instance_display()
Undefined index: moduleNoticefield.info.inc385_field_info_prepare_instance_widget()
Undefined index: moduleNoticefield.info.inc353_field_info_prepare_instance_display()
Undefined index: moduleNoticefield.info.inc353_field_info_prepare_instance_display()
Undefined index: imageNoticefield_ui.admin.inc1491field_ui_existing_field_options()
Undefined index: moduleNoticefield.info.inc385_field_info_prepare_instance_widget()
Undefined index: moduleNoticefield.info.inc353_field_info_prepare_instance_display()
Undefined index: moduleNoticefield.info.inc353_field_info_prepare_instance_display()
Undefined index: moduleNoticefield.info.inc385_field_info_prepare_instance_widget()
Undefined index: moduleNoticefield.info.inc353_field_info_prepare_instance_display()
Undefined index: moduleNoticefield.info.inc353_field_info_prepare_instance_display()
Undefined index: moduleNoticefield.info.inc385_field_info_prepare_instance_widget()
Undefined index: moduleNoticefield.info.inc353_field_info_prepare_instance_display()
Undefined index: moduleNoticefield.info.inc353_field_info_prepare_instance_display()
Undefined index: moduleNoticefield.info.inc385_field_info_prepare_instance_widget()
Undefined index: moduleNoticefield.info.inc353_field_info_prepare_instance_display()
Undefined index: moduleNoticefield.info.inc353_field_info_prepare_instance_display()
Undefined index: moduleNoticefield.info.inc385_field_info_prepare_instance_widget()
Undefined index: moduleNoticefield.info.inc353_field_info_prepare_instance_display()
Undefined index: moduleNoticefield.info.inc353_field_info_prepare_instance_display()
ExpandManage fields (FieldUIManageFieldsTestCase) [Field UI]1500180
MessageGroupFilenameLineFunctionStatus
Undefined index: moduleNoticefield.info.inc385_field_info_prepare_instance_widget()
Undefined index: moduleNoticefield.info.inc353_field_info_prepare_instance_display()
Undefined index: moduleNoticefield.info.inc353_field_info_prepare_instance_display()
Undefined index: moduleNoticefield.info.inc385_field_info_prepare_instance_widget()
Undefined index: moduleNoticefield.info.inc353_field_info_prepare_instance_display()
Undefined index: moduleNoticefield.info.inc353_field_info_prepare_instance_display()
Undefined index: imageNoticefield_ui.admin.inc1491field_ui_existing_field_options()
Undefined index: moduleNoticefield.info.inc385_field_info_prepare_instance_widget()
Undefined index: moduleNoticefield.info.inc353_field_info_prepare_instance_display()
Undefined index: moduleNoticefield.info.inc353_field_info_prepare_instance_display()
Undefined index: imageNoticefield_ui.admin.inc1491field_ui_existing_field_options()
Undefined index: moduleNoticefield.info.inc385_field_info_prepare_instance_widget()
Undefined index: moduleNoticefield.info.inc353_field_info_prepare_instance_display()
Undefined index: moduleNoticefield.info.inc353_field_info_prepare_instance_display()
Undefined index: imageNoticefield_ui.admin.inc1491field_ui_existing_field_options()
Undefined index: moduleNoticefield.info.inc385_field_info_prepare_instance_widget()
Undefined index: moduleNoticefield.info.inc353_field_info_prepare_instance_display()
Undefined index: moduleNoticefield.info.inc353_field_info_prepare_instance_display()
Undefined index: moduleNoticefield.info.inc385_field_info_prepare_instance_widget()
Undefined index: moduleNoticefield.info.inc353_field_info_prepare_instance_display()
Undefined index: moduleNoticefield.info.inc353_field_info_prepare_instance_display()
Undefined index: moduleNoticefield.info.inc385_field_info_prepare_instance_widget()
Undefined index: moduleNoticefield.info.inc353_field_info_prepare_instance_display()
Undefined index: moduleNoticefield.info.inc353_field_info_prepare_instance_display()
Undefined index: moduleNoticefield.info.inc385_field_info_prepare_instance_widget()
Undefined index: moduleNoticefield.info.inc353_field_info_prepare_instance_display()
Undefined index: moduleNoticefield.info.inc353_field_info_prepare_instance_display()
Undefined index: moduleNoticefield.info.inc385_field_info_prepare_instance_widget()
Undefined index: moduleNoticefield.info.inc353_field_info_prepare_instance_display()
Undefined index: moduleNoticefield.info.inc353_field_info_prepare_instance_display()
Undefined index: imageNoticefield_ui.admin.inc1491field_ui_existing_field_options()
Undefined index: moduleNoticefield.info.inc385_field_info_prepare_instance_widget()
Undefined index: moduleNoticefield.info.inc353_field_info_prepare_instance_display()
Undefined index: moduleNoticefield.info.inc353_field_info_prepare_instance_display()
Undefined index: imageNoticefield_ui.admin.inc1491field_ui_existing_field_options()
Undefined index: moduleNoticefield.info.inc385_field_info_prepare_instance_widget()
Undefined index: moduleNoticefield.info.inc353_field_info_prepare_instance_display()
Undefined index: moduleNoticefield.info.inc353_field_info_prepare_instance_display()
Undefined index: moduleNoticefield.info.inc385_field_info_prepare_instance_widget()
Undefined index: moduleNoticefield.info.inc353_field_info_prepare_instance_display()
Undefined index: moduleNoticefield.info.inc353_field_info_prepare_instance_display()
Undefined index: imageNoticefield_ui.admin.inc1491field_ui_existing_field_options()
Undefined index: moduleNoticefield.info.inc385_field_info_prepare_instance_widget()
Undefined index: moduleNoticefield.info.inc353_field_info_prepare_instance_display()
Undefined index: moduleNoticefield.info.inc353_field_info_prepare_instance_display()
Undefined index: moduleNoticefield.info.inc385_field_info_prepare_instance_widget()
Undefined index: moduleNoticefield.info.inc353_field_info_prepare_instance_display()
Undefined index: moduleNoticefield.info.inc353_field_info_prepare_instance_display()
Undefined index: imageNoticefield_ui.admin.inc1491field_ui_existing_field_options()
Undefined index: moduleNoticefield.info.inc385_field_info_prepare_instance_widget()
Undefined index: moduleNoticefield.info.inc353_field_info_prepare_instance_display()
Undefined index: moduleNoticefield.info.inc353_field_info_prepare_instance_display()
Undefined index: imageNoticefield_ui.admin.inc1491field_ui_existing_field_options()
Undefined index: moduleNoticefield.info.inc385_field_info_prepare_instance_widget()
Undefined index: moduleNoticefield.info.inc353_field_info_prepare_instance_display()
Undefined index: moduleNoticefield.info.inc353_field_info_prepare_instance_display()
Undefined index: imageNoticefield_ui.admin.inc1491field_ui_existing_field_options()
Undefined index: moduleNoticefield.info.inc385_field_info_prepare_instance_widget()
Undefined index: moduleNoticefield.info.inc353_field_info_prepare_instance_display()
Undefined index: moduleNoticefield.info.inc353_field_info_prepare_instance_display()
Undefined index: moduleNoticefield.info.inc385_field_info_prepare_instance_widget()
Undefined index: moduleNoticefield.info.inc353_field_info_prepare_instance_display()
Undefined index: moduleNoticefield.info.inc353_field_info_prepare_instance_display()
Undefined index: moduleNoticefield.info.inc385_field_info_prepare_instance_widget()
Undefined index: moduleNoticefield.info.inc353_field_info_prepare_instance_display()
Undefined index: moduleNoticefield.info.inc353_field_info_prepare_instance_display()
Undefined index: moduleNoticefield.info.inc385_field_info_prepare_instance_widget()
Undefined index: moduleNoticefield.info.inc353_field_info_prepare_instance_display()
Undefined index: moduleNoticefield.info.inc353_field_info_prepare_instance_display()
Undefined index: imageNoticefield_ui.admin.inc1491field_ui_existing_field_options()
Undefined index: moduleNoticefield.info.inc385_field_info_prepare_instance_widget()
Undefined index: moduleNoticefield.info.inc353_field_info_prepare_instance_display()
Undefined index: moduleNoticefield.info.inc353_field_info_prepare_instance_display()
Undefined index: moduleNoticefield.info.inc385_field_info_prepare_instance_widget()
Undefined index: moduleNoticefield.info.inc353_field_info_prepare_instance_display()
Undefined index: moduleNoticefield.info.inc353_field_info_prepare_instance_display()
Undefined index: moduleNoticefield.info.inc385_field_info_prepare_instance_widget()
Undefined index: moduleNoticefield.info.inc353_field_info_prepare_instance_display()
Undefined index: moduleNoticefield.info.inc353_field_info_prepare_instance_display()
Undefined index: imageNoticefield_ui.admin.inc1491field_ui_existing_field_options()
Undefined index: moduleNoticefield.info.inc385_field_info_prepare_instance_widget()
Undefined index: moduleNoticefield.info.inc353_field_info_prepare_instance_display()
Undefined index: moduleNoticefield.info.inc353_field_info_prepare_instance_display()
Undefined index: moduleNoticefield.info.inc385_field_info_prepare_instance_widget()
Undefined index: moduleNoticefield.info.inc353_field_info_prepare_instance_display()
Undefined index: moduleNoticefield.info.inc353_field_info_prepare_instance_display()
Undefined index: imageNoticefield_ui.admin.inc1491field_ui_existing_field_options()
ExpandMultilingual fields (LocaleMultilingualFieldsFunctionalTest) [Locale]6006
MessageGroupFilenameLineFunctionStatus
Undefined index: moduleNoticefield.info.inc385_field_info_prepare_instance_widget()
Undefined index: moduleNoticefield.info.inc353_field_info_prepare_instance_display()
Undefined index: moduleNoticefield.info.inc353_field_info_prepare_instance_display()
Undefined index: moduleNoticefield.info.inc385_field_info_prepare_instance_widget()
Undefined index: moduleNoticefield.info.inc353_field_info_prepare_instance_display()
Undefined index: moduleNoticefield.info.inc353_field_info_prepare_instance_display()
ExpandNode types (NodeTypeTestCase) [Node]84025
MessageGroupFilenameLineFunctionStatus
Undefined index: moduleNoticefield.info.inc385_field_info_prepare_instance_widget()
Undefined index: moduleNoticefield.info.inc353_field_info_prepare_instance_display()
Undefined index: moduleNoticefield.info.inc353_field_info_prepare_instance_display()
Undefined index: moduleNoticefield.info.inc385_field_info_prepare_instance_widget()
Undefined index: moduleNoticefield.info.inc353_field_info_prepare_instance_display()
Undefined index: moduleNoticefield.info.inc353_field_info_prepare_instance_display()
Undefined index: moduleNoticefield.info.inc385_field_info_prepare_instance_widget()
Undefined index: moduleNoticefield.info.inc353_field_info_prepare_instance_display()
Undefined index: moduleNoticefield.info.inc353_field_info_prepare_instance_display()
Undefined index: moduleNoticefield.info.inc385_field_info_prepare_instance_widget()
Undefined index: moduleNoticefield.info.inc353_field_info_prepare_instance_display()
Undefined index: moduleNoticefield.info.inc353_field_info_prepare_instance_display()
Undefined index: moduleNoticefield.info.inc385_field_info_prepare_instance_widget()
Undefined index: moduleNoticefield.info.inc353_field_info_prepare_instance_display()
Undefined index: moduleNoticefield.info.inc353_field_info_prepare_instance_display()
Undefined index: moduleNoticefield.info.inc385_field_info_prepare_instance_widget()
Undefined index: moduleNoticefield.info.inc353_field_info_prepare_instance_display()
Undefined index: moduleNoticefield.info.inc353_field_info_prepare_instance_display()
Undefined index: moduleNoticefield.info.inc385_field_info_prepare_instance_widget()
Undefined index: moduleNoticefield.info.inc353_field_info_prepare_instance_display()
Undefined index: moduleNoticefield.info.inc353_field_info_prepare_instance_display()
Undefined index: moduleNoticefield.info.inc385_field_info_prepare_instance_widget()
Undefined index: moduleNoticefield.info.inc353_field_info_prepare_instance_display()
Undefined index: moduleNoticefield.info.inc353_field_info_prepare_instance_display()
Undefined index: imageNoticefield_ui.admin.inc1491field_ui_existing_field_options()
ExpandNumber field (NumberFieldTestCase) [Field types]1503
MessageGroupFilenameLineFunctionStatus
Undefined index: moduleNoticefield.info.inc385_field_info_prepare_instance_widget()
Undefined index: moduleNoticefield.info.inc353_field_info_prepare_instance_display()
Undefined index: moduleNoticefield.info.inc353_field_info_prepare_instance_display()
ExpandOptions widgets (OptionsWidgetsTestCase) [Field types]229018
MessageGroupFilenameLineFunctionStatus
Undefined index: moduleNoticefield.info.inc385_field_info_prepare_instance_widget()
Undefined index: moduleNoticefield.info.inc353_field_info_prepare_instance_display()
Undefined index: moduleNoticefield.info.inc353_field_info_prepare_instance_display()
Undefined index: moduleNoticefield.info.inc385_field_info_prepare_instance_widget()
Undefined index: moduleNoticefield.info.inc353_field_info_prepare_instance_display()
Undefined index: moduleNoticefield.info.inc353_field_info_prepare_instance_display()
Undefined index: moduleNoticefield.info.inc385_field_info_prepare_instance_widget()
Undefined index: moduleNoticefield.info.inc353_field_info_prepare_instance_display()
Undefined index: moduleNoticefield.info.inc353_field_info_prepare_instance_display()
Undefined index: moduleNoticefield.info.inc385_field_info_prepare_instance_widget()
Undefined index: moduleNoticefield.info.inc353_field_info_prepare_instance_display()
Undefined index: moduleNoticefield.info.inc353_field_info_prepare_instance_display()
Undefined index: moduleNoticefield.info.inc385_field_info_prepare_instance_widget()
Undefined index: moduleNoticefield.info.inc353_field_info_prepare_instance_display()
Undefined index: moduleNoticefield.info.inc353_field_info_prepare_instance_display()
Undefined index: moduleNoticefield.info.inc385_field_info_prepare_instance_widget()
Undefined index: moduleNoticefield.info.inc353_field_info_prepare_instance_display()
Undefined index: moduleNoticefield.info.inc353_field_info_prepare_instance_display()
ExpandPath aliases with translated nodes (PathLanguageTestCase) [Path]6303
MessageGroupFilenameLineFunctionStatus
Undefined index: moduleNoticefield.info.inc385_field_info_prepare_instance_widget()
Undefined index: moduleNoticefield.info.inc353_field_info_prepare_instance_display()
Undefined index: moduleNoticefield.info.inc353_field_info_prepare_instance_display()
ExpandPath language settings (LocalePathFunctionalTest) [Locale]4303
MessageGroupFilenameLineFunctionStatus
Undefined index: moduleNoticefield.info.inc385_field_info_prepare_instance_widget()
Undefined index: moduleNoticefield.info.inc353_field_info_prepare_instance_display()
Undefined index: moduleNoticefield.info.inc353_field_info_prepare_instance_display()
ExpandRDFa markup (RdfRdfaMarkupTestCase) [RDF]1850
MessageGroupFilenameLineFunctionStatus
Failed to set field files[file_test_und_0] to /var/lib/drupaltestbot/sites/default/files/checkout/sites/default/files/simpletest/120249/text-0.txtOtherrdf.test169RdfRdfaMarkupTestCase->testAttributesInMarkupFile()
Failed to set field files[field_image_und_0] to /var/lib/drupaltestbot/sites/default/files/checkout/sites/default/files/simpletest/120249/image-test.pngOtherrdf.test169RdfRdfaMarkupTestCase->testAttributesInMarkupFile()
Found the requested form fields at node/1/editOtherrdf.test169RdfRdfaMarkupTestCase->testAttributesInMarkupFile()
Attribute 'rel' set on file field. Attribute 'resource' is also set.Otherrdf.test183RdfRdfaMarkupTestCase->testAttributesInMarkupFile()
Attribute 'rel' set on image field. Attribute 'resource' is also set.Otherrdf.test189RdfRdfaMarkupTestCase->testAttributesInMarkupFile()
ExpandRebuild arbitrary forms (FormsArbitraryRebuildTestCase) [Form API]1403
MessageGroupFilenameLineFunctionStatus
Undefined index: moduleNoticefield.info.inc385_field_info_prepare_instance_widget()
Undefined index: moduleNoticefield.info.inc353_field_info_prepare_instance_display()
Undefined index: moduleNoticefield.info.inc353_field_info_prepare_instance_display()
ExpandSecurity (FilterSecurityTestCase) [Filter]2606
MessageGroupFilenameLineFunctionStatus
Undefined index: moduleNoticefield.info.inc385_field_info_prepare_instance_widget()
Undefined index: moduleNoticefield.info.inc353_field_info_prepare_instance_display()
Undefined index: moduleNoticefield.info.inc353_field_info_prepare_instance_display()
Undefined index: moduleNoticefield.info.inc385_field_info_prepare_instance_widget()
Undefined index: moduleNoticefield.info.inc353_field_info_prepare_instance_display()
Undefined index: moduleNoticefield.info.inc353_field_info_prepare_instance_display()
ExpandString translate, search and validate (LocaleTranslationFunctionalTest) [Locale]25009
MessageGroupFilenameLineFunctionStatus
Undefined index: moduleNoticefield.info.inc385_field_info_prepare_instance_widget()
Undefined index: moduleNoticefield.info.inc353_field_info_prepare_instance_display()
Undefined index: moduleNoticefield.info.inc353_field_info_prepare_instance_display()
Undefined index: moduleNoticefield.info.inc385_field_info_prepare_instance_widget()
Undefined index: moduleNoticefield.info.inc353_field_info_prepare_instance_display()
Undefined index: moduleNoticefield.info.inc353_field_info_prepare_instance_display()
Undefined index: moduleNoticefield.info.inc385_field_info_prepare_instance_widget()
Undefined index: moduleNoticefield.info.inc353_field_info_prepare_instance_display()
Undefined index: moduleNoticefield.info.inc353_field_info_prepare_instance_display()
ExpandSummary length (SummaryLengthTestCase) [Node]1503
MessageGroupFilenameLineFunctionStatus
Undefined index: moduleNoticefield.info.inc385_field_info_prepare_instance_widget()
Undefined index: moduleNoticefield.info.inc353_field_info_prepare_instance_display()
Undefined index: moduleNoticefield.info.inc353_field_info_prepare_instance_display()
ExpandTaxonomy term functions and forms. (TaxonomyTermTestCase) [Taxonomy]16806
MessageGroupFilenameLineFunctionStatus
Undefined index: moduleNoticefield.info.inc385_field_info_prepare_instance_widget()
Undefined index: moduleNoticefield.info.inc353_field_info_prepare_instance_display()
Undefined index: moduleNoticefield.info.inc353_field_info_prepare_instance_display()
Undefined index: moduleNoticefield.info.inc385_field_info_prepare_instance_widget()
Undefined index: moduleNoticefield.info.inc353_field_info_prepare_instance_display()
Undefined index: moduleNoticefield.info.inc353_field_info_prepare_instance_display()
ExpandTaxonomy term hooks (TaxonomyHooksTestCase) [Taxonomy]1903
MessageGroupFilenameLineFunctionStatus
Undefined index: moduleNoticefield.info.inc385_field_info_prepare_instance_widget()
Undefined index: moduleNoticefield.info.inc353_field_info_prepare_instance_display()
Undefined index: moduleNoticefield.info.inc353_field_info_prepare_instance_display()
ExpandTaxonomy vocabulary interface (TaxonomyVocabularyFunctionalTest) [Taxonomy]9703
MessageGroupFilenameLineFunctionStatus
Undefined index: moduleNoticefield.info.inc385_field_info_prepare_instance_widget()
Undefined index: moduleNoticefield.info.inc353_field_info_prepare_instance_display()
Undefined index: moduleNoticefield.info.inc353_field_info_prepare_instance_display()
ExpandTest user triggers (TriggerUserTokenTestCase) [Trigger]162230
MessageGroupFilenameLineFunctionStatus
Expected text found in subject of email message: "Action was triggered by trigger user_logout user:name=vHA28DA8 user:uid=2 user:mail=vHA28DA8@example.com user:url=http://201011081733-pifr-mysql/checkout/?q=user/2 user:edit-url=http://201011081733-pifr-mysql/checkout/?q=user/2/edit user:created=Sat, 11/20/2010 - 02:02".Othertrigger.test452TriggerUserTokenTestCase->testUserTriggerTokenReplacement()
Expected text found in body of email message: "Action was triggered by trigger user_logout user:name=vHA28DA8 user:uid=2 user:mail=vHA28DA8@example.com user:url=http://201011081733-pifr-mysql/checkout/?q=user/2 user:edit-url=http://201011081733-pifr-mysql/checkout/?q=user/2/edit user:created=Sat, 11/20/2010 - 02:02".Othertrigger.test452TriggerUserTokenTestCase->testUserTriggerTokenReplacement()
Mail sent to correct destinationE-mailtrigger.test452TriggerUserTokenTestCase->testUserTriggerTokenReplacement()
Expected system message to contain token-replaced text "Action was triggered by trigger user_login user:name=vHA28DA8 user:uid=2 user:mail=vHA28DA8@example.com user:url=http://201011081733-pifr-mysql/checkout/?q=user/2 user:edit-url=http://201011081733-pifr-mysql/checkout/?q=user/2/edit user:created=Sat, 11/20/2010 - 02:02" found in configured system message actionOthertrigger.test455TriggerUserTokenTestCase->testUserTriggerTokenReplacement()
Expected text found in subject of email message: "Action was triggered by trigger user_login user:name=vHA28DA8 user:uid=2 user:mail=vHA28DA8@example.com user:url=http://201011081733-pifr-mysql/checkout/?q=user/2 user:edit-url=http://201011081733-pifr-mysql/checkout/?q=user/2/edit user:created=Sat, 11/20/2010 - 02:02".Othertrigger.test455TriggerUserTokenTestCase->testUserTriggerTokenReplacement()
Expected text found in body of email message: "Action was triggered by trigger user_login user:name=vHA28DA8 user:uid=2 user:mail=vHA28DA8@example.com user:url=http://201011081733-pifr-mysql/checkout/?q=user/2 user:edit-url=http://201011081733-pifr-mysql/checkout/?q=user/2/edit user:created=Sat, 11/20/2010 - 02:02".Othertrigger.test455TriggerUserTokenTestCase->testUserTriggerTokenReplacement()
Mail sent to correct destinationE-mailtrigger.test455TriggerUserTokenTestCase->testUserTriggerTokenReplacement()
Expected system message to contain token-replaced text "Action was triggered by trigger user_view user:name=vHA28DA8 user:uid=2 user:mail=vHA28DA8@example.com user:url=http://201011081733-pifr-mysql/checkout/?q=user/2 user:edit-url=http://201011081733-pifr-mysql/checkout/?q=user/2/edit user:created=Sat, 11/20/2010 - 02:02" found in configured system message actionOthertrigger.test456TriggerUserTokenTestCase->testUserTriggerTokenReplacement()
Expected text found in subject of email message: "Action was triggered by trigger user_view user:name=vHA28DA8 user:uid=2 user:mail=vHA28DA8@example.com user:url=http://201011081733-pifr-mysql/checkout/?q=user/2 user:edit-url=http://201011081733-pifr-mysql/checkout/?q=user/2/edit user:created=Sat, 11/20/2010 - 02:02".Othertrigger.test456TriggerUserTokenTestCase->testUserTriggerTokenReplacement()
Expected text found in body of email message: "Action was triggered by trigger user_view user:name=vHA28DA8 user:uid=2 user:mail=vHA28DA8@example.com user:url=http://201011081733-pifr-mysql/checkout/?q=user/2 user:edit-url=http://201011081733-pifr-mysql/checkout/?q=user/2/edit user:created=Sat, 11/20/2010 - 02:02".Othertrigger.test456TriggerUserTokenTestCase->testUserTriggerTokenReplacement()
Mail sent to correct destinationE-mailtrigger.test456TriggerUserTokenTestCase->testUserTriggerTokenReplacement()
Expected system message to contain token-replaced text "Action was triggered by trigger user_update user:name=vHA28DA8_changed user:uid=2 user:mail=vHA28DA8@example.com user:url=http://201011081733-pifr-mysql/checkout/?q=user/2 user:edit-url=http://201011081733-pifr-mysql/checkout/?q=user/2/edit user:created=Sat, 11/20/2010 - 02:02" found in configured system message actionOthertrigger.test460TriggerUserTokenTestCase->testUserTriggerTokenReplacement()
Expected text found in subject of email message: "Action was triggered by trigger user_update user:name=vHA28DA8_changed user:uid=2 user:mail=vHA28DA8@example.com user:url=http://201011081733-pifr-mysql/checkout/?q=user/2 user:edit-url=http://201011081733-pifr-mysql/checkout/?q=user/2/edit user:created=Sat, 11/20/2010 - 02:02".Othertrigger.test460TriggerUserTokenTestCase->testUserTriggerTokenReplacement()
Expected text found in body of email message: "Action was triggered by trigger user_update user:name=vHA28DA8_changed user:uid=2 user:mail=vHA28DA8@example.com user:url=http://201011081733-pifr-mysql/checkout/?q=user/2 user:edit-url=http://201011081733-pifr-mysql/checkout/?q=user/2/edit user:created=Sat, 11/20/2010 - 02:02".Othertrigger.test460TriggerUserTokenTestCase->testUserTriggerTokenReplacement()
Mail sent to correct destinationE-mailtrigger.test460TriggerUserTokenTestCase->testUserTriggerTokenReplacement()
Expected system message to contain token-replaced text "Action was triggered by trigger user_view user:name=vHA28DA8_changed user:uid=2 user:mail=vHA28DA8@example.com user:url=http://201011081733-pifr-mysql/checkout/?q=user/2 user:edit-url=http://201011081733-pifr-mysql/checkout/?q=user/2/edit user:created=Sat, 11/20/2010 - 02:02" found in configured system message actionOthertrigger.test463TriggerUserTokenTestCase->testUserTriggerTokenReplacement()
Expected text found in subject of email message: "Action was triggered by trigger user_view user:name=vHA28DA8_changed user:uid=2 user:mail=vHA28DA8@example.com user:url=http://201011081733-pifr-mysql/checkout/?q=user/2 user:edit-url=http://201011081733-pifr-mysql/checkout/?q=user/2/edit user:created=Sat, 11/20/2010 - 02:02".Othertrigger.test463TriggerUserTokenTestCase->testUserTriggerTokenReplacement()
Expected text found in body of email message: "Action was triggered by trigger user_view user:name=vHA28DA8_changed user:uid=2 user:mail=vHA28DA8@example.com user:url=http://201011081733-pifr-mysql/checkout/?q=user/2 user:edit-url=http://201011081733-pifr-mysql/checkout/?q=user/2/edit user:created=Sat, 11/20/2010 - 02:02".Othertrigger.test463TriggerUserTokenTestCase->testUserTriggerTokenReplacement()
Mail sent to correct destinationE-mailtrigger.test463TriggerUserTokenTestCase->testUserTriggerTokenReplacement()
Expected system message to contain token-replaced text "Action was triggered by trigger user_delete user:name=gyT5Z5Bz user:uid=16 user:mail=gyT5Z5Bz@example.com user:url=http://201011081733-pifr-mysql/checkout/?q=user/16 user:edit-url=http://201011081733-pifr-mysql/checkout/?q=user/16/edit user:created=Sat, 11/20/2010 - 02:02" found in configured system message actionOthertrigger.test473TriggerUserTokenTestCase->testUserTriggerTokenReplacement()
Expected text found in subject of email message: "Action was triggered by trigger user_delete user:name=gyT5Z5Bz user:uid=16 user:mail=gyT5Z5Bz@example.com user:url=http://201011081733-pifr-mysql/checkout/?q=user/16 user:edit-url=http://201011081733-pifr-mysql/checkout/?q=user/16/edit user:created=Sat, 11/20/2010 - 02:02".Othertrigger.test473TriggerUserTokenTestCase->testUserTriggerTokenReplacement()
Expected text found in body of email message: "Action was triggered by trigger user_delete user:name=gyT5Z5Bz user:uid=16 user:mail=gyT5Z5Bz@example.com user:url=http://201011081733-pifr-mysql/checkout/?q=user/16 user:edit-url=http://201011081733-pifr-mysql/checkout/?q=user/16/edit user:created=Sat, 11/20/2010 - 02:02".Othertrigger.test473TriggerUserTokenTestCase->testUserTriggerTokenReplacement()
Mail sent to correct destinationE-mailtrigger.test473TriggerUserTokenTestCase->testUserTriggerTokenReplacement()
ExpandText field (TextFieldTestCase) [Field types]197018
MessageGroupFilenameLineFunctionStatus
Undefined index: moduleNoticefield.info.inc385_field_info_prepare_instance_widget()
Undefined index: moduleNoticefield.info.inc353_field_info_prepare_instance_display()
Undefined index: moduleNoticefield.info.inc353_field_info_prepare_instance_display()
Undefined index: moduleNoticefield.info.inc385_field_info_prepare_instance_widget()
Undefined index: moduleNoticefield.info.inc353_field_info_prepare_instance_display()
Undefined index: moduleNoticefield.info.inc353_field_info_prepare_instance_display()
Undefined index: moduleNoticefield.info.inc385_field_info_prepare_instance_widget()
Undefined index: moduleNoticefield.info.inc353_field_info_prepare_instance_display()
Undefined index: moduleNoticefield.info.inc353_field_info_prepare_instance_display()
Undefined index: moduleNoticefield.info.inc385_field_info_prepare_instance_widget()
Undefined index: moduleNoticefield.info.inc353_field_info_prepare_instance_display()
Undefined index: moduleNoticefield.info.inc353_field_info_prepare_instance_display()
Undefined index: moduleNoticefield.info.inc385_field_info_prepare_instance_widget()
Undefined index: moduleNoticefield.info.inc353_field_info_prepare_instance_display()
Undefined index: moduleNoticefield.info.inc353_field_info_prepare_instance_display()
Undefined index: moduleNoticefield.info.inc385_field_info_prepare_instance_widget()
Undefined index: moduleNoticefield.info.inc353_field_info_prepare_instance_display()
Undefined index: moduleNoticefield.info.inc353_field_info_prepare_instance_display()
ExpandText translation (TextTranslationTestCase) [Field types]104024
MessageGroupFilenameLineFunctionStatus
Undefined index: moduleNoticefield.info.inc385_field_info_prepare_instance_widget()
Undefined index: moduleNoticefield.info.inc353_field_info_prepare_instance_display()
Undefined index: moduleNoticefield.info.inc353_field_info_prepare_instance_display()
Undefined index: moduleNoticefield.info.inc385_field_info_prepare_instance_widget()
Undefined index: moduleNoticefield.info.inc353_field_info_prepare_instance_display()
Undefined index: moduleNoticefield.info.inc353_field_info_prepare_instance_display()
Undefined index: moduleNoticefield.info.inc385_field_info_prepare_instance_widget()
Undefined index: moduleNoticefield.info.inc353_field_info_prepare_instance_display()
Undefined index: moduleNoticefield.info.inc353_field_info_prepare_instance_display()
Undefined index: imageNoticefield_ui.admin.inc356field_ui_field_overview_form()
Undefined index: Noticefield_ui.admin.inc362field_ui_field_overview_form()
Undefined property: stdClass::$field_imageNoticelocale.module410locale_field_node_form_submit()
Undefined index: moduleNoticefield.info.inc385_field_info_prepare_instance_widget()
Undefined index: moduleNoticefield.info.inc353_field_info_prepare_instance_display()
Undefined index: moduleNoticefield.info.inc353_field_info_prepare_instance_display()
Undefined index: moduleNoticefield.info.inc385_field_info_prepare_instance_widget()
Undefined index: moduleNoticefield.info.inc353_field_info_prepare_instance_display()
Undefined index: moduleNoticefield.info.inc353_field_info_prepare_instance_display()
Undefined index: moduleNoticefield.info.inc385_field_info_prepare_instance_widget()
Undefined index: moduleNoticefield.info.inc353_field_info_prepare_instance_display()
Undefined index: moduleNoticefield.info.inc353_field_info_prepare_instance_display()
Undefined index: imageNoticefield_ui.admin.inc356field_ui_field_overview_form()
Undefined index: Noticefield_ui.admin.inc362field_ui_field_overview_form()
Undefined property: stdClass::$field_imageNoticelocale.module410locale_field_node_form_submit()
ExpandTranslation functionality (TranslationTestCase) [Translation]16909
MessageGroupFilenameLineFunctionStatus
Undefined index: moduleNoticefield.info.inc385_field_info_prepare_instance_widget()
Undefined index: moduleNoticefield.info.inc353_field_info_prepare_instance_display()
Undefined index: moduleNoticefield.info.inc353_field_info_prepare_instance_display()
Undefined index: moduleNoticefield.info.inc385_field_info_prepare_instance_widget()
Undefined index: moduleNoticefield.info.inc353_field_info_prepare_instance_display()
Undefined index: moduleNoticefield.info.inc353_field_info_prepare_instance_display()
Undefined index: moduleNoticefield.info.inc385_field_info_prepare_instance_widget()
Undefined index: moduleNoticefield.info.inc353_field_info_prepare_instance_display()
Undefined index: moduleNoticefield.info.inc353_field_info_prepare_instance_display()
ExpandUser creation (LocaleUserCreationTest) [Locale]6803
MessageGroupFilenameLineFunctionStatus
Undefined index: moduleNoticefield.info.inc385_field_info_prepare_instance_widget()
Undefined index: moduleNoticefield.info.inc353_field_info_prepare_instance_display()
Undefined index: moduleNoticefield.info.inc353_field_info_prepare_instance_display()
ExpandUser language settings (LocaleUserLanguageFunctionalTest) [Locale]5103
MessageGroupFilenameLineFunctionStatus
Undefined index: moduleNoticefield.info.inc385_field_info_prepare_instance_widget()
Undefined index: moduleNoticefield.info.inc353_field_info_prepare_instance_display()
Undefined index: moduleNoticefield.info.inc353_field_info_prepare_instance_display()

All

Test namePassFailException
Leaf403 functionality (AccessDeniedTestCase) [System]7500
Leaf404 functionality (PageNotFoundTestCase) [System]1800
LeafActions configuration (ActionsConfigurationTestCase) [Actions]3800
LeafActions executing in a potentially infinite loop (ActionLoopTestCase) [Actions]2200
LeafAdd feed functionality (AddFeedTestCase) [Aggregator]2800
LeafAdmin theme block admin accessibility (BlockAdminThemeTestCase) [Block]1800
LeafAdministrative pages (SystemAdminTestCase) [System]19100
LeafAdvanced search form (SearchAdvancedSearchForm) [Search]3100
LeafAJAX command form values (AJAXFormValuesTestCase) [AJAX]2800
LeafAJAX commands (AJAXCommandsTestCase) [AJAX]6400
LeafAJAX framework (AJAXFrameworkTestCase) [AJAX]1000
LeafAJAX multi form (AJAXMultiFormTestCase) [AJAX]3500
LeafAnonymous comments (CommentAnonymous) [Comment]15600
LeafAutocompletion (ProfileTestAutocomplete) [Profile]5400
LeafBasic SQL syntax tests (DatabaseBasicSyntaxTestCase) [Database]2600
LeafBasic upgrade path (BasicUpgradePath) [Upgrade path]7000
LeafBatch percentages (BatchPercentagesUnitTestCase) [Batch API]1300
LeafBatch processing (BatchProcessingTestCase) [Batch API]15400
LeafBatch progress page (BatchPageTestCase) [Batch API]700
LeafBlock availability (NodeBlockTestCase) [Node]1800
LeafBlock availability (PollBlockTestCase) [Poll]11800
LeafBlock availability (ProfileBlockTestCase) [Profile]9000
LeafBlock availability (SearchBlockTestCase) [Search]5100
LeafBlock caching (BlockCacheTestCase) [Block]22800
LeafBlock functionality (BlockTestCase) [Block]26800
LeafBlock functionality (SystemBlockTestCase) [System]3400
LeafBlock HTML id (BlockHTMLIdTestCase) [Block]1500
LeafBlog functionality (BlogTestCase) [Blog]24100
LeafBook functionality (BookTestCase) [Book]34600
LeafBoot and exit hook invocation (HookBootExitTestCase) [Bootstrap]1800
ExpandBreadcrumbs (MenuBreadcrumbTestCase) [Menu]410019
MessageGroupFilenameLineFunctionStatus
Undefined index: moduleNoticefield.info.inc385_field_info_prepare_instance_widget()
Undefined index: moduleNoticefield.info.inc353_field_info_prepare_instance_display()
Undefined index: moduleNoticefield.info.inc353_field_info_prepare_instance_display()
Undefined index: imageNoticefield_ui.admin.inc1491field_ui_existing_field_options()
Undefined index: moduleNoticefield.info.inc385_field_info_prepare_instance_widget()
Undefined index: moduleNoticefield.info.inc353_field_info_prepare_instance_display()
Undefined index: moduleNoticefield.info.inc353_field_info_prepare_instance_display()
Undefined index: imageNoticefield_ui.admin.inc356field_ui_field_overview_form()
Undefined index: Noticefield_ui.admin.inc362field_ui_field_overview_form()
Undefined index: imageNoticefield_ui.admin.inc904field_ui_display_overview_form()
Undefined index: moduleNoticefield_ui.admin.inc977field_ui_display_overview_form()
Undefined index: moduleNoticefield_ui.admin.inc1036field_ui_display_overview_form()
Undefined index: imageNoticefield_ui.admin.inc904field_ui_display_overview_form()
Undefined index: moduleNoticefield_ui.admin.inc977field_ui_display_overview_form()
Undefined index: moduleNoticefield_ui.admin.inc1036field_ui_display_overview_form()
Undefined index: moduleNoticefield.info.inc385_field_info_prepare_instance_widget()
Undefined index: moduleNoticefield.info.inc353_field_info_prepare_instance_display()
Undefined index: moduleNoticefield.info.inc353_field_info_prepare_instance_display()
Undefined index: imageNoticefield_ui.admin.inc1491field_ui_existing_field_options()
LeafCache clear test (CacheClearCase) [Cache]1300
LeafCache emptiness test (CacheIsEmptyCase) [Cache]500
LeafCache saving test (CacheSavingCase) [Cache]500
LeafCancel account (UserCancelTestCase) [User]23700
LeafCascading stylesheets (CascadingStylesheetsTestCase) [System]2500
LeafCategorize feed functionality (CategorizeFeedTestCase) [Aggregator]1900
LeafCategorize feed item functionality (CategorizeFeedItemTestCase) [Aggregator]5300
LeafChecks display of aggregator items (AggregatorRenderingTestCase) [Aggregator]6800
LeafCJK tokenizer (SearchTokenizerTestCase) [Search]300
LeafColor functionality (ColorTestCase) [Color]6700
LeafComment approval (CommentApprovalTest) [Comment]15400
LeafComment blocks (CommentBlockFunctionalTest) [Comment]11500
LeafComment count toggle (SearchCommentCountToggleTestCase) [Search]3000
LeafComment interface (CommentInterfaceTest) [Comment]32300
ExpandComment language (LocaleCommentLanguageFunctionalTest) [Locale]5205
MessageGroupFilenameLineFunctionStatus
Undefined index: moduleNoticefield.info.inc385_field_info_prepare_instance_widget()
Undefined index: moduleNoticefield.info.inc353_field_info_prepare_instance_display()
Undefined index: moduleNoticefield.info.inc353_field_info_prepare_instance_display()
Undefined property: stdClass::$field_imageNoticelocale.module410locale_field_node_form_submit()
Undefined property: stdClass::$field_imageNoticelocale.module410locale_field_node_form_submit()
LeafComment paging settings (CommentPagerTest) [Comment]20800
LeafComment preview (CommentPreviewTest) [Comment]7200
LeafComment Rebuild (CommentContentRebuild) [Comment]3200
LeafComment RSS (CommentRSSUnitTest) [Comment]2400
ExpandComment Search tests (SearchCommentTestCase) [Search]15003
MessageGroupFilenameLineFunctionStatus
Undefined index: moduleNoticefield.info.inc385_field_info_prepare_instance_widget()
Undefined index: moduleNoticefield.info.inc353_field_info_prepare_instance_display()
Undefined index: moduleNoticefield.info.inc353_field_info_prepare_instance_display()
LeafComment token replacement (CommentTokenReplaceTestCase) [Comment]6400
LeafComment upgrade path (CommentUpgradePathTestCase) [Upgrade path]2600
LeafConfig settings form (SearchConfigSettingsForm) [Search]16600
LeafConnection tests (DatabaseConnectionTestCase) [Database]3400
ExpandContent language settings (LocaleContentFunctionalTest) [Locale]6403
MessageGroupFilenameLineFunctionStatus
Undefined index: moduleNoticefield.info.inc385_field_info_prepare_instance_widget()
Undefined index: moduleNoticefield.info.inc353_field_info_prepare_instance_display()
Undefined index: moduleNoticefield.info.inc353_field_info_prepare_instance_display()
LeafCron run (CronRunTestCase) [System]4500
LeafCSS Unit Tests (CascadingStylesheetsUnitTest) [System]1200
LeafCustom query syntax tests (DatabaseQueryTestCase) [Database]600
LeafDashboard blocks (DashboardBlocksTestCase) [Dashboard]10900
LeafData API functions (DrupalDataApiTest) [System]3200
LeafDate and time (DateTimeFunctionalTest) [System]9600
LeafDBLog functionality (DBLogTestCase) [DBLog]44000
LeafDefault text format functionality (FilterDefaultFormatTestCase) [Filter]6600
LeafDelete/Truncate tests (DatabaseDeleteTruncateTestCase) [Database]2000
LeafDrupal error handlers (DrupalErrorHandlerUnitTest) [System]2800
LeafDrupal goto (DrupalGotoTest) [System]1800
LeafDrupal HTTP request (DrupalHTTPRequestTestCase) [System]2700
LeafDrupal match path (DrupalMatchPathTestCase) [Path API]4100
LeafDrupal set/get regions (DrupalSetContentTestCase) [System]4000
LeafDrupal system listing (DrupalSystemListingTestCase) [System]600
LeafDrupal tags handling (DrupalTagsHandlingTestCase) [System]800
Leafdrupal_alter() tests (DrupalAlterTestCase) [System]500
Leafdrupal_render() (DrupalRenderTestCase) [System]3300
LeafElement processing (FormElementTestCase) [Form API]2200
LeafEmbedded forms (SearchEmbedForm) [Search]2900
LeafEmpty statement (DatabaseEmptyStatementTestCase) [Database]400
LeafEnable/disable modules (EnableDisableTestCase) [Module]5600
LeafEntity CRUD hooks (EntityCrudHookTestCase) [Entity API]4800
LeafEntity properties (EntityPropertiesTestCase) [Entity API]300
LeafEntity query (EntityFieldQueryTestCase) [Entity API]10000
LeafFeed parser functionality (FeedParserTestCase) [Aggregator]4000
LeafFetch tests (DatabaseFetchTestCase) [Database]3300
LeafFetch tests, part 2 (DatabaseFetch2TestCase) [Database]2600
LeafFetching multiple cache items (CacheGetMultipleUnitTest) [Cache]700
LeafField attach tests (other) (FieldAttachOtherTestCase) [Field API]4400
LeafField attach tests (storage-related) (FieldAttachStorageTestCase) [Field API]8300
LeafField bulk delete tests (FieldBulkDeleteTestCase) [Field API]4000
LeafField CRUD tests (FieldCrudTestCase) [Field API]5900
LeafField Display API tests (FieldDisplayAPITestCase) [Field API]4200
ExpandField form tests (FieldFormTestCase) [Field API]166018
MessageGroupFilenameLineFunctionStatus
Undefined index: moduleNoticefield.info.inc385_field_info_prepare_instance_widget()
Undefined index: moduleNoticefield.info.inc353_field_info_prepare_instance_display()
Undefined index: moduleNoticefield.info.inc353_field_info_prepare_instance_display()
Undefined index: moduleNoticefield.info.inc385_field_info_prepare_instance_widget()
Undefined index: moduleNoticefield.info.inc353_field_info_prepare_instance_display()
Undefined index: moduleNoticefield.info.inc353_field_info_prepare_instance_display()
Undefined index: moduleNoticefield.info.inc385_field_info_prepare_instance_widget()
Undefined index: moduleNoticefield.info.inc353_field_info_prepare_instance_display()
Undefined index: moduleNoticefield.info.inc353_field_info_prepare_instance_display()
Undefined index: moduleNoticefield.info.inc385_field_info_prepare_instance_widget()
Undefined index: moduleNoticefield.info.inc353_field_info_prepare_instance_display()
Undefined index: moduleNoticefield.info.inc353_field_info_prepare_instance_display()
Undefined index: moduleNoticefield.info.inc385_field_info_prepare_instance_widget()
Undefined index: moduleNoticefield.info.inc353_field_info_prepare_instance_display()
Undefined index: moduleNoticefield.info.inc353_field_info_prepare_instance_display()
Undefined index: moduleNoticefield.info.inc385_field_info_prepare_instance_widget()
Undefined index: moduleNoticefield.info.inc353_field_info_prepare_instance_display()
Undefined index: moduleNoticefield.info.inc353_field_info_prepare_instance_display()
LeafField info tests (FieldInfoTestCase) [Field API]7900
LeafField instance CRUD tests (FieldInstanceCrudTestCase) [Field API]3200
LeafField SQL storage tests (FieldSqlStorageTestCase) [Field API]8800
LeafField translations tests (FieldTranslationsTestCase) [Field API]4800
LeafFile copying (FileCopyTest) [File API]10600
LeafFile delete (FileDeleteTest) [File API]1800
LeafFile download (FileDownloadTest) [File API]3500
ExpandFile field display tests (FileFieldDisplayTestCase) [File]16613
MessageGroupFilenameLineFunctionStatus
Failed to set field files[b5tttyny_und_0] to /var/lib/drupaltestbot/sites/default/files/checkout/sites/default/files/simpletest/757930/text-0.txtOtherfile.test132FileFieldTestCase->uploadNodeFile()
Found the requested form fields at node/add/articleOtherfile.test132FileFieldTestCase->uploadNodeFile()
array_flip(): Can only flip STRING and INTEGER values!Warningentity.inc167DrupalDefaultEntityController->load()
Trying to get property of non-objectNoticefile.test717FileFieldDisplayTestCase->testNodeDisplay()
Undefined property: stdClass::$uriNoticefile.module693theme_file_link()
Undefined property: stdClass::$filemimeNoticefile.module731theme_file_icon()
Undefined property: stdClass::$filemimeNoticefile.module773file_icon_path()
Undefined property: stdClass::$filemimeNoticefile.module815file_icon_map()
Undefined property: stdClass::$filemimeNoticefile.module788file_icon_path()
Undefined property: stdClass::$filemimeNoticefile.module788file_icon_path()
Undefined property: stdClass::$filemimeNoticefile.module788file_icon_path()
Undefined property: stdClass::$filemimeNoticefile.module788file_icon_path()
Undefined property: stdClass::$filemimeNoticefile.module700theme_file_link()
Undefined property: stdClass::$filesizeNoticefile.module700theme_file_link()
Undefined property: stdClass::$filenameNoticefile.module706theme_file_link()
Default formatter displaying correctly on full node view.Otherfile.test719FileFieldDisplayTestCase->testNodeDisplay()
Failed to set field b5tttyny[und][0][display] to Otherfile.test723FileFieldDisplayTestCase->testNodeDisplay()
Found the Save buttonOtherfile.test723FileFieldDisplayTestCase->testNodeDisplay()
Found the requested form fields at node//editOtherfile.test723FileFieldDisplayTestCase->testNodeDisplay()
ExpandFile field file path tests (FileFieldPathTestCase) [File]17931
MessageGroupFilenameLineFunctionStatus
Undefined index: moduleNoticefield.info.inc385_field_info_prepare_instance_widget()
Undefined index: moduleNoticefield.info.inc353_field_info_prepare_instance_display()
Undefined index: moduleNoticefield.info.inc353_field_info_prepare_instance_display()
Undefined index: moduleNoticefield.info.inc385_field_info_prepare_instance_widget()
Undefined index: moduleNoticefield.info.inc353_field_info_prepare_instance_display()
Failed to set field files[raydgep8_und_0] to /var/lib/drupaltestbot/sites/default/files/checkout/sites/default/files/simpletest/382644/text-0.txtOtherfile.test132FileFieldTestCase->uploadNodeFile()
Found the requested form fields at node/add/articleOtherfile.test132FileFieldTestCase->uploadNodeFile()
array_flip(): Can only flip STRING and INTEGER values!Warningentity.inc167DrupalDefaultEntityController->load()
Trying to get property of non-objectNoticefile.test917FileFieldPathTestCase->testUploadPath()
Undefined property: stdClass::$uriNoticefile.test918FileFieldPathTestCase->testUploadPath()
Undefined property: stdClass::$uriNoticefile.test918FileFieldPathTestCase->testUploadPath()
The file was uploaded to the correct path.Otherfile.test918FileFieldPathTestCase->testUploadPath()
Undefined index: moduleNoticefield.crud.inc779_field_write_instance()
Undefined index: moduleNoticefield.crud.inc795_field_write_instance()
Undefined index: moduleNoticefield.info.inc385_field_info_prepare_instance_widget()
Undefined index: moduleNoticefield.info.inc353_field_info_prepare_instance_display()
Undefined index: moduleNoticefield.info.inc353_field_info_prepare_instance_display()
Undefined index: moduleNoticefield.info.inc385_field_info_prepare_instance_widget()
Undefined index: moduleNoticefield.info.inc353_field_info_prepare_instance_display()
Failed to set field files[raydgep8_und_0] to /var/lib/drupaltestbot/sites/default/files/checkout/sites/default/files/simpletest/382644/text-0.txtOtherfile.test132FileFieldTestCase->uploadNodeFile()
Found the requested form fields at node/add/articleOtherfile.test132FileFieldTestCase->uploadNodeFile()
array_flip(): Can only flip STRING and INTEGER values!Warningentity.inc167DrupalDefaultEntityController->load()
Trying to get property of non-objectNoticefile.test928FileFieldPathTestCase->testUploadPath()
Undefined property: stdClass::$uriNoticefile.test929FileFieldPathTestCase->testUploadPath()
Undefined property: stdClass::$uriNoticefile.test929FileFieldPathTestCase->testUploadPath()
The file was uploaded to the correct path.Otherfile.test929FileFieldPathTestCase->testUploadPath()
Undefined index: moduleNoticefield.crud.inc779_field_write_instance()
Undefined index: moduleNoticefield.crud.inc795_field_write_instance()
Undefined index: moduleNoticefield.info.inc385_field_info_prepare_instance_widget()
Undefined index: moduleNoticefield.info.inc353_field_info_prepare_instance_display()
Undefined index: moduleNoticefield.info.inc353_field_info_prepare_instance_display()
Undefined index: moduleNoticefield.info.inc385_field_info_prepare_instance_widget()
Undefined index: moduleNoticefield.info.inc353_field_info_prepare_instance_display()
Failed to set field files[raydgep8_und_0] to /var/lib/drupaltestbot/sites/default/files/checkout/sites/default/files/simpletest/382644/text-0.txtOtherfile.test132FileFieldTestCase->uploadNodeFile()
Found the requested form fields at node/add/articleOtherfile.test132FileFieldTestCase->uploadNodeFile()
array_flip(): Can only flip STRING and INTEGER values!Warningentity.inc167DrupalDefaultEntityController->load()
Trying to get property of non-objectNoticefile.test940FileFieldPathTestCase->testUploadPath()
Undefined property: stdClass::$uriNoticefile.test943FileFieldPathTestCase->testUploadPath()
Undefined property: stdClass::$uriNoticefile.test943FileFieldPathTestCase->testUploadPath()
The file was uploaded to the correct path with token replacements.Otherfile.test943FileFieldPathTestCase->testUploadPath()
ExpandFile field revision test (FileFieldRevisionTestCase) [File]292555
MessageGroupFilenameLineFunctionStatus
Undefined index: moduleNoticefield.info.inc385_field_info_prepare_instance_widget()
Undefined index: moduleNoticefield.info.inc353_field_info_prepare_instance_display()
Undefined index: moduleNoticefield.info.inc353_field_info_prepare_instance_display()
Undefined index: moduleNoticefield.info.inc385_field_info_prepare_instance_widget()
Undefined index: moduleNoticefield.info.inc353_field_info_prepare_instance_display()
Undefined index: moduleNoticefield.info.inc385_field_info_prepare_instance_widget()
Undefined index: moduleNoticefield.info.inc353_field_info_prepare_instance_display()
Failed to set field files[uioyt6zv_und_0] to /var/lib/drupaltestbot/sites/default/files/checkout/sites/default/files/simpletest/643346/text-0.txtOtherfile.test132FileFieldTestCase->uploadNodeFile()
Found the requested form fields at node/add/articleOtherfile.test132FileFieldTestCase->uploadNodeFile()
array_flip(): Can only flip STRING and INTEGER values!Warningentity.inc167DrupalDefaultEntityController->load()
Trying to get property of non-objectNoticefile.test604FileFieldRevisionTestCase->testRevisions()
Trying to get property of non-objectNoticefile.test605FileFieldRevisionTestCase->testRevisions()
Undefined property: stdClass::$uriNoticefile.test172FileFieldTestCase->assertFileExists()
New file saved to disk on node creation.Otherfile.test606FileFieldRevisionTestCase->testRevisions()
Undefined property: stdClass::$fidNoticefile.test180FileFieldTestCase->assertFileEntryExists()
array_flip(): Can only flip STRING and INTEGER values!Warningentity.inc167DrupalDefaultEntityController->load()
Trying to get property of non-objectNoticefile.test182FileFieldTestCase->assertFileEntryExists()
Undefined property: stdClass::$uriNoticefile.test182FileFieldTestCase->assertFileEntryExists()
Undefined property: stdClass::$statusNoticefile.test207FileFieldTestCase->assertFileIsPermanent()
File is permanent.Otherfile.test608FileFieldRevisionTestCase->testRevisions()
Found the Remove buttonOtherfile.test163FileFieldTestCase->replaceNodeFile()
Found the requested form fields at node//editOtherfile.test163FileFieldTestCase->replaceNodeFile()
Failed to set field files[uioyt6zv_und_0] to /var/lib/drupaltestbot/sites/default/files/checkout/sites/default/files/simpletest/643346/text-0.txtOtherfile.test164FileFieldTestCase->replaceNodeFile()
Failed to set field revision to 1Otherfile.test164FileFieldTestCase->replaceNodeFile()
Found the Save buttonOtherfile.test164FileFieldTestCase->replaceNodeFile()
Found the requested form fields at Otherfile.test164FileFieldTestCase->replaceNodeFile()
array_flip(): Can only flip STRING and INTEGER values!Warningentity.inc167DrupalDefaultEntityController->load()
Trying to get property of non-objectNoticefile.test613FileFieldRevisionTestCase->testRevisions()
Trying to get property of non-objectNoticefile.test614FileFieldRevisionTestCase->testRevisions()
Undefined property: stdClass::$uriNoticefile.test172FileFieldTestCase->assertFileExists()
Replacement file exists on disk after creating new revision.Otherfile.test615FileFieldRevisionTestCase->testRevisions()
Undefined property: stdClass::$fidNoticefile.test180FileFieldTestCase->assertFileEntryExists()
array_flip(): Can only flip STRING and INTEGER values!Warningentity.inc167DrupalDefaultEntityController->load()
Trying to get property of non-objectNoticefile.test182FileFieldTestCase->assertFileEntryExists()
Undefined property: stdClass::$uriNoticefile.test182FileFieldTestCase->assertFileEntryExists()
Undefined property: stdClass::$statusNoticefile.test207FileFieldTestCase->assertFileIsPermanent()
Replacement file is permanent.Otherfile.test617FileFieldRevisionTestCase->testRevisions()
array_flip(): Can only flip STRING and INTEGER values!Warningentity.inc167DrupalDefaultEntityController->load()
Trying to get property of non-objectNoticefile.test621FileFieldRevisionTestCase->testRevisions()
Undefined property: stdClass::$uriNoticefile.test172FileFieldTestCase->assertFileExists()
Original file still in place after replacing file in new revision.Otherfile.test622FileFieldRevisionTestCase->testRevisions()
Undefined property: stdClass::$fidNoticefile.test180FileFieldTestCase->assertFileEntryExists()
array_flip(): Can only flip STRING and INTEGER values!Warningentity.inc167DrupalDefaultEntityController->load()
Trying to get property of non-objectNoticefile.test182FileFieldTestCase->assertFileEntryExists()
Undefined property: stdClass::$uriNoticefile.test182FileFieldTestCase->assertFileEntryExists()
Undefined property: stdClass::$statusNoticefile.test207FileFieldTestCase->assertFileIsPermanent()
Original file is still permanent.Otherfile.test624FileFieldRevisionTestCase->testRevisions()
Failed to set field revision to 1Otherfile.test628FileFieldRevisionTestCase->testRevisions()
Found the Save buttonOtherfile.test628FileFieldRevisionTestCase->testRevisions()
Found the requested form fields at node//editOtherfile.test628FileFieldRevisionTestCase->testRevisions()
array_flip(): Can only flip STRING and INTEGER values!Warningentity.inc167DrupalDefaultEntityController->load()
Trying to get property of non-objectNoticefile.test630FileFieldRevisionTestCase->testRevisions()
Trying to get property of non-objectNoticefile.test631FileFieldRevisionTestCase->testRevisions()
Undefined property: stdClass::$statusNoticefile.test207FileFieldTestCase->assertFileIsPermanent()
New revision file is permanent.Otherfile.test633FileFieldRevisionTestCase->testRevisions()
Found the Revert buttonOtherfile.test636FileFieldRevisionTestCase->testRevisions()
Found the requested form fields at node//revisions//revertOtherfile.test636FileFieldRevisionTestCase->testRevisions()
array_flip(): Can only flip STRING and INTEGER values!Warningentity.inc167DrupalDefaultEntityController->load()
Trying to get property of non-objectNoticefile.test638FileFieldRevisionTestCase->testRevisions()
Trying to get property of non-objectNoticefile.test639FileFieldRevisionTestCase->testRevisions()
Undefined property: stdClass::$statusNoticefile.test207FileFieldTestCase->assertFileIsPermanent()
Original revision file still permanent after reverting to the original revision.Otherfile.test641FileFieldRevisionTestCase->testRevisions()
Found the Delete buttonOtherfile.test645FileFieldRevisionTestCase->testRevisions()
Found the requested form fields at node//revisions//deleteOtherfile.test645FileFieldRevisionTestCase->testRevisions()
Undefined property: stdClass::$uriNoticefile.test172FileFieldTestCase->assertFileExists()
Second file is still available after deleting second revision, since it is being used by the third revision.Otherfile.test646FileFieldRevisionTestCase->testRevisions()
Undefined property: stdClass::$fidNoticefile.test180FileFieldTestCase->assertFileEntryExists()
array_flip(): Can only flip STRING and INTEGER values!Warningentity.inc167DrupalDefaultEntityController->load()
Trying to get property of non-objectNoticefile.test182FileFieldTestCase->assertFileEntryExists()
Undefined property: stdClass::$uriNoticefile.test182FileFieldTestCase->assertFileEntryExists()
Undefined property: stdClass::$statusNoticefile.test207FileFieldTestCase->assertFileIsPermanent()
Second file entry is still permanent after deleting second revision, since it is being used by the third revision.Otherfile.test648FileFieldRevisionTestCase->testRevisions()
Undefined index: fidNoticefile.field.inc220file_field_presave()
array_flip(): Can only flip STRING and INTEGER values!Warningentity.inc167DrupalDefaultEntityController->load()
Trying to get property of non-objectNoticefile.field.inc221file_field_presave()
Undefined property: stdClass::$uriNoticefile.inc569file_save()
Undefined index: fidNoticefile.field.inc262file_field_update()
Undefined index: fidNoticefile.field.inc283file_field_update()
Undefined property: stdClass::$fidNoticefile.inc643file_usage_add()
PDOException: SQLSTATE[23000]: Integrity constraint violation: 1048 Column 'fid' cannot be null: INSERT INTO {file_usage} (fid, module, type, id, count) VALUES (:db_insert_placeholder_0, :db_insert_placeholder_1, :db_insert_placeholder_2, :db_insert_placeholder_3, :db_insert_placeholder_4); Array ( [:db_insert_placeholder_0] => [:db_insert_placeholder_1] => file [:db_insert_placeholder_2] => user [:db_insert_placeholder_3] => 3 [:db_insert_placeholder_4] => 1 ) in file_usage_add() (line 650 of /var/lib/drupaltestbot/sites/default/files/checkout/includes/file.inc).Uncaught exceptiondatabase.inc1970PDOStatement->execute()
ExpandFile field validation tests (FileFieldValidateTestCase) [File]763985
MessageGroupFilenameLineFunctionStatus
Node save failed when required file field was empty.Otherfile.test761FileFieldValidateTestCase->testRequired()
Failed to set field files[lxloxs8j_und_0] to /var/lib/drupaltestbot/sites/default/files/checkout/sites/default/files/simpletest/763530/text-0.txtOtherfile.test132FileFieldTestCase->uploadNodeFile()
Found the requested form fields at node/add/articleOtherfile.test132FileFieldTestCase->uploadNodeFile()
uploadNodeFile(public://text-0.txt, lxloxs8j, article) succeededOtherfile.test765FileFieldValidateTestCase->testRequired()
array_flip(): Can only flip STRING and INTEGER values!Warningentity.inc167DrupalDefaultEntityController->load()
Trying to get property of non-objectNoticefile.test769FileFieldValidateTestCase->testRequired()
Undefined property: stdClass::$uriNoticefile.test172FileFieldTestCase->assertFileExists()
File exists after uploading to the required field.Otherfile.test770FileFieldValidateTestCase->testRequired()
Undefined property: stdClass::$fidNoticefile.test180FileFieldTestCase->assertFileEntryExists()
array_flip(): Can only flip STRING and INTEGER values!Warningentity.inc167DrupalDefaultEntityController->load()
Trying to get property of non-objectNoticefile.test182FileFieldTestCase->assertFileEntryExists()
Undefined property: stdClass::$uriNoticefile.test182FileFieldTestCase->assertFileEntryExists()
Undefined index: moduleNoticefield.info.inc385_field_info_prepare_instance_widget()
Undefined index: moduleNoticefield.info.inc353_field_info_prepare_instance_display()
Undefined index: moduleNoticefield.info.inc353_field_info_prepare_instance_display()
Undefined index: moduleNoticefield.info.inc385_field_info_prepare_instance_widget()
Undefined index: moduleNoticefield.info.inc353_field_info_prepare_instance_display()
Node save failed when required multiple value file field was empty.Otherfile.test780FileFieldValidateTestCase->testRequired()
Failed to set field files[lxloxs8j_und_0] to /var/lib/drupaltestbot/sites/default/files/checkout/sites/default/files/simpletest/763530/text-0.txtOtherfile.test132FileFieldTestCase->uploadNodeFile()
Found the requested form fields at node/add/articleOtherfile.test132FileFieldTestCase->uploadNodeFile()
array_flip(): Can only flip STRING and INTEGER values!Warningentity.inc167DrupalDefaultEntityController->load()
Trying to get property of non-objectNoticefile.test785FileFieldValidateTestCase->testRequired()
Undefined property: stdClass::$uriNoticefile.test172FileFieldTestCase->assertFileExists()
File exists after uploading to the required multiple value field.Otherfile.test786FileFieldValidateTestCase->testRequired()
Undefined property: stdClass::$fidNoticefile.test180FileFieldTestCase->assertFileEntryExists()
array_flip(): Can only flip STRING and INTEGER values!Warningentity.inc167DrupalDefaultEntityController->load()
Trying to get property of non-objectNoticefile.test182FileFieldTestCase->assertFileEntryExists()
Undefined property: stdClass::$uriNoticefile.test182FileFieldTestCase->assertFileEntryExists()
ExpandFile field widget test (FileFieldWidgetTestCase) [File]1267236
MessageGroupFilenameLineFunctionStatus
Failed to set field files[ktvytriq_und_0] to /var/lib/drupaltestbot/sites/default/files/checkout/sites/default/files/simpletest/720185/text-0.txtOtherfile.test132FileFieldTestCase->uploadNodeFile()
Found the requested form fields at node/add/pageOtherfile.test132FileFieldTestCase->uploadNodeFile()
array_flip(): Can only flip STRING and INTEGER values!Warningentity.inc167DrupalDefaultEntityController->load()
Trying to get property of non-objectNoticefile.test336FileFieldWidgetTestCase->testSingleValuedWidget()
Undefined property: stdClass::$uriNoticefile.test172FileFieldTestCase->assertFileExists()
New file saved to disk on node creation.Otherfile.test337FileFieldWidgetTestCase->testSingleValuedWidget()
Undefined property: stdClass::$uriNoticefile.test340FileFieldWidgetTestCase->testSingleValuedWidget()
Node with file displays the "Remove" button.Otherfile.test346FileFieldWidgetTestCase->testSingleValuedWidget()
Found the Remove buttonOtherfile.test351FileFieldWidgetTestCase->testSingleValuedWidget()
Found the requested form fields at Otherfile.test351FileFieldWidgetTestCase->testSingleValuedWidget()
After clicking the "Remove" button, the "Upload" button is displayed.Otherfile.test361FileFieldWidgetTestCase->testSingleValuedWidget()
Found the Save buttonOtherfile.test364FileFieldWidgetTestCase->testSingleValuedWidget()
Found the requested form fields at Otherfile.test364FileFieldWidgetTestCase->testSingleValuedWidget()
array_flip(): Can only flip STRING and INTEGER values!Warningentity.inc167DrupalDefaultEntityController->load()
Failed to set field files[ktvytriq_und_0] to /var/lib/drupaltestbot/sites/default/files/checkout/sites/default/files/simpletest/720185/text-0.txtOtherfile.test132FileFieldTestCase->uploadNodeFile()
Found the requested form fields at node/add/pageOtherfile.test132FileFieldTestCase->uploadNodeFile()
array_flip(): Can only flip STRING and INTEGER values!Warningentity.inc167DrupalDefaultEntityController->load()
Trying to get property of non-objectNoticefile.test336FileFieldWidgetTestCase->testSingleValuedWidget()
Undefined property: stdClass::$uriNoticefile.test172FileFieldTestCase->assertFileExists()
New file saved to disk on node creation.Otherfile.test337FileFieldWidgetTestCase->testSingleValuedWidget()
Undefined property: stdClass::$uriNoticefile.test340FileFieldWidgetTestCase->testSingleValuedWidget()
Node with file displays the "Remove" button.Otherfile.test346FileFieldWidgetTestCase->testSingleValuedWidget()
Undefined offset: 0Noticefile.test355FileFieldWidgetTestCase->testSingleValuedWidget()
Undefined offset: 0Noticefile.test355FileFieldWidgetTestCase->testSingleValuedWidget()
Undefined offset: 0Noticedrupal_web_test_case.php1826DrupalWebTestCase->drupalPostAJAX()
Undefined index: ajaxNoticedrupal_web_test_case.php1827DrupalWebTestCase->drupalPostAJAX()
Found the requested form fields at Otherfile.test355FileFieldWidgetTestCase->testSingleValuedWidget()
After clicking the "Remove" button, the "Upload" button is displayed.Otherfile.test361FileFieldWidgetTestCase->testSingleValuedWidget()
Found the Save buttonOtherfile.test364FileFieldWidgetTestCase->testSingleValuedWidget()
Found the requested form fields at Otherfile.test364FileFieldWidgetTestCase->testSingleValuedWidget()
array_flip(): Can only flip STRING and INTEGER values!Warningentity.inc167DrupalDefaultEntityController->load()
LeafFile loading (FileLoadTest) [File API]2900
LeafFile mimetypes (FileMimeTypeTest) [File API]3800
LeafFile moving (FileMoveTest) [File API]10500
LeafFile naming (FileNameMungingTest) [File API]500
LeafFile paths and directories (FileDirectoryTest) [File API]2000
LeafFile save data (FileSaveDataTest) [File API]8800
LeafFile saving (FileSaveTest) [File API]1400
LeafFile scan directory (FileScanDirectoryTest) [File API]2500
LeafFile space used tests (FileSpaceUsedTest) [File API]1100
ExpandFile token replacement (FileTokenReplaceTestCase) [File]27953
MessageGroupFilenameLineFunctionStatus
Failed to set field files[field_alvg9eel_und_0] to /var/lib/drupaltestbot/sites/default/files/checkout/sites/default/files/simpletest/463960/text-0.txtOtherfile.test132FileFieldTestCase->uploadNodeFile()
Found the requested form fields at node/add/articleOtherfile.test132FileFieldTestCase->uploadNodeFile()
array_flip(): Can only flip STRING and INTEGER values!Warningentity.inc167DrupalDefaultEntityController->load()
Trying to get property of non-objectNoticefile.test1005FileTokenReplaceTestCase->testFileTokenReplacement()
Undefined property: stdClass::$fidNoticefile.test1010FileTokenReplaceTestCase->testFileTokenReplacement()
Undefined property: stdClass::$filenameNoticefile.test1011FileTokenReplaceTestCase->testFileTokenReplacement()
Undefined property: stdClass::$uriNoticefile.test1013FileTokenReplaceTestCase->testFileTokenReplacement()
Undefined property: stdClass::$filemimeNoticefile.test1014FileTokenReplaceTestCase->testFileTokenReplacement()
Undefined property: stdClass::$filesizeNoticefile.test1015FileTokenReplaceTestCase->testFileTokenReplacement()
Undefined property: stdClass::$uriNoticefile.test1016FileTokenReplaceTestCase->testFileTokenReplacement()
Undefined property: stdClass::$timestampNoticefile.test1017FileTokenReplaceTestCase->testFileTokenReplacement()
date_timezone_set() expects parameter 1 to be DateTime, boolean givenWarningcommon.inc1882format_date()
date_format() expects parameter 1 to be DateTime, boolean givenWarningcommon.inc1892format_date()
Undefined property: stdClass::$timestampNoticefile.test1018FileTokenReplaceTestCase->testFileTokenReplacement()
date_timezone_set() expects parameter 1 to be DateTime, boolean givenWarningcommon.inc1882format_date()
date_format() expects parameter 1 to be DateTime, boolean givenWarningcommon.inc1892format_date()
Undefined property: stdClass::$uidNoticefile.test1020FileTokenReplaceTestCase->testFileTokenReplacement()
No empty tokens generated.Otherfile.test1023FileTokenReplaceTestCase->testFileTokenReplacement()
Undefined property: stdClass::$fidNoticesystem.tokens.inc224system_tokens()
Undefined property: stdClass::$filenameNoticesystem.tokens.inc229system_tokens()
Undefined property: stdClass::$uriNoticesystem.tokens.inc237system_tokens()
Undefined property: stdClass::$filemimeNoticesystem.tokens.inc241system_tokens()
Undefined property: stdClass::$filesizeNoticesystem.tokens.inc245system_tokens()
Undefined property: stdClass::$uriNoticesystem.tokens.inc249system_tokens()
Undefined property: stdClass::$timestampNoticesystem.tokens.inc254system_tokens()
date_timezone_set() expects parameter 1 to be DateTime, boolean givenWarningcommon.inc1882format_date()
date_format() expects parameter 1 to be DateTime, boolean givenWarningcommon.inc1892format_date()
Undefined property: stdClass::$timestampNoticesystem.tokens.inc265system_tokens()
Sanitized file token [file:timestamp:short] replaced.Otherfile.test1027FileTokenReplaceTestCase->testFileTokenReplacement()
Undefined property: stdClass::$uidNoticesystem.tokens.inc258system_tokens()
array_flip(): Can only flip STRING and INTEGER values!Warningentity.inc167DrupalDefaultEntityController->load()
array_flip(): Can only flip STRING and INTEGER values!Warningentity.inc343DrupalDefaultEntityController->cacheGet()
Trying to get property of non-objectNoticesystem.tokens.inc259system_tokens()
Sanitized file token [file:owner] replaced.Otherfile.test1027FileTokenReplaceTestCase->testFileTokenReplacement()
Undefined property: stdClass::$uidNoticesystem.tokens.inc268system_tokens()
array_flip(): Can only flip STRING and INTEGER values!Warningentity.inc167DrupalDefaultEntityController->load()
array_flip(): Can only flip STRING and INTEGER values!Warningentity.inc343DrupalDefaultEntityController->cacheGet()
Sanitized file token [file:owner:uid] replaced.Otherfile.test1027FileTokenReplaceTestCase->testFileTokenReplacement()
Undefined property: stdClass::$filenameNoticefile.test1031FileTokenReplaceTestCase->testFileTokenReplacement()
Undefined property: stdClass::$uriNoticefile.test1033FileTokenReplaceTestCase->testFileTokenReplacement()
Undefined property: stdClass::$filemimeNoticefile.test1034FileTokenReplaceTestCase->testFileTokenReplacement()
Undefined property: stdClass::$filesizeNoticefile.test1035FileTokenReplaceTestCase->testFileTokenReplacement()
Undefined property: stdClass::$fidNoticesystem.tokens.inc224system_tokens()
LeafFile uploading (FileSaveUploadTest) [File API]29200
LeafFile URL rewriting (FileURLRewritingTest) [File]1500
LeafFile usage (FileUsageTest) [File]2100
LeafFile validate (FileValidateTest) [File API]1100
LeafFile validator tests (FileValidatorTest) [File API]3600
LeafFileTransfer unit tests (FileTranferTest) [System]200
ExpandFilter administration functionality (FilterAdminTestCase) [Filter]21203
MessageGroupFilenameLineFunctionStatus
Undefined index: moduleNoticefield.info.inc385_field_info_prepare_instance_widget()
Undefined index: moduleNoticefield.info.inc353_field_info_prepare_instance_display()
Undefined index: moduleNoticefield.info.inc353_field_info_prepare_instance_display()
LeafFilter CRUD operations (FilterCRUDTestCase) [Filter]29800
ExpandFilter format access (FilterFormatAccessTestCase) [Filter]29006
MessageGroupFilenameLineFunctionStatus
Undefined index: moduleNoticefield.info.inc385_field_info_prepare_instance_widget()
Undefined index: moduleNoticefield.info.inc353_field_info_prepare_instance_display()
Undefined index: moduleNoticefield.info.inc353_field_info_prepare_instance_display()
Undefined index: moduleNoticefield.info.inc385_field_info_prepare_instance_widget()
Undefined index: moduleNoticefield.info.inc353_field_info_prepare_instance_display()
Undefined index: moduleNoticefield.info.inc353_field_info_prepare_instance_display()
LeafFilter format hooks (FilterHooksTestCase) [Filter]6400
LeafFilter format upgrade path (FilterFormatUpgradePathTestCase) [Upgrade path]3600
LeafFilter module filters (FilterUnitTestCase) [Filter]29800
LeafFingerprinting meta tag (AdminMetaTagTestCase) [System]300
LeafFlood control mechanism (FloodFunctionalTest) [System]600
LeafForm alter hooks (FormAlterTestCase) [Form API]300
LeafForm API checkbox (FormCheckboxTestCase) [Form API]9600
LeafForm API file inclusion (FormsFileInclusionTestCase) [Form API]900
LeafForm element and label output test (FormsElementsLabelsTestCase) [Form API]1500
LeafForm element validation (FormsTestCase) [Form API]27000
LeafForm rebuilding (FormsRebuildTestCase) [Form API]5000
LeafForm state values clearance (FormStateValuesCleanTestCase) [Form API]1300
LeafForm triggering element determination (FormsTriggeringElementTestCase) [Form API]4800
LeafForm validation handlers (FormValidationTestCase) [Form API]4700
LeafForm wrapper callback (FormsFormWrapperTestCase) [Form API]400
ExpandFormat date (FormatDateUnitTest) [System]4303
MessageGroupFilenameLineFunctionStatus
Undefined index: moduleNoticefield.info.inc385_field_info_prepare_instance_widget()
Undefined index: moduleNoticefield.info.inc353_field_info_prepare_instance_display()
Undefined index: moduleNoticefield.info.inc353_field_info_prepare_instance_display()
ExpandForum functionality (ForumTestCase) [Forum]60803
MessageGroupFilenameLineFunctionStatus
Undefined index: moduleNoticefield.info.inc385_field_info_prepare_instance_widget()
Undefined index: moduleNoticefield.info.inc353_field_info_prepare_instance_display()
Undefined index: moduleNoticefield.info.inc353_field_info_prepare_instance_display()
LeafFront page (FrontPageTestCase) [System]3600
LeafGet filename test (BootstrapGetFilenameTestCase) [Bootstrap]400
LeafGraph (GraphUnitTest) [System]2800
LeafHelp functionality (HelpTestCase) [Help]30800
LeafHTML Attributes (DrupalAttributesUnitTest) [System]600
LeafHTML identifiers (DrupalHTMLIdentifierTestCase) [System]1000
LeafHTML in page titles (PageTitleFiltering) [System]4000
LeafHTTP file retrieval (RetrieveFileTestCase) [System]700
LeafImage effects (ImageEffectsUnitTest) [Image]3300
ExpandImage field display tests (ImageFieldDisplayTestCase) [Image]17710
MessageGroupFilenameLineFunctionStatus
The test did not complete due to a fatal error.Completion checkimage.test625ImageFieldDisplayTestCase->testImageFieldFormattersPublic()
Undefined index: moduleNoticefield.info.inc385_field_info_prepare_instance_widget()
Undefined index: moduleNoticefield.info.inc353_field_info_prepare_instance_display()
Undefined index: moduleNoticefield.info.inc353_field_info_prepare_instance_display()
Undefined index: moduleNoticefield.info.inc385_field_info_prepare_instance_widget()
Undefined index: moduleNoticefield.info.inc353_field_info_prepare_instance_display()
Failed to set field files[fg4ad1wx_und_0] to /var/lib/drupaltestbot/sites/default/files/checkout/sites/default/files/simpletest/283669/image-test.pngOtherimage.test98ImageFieldTestCase->uploadNodeImage()
Found the requested form fields at node/add/articleOtherimage.test98ImageFieldTestCase->uploadNodeImage()
array_flip(): Can only flip STRING and INTEGER values!Warningentity.inc167DrupalDefaultEntityController->load()
Trying to get property of non-objectNoticeimage.test650ImageFieldDisplayTestCase->_testImageFieldFormatters()
Default formatter displaying correctly on full node view.Otherimage.test655ImageFieldDisplayTestCase->_testImageFieldFormatters()
Undefined index: moduleNoticefield.crud.inc779_field_write_instance()
Image linked to file formatter displaying correctly on full node view.Otherimage.test664ImageFieldDisplayTestCase->_testImageFieldFormatters()
File was downloaded successfully.Otherimage.test666ImageFieldDisplayTestCase->_testImageFieldFormatters()
Undefined index: moduleNoticefield.crud.inc779_field_write_instance()
Image linked to content formatter displaying correctly on full node view.Otherimage.test688ImageFieldDisplayTestCase->_testImageFieldFormatters()
Undefined index: moduleNoticefield.crud.inc779_field_write_instance()
ExpandImage field validation tests (ImageFieldValidateTestCase) [Image]1465
MessageGroupFilenameLineFunctionStatus
Undefined index: moduleNoticefield.info.inc385_field_info_prepare_instance_widget()
Undefined index: moduleNoticefield.info.inc353_field_info_prepare_instance_display()
Undefined index: moduleNoticefield.info.inc353_field_info_prepare_instance_display()
Undefined index: moduleNoticefield.info.inc385_field_info_prepare_instance_widget()
Undefined index: moduleNoticefield.info.inc353_field_info_prepare_instance_display()
Failed to set field files[vz8qq66y_und_0] to /var/lib/drupaltestbot/sites/default/files/checkout/sites/default/files/simpletest/971262/image-test.jpgOtherimage.test98ImageFieldTestCase->uploadNodeImage()
Found the requested form fields at node/add/articleOtherimage.test98ImageFieldTestCase->uploadNodeImage()
Node save failed when minimum image resolution was not met.Otherimage.test863ImageFieldValidateTestCase->testResolution()
Failed to set field files[vz8qq66y_und_0] to /var/lib/drupaltestbot/sites/default/files/checkout/sites/default/files/simpletest/971262/image-1.pngOtherimage.test98ImageFieldTestCase->uploadNodeImage()
Found the requested form fields at node/add/articleOtherimage.test98ImageFieldTestCase->uploadNodeImage()
Image exceeding max resolution was properly resized.Otherimage.test865ImageFieldValidateTestCase->testResolution()
LeafImage GD manipulation tests (ImageToolkitGdTestCase) [Image]100
ExpandImage styles and effects UI configuration (ImageAdminStylesUnitTest) [Image]14937
MessageGroupFilenameLineFunctionStatus
The test did not complete due to a fatal error.Completion checkimage.test565ImageAdminStylesUnitTest->testStyleReplacement()
Undefined index: moduleNoticefield.info.inc385_field_info_prepare_instance_widget()
Undefined index: moduleNoticefield.info.inc353_field_info_prepare_instance_display()
Undefined index: moduleNoticefield.info.inc353_field_info_prepare_instance_display()
Undefined index: moduleNoticefield.info.inc385_field_info_prepare_instance_widget()
Undefined index: moduleNoticefield.info.inc353_field_info_prepare_instance_display()
Failed to set field files[gbb8fkfumc_und_0] to /var/lib/drupaltestbot/sites/default/files/checkout/sites/default/files/simpletest/997585/image-test.pngOtherimage.test98ImageFieldTestCase->uploadNodeImage()
Found the requested form fields at node/add/articleOtherimage.test98ImageFieldTestCase->uploadNodeImage()
array_flip(): Can only flip STRING and INTEGER values!Warningentity.inc167DrupalDefaultEntityController->load()
Trying to get property of non-objectNoticeimage.test585ImageAdminStylesUnitTest->testStyleReplacement()
LeafImage styles path and URL functions (ImageStylesPathAndUrlUnitTest) [Image]2100
LeafImage toolkit tests (ImageToolkitUnitTest) [Image]4400
LeafImport feeds from OPML functionality (ImportOPMLTestCase) [Aggregator]5300
LeafInfo file format parser (InfoFileParserTestCase) [System]900
LeafInsert tests (DatabaseInsertTestCase) [Database]4500
LeafInsert tests, default fields (DatabaseInsertDefaultsTestCase) [Database]1900
LeafInsert tests, LOB fields (DatabaseInsertLOBTestCase) [Database]1300
LeafInvalid data (DatabaseInvalidDataTestCase) [Database]700
LeafIP address and HTTP_HOST test (BootstrapIPAddressTestCase) [Bootstrap]1100
LeafIP address blocking (IPAddressBlockingTestCase) [System]4200
LeafJavaScript (JavaScriptTestCase) [System]3500
LeafJSON (DrupalJSONTest) [System]1400
LeafKeywords and conditions (SearchKeywordsConditions) [Search]2500
LeafLanguage configuration (LocaleConfigurationTest) [Locale]7800
LeafLanguage switching (LocaleLanguageSwitchingFunctionalTest) [Locale]2500
LeafLinks (ThemeLinksUnitTest) [Theme]1700
LeafList field (ListFieldTestCase) [Field types]1400
ExpandList field UI (ListFieldUITestCase) [Field types]36019
MessageGroupFilenameLineFunctionStatus
Undefined index: moduleNoticefield.info.inc385_field_info_prepare_instance_widget()
Undefined index: moduleNoticefield.info.inc353_field_info_prepare_instance_display()
Undefined index: moduleNoticefield.info.inc353_field_info_prepare_instance_display()
Undefined index: moduleNoticefield.info.inc385_field_info_prepare_instance_widget()
Undefined index: moduleNoticefield.info.inc353_field_info_prepare_instance_display()
Undefined index: moduleNoticefield.info.inc353_field_info_prepare_instance_display()
Undefined index: moduleNoticefield.info.inc385_field_info_prepare_instance_widget()
Undefined index: moduleNoticefield.info.inc353_field_info_prepare_instance_display()
Undefined index: moduleNoticefield.info.inc353_field_info_prepare_instance_display()
Undefined index: moduleNoticefield.info.inc385_field_info_prepare_instance_widget()
Undefined index: moduleNoticefield.info.inc353_field_info_prepare_instance_display()
Undefined index: moduleNoticefield.info.inc353_field_info_prepare_instance_display()
Undefined index: moduleNoticefield.info.inc385_field_info_prepare_instance_widget()
Undefined index: moduleNoticefield.info.inc353_field_info_prepare_instance_display()
Undefined index: moduleNoticefield.info.inc353_field_info_prepare_instance_display()
Undefined index: moduleNoticefield.info.inc385_field_info_prepare_instance_widget()
Undefined index: moduleNoticefield.info.inc353_field_info_prepare_instance_display()
Undefined index: moduleNoticefield.info.inc353_field_info_prepare_instance_display()
Undefined index: imageNoticefield_ui.admin.inc1491field_ui_existing_field_options()
LeafLoad multiple nodes (NodeLoadMultipleUnitTest) [Node]3600
LeafLocale uninstall (EN) (LocaleUninstallFunctionalTest) [Locale]3100
LeafLocale uninstall (FR) (LocaleUninstallFrenchFunctionalTest) [Locale]3100
LeafLocale upgrade path (LocaleUpgradePathTestCase) [Upgrade path]16100
ExpandLocalize date formats (LocaleDateFormatsFunctionalTest) [Locale]3503
MessageGroupFilenameLineFunctionStatus
Undefined index: moduleNoticefield.info.inc385_field_info_prepare_instance_widget()
Undefined index: moduleNoticefield.info.inc353_field_info_prepare_instance_display()
Undefined index: moduleNoticefield.info.inc353_field_info_prepare_instance_display()
LeafLocking framework tests (LockFunctionalTest) [System]1700
LeafMail system (MailTestCase) [System]100
ExpandMain content rendering fallback (SystemMainContentFallback) [System]6603
MessageGroupFilenameLineFunctionStatus
Undefined index: moduleNoticefield.info.inc385_field_info_prepare_instance_widget()
Undefined index: moduleNoticefield.info.inc353_field_info_prepare_instance_display()
Undefined index: moduleNoticefield.info.inc353_field_info_prepare_instance_display()
ExpandManage display (FieldUIManageDisplayTestCase) [Field UI]81072
MessageGroupFilenameLineFunctionStatus
Undefined index: moduleNoticefield.info.inc385_field_info_prepare_instance_widget()
Undefined index: moduleNoticefield.info.inc353_field_info_prepare_instance_display()
Undefined index: moduleNoticefield.info.inc353_field_info_prepare_instance_display()
Undefined index: moduleNoticefield.info.inc385_field_info_prepare_instance_widget()
Undefined index: moduleNoticefield.info.inc353_field_info_prepare_instance_display()
Undefined index: moduleNoticefield.info.inc353_field_info_prepare_instance_display()
Undefined index: imageNoticefield_ui.admin.inc1491field_ui_existing_field_options()
Undefined index: moduleNoticefield.info.inc385_field_info_prepare_instance_widget()
Undefined index: moduleNoticefield.info.inc353_field_info_prepare_instance_display()
Undefined index: moduleNoticefield.info.inc353_field_info_prepare_instance_display()
Undefined index: imageNoticefield_ui.admin.inc1491field_ui_existing_field_options()
Undefined index: moduleNoticefield.info.inc385_field_info_prepare_instance_widget()
Undefined index: moduleNoticefield.info.inc353_field_info_prepare_instance_display()
Undefined index: moduleNoticefield.info.inc353_field_info_prepare_instance_display()
Undefined index: moduleNoticefield.info.inc385_field_info_prepare_instance_widget()
Undefined index: moduleNoticefield.info.inc353_field_info_prepare_instance_display()
Undefined index: moduleNoticefield.info.inc353_field_info_prepare_instance_display()
Undefined index: moduleNoticefield.info.inc385_field_info_prepare_instance_widget()
Undefined index: moduleNoticefield.info.inc353_field_info_prepare_instance_display()
Undefined index: moduleNoticefield.info.inc353_field_info_prepare_instance_display()
Undefined index: moduleNoticefield.info.inc385_field_info_prepare_instance_widget()
Undefined index: moduleNoticefield.info.inc353_field_info_prepare_instance_display()
Undefined index: moduleNoticefield.info.inc353_field_info_prepare_instance_display()
Undefined index: moduleNoticefield.info.inc385_field_info_prepare_instance_widget()
Undefined index: moduleNoticefield.info.inc353_field_info_prepare_instance_display()
Undefined index: moduleNoticefield.info.inc353_field_info_prepare_instance_display()
Undefined index: imageNoticefield_ui.admin.inc1491field_ui_existing_field_options()
Undefined index: moduleNoticefield.info.inc385_field_info_prepare_instance_widget()
Undefined index: moduleNoticefield.info.inc353_field_info_prepare_instance_display()
Undefined index: moduleNoticefield.info.inc353_field_info_prepare_instance_display()
Undefined index: moduleNoticefield.info.inc385_field_info_prepare_instance_widget()
Undefined index: moduleNoticefield.info.inc353_field_info_prepare_instance_display()
Undefined index: moduleNoticefield.info.inc353_field_info_prepare_instance_display()
Undefined index: moduleNoticefield.info.inc385_field_info_prepare_instance_widget()
Undefined index: moduleNoticefield.info.inc353_field_info_prepare_instance_display()
Undefined index: moduleNoticefield.info.inc353_field_info_prepare_instance_display()
Undefined index: imageNoticefield_ui.admin.inc1491field_ui_existing_field_options()
Undefined index: moduleNoticefield.info.inc385_field_info_prepare_instance_widget()
Undefined index: moduleNoticefield.info.inc353_field_info_prepare_instance_display()
Undefined index: moduleNoticefield.info.inc353_field_info_prepare_instance_display()
Undefined index: imageNoticefield_ui.admin.inc1491field_ui_existing_field_options()
Undefined index: moduleNoticefield.info.inc385_field_info_prepare_instance_widget()
Undefined index: moduleNoticefield.info.inc353_field_info_prepare_instance_display()
Undefined index: moduleNoticefield.info.inc353_field_info_prepare_instance_display()
Undefined index: moduleNoticefield.info.inc385_field_info_prepare_instance_widget()
Undefined index: moduleNoticefield.info.inc353_field_info_prepare_instance_display()
Undefined index: moduleNoticefield.info.inc353_field_info_prepare_instance_display()
Undefined index: moduleNoticefield.info.inc385_field_info_prepare_instance_widget()
Undefined index: moduleNoticefield.info.inc353_field_info_prepare_instance_display()
Undefined index: moduleNoticefield.info.inc353_field_info_prepare_instance_display()
Undefined index: moduleNoticefield.info.inc385_field_info_prepare_instance_widget()
Undefined index: moduleNoticefield.info.inc353_field_info_prepare_instance_display()
Undefined index: moduleNoticefield.info.inc353_field_info_prepare_instance_display()
Undefined index: moduleNoticefield.info.inc385_field_info_prepare_instance_widget()
Undefined index: moduleNoticefield.info.inc353_field_info_prepare_instance_display()
Undefined index: moduleNoticefield.info.inc353_field_info_prepare_instance_display()
Undefined index: imageNoticefield_ui.admin.inc1491field_ui_existing_field_options()
Undefined index: moduleNoticefield.info.inc385_field_info_prepare_instance_widget()
Undefined index: moduleNoticefield.info.inc353_field_info_prepare_instance_display()
Undefined index: moduleNoticefield.info.inc353_field_info_prepare_instance_display()
Undefined index: moduleNoticefield.info.inc385_field_info_prepare_instance_widget()
Undefined index: moduleNoticefield.info.inc353_field_info_prepare_instance_display()
Undefined index: moduleNoticefield.info.inc353_field_info_prepare_instance_display()
Undefined index: moduleNoticefield.info.inc385_field_info_prepare_instance_widget()
Undefined index: moduleNoticefield.info.inc353_field_info_prepare_instance_display()
Undefined index: moduleNoticefield.info.inc353_field_info_prepare_instance_display()
Undefined index: moduleNoticefield.info.inc385_field_info_prepare_instance_widget()
Undefined index: moduleNoticefield.info.inc353_field_info_prepare_instance_display()
Undefined index: moduleNoticefield.info.inc353_field_info_prepare_instance_display()
Undefined index: moduleNoticefield.info.inc385_field_info_prepare_instance_widget()
Undefined index: moduleNoticefield.info.inc353_field_info_prepare_instance_display()
Undefined index: moduleNoticefield.info.inc353_field_info_prepare_instance_display()
ExpandManage fields (FieldUIManageFieldsTestCase) [Field UI]1500180
MessageGroupFilenameLineFunctionStatus
Undefined index: moduleNoticefield.info.inc385_field_info_prepare_instance_widget()
Undefined index: moduleNoticefield.info.inc353_field_info_prepare_instance_display()
Undefined index: moduleNoticefield.info.inc353_field_info_prepare_instance_display()
Undefined index: moduleNoticefield.info.inc385_field_info_prepare_instance_widget()
Undefined index: moduleNoticefield.info.inc353_field_info_prepare_instance_display()
Undefined index: moduleNoticefield.info.inc353_field_info_prepare_instance_display()
Undefined index: imageNoticefield_ui.admin.inc1491field_ui_existing_field_options()
Undefined index: moduleNoticefield.info.inc385_field_info_prepare_instance_widget()
Undefined index: moduleNoticefield.info.inc353_field_info_prepare_instance_display()
Undefined index: moduleNoticefield.info.inc353_field_info_prepare_instance_display()
Undefined index: imageNoticefield_ui.admin.inc1491field_ui_existing_field_options()
Undefined index: moduleNoticefield.info.inc385_field_info_prepare_instance_widget()
Undefined index: moduleNoticefield.info.inc353_field_info_prepare_instance_display()
Undefined index: moduleNoticefield.info.inc353_field_info_prepare_instance_display()
Undefined index: imageNoticefield_ui.admin.inc1491field_ui_existing_field_options()
Undefined index: moduleNoticefield.info.inc385_field_info_prepare_instance_widget()
Undefined index: moduleNoticefield.info.inc353_field_info_prepare_instance_display()
Undefined index: moduleNoticefield.info.inc353_field_info_prepare_instance_display()
Undefined index: moduleNoticefield.info.inc385_field_info_prepare_instance_widget()
Undefined index: moduleNoticefield.info.inc353_field_info_prepare_instance_display()
Undefined index: moduleNoticefield.info.inc353_field_info_prepare_instance_display()
Undefined index: moduleNoticefield.info.inc385_field_info_prepare_instance_widget()
Undefined index: moduleNoticefield.info.inc353_field_info_prepare_instance_display()
Undefined index: moduleNoticefield.info.inc353_field_info_prepare_instance_display()
Undefined index: moduleNoticefield.info.inc385_field_info_prepare_instance_widget()
Undefined index: moduleNoticefield.info.inc353_field_info_prepare_instance_display()
Undefined index: moduleNoticefield.info.inc353_field_info_prepare_instance_display()
Undefined index: moduleNoticefield.info.inc385_field_info_prepare_instance_widget()
Undefined index: moduleNoticefield.info.inc353_field_info_prepare_instance_display()
Undefined index: moduleNoticefield.info.inc353_field_info_prepare_instance_display()
Undefined index: imageNoticefield_ui.admin.inc1491field_ui_existing_field_options()
Undefined index: moduleNoticefield.info.inc385_field_info_prepare_instance_widget()
Undefined index: moduleNoticefield.info.inc353_field_info_prepare_instance_display()
Undefined index: moduleNoticefield.info.inc353_field_info_prepare_instance_display()
Undefined index: imageNoticefield_ui.admin.inc1491field_ui_existing_field_options()
Undefined index: moduleNoticefield.info.inc385_field_info_prepare_instance_widget()
Undefined index: moduleNoticefield.info.inc353_field_info_prepare_instance_display()
Undefined index: moduleNoticefield.info.inc353_field_info_prepare_instance_display()
Undefined index: moduleNoticefield.info.inc385_field_info_prepare_instance_widget()
Undefined index: moduleNoticefield.info.inc353_field_info_prepare_instance_display()
Undefined index: moduleNoticefield.info.inc353_field_info_prepare_instance_display()
Undefined index: imageNoticefield_ui.admin.inc1491field_ui_existing_field_options()
Undefined index: moduleNoticefield.info.inc385_field_info_prepare_instance_widget()
Undefined index: moduleNoticefield.info.inc353_field_info_prepare_instance_display()
Undefined index: moduleNoticefield.info.inc353_field_info_prepare_instance_display()
Undefined index: moduleNoticefield.info.inc385_field_info_prepare_instance_widget()
Undefined index: moduleNoticefield.info.inc353_field_info_prepare_instance_display()
Undefined index: moduleNoticefield.info.inc353_field_info_prepare_instance_display()
Undefined index: imageNoticefield_ui.admin.inc1491field_ui_existing_field_options()
Undefined index: moduleNoticefield.info.inc385_field_info_prepare_instance_widget()
Undefined index: moduleNoticefield.info.inc353_field_info_prepare_instance_display()
Undefined index: moduleNoticefield.info.inc353_field_info_prepare_instance_display()
Undefined index: imageNoticefield_ui.admin.inc1491field_ui_existing_field_options()
Undefined index: moduleNoticefield.info.inc385_field_info_prepare_instance_widget()
Undefined index: moduleNoticefield.info.inc353_field_info_prepare_instance_display()
Undefined index: moduleNoticefield.info.inc353_field_info_prepare_instance_display()
Undefined index: imageNoticefield_ui.admin.inc1491field_ui_existing_field_options()
Undefined index: moduleNoticefield.info.inc385_field_info_prepare_instance_widget()
Undefined index: moduleNoticefield.info.inc353_field_info_prepare_instance_display()
Undefined index: moduleNoticefield.info.inc353_field_info_prepare_instance_display()
Undefined index: moduleNoticefield.info.inc385_field_info_prepare_instance_widget()
Undefined index: moduleNoticefield.info.inc353_field_info_prepare_instance_display()
Undefined index: moduleNoticefield.info.inc353_field_info_prepare_instance_display()
Undefined index: moduleNoticefield.info.inc385_field_info_prepare_instance_widget()
Undefined index: moduleNoticefield.info.inc353_field_info_prepare_instance_display()
Undefined index: moduleNoticefield.info.inc353_field_info_prepare_instance_display()
Undefined index: moduleNoticefield.info.inc385_field_info_prepare_instance_widget()
Undefined index: moduleNoticefield.info.inc353_field_info_prepare_instance_display()
Undefined index: moduleNoticefield.info.inc353_field_info_prepare_instance_display()
Undefined index: imageNoticefield_ui.admin.inc1491field_ui_existing_field_options()
Undefined index: moduleNoticefield.info.inc385_field_info_prepare_instance_widget()
Undefined index: moduleNoticefield.info.inc353_field_info_prepare_instance_display()
Undefined index: moduleNoticefield.info.inc353_field_info_prepare_instance_display()
Undefined index: moduleNoticefield.info.inc385_field_info_prepare_instance_widget()
Undefined index: moduleNoticefield.info.inc353_field_info_prepare_instance_display()
Undefined index: moduleNoticefield.info.inc353_field_info_prepare_instance_display()
Undefined index: moduleNoticefield.info.inc385_field_info_prepare_instance_widget()
Undefined index: moduleNoticefield.info.inc353_field_info_prepare_instance_display()
Undefined index: moduleNoticefield.info.inc353_field_info_prepare_instance_display()
Undefined index: imageNoticefield_ui.admin.inc1491field_ui_existing_field_options()
Undefined index: moduleNoticefield.info.inc385_field_info_prepare_instance_widget()
Undefined index: moduleNoticefield.info.inc353_field_info_prepare_instance_display()
Undefined index: moduleNoticefield.info.inc353_field_info_prepare_instance_display()
Undefined index: moduleNoticefield.info.inc385_field_info_prepare_instance_widget()
Undefined index: moduleNoticefield.info.inc353_field_info_prepare_instance_display()
Undefined index: moduleNoticefield.info.inc353_field_info_prepare_instance_display()
Undefined index: imageNoticefield_ui.admin.inc1491field_ui_existing_field_options()
LeafManaged file element test (FileManagedFileElementTestCase) [File]26400
LeafMenu link creation/deletion (MenuTestCase) [Menu]64400
LeafMenu rebuild test (MenuRebuildTestCase) [Menu]500
LeafMenu router (MenuRouterTestCase) [Menu]19100
LeafMenu settings for nodes (MenuNodeTestCase) [Menu]4700
LeafMenu tree generation (MenuTreeDataTestCase) [Menu]400
LeafMerge tests (DatabaseMergeTestCase) [Database]7500
LeafMiscellaneous AJAX tests (AJAXElementValidation) [AJAX]800
LeafMissing update dependencies (UpdateDependencyMissingTestCase) [Update API]300
LeafModule API (ModuleUnitTest) [Module]3300
LeafModule dependencies (ModuleDependencyTestCase) [Module]11800
LeafModule installation (ModuleInstallTestCase) [Module]200
LeafModule uninstallation (ModuleUninstallTestCase) [Module]100
LeafModule versions (ModuleVersionTestCase) [Module]5000
ExpandMultilingual fields (LocaleMultilingualFieldsFunctionalTest) [Locale]6006
MessageGroupFilenameLineFunctionStatus
Undefined index: moduleNoticefield.info.inc385_field_info_prepare_instance_widget()
Undefined index: moduleNoticefield.info.inc353_field_info_prepare_instance_display()
Undefined index: moduleNoticefield.info.inc353_field_info_prepare_instance_display()
Undefined index: moduleNoticefield.info.inc385_field_info_prepare_instance_widget()
Undefined index: moduleNoticefield.info.inc353_field_info_prepare_instance_display()
Undefined index: moduleNoticefield.info.inc353_field_info_prepare_instance_display()
LeafMultistep form using form storage (FormsFormStorageTestCase) [Form API]11500
LeafMultistep node form basic options (MultiStepNodeFormBasicOptionsTest) [Node]1500
LeafNew default theme blocks (NewDefaultThemeBlocks) [Block]2400
LeafNo help (NoHelpTestCase) [Help]1100
LeafNode access (NodeAccessUnitTest) [Node]3100
LeafNode access rebuild (NodeAccessRebuildTestCase) [Node]1600
LeafNode access records (NodeAccessRecordsUnitTest) [Node]2300
LeafNode administration (NodeAdminTestCase) [Node]13900
LeafNode blocks (NodeBlockFunctionalTest) [Node]8300
LeafNode body upgrade path (NodeBodyUpgradePathTestCase) [Upgrade path]3700
LeafNode creation (NodeCreationTestCase) [Node]2500
LeafNode edit (PageEditTestCase) [Node]9300
LeafNode edit permissions (PageViewTestCase) [Node]3200
LeafNode entity query alter (NodeEntityFieldQueryAlter) [Node]3000
LeafNode feed (NodeFeedTestCase) [Node]100
LeafNode post information display (NodePostSettingsTestCase) [Node]3400
LeafNode preview (PagePreviewTestCase) [Node]3500
LeafNode query alter (NodeQueryAlter) [Node]5900
LeafNode revisions (NodeRevisionsTestCase) [Node]4400
LeafNode RSS Content (NodeRSSContentTestCase) [Node]1600
LeafNode save (NodeSaveTestCase) [Node]2800
LeafNode title (NodeTitleTestCase) [Node]2000
LeafNode title XSS filtering (NodeTitleXSSTestCase) [Node]2000
LeafNode token replacement (NodeTokenReplaceTestCase) [Node]3400
LeafNode type persist (NodeTypePersistenceTestCase) [Node]6200
ExpandNode types (NodeTypeTestCase) [Node]84025
MessageGroupFilenameLineFunctionStatus
Undefined index: moduleNoticefield.info.inc385_field_info_prepare_instance_widget()
Undefined index: moduleNoticefield.info.inc353_field_info_prepare_instance_display()
Undefined index: moduleNoticefield.info.inc353_field_info_prepare_instance_display()
Undefined index: moduleNoticefield.info.inc385_field_info_prepare_instance_widget()
Undefined index: moduleNoticefield.info.inc353_field_info_prepare_instance_display()
Undefined index: moduleNoticefield.info.inc353_field_info_prepare_instance_display()
Undefined index: moduleNoticefield.info.inc385_field_info_prepare_instance_widget()
Undefined index: moduleNoticefield.info.inc353_field_info_prepare_instance_display()
Undefined index: moduleNoticefield.info.inc353_field_info_prepare_instance_display()
Undefined index: moduleNoticefield.info.inc385_field_info_prepare_instance_widget()
Undefined index: moduleNoticefield.info.inc353_field_info_prepare_instance_display()
Undefined index: moduleNoticefield.info.inc353_field_info_prepare_instance_display()
Undefined index: moduleNoticefield.info.inc385_field_info_prepare_instance_widget()
Undefined index: moduleNoticefield.info.inc353_field_info_prepare_instance_display()
Undefined index: moduleNoticefield.info.inc353_field_info_prepare_instance_display()
Undefined index: moduleNoticefield.info.inc385_field_info_prepare_instance_widget()
Undefined index: moduleNoticefield.info.inc353_field_info_prepare_instance_display()
Undefined index: moduleNoticefield.info.inc353_field_info_prepare_instance_display()
Undefined index: moduleNoticefield.info.inc385_field_info_prepare_instance_widget()
Undefined index: moduleNoticefield.info.inc353_field_info_prepare_instance_display()
Undefined index: moduleNoticefield.info.inc353_field_info_prepare_instance_display()
Undefined index: moduleNoticefield.info.inc385_field_info_prepare_instance_widget()
Undefined index: moduleNoticefield.info.inc353_field_info_prepare_instance_display()
Undefined index: moduleNoticefield.info.inc353_field_info_prepare_instance_display()
Undefined index: imageNoticefield_ui.admin.inc1491field_ui_existing_field_options()
LeafNon default theme admin (NonDefaultBlockAdmin) [Block]1000
ExpandNumber field (NumberFieldTestCase) [Field types]1503
MessageGroupFilenameLineFunctionStatus
Undefined index: moduleNoticefield.info.inc385_field_info_prepare_instance_widget()
Undefined index: moduleNoticefield.info.inc353_field_info_prepare_instance_display()
Undefined index: moduleNoticefield.info.inc353_field_info_prepare_instance_display()
LeafOpenID account registration (OpenIDRegistrationTestCase) [OpenID]13100
LeafOpenID discovery and login (OpenIDFunctionalTestCase) [OpenID]24800
LeafOpenID helper functions (OpenIDUnitTest) [OpenID]3200
ExpandOptions widgets (OptionsWidgetsTestCase) [Field types]229018
MessageGroupFilenameLineFunctionStatus
Undefined index: moduleNoticefield.info.inc385_field_info_prepare_instance_widget()
Undefined index: moduleNoticefield.info.inc353_field_info_prepare_instance_display()
Undefined index: moduleNoticefield.info.inc353_field_info_prepare_instance_display()
Undefined index: moduleNoticefield.info.inc385_field_info_prepare_instance_widget()
Undefined index: moduleNoticefield.info.inc353_field_info_prepare_instance_display()
Undefined index: moduleNoticefield.info.inc353_field_info_prepare_instance_display()
Undefined index: moduleNoticefield.info.inc385_field_info_prepare_instance_widget()
Undefined index: moduleNoticefield.info.inc353_field_info_prepare_instance_display()
Undefined index: moduleNoticefield.info.inc353_field_info_prepare_instance_display()
Undefined index: moduleNoticefield.info.inc385_field_info_prepare_instance_widget()
Undefined index: moduleNoticefield.info.inc353_field_info_prepare_instance_display()
Undefined index: moduleNoticefield.info.inc353_field_info_prepare_instance_display()
Undefined index: moduleNoticefield.info.inc385_field_info_prepare_instance_widget()
Undefined index: moduleNoticefield.info.inc353_field_info_prepare_instance_display()
Undefined index: moduleNoticefield.info.inc353_field_info_prepare_instance_display()
Undefined index: moduleNoticefield.info.inc385_field_info_prepare_instance_widget()
Undefined index: moduleNoticefield.info.inc353_field_info_prepare_instance_display()
Undefined index: moduleNoticefield.info.inc353_field_info_prepare_instance_display()
LeafPage cache test (BootstrapPageCacheTestCase) [Bootstrap]7800
LeafPager query tests (DatabaseSelectPagerDefaultTestCase) [Database]4200
LeafParsing .info files (ParseInfoFilesTestCase) [System]300
LeafPath alias functionality (PathTestCase) [Path]10200
LeafPath aliases with languages (PathLanguageUITestCase) [Path]6900
ExpandPath aliases with translated nodes (PathLanguageTestCase) [Path]6303
MessageGroupFilenameLineFunctionStatus
Undefined index: moduleNoticefield.info.inc385_field_info_prepare_instance_widget()
Undefined index: moduleNoticefield.info.inc353_field_info_prepare_instance_display()
Undefined index: moduleNoticefield.info.inc353_field_info_prepare_instance_display()
ExpandPath language settings (LocalePathFunctionalTest) [Locale]4303
MessageGroupFilenameLineFunctionStatus
Undefined index: moduleNoticefield.info.inc385_field_info_prepare_instance_widget()
Undefined index: moduleNoticefield.info.inc353_field_info_prepare_instance_display()
Undefined index: moduleNoticefield.info.inc353_field_info_prepare_instance_display()
LeafPaths on non-English monolingual sites (PathMonolingualTestCase) [Path]3400
LeafPersonal contact form (ContactPersonalTestCase) [Contact]14200
LeafPHP filter access check (PHPAccessTestCase) [PHP]3700
LeafPHP filter functionality (PHPFilterTestCase) [PHP]4100
LeafPoll add choice (PollJSAddChoice) [Poll]1500
LeafPoll create (PollCreateTestCase) [Poll]14300
LeafPoll expiration (PollExpirationTestCase) [Poll]3200
LeafPoll token replacement (PollTokenReplaceTestCase) [Poll]11000
LeafPoll upgrade path (PollUpgradePathTestCase) [Upgrade path]21600
LeafPoll vote (PollVoteTestCase) [Poll]8400
LeafProfile browsing (ProfileTestBrowsing) [Profile]3200
LeafProgrammatic form submissions (FormsProgrammaticTestCase) [Form API]1800
LeafQuery altering tests (DatabaseAlterTestCase) [Database]5500
LeafQuery logging (DatabaseLoggingTestCase) [Database]3800
LeafQuery tagging tests (DatabaseTaggingTestCase) [Database]2800
LeafQueue functionality (QueueTestCase) [System]700
LeafRange query test (DatabaseRangeQueryTestCase) [Database]200
LeafRDF comment mapping (RdfCommentAttributesTestCase) [RDF]20400
LeafRDF mapping CRUD functions (RdfCrudTestCase) [RDF]900
LeafRDF mapping definition functionality (RdfMappingDefinitionTestCase) [RDF]6100
LeafRDF mapping hook (RdfMappingHookTestCase) [RDF]500
LeafRDF namespaces (RdfGetRdfNamespacesTestCase) [RDF]400
LeafRDF namespaces XML serialization tests (DrupalGetRdfNamespacesTestCase) [System]600
LeafRDF tracker page mapping (RdfTrackerAttributesTestCase) [RDF]3200
ExpandRDFa markup (RdfRdfaMarkupTestCase) [RDF]1850
MessageGroupFilenameLineFunctionStatus
Failed to set field files[file_test_und_0] to /var/lib/drupaltestbot/sites/default/files/checkout/sites/default/files/simpletest/120249/text-0.txtOtherrdf.test169RdfRdfaMarkupTestCase->testAttributesInMarkupFile()
Failed to set field files[field_image_und_0] to /var/lib/drupaltestbot/sites/default/files/checkout/sites/default/files/simpletest/120249/image-test.pngOtherrdf.test169RdfRdfaMarkupTestCase->testAttributesInMarkupFile()
Found the requested form fields at node/1/editOtherrdf.test169RdfRdfaMarkupTestCase->testAttributesInMarkupFile()
Attribute 'rel' set on file field. Attribute 'resource' is also set.Otherrdf.test183RdfRdfaMarkupTestCase->testAttributesInMarkupFile()
Attribute 'rel' set on image field. Attribute 'resource' is also set.Otherrdf.test189RdfRdfaMarkupTestCase->testAttributesInMarkupFile()
ExpandRebuild arbitrary forms (FormsArbitraryRebuildTestCase) [Form API]1403
MessageGroupFilenameLineFunctionStatus
Undefined index: moduleNoticefield.info.inc385_field_info_prepare_instance_widget()
Undefined index: moduleNoticefield.info.inc353_field_info_prepare_instance_display()
Undefined index: moduleNoticefield.info.inc353_field_info_prepare_instance_display()
LeafRebuild content (NodeBuildContent) [Node]100
LeafRegistry parse file test (RegistryParseFileTestCase) [System]200
LeafRegistry parse files test (RegistryParseFilesTestCase) [System]600
LeafRegression tests (DatabaseRegressionTestCase) [Database]2700
LeafRemove feed functionality (RemoveFeedTestCase) [Aggregator]2300
LeafRemove feed item functionality (RemoveFeedItemTestCase) [Aggregator]19600
LeafRequired modules (ModuleRequiredTestCase) [Module]1800
LeafRequirements hook failure (HookRequirementsTestCase) [Module]1500
LeafResettable static variables test (BootstrapResettableStaticTestCase) [Bootstrap]500
LeafRole assignment (UserRolesAssignmentTestCase) [User]5300
LeafRole permissions (UserPermissionsTestCase) [User]5000
LeafSchema API (SchemaTestCase) [Database]2800
LeafSearch engine phrase queries (SearchExactTestCase) [Search]2200
LeafSearch engine queries (SearchMatchTestCase) [Search]14400
LeafSearch engine ranking (SearchRankingTestCase) [Search]8500
LeafSearch excerpt extraction (SearchExcerptTestCase) [Search]500
LeafSearch expression insert/extract (SearchExpressionInsertExtractTestCase) [Search]2400
LeafSearch page override (SearchPageOverride) [Search]1200
LeafSearch page text (SearchPageText) [Search]2600
LeafSearch simplify (SearchSimplifyTestCase) [Search]45800
ExpandSecurity (FilterSecurityTestCase) [Filter]2606
MessageGroupFilenameLineFunctionStatus
Undefined index: moduleNoticefield.info.inc385_field_info_prepare_instance_widget()
Undefined index: moduleNoticefield.info.inc353_field_info_prepare_instance_display()
Undefined index: moduleNoticefield.info.inc353_field_info_prepare_instance_display()
Undefined index: moduleNoticefield.info.inc385_field_info_prepare_instance_widget()
Undefined index: moduleNoticefield.info.inc353_field_info_prepare_instance_display()
Undefined index: moduleNoticefield.info.inc353_field_info_prepare_instance_display()
LeafSelect tests (DatabaseSelectTestCase) [Database]11700
LeafSelect tests, complex (DatabaseSelectComplexTestCase) [Database]11500
LeafSelect tests, complex 2 (DatabaseSelectComplexTestCase2) [Database]1400
LeafSelect tests, ordered (DatabaseSelectOrderedTestCase) [Database]2600
LeafSelect tests, subqueries (DatabaseSelectSubqueryTestCase) [Database]2400
LeafSequences API (DatabaseNextIdCase) [Database]200
LeafSession https handling (SessionHttpsTestCase) [Session]11100
LeafSession tests (SessionTestCase) [Session]21900
LeafShortcut link functionality (ShortcutLinksTestCase) [Shortcut]10300
LeafShortcut set functionality (ShortcutSetsTestCase) [Shortcut]15300
LeafShutdown functions (ShutdownFunctionsTest) [System]400
LeafSimpleTest browser (SimpleTestBrowserTestCase) [SimpleTest]1600
LeafSimpleTest e-mail capturing (SimpleTestMailCaptureTestCase) [SimpleTest]1300
LeafSimpleTest error collector (DrupalErrorCollectionUnitTest) [SimpleTest]1500
LeafSimpleTest functionality (SimpleTestFunctionalTest) [SimpleTest]11400
LeafSite maintenance mode functionality (SiteMaintenanceTestCase) [System]8000
LeafSite-wide contact form (ContactSitewideTestCase) [Contact]23700
LeafSize parsing test (CommonSizeTestCase) [System]3500
LeafStatistics logging tests (StatisticsLoggingTestCase) [Statistics]1200
LeafStatistics reports tests (StatisticsReportsTestCase) [Statistics]8000
LeafStatistics token replacement (StatisticsTokenReplaceTestCase) [Statistics]2900
LeafStream wrappers (StreamWrapperTest) [File API]2500
LeafString filtering tests (CommonXssUnitTest) [System]900
ExpandString translate, search and validate (LocaleTranslationFunctionalTest) [Locale]25009
MessageGroupFilenameLineFunctionStatus
Undefined index: moduleNoticefield.info.inc385_field_info_prepare_instance_widget()
Undefined index: moduleNoticefield.info.inc353_field_info_prepare_instance_display()
Undefined index: moduleNoticefield.info.inc353_field_info_prepare_instance_display()
Undefined index: moduleNoticefield.info.inc385_field_info_prepare_instance_widget()
Undefined index: moduleNoticefield.info.inc353_field_info_prepare_instance_display()
Undefined index: moduleNoticefield.info.inc353_field_info_prepare_instance_display()
Undefined index: moduleNoticefield.info.inc385_field_info_prepare_instance_widget()
Undefined index: moduleNoticefield.info.inc353_field_info_prepare_instance_display()
Undefined index: moduleNoticefield.info.inc353_field_info_prepare_instance_display()
LeafString translation using st() (LocaleInstallTest) [Locale]100
ExpandSummary length (SummaryLengthTestCase) [Node]1503
MessageGroupFilenameLineFunctionStatus
Undefined index: moduleNoticefield.info.inc385_field_info_prepare_instance_widget()
Undefined index: moduleNoticefield.info.inc353_field_info_prepare_instance_display()
Undefined index: moduleNoticefield.info.inc353_field_info_prepare_instance_display()
LeafSyslog functionality (SyslogTestCase) [Syslog]1600
LeafSystem info alter (SystemInfoAlterTestCase) [System]1000
LeafTableselect form element type test (FormsElementsTableSelectFunctionalTest) [Form API]5200
LeafTablesort query tests (DatabaseSelectTableSortDefaultTestCase) [Database]4100
ExpandTaxonomy term functions and forms. (TaxonomyTermTestCase) [Taxonomy]16806
MessageGroupFilenameLineFunctionStatus
Undefined index: moduleNoticefield.info.inc385_field_info_prepare_instance_widget()
Undefined index: moduleNoticefield.info.inc353_field_info_prepare_instance_display()
Undefined index: moduleNoticefield.info.inc353_field_info_prepare_instance_display()
Undefined index: moduleNoticefield.info.inc385_field_info_prepare_instance_widget()
Undefined index: moduleNoticefield.info.inc353_field_info_prepare_instance_display()
Undefined index: moduleNoticefield.info.inc353_field_info_prepare_instance_display()
ExpandTaxonomy term hooks (TaxonomyHooksTestCase) [Taxonomy]1903
MessageGroupFilenameLineFunctionStatus
Undefined index: moduleNoticefield.info.inc385_field_info_prepare_instance_widget()
Undefined index: moduleNoticefield.info.inc353_field_info_prepare_instance_display()
Undefined index: moduleNoticefield.info.inc353_field_info_prepare_instance_display()
LeafTaxonomy term multiple loading (TaxonomyLoadMultipleUnitTest) [Taxonomy]1700
LeafTaxonomy term reference field (TaxonomyTermFieldTestCase) [Taxonomy]3600
LeafTaxonomy term unit tests (TaxonomyTermUnitTest) [Taxonomy]100
LeafTaxonomy term URL aliases (PathTaxonomyTermTestCase) [Path]3400
LeafTaxonomy token replacement (TaxonomyTokenReplaceTestCase) [Taxonomy]5300
LeafTaxonomy upgrade path (UpgradePathTaxonomyTestCase) [Upgrade path]126500
LeafTaxonomy vocabularies (TaxonomyVocabularyUnitTest) [Taxonomy]6100
ExpandTaxonomy vocabulary interface (TaxonomyVocabularyFunctionalTest) [Taxonomy]9703
MessageGroupFilenameLineFunctionStatus
Undefined index: moduleNoticefield.info.inc385_field_info_prepare_instance_widget()
Undefined index: moduleNoticefield.info.inc353_field_info_prepare_instance_display()
Undefined index: moduleNoticefield.info.inc353_field_info_prepare_instance_display()
LeafTemporary query test (DatabaseTemporaryQueryTestCase) [Database]500
LeafTest date field (ProfileTestDate) [Profile]4900
LeafTest field weights (ProfileTestWeights) [Profile]5300
LeafTest select field (ProfileTestSelect) [Profile]4500
LeafTest single fields (ProfileTestFields) [Profile]18000
LeafTest statistics admin. (StatisticsAdminTestCase) [Statistics]10400
LeafTest user actions (TriggerUserActionTestCase) [Trigger]6500
ExpandTest user triggers (TriggerUserTokenTestCase) [Trigger]162230
MessageGroupFilenameLineFunctionStatus
Expected text found in subject of email message: "Action was triggered by trigger user_logout user:name=vHA28DA8 user:uid=2 user:mail=vHA28DA8@example.com user:url=http://201011081733-pifr-mysql/checkout/?q=user/2 user:edit-url=http://201011081733-pifr-mysql/checkout/?q=user/2/edit user:created=Sat, 11/20/2010 - 02:02".Othertrigger.test452TriggerUserTokenTestCase->testUserTriggerTokenReplacement()
Expected text found in body of email message: "Action was triggered by trigger user_logout user:name=vHA28DA8 user:uid=2 user:mail=vHA28DA8@example.com user:url=http://201011081733-pifr-mysql/checkout/?q=user/2 user:edit-url=http://201011081733-pifr-mysql/checkout/?q=user/2/edit user:created=Sat, 11/20/2010 - 02:02".Othertrigger.test452TriggerUserTokenTestCase->testUserTriggerTokenReplacement()
Mail sent to correct destinationE-mailtrigger.test452TriggerUserTokenTestCase->testUserTriggerTokenReplacement()
Expected system message to contain token-replaced text "Action was triggered by trigger user_login user:name=vHA28DA8 user:uid=2 user:mail=vHA28DA8@example.com user:url=http://201011081733-pifr-mysql/checkout/?q=user/2 user:edit-url=http://201011081733-pifr-mysql/checkout/?q=user/2/edit user:created=Sat, 11/20/2010 - 02:02" found in configured system message actionOthertrigger.test455TriggerUserTokenTestCase->testUserTriggerTokenReplacement()
Expected text found in subject of email message: "Action was triggered by trigger user_login user:name=vHA28DA8 user:uid=2 user:mail=vHA28DA8@example.com user:url=http://201011081733-pifr-mysql/checkout/?q=user/2 user:edit-url=http://201011081733-pifr-mysql/checkout/?q=user/2/edit user:created=Sat, 11/20/2010 - 02:02".Othertrigger.test455TriggerUserTokenTestCase->testUserTriggerTokenReplacement()
Expected text found in body of email message: "Action was triggered by trigger user_login user:name=vHA28DA8 user:uid=2 user:mail=vHA28DA8@example.com user:url=http://201011081733-pifr-mysql/checkout/?q=user/2 user:edit-url=http://201011081733-pifr-mysql/checkout/?q=user/2/edit user:created=Sat, 11/20/2010 - 02:02".Othertrigger.test455TriggerUserTokenTestCase->testUserTriggerTokenReplacement()
Mail sent to correct destinationE-mailtrigger.test455TriggerUserTokenTestCase->testUserTriggerTokenReplacement()
Expected system message to contain token-replaced text "Action was triggered by trigger user_view user:name=vHA28DA8 user:uid=2 user:mail=vHA28DA8@example.com user:url=http://201011081733-pifr-mysql/checkout/?q=user/2 user:edit-url=http://201011081733-pifr-mysql/checkout/?q=user/2/edit user:created=Sat, 11/20/2010 - 02:02" found in configured system message actionOthertrigger.test456TriggerUserTokenTestCase->testUserTriggerTokenReplacement()
Expected text found in subject of email message: "Action was triggered by trigger user_view user:name=vHA28DA8 user:uid=2 user:mail=vHA28DA8@example.com user:url=http://201011081733-pifr-mysql/checkout/?q=user/2 user:edit-url=http://201011081733-pifr-mysql/checkout/?q=user/2/edit user:created=Sat, 11/20/2010 - 02:02".Othertrigger.test456TriggerUserTokenTestCase->testUserTriggerTokenReplacement()
Expected text found in body of email message: "Action was triggered by trigger user_view user:name=vHA28DA8 user:uid=2 user:mail=vHA28DA8@example.com user:url=http://201011081733-pifr-mysql/checkout/?q=user/2 user:edit-url=http://201011081733-pifr-mysql/checkout/?q=user/2/edit user:created=Sat, 11/20/2010 - 02:02".Othertrigger.test456TriggerUserTokenTestCase->testUserTriggerTokenReplacement()
Mail sent to correct destinationE-mailtrigger.test456TriggerUserTokenTestCase->testUserTriggerTokenReplacement()
Expected system message to contain token-replaced text "Action was triggered by trigger user_update user:name=vHA28DA8_changed user:uid=2 user:mail=vHA28DA8@example.com user:url=http://201011081733-pifr-mysql/checkout/?q=user/2 user:edit-url=http://201011081733-pifr-mysql/checkout/?q=user/2/edit user:created=Sat, 11/20/2010 - 02:02" found in configured system message actionOthertrigger.test460TriggerUserTokenTestCase->testUserTriggerTokenReplacement()
Expected text found in subject of email message: "Action was triggered by trigger user_update user:name=vHA28DA8_changed user:uid=2 user:mail=vHA28DA8@example.com user:url=http://201011081733-pifr-mysql/checkout/?q=user/2 user:edit-url=http://201011081733-pifr-mysql/checkout/?q=user/2/edit user:created=Sat, 11/20/2010 - 02:02".Othertrigger.test460TriggerUserTokenTestCase->testUserTriggerTokenReplacement()
Expected text found in body of email message: "Action was triggered by trigger user_update user:name=vHA28DA8_changed user:uid=2 user:mail=vHA28DA8@example.com user:url=http://201011081733-pifr-mysql/checkout/?q=user/2 user:edit-url=http://201011081733-pifr-mysql/checkout/?q=user/2/edit user:created=Sat, 11/20/2010 - 02:02".Othertrigger.test460TriggerUserTokenTestCase->testUserTriggerTokenReplacement()
Mail sent to correct destinationE-mailtrigger.test460TriggerUserTokenTestCase->testUserTriggerTokenReplacement()
Expected system message to contain token-replaced text "Action was triggered by trigger user_view user:name=vHA28DA8_changed user:uid=2 user:mail=vHA28DA8@example.com user:url=http://201011081733-pifr-mysql/checkout/?q=user/2 user:edit-url=http://201011081733-pifr-mysql/checkout/?q=user/2/edit user:created=Sat, 11/20/2010 - 02:02" found in configured system message actionOthertrigger.test463TriggerUserTokenTestCase->testUserTriggerTokenReplacement()
Expected text found in subject of email message: "Action was triggered by trigger user_view user:name=vHA28DA8_changed user:uid=2 user:mail=vHA28DA8@example.com user:url=http://201011081733-pifr-mysql/checkout/?q=user/2 user:edit-url=http://201011081733-pifr-mysql/checkout/?q=user/2/edit user:created=Sat, 11/20/2010 - 02:02".Othertrigger.test463TriggerUserTokenTestCase->testUserTriggerTokenReplacement()
Expected text found in body of email message: "Action was triggered by trigger user_view user:name=vHA28DA8_changed user:uid=2 user:mail=vHA28DA8@example.com user:url=http://201011081733-pifr-mysql/checkout/?q=user/2 user:edit-url=http://201011081733-pifr-mysql/checkout/?q=user/2/edit user:created=Sat, 11/20/2010 - 02:02".Othertrigger.test463TriggerUserTokenTestCase->testUserTriggerTokenReplacement()
Mail sent to correct destinationE-mailtrigger.test463TriggerUserTokenTestCase->testUserTriggerTokenReplacement()
Expected system message to contain token-replaced text "Action was triggered by trigger user_delete user:name=gyT5Z5Bz user:uid=16 user:mail=gyT5Z5Bz@example.com user:url=http://201011081733-pifr-mysql/checkout/?q=user/16 user:edit-url=http://201011081733-pifr-mysql/checkout/?q=user/16/edit user:created=Sat, 11/20/2010 - 02:02" found in configured system message actionOthertrigger.test473TriggerUserTokenTestCase->testUserTriggerTokenReplacement()
Expected text found in subject of email message: "Action was triggered by trigger user_delete user:name=gyT5Z5Bz user:uid=16 user:mail=gyT5Z5Bz@example.com user:url=http://201011081733-pifr-mysql/checkout/?q=user/16 user:edit-url=http://201011081733-pifr-mysql/checkout/?q=user/16/edit user:created=Sat, 11/20/2010 - 02:02".Othertrigger.test473TriggerUserTokenTestCase->testUserTriggerTokenReplacement()
Expected text found in body of email message: "Action was triggered by trigger user_delete user:name=gyT5Z5Bz user:uid=16 user:mail=gyT5Z5Bz@example.com user:url=http://201011081733-pifr-mysql/checkout/?q=user/16 user:edit-url=http://201011081733-pifr-mysql/checkout/?q=user/16/edit user:created=Sat, 11/20/2010 - 02:02".Othertrigger.test473TriggerUserTokenTestCase->testUserTriggerTokenReplacement()
Mail sent to correct destinationE-mailtrigger.test473TriggerUserTokenTestCase->testUserTriggerTokenReplacement()
LeafTesting SimpleTest setUp (SimpleTestFolderTestCase) [SimpleTest]100
ExpandText field (TextFieldTestCase) [Field types]197018
MessageGroupFilenameLineFunctionStatus
Undefined index: moduleNoticefield.info.inc385_field_info_prepare_instance_widget()
Undefined index: moduleNoticefield.info.inc353_field_info_prepare_instance_display()
Undefined index: moduleNoticefield.info.inc353_field_info_prepare_instance_display()
Undefined index: moduleNoticefield.info.inc385_field_info_prepare_instance_widget()
Undefined index: moduleNoticefield.info.inc353_field_info_prepare_instance_display()
Undefined index: moduleNoticefield.info.inc353_field_info_prepare_instance_display()
Undefined index: moduleNoticefield.info.inc385_field_info_prepare_instance_widget()
Undefined index: moduleNoticefield.info.inc353_field_info_prepare_instance_display()
Undefined index: moduleNoticefield.info.inc353_field_info_prepare_instance_display()
Undefined index: moduleNoticefield.info.inc385_field_info_prepare_instance_widget()
Undefined index: moduleNoticefield.info.inc353_field_info_prepare_instance_display()
Undefined index: moduleNoticefield.info.inc353_field_info_prepare_instance_display()
Undefined index: moduleNoticefield.info.inc385_field_info_prepare_instance_widget()
Undefined index: moduleNoticefield.info.inc353_field_info_prepare_instance_display()
Undefined index: moduleNoticefield.info.inc353_field_info_prepare_instance_display()
Undefined index: moduleNoticefield.info.inc385_field_info_prepare_instance_widget()
Undefined index: moduleNoticefield.info.inc353_field_info_prepare_instance_display()
Undefined index: moduleNoticefield.info.inc353_field_info_prepare_instance_display()
LeafText summary (TextSummaryTestCase) [Field types]13800
ExpandText translation (TextTranslationTestCase) [Field types]104024
MessageGroupFilenameLineFunctionStatus
Undefined index: moduleNoticefield.info.inc385_field_info_prepare_instance_widget()
Undefined index: moduleNoticefield.info.inc353_field_info_prepare_instance_display()
Undefined index: moduleNoticefield.info.inc353_field_info_prepare_instance_display()
Undefined index: moduleNoticefield.info.inc385_field_info_prepare_instance_widget()
Undefined index: moduleNoticefield.info.inc353_field_info_prepare_instance_display()
Undefined index: moduleNoticefield.info.inc353_field_info_prepare_instance_display()
Undefined index: moduleNoticefield.info.inc385_field_info_prepare_instance_widget()
Undefined index: moduleNoticefield.info.inc353_field_info_prepare_instance_display()
Undefined index: moduleNoticefield.info.inc353_field_info_prepare_instance_display()
Undefined index: imageNoticefield_ui.admin.inc356field_ui_field_overview_form()
Undefined index: Noticefield_ui.admin.inc362field_ui_field_overview_form()
Undefined property: stdClass::$field_imageNoticelocale.module410locale_field_node_form_submit()
Undefined index: moduleNoticefield.info.inc385_field_info_prepare_instance_widget()
Undefined index: moduleNoticefield.info.inc353_field_info_prepare_instance_display()
Undefined index: moduleNoticefield.info.inc353_field_info_prepare_instance_display()
Undefined index: moduleNoticefield.info.inc385_field_info_prepare_instance_widget()
Undefined index: moduleNoticefield.info.inc353_field_info_prepare_instance_display()
Undefined index: moduleNoticefield.info.inc353_field_info_prepare_instance_display()
Undefined index: moduleNoticefield.info.inc385_field_info_prepare_instance_widget()
Undefined index: moduleNoticefield.info.inc353_field_info_prepare_instance_display()
Undefined index: moduleNoticefield.info.inc353_field_info_prepare_instance_display()
Undefined index: imageNoticefield_ui.admin.inc356field_ui_field_overview_form()
Undefined index: Noticefield_ui.admin.inc362field_ui_field_overview_form()
Undefined property: stdClass::$field_imageNoticelocale.module410locale_field_node_form_submit()
LeafTheme API (ThemeUnitTest) [Theme]1600
LeafTheme fast initialization (ThemeFastTestCase) [Theme]1000
LeafTheme initialization in hook_init() (ThemeHookInitUnitTest) [Theme]400
LeafTheme interface functionality (SystemThemeFunctionalTest) [System]6600
LeafTheme item list (ThemeItemListUnitTest) [Theme]100
LeafTheme Table (ThemeTableUnitTest) [Theme]600
LeafTimer test (BootstrapTimerTestCase) [Bootstrap]500
LeafToken replacement (TokenReplaceTestCase) [System]2700
LeafTop visitor blocking (StatisticsBlockVisitorsTestCase) [Statistics]4500
LeafTracker (TrackerTest) [Tracker]21900
LeafTransaction tests (DatabaseTransactionTestCase) [Database]3100
LeafTranslation export (LocaleExportFunctionalTest) [Locale]2900
ExpandTranslation functionality (TranslationTestCase) [Translation]16909
MessageGroupFilenameLineFunctionStatus
Undefined index: moduleNoticefield.info.inc385_field_info_prepare_instance_widget()
Undefined index: moduleNoticefield.info.inc353_field_info_prepare_instance_display()
Undefined index: moduleNoticefield.info.inc353_field_info_prepare_instance_display()
Undefined index: moduleNoticefield.info.inc385_field_info_prepare_instance_widget()
Undefined index: moduleNoticefield.info.inc353_field_info_prepare_instance_display()
Undefined index: moduleNoticefield.info.inc353_field_info_prepare_instance_display()
Undefined index: moduleNoticefield.info.inc385_field_info_prepare_instance_widget()
Undefined index: moduleNoticefield.info.inc353_field_info_prepare_instance_display()
Undefined index: moduleNoticefield.info.inc353_field_info_prepare_instance_display()
LeafTranslation import (LocaleImportFunctionalTest) [Locale]11600
LeafTrigger content (node) actions (TriggerContentTestCase) [Trigger]35300
LeafTrigger cron (system) actions (TriggerCronTestCase) [Trigger]3300
LeafTrigger orphaned actions (TriggerOrphanedActionsTestCase) [Trigger]3700
LeafTrigger other actions (TriggerOtherTestCase) [Trigger]11200
LeafUI language negotiation (LocaleUILanguageNegotiationTest) [Locale]7300
LeafUnassigned text format functionality (FilterNoFormatTestCase) [Filter]200
LeafUnicode handling (UnicodeUnitTest) [System]17600
LeafUnmanaged file copying (FileUnmanagedCopyTest) [File API]3100
LeafUnmanaged file delete (FileUnmanagedDeleteTest) [File API]800
LeafUnmanaged file moving (FileUnmanagedMoveTest) [File API]2200
LeafUnmanaged file save data (FileUnmanagedSaveDataTest) [File API]700
LeafUnmanaged recursive file delete (FileUnmanagedDeleteRecursiveTest) [File API]1700
LeafUpdate contrib functionality (UpdateTestContribCase) [Update]18100
LeafUpdate core functionality (UpdateCoreTestCase) [Update]16000
LeafUpdate dependency hook invocation (UpdateDependencyHookInvocationTestCase) [Update API]300
LeafUpdate dependency ordering (UpdateDependencyOrderingTestCase) [Update API]300
LeafUpdate feed functionality (UpdateFeedTestCase) [Aggregator]7400
LeafUpdate feed item functionality (UpdateFeedItemTestCase) [Aggregator]6100
LeafUpdate functionality (UpdateScriptFunctionalTest) [System]5600
LeafUpdate on cron functionality (AggregatorCronTestCase) [Aggregator]5300
LeafUpdate tests (DatabaseUpdateTestCase) [Database]3500
LeafUpdate tests, Complex (DatabaseUpdateComplexTestCase) [Database]5200
LeafUpdate tests, LOB (DatabaseUpdateLOBTestCase) [Database]1300
LeafUpload and extract module functionality (UpdateTestUploadCase) [Update]6100
LeafUpload upgrade path (UploadUpgradePathTestCase) [Upgrade path]3100
LeafUpload user picture (UserPictureTestCase) [User]8900
LeafURL altering (UrlAlterFunctionalTest) [Path API]2800
LeafURL generation tests (CommonURLUnitTest) [System]5600
LeafUser account links (UserAccountLinksUnitTests) [User]2100
LeafUser administration (UserAdminTestCase) [User]6500
LeafUser autocompletion (UserAutocompleteTestCase) [User]2800
LeafUser blocks (UserBlocksUnitTests) [User]4300
LeafUser create (UserCreateTestCase) [User]2700
ExpandUser creation (LocaleUserCreationTest) [Locale]6803
MessageGroupFilenameLineFunctionStatus
Undefined index: moduleNoticefield.info.inc385_field_info_prepare_instance_widget()
Undefined index: moduleNoticefield.info.inc353_field_info_prepare_instance_display()
Undefined index: moduleNoticefield.info.inc353_field_info_prepare_instance_display()
LeafUser edit (UserEditTestCase) [User]6800
LeafUser edited own account (UserEditedOwnAccountTestCase) [User]2300
ExpandUser language settings (LocaleUserLanguageFunctionalTest) [Locale]5103
MessageGroupFilenameLineFunctionStatus
Undefined index: moduleNoticefield.info.inc385_field_info_prepare_instance_widget()
Undefined index: moduleNoticefield.info.inc353_field_info_prepare_instance_display()
Undefined index: moduleNoticefield.info.inc353_field_info_prepare_instance_display()
LeafUser login (UserLoginTestCase) [User]13200
LeafUser poll vote capability. (PollVoteCheckHostname) [Poll]12400
LeafUser registration (UserRegistrationTestCase) [User]8100
LeafUser role administration (UserRoleAdminTestCase) [User]5300
LeafUser save test (UserSaveTestCase) [User]300
LeafUser search (UserUserSearchTestCase) [User]3800
LeafUser signatures (UserSignatureTestCase) [User]4500
LeafUser time zones (UserTimeZoneFunctionalTest) [User]3100
LeafUser token replacement (UserTokenReplaceTestCase) [User]4300
LeafUsername/e-mail validation (UserValidationTestCase) [User]1900
LeafValid Url (ValidUrlTestCase) [System]7900
LeafVariable test (BootstrapVariableTestCase) [Bootstrap]700
LeafXML-RPC basic (XMLRPCBasicTestCase) [XML-RPC]500
LeafXML-RPC message and alteration (XMLRPCMessagesTestCase) [XML-RPC]500
LeafXML-RPC validator (XMLRPCValidator1IncTestCase) [XML-RPC]900