simple_little_regex_1.patch

Test status
StatusResult
Last receivedSun, 10/31/2010 - 18:20:29
Last requestedSun, 10/31/2010 - 20:29:02
Last testedSun, 10/31/2010 - 21:04:59
Test count1
Environment status
MySQLfail
File information
Filesimple_little_regex_1.patch
BranchDrupal core - 7.x
LinkIssue Link
SummaryFAILED: [[SimpleTest]]: [MySQL] 26,585 pass(es), 292 fail(s), and 51 exception(s).
Details

MySQL

  1. Setup environment
  2. Detect an invalid patch URL
  3. Detect invalid repository information
  4. Detect invalid patch format
  5. Detect a non-applicable patch
  6. Detect invalid PHP syntax
  7. Detect a Drupal installation failure
  8. Detect a test run failure
  9. Detect a failing test
    Review the test failures below then if necessary run them locally until the problem has been fixed.
  10. Complete test suite with all tests passing
26,585 pass(es), 292 fail(s), and 51 exception(s)

Non-pass

Test namePassFailException
ExpandAdvanced search form (SearchAdvancedSearchForm) [Search]3010
MessageGroupFilenameLineFunctionStatus
Article node is not found with POST query and type:article.Othersearch.test344SearchAdvancedSearchForm->testNodeType()
ExpandAJAX command form values (AJAXFormValuesTestCase) [AJAX]2710
MessageGroupFilenameLineFunctionStatus
verification of AJAX form values from a checkbox issued with a correct valueOtherajax.test312AJAXFormValuesTestCase->testSimpleAJAXFormValue()
ExpandAutocompletion (ProfileTestAutocomplete) [Profile]5310
MessageGroupFilenameLineFunctionStatus
Autocomplete form element class found.Otherprofile.test345ProfileTestAutocomplete->testAutocomplete()
ExpandBlock availability (PollBlockTestCase) [Poll]10891
MessageGroupFilenameLineFunctionStatus
Poll appears in block.Otherpoll.test370PollBlockTestCase->testRecentBlock()
Failed to set field choice to 1Otherpoll.test381PollBlockTestCase->testRecentBlock()
Found the Vote buttonOtherpoll.test381PollBlockTestCase->testRecentBlock()
Found the requested form fields at user/4Otherpoll.test381PollBlockTestCase->testRecentBlock()
Your vote was recorded.Otherpoll.test382PollBlockTestCase->testRecentBlock()
Vote count updated correctly.Otherpoll.test383PollBlockTestCase->testRecentBlock()
Link to older polls appears.Otherpoll.test384PollBlockTestCase->testRecentBlock()
Undefined variable: url_targetNoticedrupal_web_test_case.php2327DrupalWebTestCase->clickLink()
Clicked link Older polls () from http://mysql.qa.damz.org/checkout/?q=user/4Browserpoll.test385PollBlockTestCase->testRecentBlock()
Link to poll listing correct.Otherpoll.test386PollBlockTestCase->testRecentBlock()
ExpandBlock availability (ProfileBlockTestCase) [Profile]8280
MessageGroupFilenameLineFunctionStatus
Found profile field with title ujhveINIOtherprofile.test140ProfileTestCase->setProfileField()
Found profile field with value ulUtGaGuOtherprofile.test144ProfileTestCase->setProfileField()
Found profile field with title o46gXGhzOtherprofile.test140ProfileTestCase->setProfileField()
Found profile field with value kCBasJQlOtherprofile.test144ProfileTestCase->setProfileField()
Field 1 is displayedOtherprofile.test412ProfileBlockTestCase->testAuthorInformationBlock()
Field 2 is displayedOtherprofile.test425ProfileBlockTestCase->testAuthorInformationBlock()
Field 1 is displayedOtherprofile.test436ProfileBlockTestCase->testAuthorInformationBlock()
Field 2 is displayedOtherprofile.test437ProfileBlockTestCase->testAuthorInformationBlock()
ExpandBlock availability (SearchBlockTestCase) [Search]4840
MessageGroupFilenameLineFunctionStatus
Failed to set field search_block_form to testOthersearch.test611SearchBlockTestCase->testBlock()
Found the Search buttonOthersearch.test611SearchBlockTestCase->testBlock()
Found the requested form fields at nodeOthersearch.test611SearchBlockTestCase->testBlock()
"Your search yielded no results" foundOthersearch.test612SearchBlockTestCase->testBlock()
ExpandBlock functionality (BlockTestCase) [Block]243250
MessageGroupFilenameLineFunctionStatus
Block successfully being displayed on the page.Otherblock.test250BlockTestCase->moveBlockToRegion()
Custom block found in header region.Otherblock.test257BlockTestCase->moveBlockToRegion()
Block successfully being displayed on the page.Otherblock.test250BlockTestCase->moveBlockToRegion()
Custom block found in sidebar_first region.Otherblock.test257BlockTestCase->moveBlockToRegion()
Block successfully being displayed on the page.Otherblock.test250BlockTestCase->moveBlockToRegion()
Custom block found in content region.Otherblock.test257BlockTestCase->moveBlockToRegion()
Block successfully being displayed on the page.Otherblock.test250BlockTestCase->moveBlockToRegion()
Custom block found in sidebar_second region.Otherblock.test257BlockTestCase->moveBlockToRegion()
Block successfully being displayed on the page.Otherblock.test250BlockTestCase->moveBlockToRegion()
Custom block found in footer region.Otherblock.test257BlockTestCase->moveBlockToRegion()
Custom block successfully being displayed using Full HTML.Otherblock.test128BlockTestCase->testCustomBlockFormat()
Custom block successfully being displayed using Full HTML.Otherblock.test141BlockTestCase->testCustomBlockFormat()
Block successfully being displayed on the page.Otherblock.test250BlockTestCase->moveBlockToRegion()
Custom block found in sidebar_first region.Otherblock.test257BlockTestCase->moveBlockToRegion()
Block was displayed on the front page.Otherblock.test176BlockTestCase->testBlockVisibility()
Block successfully being displayed on the page.Otherblock.test250BlockTestCase->moveBlockToRegion()
Custom block found in header region.Otherblock.test257BlockTestCase->moveBlockToRegion()
Block successfully being displayed on the page.Otherblock.test250BlockTestCase->moveBlockToRegion()
Custom block found in sidebar_first region.Otherblock.test257BlockTestCase->moveBlockToRegion()
Block successfully being displayed on the page.Otherblock.test250BlockTestCase->moveBlockToRegion()
Custom block found in content region.Otherblock.test257BlockTestCase->moveBlockToRegion()
Block successfully being displayed on the page.Otherblock.test250BlockTestCase->moveBlockToRegion()
Custom block found in sidebar_second region.Otherblock.test257BlockTestCase->moveBlockToRegion()
Block successfully being displayed on the page.Otherblock.test250BlockTestCase->moveBlockToRegion()
Custom block found in footer region.Otherblock.test257BlockTestCase->moveBlockToRegion()
ExpandBlock functionality (SystemBlockTestCase) [System]3310
MessageGroupFilenameLineFunctionStatus
Block successfully being displayed on the page.Othersystem.test1207SystemBlockTestCase->testPoweredByBlock()
ExpandBlog functionality (BlogTestCase) [Blog]23740
MessageGroupFilenameLineFunctionStatus
Blog block was displayedOtherblog.test138BlogTestCase->verifyBlogs()
Blog block was displayedOtherblog.test138BlogTestCase->verifyBlogs()
Blog block was displayedOtherblog.test138BlogTestCase->verifyBlogs()
Blog block was displayedOtherblog.test138BlogTestCase->verifyBlogs()
ExpandBook functionality (BookTestCase) [Book]34420
MessageGroupFilenameLineFunctionStatus
Book navigation block is displayed.Otherbook.test272BookTestCase->testBookNavigationBlock()
Link to book root (15 - SimpleTest test node oMUkt8I5JB) is displayed.Otherbook.test273BookTestCase->testBookNavigationBlock()
ExpandCancel account (UserCancelTestCase) [User]23220
MessageGroupFilenameLineFunctionStatus
User deleted.Otheruser.test650UserCancelTestCase->testUserCancelByAdmin()
User is not found in the database.Otheruser.test651UserCancelTestCase->testUserCancelByAdmin()
ExpandCategorize feed item functionality (CategorizeFeedItemTestCase) [Aggregator]4101
MessageGroupFilenameLineFunctionStatus
PDOException: SQLSTATE[23000]: Integrity constraint violation: 1062 Duplicate entry '1-1' for key 'PRIMARY': INSERT INTO {aggregator_category_feed} (cid, fid) VALUES (:db_insert_placeholder_0, :db_insert_placeholder_1); Array ( [:db_insert_placeholder_0] => 1 [:db_insert_placeholder_1] => 1 ) in CategorizeFeedItemTestCase->testCategorizeFeedItem() (line 559 of /var/lib/drupaltestbot/sites/default/files/checkout/modules/aggregator/aggregator.test).Uncaught exceptiondatabase.inc1970PDOStatement->execute()
ExpandComment blocks (CommentBlockFunctionalTest) [Comment]98113
MessageGroupFilenameLineFunctionStatus
Block was found.Othercomment.test1047CommentBlockFunctionalTest->testRecentCommentBlock()
Comment found in block.Othercomment.test1051CommentBlockFunctionalTest->testRecentCommentBlock()
Comment found in block.Othercomment.test1052CommentBlockFunctionalTest->testRecentCommentBlock()
Comments were ordered correctly in block.Othercomment.test1053CommentBlockFunctionalTest->testRecentCommentBlock()
Undefined variable: url_targetNoticedrupal_web_test_case.php2327DrupalWebTestCase->clickLink()
Clicked link bZMXN6cI () from http://mysql.qa.damz.org/checkout/Browsercomment.test1076CommentBlockFunctionalTest->testRecentCommentBlock()
Comment link goes to correct page.Othercomment.test1077CommentBlockFunctionalTest->testRecentCommentBlock()
Undefined variable: url_targetNoticedrupal_web_test_case.php2327DrupalWebTestCase->clickLink()
Clicked link tBTj0TvM () from http://mysql.qa.damz.org/checkout/Browsercomment.test1079CommentBlockFunctionalTest->testRecentCommentBlock()
Comment link goes to correct page.Othercomment.test1080CommentBlockFunctionalTest->testRecentCommentBlock()
Undefined variable: url_targetNoticedrupal_web_test_case.php2327DrupalWebTestCase->clickLink()
Clicked link oLzajQ3B () from http://mysql.qa.damz.org/checkout/Browsercomment.test1081CommentBlockFunctionalTest->testRecentCommentBlock()
Comment link goes to correct page.Othercomment.test1082CommentBlockFunctionalTest->testRecentCommentBlock()
Canonical URL was found in the HTML headOthercomment.test1085CommentBlockFunctionalTest->testRecentCommentBlock()
ExpandComment language (LocaleCommentLanguageFunctionalTest) [Locale]5020
MessageGroupFilenameLineFunctionStatus
The comment posted with content language en and belonging to the node with language en has language frOtherlocale.test2093LocaleCommentLanguageFunctionalTest->testCommentLanguage()
The comment posted with content language en and belonging to the node with language fr has language frOtherlocale.test2093LocaleCommentLanguageFunctionalTest->testCommentLanguage()
ExpandComment Search tests (SearchCommentTestCase) [Search]13810
MessageGroupFilenameLineFunctionStatus
HTML in comment body is not hidden.Othersearch.test761SearchCommentTestCase->testSearchResultsComment()
ExpandConfig settings form (SearchConfigSettingsForm) [Search]10850
MessageGroupFilenameLineFunctionStatus
User search tab is not shownOthersearch.test1232SearchConfigSettingsForm->testSearchModuleDisabling()
Content search tab is not shownOthersearch.test1232SearchConfigSettingsForm->testSearchModuleDisabling()
Correct search text foundOthersearch.test1226SearchConfigSettingsForm->testSearchModuleDisabling()
Dummy search type search tab is shownOthersearch.test1267SearchConfigSettingsForm->testSearchModuleDisabling()
Dummy search type search tab is shownOthersearch.test1267SearchConfigSettingsForm->testSearchModuleDisabling()
ExpandContent language settings (LocaleContentFunctionalTest) [Locale]6310
MessageGroupFilenameLineFunctionStatus
Disabled language not present.Otherlocale.test1668LocaleContentFunctionalTest->testContentTypeLanguageConfiguration()
ExpandDashboard blocks (DashboardBlocksTestCase) [Dashboard]4910
MessageGroupFilenameLineFunctionStatus
Admin has access to a dashboard block.Otherdashboard.test51DashboardBlocksTestCase->testDashboardAccess()
ExpandDBLog functionality (DBLogTestCase) [DBLog]43310
MessageGroupFilenameLineFunctionStatus
DBLog event was recorded: [delete user]Otherdblog.test246DBLogTestCase->doUser()
ExpandDefault text format functionality (FilterDefaultFormatTestCase) [Filter]3210
MessageGroupFilenameLineFunctionStatus
The second user's default format is the lowest weighted format that the user has access to, and is different than the first user's.Otherfilter.test706FilterDefaultFormatTestCase->testDefaultTextFormats()
ExpandEnable/disable modules (EnableDisableTestCase) [Module]42151
MessageGroupFilenameLineFunctionStatus
Modules status has been updated.Othersystem.test132EnableDisableTestCase->testEnableDisable()
hook_modules_disabled fired.Othersystem.test135EnableDisableTestCase->testEnableDisable()
Module "aggregator" is not enabled.Othersystem.test136EnableDisableTestCase->testEnableDisable()
watchdog table contains 0 rows for %module module disabled.Othersystem.test138EnableDisableTestCase->testEnableDisable()
Failed to set field uninstall[aggregator] to aggregatorOthersystem.test143EnableDisableTestCase->testEnableDisable()
Found the Uninstall buttonOthersystem.test143EnableDisableTestCase->testEnableDisable()
Found the requested form fields at admin/modules/uninstallOthersystem.test143EnableDisableTestCase->testEnableDisable()
Invalid argument supplied for foreach()Warningdrupal_web_test_case.php1787DrupalWebTestCase->drupalPost()
Found the Uninstall buttonOthersystem.test145EnableDisableTestCase->testEnableDisable()
Found the requested form fields at Othersystem.test145EnableDisableTestCase->testEnableDisable()
Modules status has been updated.Othersystem.test146EnableDisableTestCase->testEnableDisable()
hook_modules_uninstalled fired.Othersystem.test149EnableDisableTestCase->testEnableDisable()
Module "aggregator" is not enabled.Othersystem.test150EnableDisableTestCase->testEnableDisable()
Tables matching "aggregator" not found.Othersystem.test151EnableDisableTestCase->testEnableDisable()
watchdog table contains 0 rows for %module module uninstalled.Othersystem.test152EnableDisableTestCase->testEnableDisable()
Modules status has been updated.Othersystem.test158EnableDisableTestCase->testEnableDisable()
ExpandFile field widget test (FileFieldWidgetTestCase) [File]19010
MessageGroupFilenameLineFunctionStatus
Confirmed that access is denied for the file without the needed permission.Browserfile.test463FileFieldWidgetTestCase->testPrivateFileComment()
ExpandFile uploading (FileSaveUploadTest) [File API]251120
MessageGroupFilenameLineFunctionStatus
Can't upload a disallowed extensionOtherfile.test675FileSaveUploadTest->testHandleExtension()
Found the failure message.Otherfile.test676FileSaveUploadTest->testHandleExtension()
Unexpected hooks were called: load, update.Otherfile.test679FileSaveUploadTest->testHandleExtension()
Dangerous file was renamed.Otherfile.test734FileSaveUploadTest->testHandleDangerousFile()
Dangerous file's MIME type was changed.Otherfile.test735FileSaveUploadTest->testHandleDangerousFile()
Found the success message.Otherfile.test736FileSaveUploadTest->testHandleDangerousFile()
Expected hooks validate, insert to be called but insert was not called.Otherfile.test739FileSaveUploadTest->testHandleDangerousFile()
Dangerous file was not renamed when insecure uploads is TRUE.Otherfile.test750FileSaveUploadTest->testHandleDangerousFile()
Found the success message.Otherfile.test751FileSaveUploadTest->testHandleDangerousFile()
Expected hooks validate, insert to be called but insert was not called.Otherfile.test754FileSaveUploadTest->testHandleDangerousFile()
Found security message.Otherfile.test783FileSaveUploadTest->testHandleFileMunge()
File was successfully munged.Otherfile.test784FileSaveUploadTest->testHandleFileMunge()
ExpandFilter administration functionality (FilterAdminTestCase) [Filter]15410
MessageGroupFilenameLineFunctionStatus
Filter removed invalid tag.Otherfilter.test343FilterAdminTestCase->testFilterAdmin()
ExpandFilter format access (FilterFormatAccessTestCase) [Filter]23860
MessageGroupFilenameLineFunctionStatus
A regular user does not have access to a text format they were not granted access to.Otherfilter.test482FilterFormatAccessTestCase->testFormatPermissions()
The disallowed format does not appear in the list of available formats for a regular user.Otherfilter.test488FilterFormatAccessTestCase->testFormatPermissions()
A regular user does not have permission to use the disallowed text format.Otherfilter.test494FilterFormatAccessTestCase->testFormatPermissions()
The disallowed text format does not appear as an option when adding a new node.Otherfilter.test510FilterFormatAccessTestCase->testFormatPermissions()
Text format access denied message found.Otherfilter.test564FilterFormatAccessTestCase->testFormatWidgetPermissions()
Text format access denied message found.Otherfilter.test585FilterFormatAccessTestCase->testFormatWidgetPermissions()
ExpandForm API checkbox (FormCheckboxTestCase) [Form API]79170
MessageGroupFilenameLineFunctionStatus
All three in checkbox_off are zeroes: off.Otherform.test1410FormCheckboxTestCase->testFormCheckbox()
The first choice is on in checkbox_zero_defaultOtherform.test1411FormCheckboxTestCase->testFormCheckbox()
The first choice is on in checkbox_string_zero_defaultOtherform.test1412FormCheckboxTestCase->testFormCheckbox()
The first choice is on in checkbox_off but the rest is notOtherform.test1415FormCheckboxTestCase->testFormCheckbox()
Checkbox checkbox_off[0] correctly checkedOtherform.test1424FormCheckboxTestCase->testFormCheckbox()
Checkbox checkbox_off[1] correctly checkedOtherform.test1424FormCheckboxTestCase->testFormCheckbox()
Checkbox checkbox_off[2] correctly checkedOtherform.test1424FormCheckboxTestCase->testFormCheckbox()
Checkbox checkbox_zero_default[1] correctly checkedOtherform.test1424FormCheckboxTestCase->testFormCheckbox()
Checkbox checkbox_zero_default[2] correctly checkedOtherform.test1424FormCheckboxTestCase->testFormCheckbox()
Checkbox checkbox_string_zero_default[1] correctly checkedOtherform.test1424FormCheckboxTestCase->testFormCheckbox()
Checkbox checkbox_string_zero_default[2] correctly checkedOtherform.test1424FormCheckboxTestCase->testFormCheckbox()
Checkbox checkbox_off[1] correctly checkedOtherform.test1432FormCheckboxTestCase->testFormCheckbox()
Checkbox checkbox_off[2] correctly checkedOtherform.test1432FormCheckboxTestCase->testFormCheckbox()
Checkbox checkbox_zero_default[1] correctly checkedOtherform.test1432FormCheckboxTestCase->testFormCheckbox()
Checkbox checkbox_zero_default[2] correctly checkedOtherform.test1432FormCheckboxTestCase->testFormCheckbox()
Checkbox checkbox_string_zero_default[1] correctly checkedOtherform.test1432FormCheckboxTestCase->testFormCheckbox()
Checkbox checkbox_string_zero_default[2] correctly checkedOtherform.test1432FormCheckboxTestCase->testFormCheckbox()
ExpandForm element validation (FormsTestCase) [Form API]41790
MessageGroupFilenameLineFunctionStatus
Check empty(0) 'checkbox' field 'wluKAwaZ'Otherform.test96FormsTestCase->testRequiredFields()
Check empty(0) 'checkbox' field 'wluKAwaZ'Otherform.test96FormsTestCase->testRequiredFields()
A required checkbox is actually mandatoryOtherform.test134FormsTestCase->testCheckboxProcessing()
Failed to set field required_checkbox to 1Otherform.test137FormsTestCase->testCheckboxProcessing()
Found the Submit buttonOtherform.test137FormsTestCase->testCheckboxProcessing()
Found the requested form fields at Otherform.test137FormsTestCase->testCheckboxProcessing()
Checkbox 'disabled_checkbox_on' returns expected value (expected: 'disabled_checkbox_on', got: NULL)Otherform.test151FormsTestCase->testCheckboxProcessing()
Checkbox 'checkbox_on' returns expected value (expected: 'checkbox_on', got: NULL)Otherform.test151FormsTestCase->testCheckboxProcessing()
Checkbox 'zero_checkbox_on' returns expected value (expected: '0', got: NULL)Otherform.test151FormsTestCase->testCheckboxProcessing()
ExpandForm rebuilding (FormsRebuildTestCase) [Form API]9820
MessageGroupFilenameLineFunctionStatus
A submitted unchecked checkbox retained its unchecked state during a rebuild.Browserform.test1018FormsRebuildTestCase->testRebuildPreservesValues()
A submitted unchecked checkbox retained its unchecked state during a rebuild.Browserform.test1018FormsRebuildTestCase->testRebuildPreservesValues()
ExpandLanguage configuration (LocaleConfigurationTest) [Locale]7710
MessageGroupFilenameLineFunctionStatus
Language disabled.Browserlocale.test103LocaleConfigurationTest->testLanguageConfiguration()
ExpandList field UI (ListFieldUITestCase) [Field types]3240
MessageGroupFilenameLineFunctionStatus
The 'On' and 'Off' form fields work for boolean fields.Otherlist.test168ListFieldUITestCase->testAllowedValues()
The 'On' value is stored correctly.Browserlist.test171ListFieldUITestCase->testAllowedValues()
The 'Off' value is stored correctly.Browserlist.test172ListFieldUITestCase->testAllowedValues()
The allowed value is correctOtherlist.test174ListFieldUITestCase->testAllowedValues()
ExpandMain content rendering fallback (SystemMainContentFallback) [System]6080
MessageGroupFilenameLineFunctionStatus
Failed to set field modules[Core][block][enable] to Othersystem.test1268SystemMainContentFallback->testMainContentFallback()
Found the requested form fields at admin/modulesOthersystem.test1268SystemMainContentFallback->testMainContentFallback()
Modules status has been updated.Othersystem.test1269SystemMainContentFallback->testMainContentFallback()
Block module disabled.Othersystem.test1271SystemMainContentFallback->testMainContentFallback()
Main content not duplicated.Othersystem.test1291SystemMainContentFallback->testMainContentFallback()
Failed to set field modules[Core][block][enable] to blockOthersystem.test1302SystemMainContentFallback->testMainContentFallback()
Found the requested form fields at admin/modulesOthersystem.test1302SystemMainContentFallback->testMainContentFallback()
Modules status has been updated.Othersystem.test1303SystemMainContentFallback->testMainContentFallback()
ExpandManage display (FieldUIManageDisplayTestCase) [Field UI]8010
MessageGroupFilenameLineFunctionStatus
The field is displayed as expected when 'rss' mode is set back to 'default' settings.Otherfield_ui.test535FieldUIManageDisplayTestCase->testViewModeCustom()
ExpandMenu link creation/deletion (MenuTestCase) [Menu]634100
MessageGroupFilenameLineFunctionStatus
Parameter hidden had expected value.Othermenu.test475MenuTestCase->disableMenuLink()
Menu link was not displayedOthermenu.test454MenuTestCase->toggleMenuLink()
Parameter hidden had expected value.Othermenu.test475MenuTestCase->disableMenuLink()
Menu link was not displayedOthermenu.test454MenuTestCase->toggleMenuLink()
Parameter hidden had expected value.Othermenu.test475MenuTestCase->disableMenuLink()
Parameter hidden had expected value.Othermenu.test475MenuTestCase->disableMenuLink()
Menu link was not displayedOthermenu.test454MenuTestCase->toggleMenuLink()
Parameter hidden had expected value.Othermenu.test475MenuTestCase->disableMenuLink()
Menu link was not displayedOthermenu.test454MenuTestCase->toggleMenuLink()
Parameter hidden had expected value.Othermenu.test475MenuTestCase->disableMenuLink()
ExpandMenu settings for nodes (MenuNodeTestCase) [Menu]4430
MessageGroupFilenameLineFunctionStatus
Link with label jClRnu0W not found.Othermenu.test635MenuNodeTestCase->testMenuNodeFormWidget()
Link with label jClRnu0W not found.Othermenu.test644MenuNodeTestCase->testMenuNodeFormWidget()
Link with label jClRnu0W not found.Othermenu.test667MenuNodeTestCase->testMenuNodeFormWidget()
ExpandModule dependencies (ModuleDependencyTestCase) [Module]100212
MessageGroupFilenameLineFunctionStatus
Dependency required.Othersystem.test224ModuleDependencyTestCase->testEnableWithoutDependency()
Module "translation" is not enabled.Othersystem.test226ModuleDependencyTestCase->testEnableWithoutDependency()
Module "locale" is not enabled.Othersystem.test226ModuleDependencyTestCase->testEnableWithoutDependency()
Tables matching "languages" not found.Othersystem.test229ModuleDependencyTestCase->testEnableWithoutDependency()
Tables matching "locale" not found.Othersystem.test230ModuleDependencyTestCase->testEnableWithoutDependency()
Invalid argument supplied for foreach()Warningdrupal_web_test_case.php1787DrupalWebTestCase->drupalPost()
Found the Continue buttonOthersystem.test232ModuleDependencyTestCase->testEnableWithoutDependency()
Found the requested form fields at Othersystem.test232ModuleDependencyTestCase->testEnableWithoutDependency()
Module "forum" is not enabled.Othersystem.test306ModuleDependencyTestCase->testEnableForumTaxonomyFieldDependency()
Failed to set field modules[Core][taxonomy][enable] to Othersystem.test311ModuleDependencyTestCase->testEnableForumTaxonomyFieldDependency()
Found the requested form fields at admin/modulesOthersystem.test311ModuleDependencyTestCase->testEnableForumTaxonomyFieldDependency()
Module "taxonomy" is not enabled.Othersystem.test312ModuleDependencyTestCase->testEnableForumTaxonomyFieldDependency()
Dependency required.Othersystem.test319ModuleDependencyTestCase->testEnableForumTaxonomyFieldDependency()
Invalid argument supplied for foreach()Warningdrupal_web_test_case.php1787DrupalWebTestCase->drupalPost()
Found the Continue buttonOthersystem.test320ModuleDependencyTestCase->testEnableForumTaxonomyFieldDependency()
Found the requested form fields at Othersystem.test320ModuleDependencyTestCase->testEnableForumTaxonomyFieldDependency()
Modules status has been updated.Othersystem.test321ModuleDependencyTestCase->testEnableForumTaxonomyFieldDependency()
Module "forum" is not enabled.Othersystem.test343ModuleDependencyTestCase->testModuleEnableOrder()
Dependency chain created.Othersystem.test344ModuleDependencyTestCase->testModuleEnableOrder()
Failed to set field modules[Core][poll][enable] to pollOthersystem.test347ModuleDependencyTestCase->testModuleEnableOrder()
Failed to set field modules[Core][php][enable] to phpOthersystem.test347ModuleDependencyTestCase->testModuleEnableOrder()
Found the requested form fields at admin/modulesOthersystem.test347ModuleDependencyTestCase->testModuleEnableOrder()
Modules enabled in the correct order.Othersystem.test351ModuleDependencyTestCase->testModuleEnableOrder()
ExpandMultistep node form basic options (MultiStepNodeFormBasicOptionsTest) [Node]1320
MessageGroupFilenameLineFunctionStatus
status stayed uncheckedBrowsernode.test1644MultiStepNodeFormBasicOptionsTest->testMultiStepNodeFormBasicOptions()
promote stayed uncheckedBrowsernode.test1645MultiStepNodeFormBasicOptionsTest->testMultiStepNodeFormBasicOptions()
ExpandNode blocks (NodeBlockFunctionalTest) [Node]7580
MessageGroupFilenameLineFunctionStatus
Block with "No content available." found.Othernode.test1528NodeBlockFunctionalTest->testRecentNodeBlock()
Node found in block.Othernode.test1559NodeBlockFunctionalTest->testRecentNodeBlock()
Node found in block.Othernode.test1560NodeBlockFunctionalTest->testRecentNodeBlock()
Nodes were ordered correctly in block.Othernode.test1563NodeBlockFunctionalTest->testRecentNodeBlock()
Node found in block.Othernode.test1579NodeBlockFunctionalTest->testRecentNodeBlock()
Node found in block.Othernode.test1580NodeBlockFunctionalTest->testRecentNodeBlock()
Node found in block.Othernode.test1581NodeBlockFunctionalTest->testRecentNodeBlock()
Node found in block.Othernode.test1582NodeBlockFunctionalTest->testRecentNodeBlock()
ExpandNode type persist (NodeTypePersistenceTestCase) [Node]51120
MessageGroupFilenameLineFunctionStatus
Poll node type is not disabledOthernode.test1178NodeTypePersistenceTestCase->testNodeTypeCustomizationPersistence()
Customized description foundOthernode.test1191NodeTypePersistenceTestCase->testNodeTypeCustomizationPersistence()
poll type is not found on node/addOthernode.test1198NodeTypePersistenceTestCase->testNodeTypeCustomizationPersistence()
Poll node type is not disabledOthernode.test1205NodeTypePersistenceTestCase->testNodeTypeCustomizationPersistence()
Customized description foundOthernode.test1207NodeTypePersistenceTestCase->testNodeTypeCustomizationPersistence()
Failed to set field uninstall[poll] to pollOthernode.test1212NodeTypePersistenceTestCase->testNodeTypeCustomizationPersistence()
Found the Uninstall buttonOthernode.test1212NodeTypePersistenceTestCase->testNodeTypeCustomizationPersistence()
Found the requested form fields at admin/modules/uninstallOthernode.test1212NodeTypePersistenceTestCase->testNodeTypeCustomizationPersistence()
Found the Uninstall buttonOthernode.test1213NodeTypePersistenceTestCase->testNodeTypeCustomizationPersistence()
Found the requested form fields at Othernode.test1213NodeTypePersistenceTestCase->testNodeTypeCustomizationPersistence()
poll type is no longer found on node/addOthernode.test1217NodeTypePersistenceTestCase->testNodeTypeCustomizationPersistence()
Customized description is found even after uninstall and reenable.Othernode.test1223NodeTypePersistenceTestCase->testNodeTypeCustomizationPersistence()
ExpandOpenID account registration (OpenIDRegistrationTestCase) [OpenID]12740
MessageGroupFilenameLineFunctionStatus
User was asked to verify e-mail address.Otheropenid.test395OpenIDRegistrationTestCase->testRegisterUserWithInvalidSreg()
OpenID identity was registered.Otheropenid.test410OpenIDRegistrationTestCase->testRegisterUserWithInvalidSreg()
User was asked to verify e-mail address.Otheropenid.test431OpenIDRegistrationTestCase->testRegisterUserWithoutSreg()
OpenID identity was registered.Otheropenid.test446OpenIDRegistrationTestCase->testRegisterUserWithoutSreg()
ExpandOptions widgets (OptionsWidgetsTestCase) [Field types]22720
MessageGroupFilenameLineFunctionStatus
Value 1 was saved correctly.Otheroptions.test451OptionsWidgetsTestCase->testOnOffCheckbox()
Checkbox field edit-bool-und is not checked.Browseroptions.test455OptionsWidgetsTestCase->testOnOffCheckbox()
ExpandPath language settings (LocalePathFunctionalTest) [Locale]4210
MessageGroupFilenameLineFunctionStatus
The "xx" front page is not available yet.Browserlocale.test1534LocalePathFunctionalTest->testPathLanguageConfiguration()
ExpandPaths on non-English monolingual sites (PathMonolingualTestCase) [Path]3310
MessageGroupFilenameLineFunctionStatus
Site is mono-lingualOtherpath.test479PathMonolingualTestCase->setUp()
ExpandPersonal contact form (ContactPersonalTestCase) [Contact]14210
MessageGroupFilenameLineFunctionStatus
HTTP response expected 403, actual 200Browsercontact.test349ContactPersonalTestCase->testPersonalContactAccess()
ExpandProgrammatic form submissions (FormsProgrammaticTestCase) [Form API]993
MessageGroupFilenameLineFunctionStatus
Input values: Array ( [textfield] => dummy value [checkboxes] => Array ( [1] => 1 [2] => ) ) Validation handler errors: An illegal choice has been detected. Please contact the site administrator.Otherform.test1144FormsProgrammaticTestCase->submitForm()
Undefined index: storageNoticeform.test1150FormsProgrammaticTestCase->submitForm()
Submission handler correctly executed: textfield is dummy valueOtherform.test1152FormsProgrammaticTestCase->submitForm()
Submission handler correctly executed: checkboxes is Array ( [1] => 1 [2] => ) Otherform.test1152FormsProgrammaticTestCase->submitForm()
Input values: Array ( [textfield] => dummy value [checkboxes] => Array ( [1] => [2] => 2 ) ) Validation handler errors: An illegal choice has been detected. Please contact the site administrator.Otherform.test1144FormsProgrammaticTestCase->submitForm()
Undefined index: storageNoticeform.test1150FormsProgrammaticTestCase->submitForm()
Submission handler correctly executed: textfield is dummy valueOtherform.test1152FormsProgrammaticTestCase->submitForm()
Submission handler correctly executed: checkboxes is Array ( [1] => [2] => 2 ) Otherform.test1152FormsProgrammaticTestCase->submitForm()
Input values: Array ( [textfield] => dummy value [checkboxes] => Array ( [1] => [2] => ) ) Validation handler errors: An illegal choice has been detected. Please contact the site administrator.Otherform.test1144FormsProgrammaticTestCase->submitForm()
Undefined index: storageNoticeform.test1150FormsProgrammaticTestCase->submitForm()
Submission handler correctly executed: textfield is dummy valueOtherform.test1152FormsProgrammaticTestCase->submitForm()
Submission handler correctly executed: checkboxes is Array ( [1] => [2] => ) Otherform.test1152FormsProgrammaticTestCase->submitForm()
ExpandRole assignment (UserRolesAssignmentTestCase) [User]4950
MessageGroupFilenameLineFunctionStatus
Role is removed from user.Browseruser.test1850UserRolesAssignmentTestCase->testAssignAndRemoveRole()
The role is not present in the user object.Otheruser.test1897UserRolesAssignmentTestCase->userLoadAndCheckRoleAssigned()
"Created a new user account for h7kiKSMl." foundOtheruser.test1869UserRolesAssignmentTestCase->testCreateUserWithRole()
Role is removed from user.Browseruser.test1880UserRolesAssignmentTestCase->testCreateUserWithRole()
The role is not present in the user object.Otheruser.test1897UserRolesAssignmentTestCase->userLoadAndCheckRoleAssigned()
ExpandRole permissions (UserPermissionsTestCase) [User]4910
MessageGroupFilenameLineFunctionStatus
User no longer has "access user profiles" permission.Otheruser.test999UserPermissionsTestCase->testUserPermissionChanges()
ExpandSimpleTest functionality (SimpleTestFunctionalTest) [SimpleTest]2342138
MessageGroupFilenameLineFunctionStatus
Undefined index: assertionsNoticesimpletest.test202SimpleTestFunctionalTest->assertAssertion()
Invalid argument supplied for foreach()Warningsimpletest.test202SimpleTestFunctionalTest->assertAssertion()
Found assertion {"SimpleTest pass.", "Other", "Pass", "simpletest.test", "SimpleTestFunctionalTest->stubTest()"}.Othersimpletest.test151SimpleTestFunctionalTest->confirmStubTestResults()
Undefined index: assertionsNoticesimpletest.test202SimpleTestFunctionalTest->assertAssertion()
Invalid argument supplied for foreach()Warningsimpletest.test202SimpleTestFunctionalTest->assertAssertion()
Found assertion {"SimpleTest fail.", "Other", "Fail", "simpletest.test", "SimpleTestFunctionalTest->stubTest()"}.Othersimpletest.test152SimpleTestFunctionalTest->confirmStubTestResults()
Undefined index: assertionsNoticesimpletest.test202SimpleTestFunctionalTest->assertAssertion()
Invalid argument supplied for foreach()Warningsimpletest.test202SimpleTestFunctionalTest->assertAssertion()
Found assertion {"Created permissions: access content", "Role", "Pass", "simpletest.test", "SimpleTestFunctionalTest->stubTest()"}.Othersimpletest.test154SimpleTestFunctionalTest->confirmStubTestResults()
Undefined index: assertionsNoticesimpletest.test202SimpleTestFunctionalTest->assertAssertion()
Invalid argument supplied for foreach()Warningsimpletest.test202SimpleTestFunctionalTest->assertAssertion()
Found assertion {"Invalid permission invalid permission.", "Role", "Fail", "simpletest.test", "SimpleTestFunctionalTest->stubTest()"}.Othersimpletest.test155SimpleTestFunctionalTest->confirmStubTestResults()
Undefined index: assertionsNoticesimpletest.test202SimpleTestFunctionalTest->assertAssertion()
Invalid argument supplied for foreach()Warningsimpletest.test202SimpleTestFunctionalTest->assertAssertion()
Found assertion {"Division by zero", "Warning", "Fail", "simpletest.test", "SimpleTestFunctionalTest->stubTest()"}.Othersimpletest.test158SimpleTestFunctionalTest->confirmStubTestResults()
Undefined index: assertionsNoticesimpletest.test202SimpleTestFunctionalTest->assertAssertion()
Invalid argument supplied for foreach()Warningsimpletest.test202SimpleTestFunctionalTest->assertAssertion()
Found assertion {"This is nothing.", "Other", "Pass", "simpletest.test", "SimpleTestFunctionalTest->stubTest()"}.Othersimpletest.test161SimpleTestFunctionalTest->confirmStubTestResults()
Undefined index: assertionsNoticesimpletest.test202SimpleTestFunctionalTest->assertAssertion()
Invalid argument supplied for foreach()Warningsimpletest.test202SimpleTestFunctionalTest->assertAssertion()
Found assertion {"array_key_exists", "Warning", "Fail", "simpletest.test", "SimpleTestFunctionalTest->stubTest()"}.Othersimpletest.test166SimpleTestFunctionalTest->confirmStubTestResults()
Undefined index: assertionsNoticesimpletest.test202SimpleTestFunctionalTest->assertAssertion()
Invalid argument supplied for foreach()Warningsimpletest.test202SimpleTestFunctionalTest->assertAssertion()
Found assertion {"Debug: 'Foo'", "Debug", "Fail", "simpletest.test", "SimpleTestFunctionalTest->stubTest()"}.Othersimpletest.test168SimpleTestFunctionalTest->confirmStubTestResults()
Undefined index: summaryNoticesimpletest.test170SimpleTestFunctionalTest->confirmStubTestResults()
Stub test summary is correctOthersimpletest.test170SimpleTestFunctionalTest->confirmStubTestResults()
Undefined index: assertionsNoticesimpletest.test180SimpleTestFunctionalTest->getTestIdFromResults()
Invalid argument supplied for foreach()Warningsimpletest.test180SimpleTestFunctionalTest->getTestIdFromResults()
Found test ID in results.Othersimpletest.test173SimpleTestFunctionalTest->confirmStubTestResults()
Undefined index: assertionsNoticesimpletest.test202SimpleTestFunctionalTest->assertAssertion()
Invalid argument supplied for foreach()Warningsimpletest.test202SimpleTestFunctionalTest->assertAssertion()
Found assertion {"SimpleTest pass.", "Other", "Pass", "simpletest.test", "SimpleTestFunctionalTest->stubTest()"}.Othersimpletest.test151SimpleTestFunctionalTest->confirmStubTestResults()
Undefined index: assertionsNoticesimpletest.test202SimpleTestFunctionalTest->assertAssertion()
Invalid argument supplied for foreach()Warningsimpletest.test202SimpleTestFunctionalTest->assertAssertion()
Found assertion {"SimpleTest fail.", "Other", "Fail", "simpletest.test", "SimpleTestFunctionalTest->stubTest()"}.Othersimpletest.test152SimpleTestFunctionalTest->confirmStubTestResults()
Undefined index: assertionsNoticesimpletest.test202SimpleTestFunctionalTest->assertAssertion()
Invalid argument supplied for foreach()Warningsimpletest.test202SimpleTestFunctionalTest->assertAssertion()
Found assertion {"Created permissions: access content", "Role", "Pass", "simpletest.test", "SimpleTestFunctionalTest->stubTest()"}.Othersimpletest.test154SimpleTestFunctionalTest->confirmStubTestResults()
Undefined index: assertionsNoticesimpletest.test202SimpleTestFunctionalTest->assertAssertion()
Invalid argument supplied for foreach()Warningsimpletest.test202SimpleTestFunctionalTest->assertAssertion()
Found assertion {"Invalid permission invalid permission.", "Role", "Fail", "simpletest.test", "SimpleTestFunctionalTest->stubTest()"}.Othersimpletest.test155SimpleTestFunctionalTest->confirmStubTestResults()
Undefined index: assertionsNoticesimpletest.test202SimpleTestFunctionalTest->assertAssertion()
Invalid argument supplied for foreach()Warningsimpletest.test202SimpleTestFunctionalTest->assertAssertion()
Found assertion {"Division by zero", "Warning", "Fail", "simpletest.test", "SimpleTestFunctionalTest->stubTest()"}.Othersimpletest.test158SimpleTestFunctionalTest->confirmStubTestResults()
Undefined index: assertionsNoticesimpletest.test202SimpleTestFunctionalTest->assertAssertion()
Invalid argument supplied for foreach()Warningsimpletest.test202SimpleTestFunctionalTest->assertAssertion()
Found assertion {"This is nothing.", "Other", "Pass", "simpletest.test", "SimpleTestFunctionalTest->stubTest()"}.Othersimpletest.test161SimpleTestFunctionalTest->confirmStubTestResults()
Undefined index: assertionsNoticesimpletest.test202SimpleTestFunctionalTest->assertAssertion()
Invalid argument supplied for foreach()Warningsimpletest.test202SimpleTestFunctionalTest->assertAssertion()
Found assertion {"array_key_exists", "Warning", "Fail", "simpletest.test", "SimpleTestFunctionalTest->stubTest()"}.Othersimpletest.test166SimpleTestFunctionalTest->confirmStubTestResults()
Undefined index: assertionsNoticesimpletest.test202SimpleTestFunctionalTest->assertAssertion()
Invalid argument supplied for foreach()Warningsimpletest.test202SimpleTestFunctionalTest->assertAssertion()
Found assertion {"Debug: 'Foo'", "Debug", "Fail", "simpletest.test", "SimpleTestFunctionalTest->stubTest()"}.Othersimpletest.test168SimpleTestFunctionalTest->confirmStubTestResults()
Undefined index: summaryNoticesimpletest.test170SimpleTestFunctionalTest->confirmStubTestResults()
Stub test summary is correctOthersimpletest.test170SimpleTestFunctionalTest->confirmStubTestResults()
Undefined index: assertionsNoticesimpletest.test180SimpleTestFunctionalTest->getTestIdFromResults()
Invalid argument supplied for foreach()Warningsimpletest.test180SimpleTestFunctionalTest->getTestIdFromResults()
Found test ID in results.Othersimpletest.test173SimpleTestFunctionalTest->confirmStubTestResults()
Test ID is incrementing.Othersimpletest.test112SimpleTestFunctionalTest->testWebTestRunner()
ExpandTableselect form element type test (FormsElementsTableSelectFunctionalTest) [Form API]5330
MessageGroupFilenameLineFunctionStatus
Unchecked checkbox row2.Otherform.test631FormsElementsTableSelectFunctionalTest->testMultipleTrueSubmit()
Unchecked checkbox row3.Otherform.test632FormsElementsTableSelectFunctionalTest->testMultipleTrueSubmit()
Unchecked checkbox row2.Otherform.test640FormsElementsTableSelectFunctionalTest->testMultipleTrueSubmit()
ExpandTest field weights (ProfileTestWeights) [Profile]4850
MessageGroupFilenameLineFunctionStatus
Found profile field with title z5BPeE8GOtherprofile.test140ProfileTestCase->setProfileField()
Found profile field with value blDWP304Otherprofile.test144ProfileTestCase->setProfileField()
Found profile field with title y1eCIfL7Otherprofile.test140ProfileTestCase->setProfileField()
Found profile field with value f0y7Vkf6Otherprofile.test144ProfileTestCase->setProfileField()
Profile field weights are respected on the user profile page.Otherprofile.test307ProfileTestWeights->testProfileFieldWeights()
ExpandTest user triggers (TriggerUserTokenTestCase) [Trigger]17830
MessageGroupFilenameLineFunctionStatus
Expected system message to contain token-replaced text "Action was triggered by trigger user_delete user:name=knF7uYVS user:uid=16 user:mail=knF7uYVS@example.com user:url=http://mysql.qa.damz.org/checkout/?q=user/16 user:edit-url=http://mysql.qa.damz.org/checkout/?q=user/16/edit user:created=Sun, 10/31/2010 - 20:29" found in configured system message actionOthertrigger.test473TriggerUserTokenTestCase->testUserTriggerTokenReplacement()
Expected text found in subject of email message: "Action was triggered by trigger user_delete user:name=knF7uYVS user:uid=16 user:mail=knF7uYVS@example.com user:url=http://mysql.qa.damz.org/checkout/?q=user/16 user:edit-url=http://mysql.qa.damz.org/checkout/?q=user/16/edit user:created=Sun, 10/31/2010 - 20:29".Othertrigger.test473TriggerUserTokenTestCase->testUserTriggerTokenReplacement()
Expected text found in body of email message: "Action was triggered by trigger user_delete user:name=knF7uYVS user:uid=16 user:mail=knF7uYVS@example.com user:url=http://mysql.qa.damz.org/checkout/?q=user/16 user:edit-url=http://mysql.qa.damz.org/checkout/?q=user/16/edit user:created=Sun, 10/31/2010 - 20:29".Othertrigger.test473TriggerUserTokenTestCase->testUserTriggerTokenReplacement()
ExpandText field (TextFieldTestCase) [Field types]19520
MessageGroupFilenameLineFunctionStatus
Value is displayed unfilteredOthertext.test232TextFieldTestCase->_testTextfieldWidgetsFormatted()
Value is displayed unfilteredOthertext.test232TextFieldTestCase->_testTextfieldWidgetsFormatted()
ExpandText translation (TextTranslationTestCase) [Field types]94122
MessageGroupFilenameLineFunctionStatus
Failed to set field body[en][0][value] to wOiYlZy5Othertext.test499TextTranslationTestCase->testTextFieldFormatted()
Failed to set field body[en][0][format] to full_htmlOthertext.test499TextTranslationTestCase->testTextFieldFormatted()
Found the Save buttonOthertext.test499TextTranslationTestCase->testTextFieldFormatted()
Found the requested form fields at node/1/editOthertext.test499TextTranslationTestCase->testTextFieldFormatted()
The body field with delta 0 has been saved.Othertext.test500TextTranslationTestCase->testTextFieldFormatted()
Failed to set field body[en][1][value] to gZ9UrAlqOthertext.test499TextTranslationTestCase->testTextFieldFormatted()
Failed to set field body[en][1][format] to filtered_htmlOthertext.test499TextTranslationTestCase->testTextFieldFormatted()
Found the Save buttonOthertext.test499TextTranslationTestCase->testTextFieldFormatted()
Found the requested form fields at node/1/editOthertext.test499TextTranslationTestCase->testTextFieldFormatted()
The body field with delta 1 has been saved.Othertext.test500TextTranslationTestCase->testTextFieldFormatted()
Trying to get property of non-objectNoticetext.test508TextTranslationTestCase->testTextFieldFormatted()
Undefined variable: url_targetNoticedrupal_web_test_case.php2327DrupalWebTestCase->clickLink()
Clicked link add translation () from http://mysql.qa.damz.org/checkout/?q=node//translateBrowsertext.test509TextTranslationTestCase->testTextFieldFormatted()
The body field with delta 1 is shown.Othertext.test511TextTranslationTestCase->testTextFieldFormatted()
ExpandTheme interface functionality (SystemThemeFunctionalTest) [System]6420
MessageGroupFilenameLineFunctionStatus
Logo path successfully changed.Othersystem.test1342SystemThemeFunctionalTest->testThemeSettings()
Site default theme used on the add content page.Othersystem.test1392SystemThemeFunctionalTest->testAdministrationTheme()
ExpandTranslation functionality (TranslationTestCase) [Translation]16810
MessageGroupFilenameLineFunctionStatus
"EspaƱol" not foundOthertranslation.test96TranslationTestCase->testContentTranslation()
ExpandTrigger content (node) actions (TriggerContentTestCase) [Trigger]35210
MessageGroupFilenameLineFunctionStatus
Action was triggered 2 times. Actual: 3Othertrigger.test131TriggerContentTestCase->testActionContentMultiple()
ExpandUser create (UserCreateTestCase) [User]2430
MessageGroupFilenameLineFunctionStatus
User createdOtheruser.test1447UserCreateTestCase->testUserAdd()
Notification e-mail not sentOtheruser.test1448UserCreateTestCase->testUserAdd()
Notification e-mail sentOtheruser.test1444UserCreateTestCase->testUserAdd()
ExpandUser language settings (LocaleUserLanguageFunctionalTest) [Locale]5010
MessageGroupFilenameLineFunctionStatus
Disabled language not present on form.Otherlocale.test1368LocaleUserLanguageFunctionalTest->testUserLanguageConfiguration()

All

Test namePassFailException
Leaf403 functionality (AccessDeniedTestCase) [System]7500
Leaf404 functionality (PageNotFoundTestCase) [System]1800
LeafActions configuration (ActionsConfigurationTestCase) [Actions]3800
LeafActions executing in a potentially infinite loop (ActionLoopTestCase) [Actions]2300
LeafAdd feed functionality (AddFeedTestCase) [Aggregator]2800
LeafAdmin theme block admin accessibility (BlockAdminThemeTestCase) [Block]1800
LeafAdministrative pages (SystemAdminTestCase) [System]19100
ExpandAdvanced search form (SearchAdvancedSearchForm) [Search]3010
MessageGroupFilenameLineFunctionStatus
Article node is not found with POST query and type:article.Othersearch.test344SearchAdvancedSearchForm->testNodeType()
ExpandAJAX command form values (AJAXFormValuesTestCase) [AJAX]2710
MessageGroupFilenameLineFunctionStatus
verification of AJAX form values from a checkbox issued with a correct valueOtherajax.test312AJAXFormValuesTestCase->testSimpleAJAXFormValue()
LeafAJAX commands (AJAXCommandsTestCase) [AJAX]6400
LeafAJAX framework (AJAXFrameworkTestCase) [AJAX]1000
LeafAJAX multi form (AJAXMultiFormTestCase) [AJAX]3500
LeafAnonymous comments (CommentAnonymous) [Comment]15600
ExpandAutocompletion (ProfileTestAutocomplete) [Profile]5310
MessageGroupFilenameLineFunctionStatus
Autocomplete form element class found.Otherprofile.test345ProfileTestAutocomplete->testAutocomplete()
LeafBasic SQL syntax tests (DatabaseBasicSyntaxTestCase) [Database]2600
LeafBasic upgrade path (BasicUpgradePath) [Upgrade path]7200
LeafBatch percentages (BatchPercentagesUnitTestCase) [Batch API]1300
LeafBatch processing (BatchProcessingTestCase) [Batch API]15400
LeafBatch progress page (BatchPageTestCase) [Batch API]700
LeafBlock availability (NodeBlockTestCase) [Node]1800
ExpandBlock availability (PollBlockTestCase) [Poll]10891
MessageGroupFilenameLineFunctionStatus
Poll appears in block.Otherpoll.test370PollBlockTestCase->testRecentBlock()
Failed to set field choice to 1Otherpoll.test381PollBlockTestCase->testRecentBlock()
Found the Vote buttonOtherpoll.test381PollBlockTestCase->testRecentBlock()
Found the requested form fields at user/4Otherpoll.test381PollBlockTestCase->testRecentBlock()
Your vote was recorded.Otherpoll.test382PollBlockTestCase->testRecentBlock()
Vote count updated correctly.Otherpoll.test383PollBlockTestCase->testRecentBlock()
Link to older polls appears.Otherpoll.test384PollBlockTestCase->testRecentBlock()
Undefined variable: url_targetNoticedrupal_web_test_case.php2327DrupalWebTestCase->clickLink()
Clicked link Older polls () from http://mysql.qa.damz.org/checkout/?q=user/4Browserpoll.test385PollBlockTestCase->testRecentBlock()
Link to poll listing correct.Otherpoll.test386PollBlockTestCase->testRecentBlock()
ExpandBlock availability (ProfileBlockTestCase) [Profile]8280
MessageGroupFilenameLineFunctionStatus
Found profile field with title ujhveINIOtherprofile.test140ProfileTestCase->setProfileField()
Found profile field with value ulUtGaGuOtherprofile.test144ProfileTestCase->setProfileField()
Found profile field with title o46gXGhzOtherprofile.test140ProfileTestCase->setProfileField()
Found profile field with value kCBasJQlOtherprofile.test144ProfileTestCase->setProfileField()
Field 1 is displayedOtherprofile.test412ProfileBlockTestCase->testAuthorInformationBlock()
Field 2 is displayedOtherprofile.test425ProfileBlockTestCase->testAuthorInformationBlock()
Field 1 is displayedOtherprofile.test436ProfileBlockTestCase->testAuthorInformationBlock()
Field 2 is displayedOtherprofile.test437ProfileBlockTestCase->testAuthorInformationBlock()
ExpandBlock availability (SearchBlockTestCase) [Search]4840
MessageGroupFilenameLineFunctionStatus
Failed to set field search_block_form to testOthersearch.test611SearchBlockTestCase->testBlock()
Found the Search buttonOthersearch.test611SearchBlockTestCase->testBlock()
Found the requested form fields at nodeOthersearch.test611SearchBlockTestCase->testBlock()
"Your search yielded no results" foundOthersearch.test612SearchBlockTestCase->testBlock()
LeafBlock caching (BlockCacheTestCase) [Block]22800
ExpandBlock functionality (BlockTestCase) [Block]243250
MessageGroupFilenameLineFunctionStatus
Block successfully being displayed on the page.Otherblock.test250BlockTestCase->moveBlockToRegion()
Custom block found in header region.Otherblock.test257BlockTestCase->moveBlockToRegion()
Block successfully being displayed on the page.Otherblock.test250BlockTestCase->moveBlockToRegion()
Custom block found in sidebar_first region.Otherblock.test257BlockTestCase->moveBlockToRegion()
Block successfully being displayed on the page.Otherblock.test250BlockTestCase->moveBlockToRegion()
Custom block found in content region.Otherblock.test257BlockTestCase->moveBlockToRegion()
Block successfully being displayed on the page.Otherblock.test250BlockTestCase->moveBlockToRegion()
Custom block found in sidebar_second region.Otherblock.test257BlockTestCase->moveBlockToRegion()
Block successfully being displayed on the page.Otherblock.test250BlockTestCase->moveBlockToRegion()
Custom block found in footer region.Otherblock.test257BlockTestCase->moveBlockToRegion()
Custom block successfully being displayed using Full HTML.Otherblock.test128BlockTestCase->testCustomBlockFormat()
Custom block successfully being displayed using Full HTML.Otherblock.test141BlockTestCase->testCustomBlockFormat()
Block successfully being displayed on the page.Otherblock.test250BlockTestCase->moveBlockToRegion()
Custom block found in sidebar_first region.Otherblock.test257BlockTestCase->moveBlockToRegion()
Block was displayed on the front page.Otherblock.test176BlockTestCase->testBlockVisibility()
Block successfully being displayed on the page.Otherblock.test250BlockTestCase->moveBlockToRegion()
Custom block found in header region.Otherblock.test257BlockTestCase->moveBlockToRegion()
Block successfully being displayed on the page.Otherblock.test250BlockTestCase->moveBlockToRegion()
Custom block found in sidebar_first region.Otherblock.test257BlockTestCase->moveBlockToRegion()
Block successfully being displayed on the page.Otherblock.test250BlockTestCase->moveBlockToRegion()
Custom block found in content region.Otherblock.test257BlockTestCase->moveBlockToRegion()
Block successfully being displayed on the page.Otherblock.test250BlockTestCase->moveBlockToRegion()
Custom block found in sidebar_second region.Otherblock.test257BlockTestCase->moveBlockToRegion()
Block successfully being displayed on the page.Otherblock.test250BlockTestCase->moveBlockToRegion()
Custom block found in footer region.Otherblock.test257BlockTestCase->moveBlockToRegion()
ExpandBlock functionality (SystemBlockTestCase) [System]3310
MessageGroupFilenameLineFunctionStatus
Block successfully being displayed on the page.Othersystem.test1207SystemBlockTestCase->testPoweredByBlock()
LeafBlock HTML id (BlockHTMLIdTestCase) [Block]1500
ExpandBlog functionality (BlogTestCase) [Blog]23740
MessageGroupFilenameLineFunctionStatus
Blog block was displayedOtherblog.test138BlogTestCase->verifyBlogs()
Blog block was displayedOtherblog.test138BlogTestCase->verifyBlogs()
Blog block was displayedOtherblog.test138BlogTestCase->verifyBlogs()
Blog block was displayedOtherblog.test138BlogTestCase->verifyBlogs()
ExpandBook functionality (BookTestCase) [Book]34420
MessageGroupFilenameLineFunctionStatus
Book navigation block is displayed.Otherbook.test272BookTestCase->testBookNavigationBlock()
Link to book root (15 - SimpleTest test node oMUkt8I5JB) is displayed.Otherbook.test273BookTestCase->testBookNavigationBlock()
LeafBoot and exit hook invocation (HookBootExitTestCase) [Bootstrap]1800
LeafBreadcrumbs (MenuBreadcrumbTestCase) [Menu]41000
LeafCache clear test (CacheClearCase) [Cache]1300
LeafCache emptiness test (CacheIsEmptyCase) [Cache]500
LeafCache saving test (CacheSavingCase) [Cache]500
ExpandCancel account (UserCancelTestCase) [User]23220
MessageGroupFilenameLineFunctionStatus
User deleted.Otheruser.test650UserCancelTestCase->testUserCancelByAdmin()
User is not found in the database.Otheruser.test651UserCancelTestCase->testUserCancelByAdmin()
LeafCascading stylesheets (CascadingStylesheetsTestCase) [System]3000
LeafCategorize feed functionality (CategorizeFeedTestCase) [Aggregator]1900
ExpandCategorize feed item functionality (CategorizeFeedItemTestCase) [Aggregator]4101
MessageGroupFilenameLineFunctionStatus
PDOException: SQLSTATE[23000]: Integrity constraint violation: 1062 Duplicate entry '1-1' for key 'PRIMARY': INSERT INTO {aggregator_category_feed} (cid, fid) VALUES (:db_insert_placeholder_0, :db_insert_placeholder_1); Array ( [:db_insert_placeholder_0] => 1 [:db_insert_placeholder_1] => 1 ) in CategorizeFeedItemTestCase->testCategorizeFeedItem() (line 559 of /var/lib/drupaltestbot/sites/default/files/checkout/modules/aggregator/aggregator.test).Uncaught exceptiondatabase.inc1970PDOStatement->execute()
LeafChecks display of aggregator items (AggregatorRenderingTestCase) [Aggregator]6800
LeafCJK tokenizer (SearchTokenizerTestCase) [Search]200
LeafColor functionality (ColorTestCase) [Color]6100
LeafComment approval (CommentApprovalTest) [Comment]15400
ExpandComment blocks (CommentBlockFunctionalTest) [Comment]98113
MessageGroupFilenameLineFunctionStatus
Block was found.Othercomment.test1047CommentBlockFunctionalTest->testRecentCommentBlock()
Comment found in block.Othercomment.test1051CommentBlockFunctionalTest->testRecentCommentBlock()
Comment found in block.Othercomment.test1052CommentBlockFunctionalTest->testRecentCommentBlock()
Comments were ordered correctly in block.Othercomment.test1053CommentBlockFunctionalTest->testRecentCommentBlock()
Undefined variable: url_targetNoticedrupal_web_test_case.php2327DrupalWebTestCase->clickLink()
Clicked link bZMXN6cI () from http://mysql.qa.damz.org/checkout/Browsercomment.test1076CommentBlockFunctionalTest->testRecentCommentBlock()
Comment link goes to correct page.Othercomment.test1077CommentBlockFunctionalTest->testRecentCommentBlock()
Undefined variable: url_targetNoticedrupal_web_test_case.php2327DrupalWebTestCase->clickLink()
Clicked link tBTj0TvM () from http://mysql.qa.damz.org/checkout/Browsercomment.test1079CommentBlockFunctionalTest->testRecentCommentBlock()
Comment link goes to correct page.Othercomment.test1080CommentBlockFunctionalTest->testRecentCommentBlock()
Undefined variable: url_targetNoticedrupal_web_test_case.php2327DrupalWebTestCase->clickLink()
Clicked link oLzajQ3B () from http://mysql.qa.damz.org/checkout/Browsercomment.test1081CommentBlockFunctionalTest->testRecentCommentBlock()
Comment link goes to correct page.Othercomment.test1082CommentBlockFunctionalTest->testRecentCommentBlock()
Canonical URL was found in the HTML headOthercomment.test1085CommentBlockFunctionalTest->testRecentCommentBlock()
LeafComment count toggle (SearchCommentCountToggleTestCase) [Search]3000
LeafComment interface (CommentInterfaceTest) [Comment]22300
ExpandComment language (LocaleCommentLanguageFunctionalTest) [Locale]5020
MessageGroupFilenameLineFunctionStatus
The comment posted with content language en and belonging to the node with language en has language frOtherlocale.test2093LocaleCommentLanguageFunctionalTest->testCommentLanguage()
The comment posted with content language en and belonging to the node with language fr has language frOtherlocale.test2093LocaleCommentLanguageFunctionalTest->testCommentLanguage()
LeafComment paging settings (CommentPagerTest) [Comment]20800
LeafComment preview (CommentPreviewTest) [Comment]7200
LeafComment Rebuild (CommentContentRebuild) [Comment]3200
LeafComment RSS (CommentRSSUnitTest) [Comment]2400
ExpandComment Search tests (SearchCommentTestCase) [Search]13810
MessageGroupFilenameLineFunctionStatus
HTML in comment body is not hidden.Othersearch.test761SearchCommentTestCase->testSearchResultsComment()
LeafComment token replacement (CommentTokenReplaceTestCase) [Comment]6400
LeafComment upgrade path (CommentUpgradePathTestCase) [Upgrade path]2600
ExpandConfig settings form (SearchConfigSettingsForm) [Search]10850
MessageGroupFilenameLineFunctionStatus
User search tab is not shownOthersearch.test1232SearchConfigSettingsForm->testSearchModuleDisabling()
Content search tab is not shownOthersearch.test1232SearchConfigSettingsForm->testSearchModuleDisabling()
Correct search text foundOthersearch.test1226SearchConfigSettingsForm->testSearchModuleDisabling()
Dummy search type search tab is shownOthersearch.test1267SearchConfigSettingsForm->testSearchModuleDisabling()
Dummy search type search tab is shownOthersearch.test1267SearchConfigSettingsForm->testSearchModuleDisabling()
LeafConnection tests (DatabaseConnectionTestCase) [Database]3400
ExpandContent language settings (LocaleContentFunctionalTest) [Locale]6310
MessageGroupFilenameLineFunctionStatus
Disabled language not present.Otherlocale.test1668LocaleContentFunctionalTest->testContentTypeLanguageConfiguration()
LeafCron run (CronRunTestCase) [System]9000
LeafCSS Unit Tests (CascadingStylesheetsUnitTest) [System]600
LeafCustom query syntax tests (DatabaseQueryTestCase) [Database]600
ExpandDashboard blocks (DashboardBlocksTestCase) [Dashboard]4910
MessageGroupFilenameLineFunctionStatus
Admin has access to a dashboard block.Otherdashboard.test51DashboardBlocksTestCase->testDashboardAccess()
LeafData API functions (DrupalDataApiTest) [System]6400
LeafDate and time (DateTimeFunctionalTest) [System]18400
ExpandDBLog functionality (DBLogTestCase) [DBLog]43310
MessageGroupFilenameLineFunctionStatus
DBLog event was recorded: [delete user]Otherdblog.test246DBLogTestCase->doUser()
ExpandDefault text format functionality (FilterDefaultFormatTestCase) [Filter]3210
MessageGroupFilenameLineFunctionStatus
The second user's default format is the lowest weighted format that the user has access to, and is different than the first user's.Otherfilter.test706FilterDefaultFormatTestCase->testDefaultTextFormats()
LeafDelete/Truncate tests (DatabaseDeleteTruncateTestCase) [Database]2000
LeafDrupal error handlers (DrupalErrorHandlerUnitTest) [System]2800
LeafDrupal goto (DrupalGotoTest) [System]1800
LeafDrupal HTTP request (DrupalHTTPRequestTestCase) [System]2700
LeafDrupal match path (DrupalMatchPathTestCase) [Path API]4100
LeafDrupal set/get regions (DrupalSetContentTestCase) [System]3800
LeafDrupal tags handling (DrupalTagsHandlingTestCase) [System]800
Leafdrupal_alter() tests (DrupalAlterTestCase) [System]1000
Leafdrupal_render() (DrupalRenderTestCase) [System]3300
LeafEmbedded forms (SearchEmbedForm) [Search]2900
LeafEmpty statement (DatabaseEmptyStatementTestCase) [Database]400
ExpandEnable/disable modules (EnableDisableTestCase) [Module]42151
MessageGroupFilenameLineFunctionStatus
Modules status has been updated.Othersystem.test132EnableDisableTestCase->testEnableDisable()
hook_modules_disabled fired.Othersystem.test135EnableDisableTestCase->testEnableDisable()
Module "aggregator" is not enabled.Othersystem.test136EnableDisableTestCase->testEnableDisable()
watchdog table contains 0 rows for %module module disabled.Othersystem.test138EnableDisableTestCase->testEnableDisable()
Failed to set field uninstall[aggregator] to aggregatorOthersystem.test143EnableDisableTestCase->testEnableDisable()
Found the Uninstall buttonOthersystem.test143EnableDisableTestCase->testEnableDisable()
Found the requested form fields at admin/modules/uninstallOthersystem.test143EnableDisableTestCase->testEnableDisable()
Invalid argument supplied for foreach()Warningdrupal_web_test_case.php1787DrupalWebTestCase->drupalPost()
Found the Uninstall buttonOthersystem.test145EnableDisableTestCase->testEnableDisable()
Found the requested form fields at Othersystem.test145EnableDisableTestCase->testEnableDisable()
Modules status has been updated.Othersystem.test146EnableDisableTestCase->testEnableDisable()
hook_modules_uninstalled fired.Othersystem.test149EnableDisableTestCase->testEnableDisable()
Module "aggregator" is not enabled.Othersystem.test150EnableDisableTestCase->testEnableDisable()
Tables matching "aggregator" not found.Othersystem.test151EnableDisableTestCase->testEnableDisable()
watchdog table contains 0 rows for %module module uninstalled.Othersystem.test152EnableDisableTestCase->testEnableDisable()
Modules status has been updated.Othersystem.test158EnableDisableTestCase->testEnableDisable()
LeafEntity CRUD hooks (EntityCrudHookTestCase) [Entity API]4800
LeafEntity properties (EntityPropertiesTestCase) [Entity API]300
LeafEntity query (EntityFieldQueryTestCase) [Entity API]8500
LeafFeed parser functionality (FeedParserTestCase) [Aggregator]4000
LeafFetch tests (DatabaseFetchTestCase) [Database]3300
LeafFetch tests, part 2 (DatabaseFetch2TestCase) [Database]2600
LeafFetching multiple cache items (CacheGetMultipleUnitTest) [Cache]700
LeafField attach tests (other) (FieldAttachOtherTestCase) [Field API]4400
LeafField attach tests (storage-related) (FieldAttachStorageTestCase) [Field API]8300
LeafField bulk delete tests (FieldBulkDeleteTestCase) [Field API]4000
LeafField CRUD tests (FieldCrudTestCase) [Field API]5900
LeafField Display API tests (FieldDisplayAPITestCase) [Field API]4200
LeafField form tests (FieldFormTestCase) [Field API]16600
LeafField info tests (FieldInfoTestCase) [Field API]7900
LeafField instance CRUD tests (FieldInstanceCrudTestCase) [Field API]3200
LeafField SQL storage tests (FieldSqlStorageTestCase) [Field API]8800
LeafField translations tests (FieldTranslationsTestCase) [Field API]4400
LeafFile copying (FileCopyTest) [File API]10600
LeafFile delete (FileDeleteTest) [File API]1800
LeafFile download (FileDownloadTest) [File API]3500
LeafFile field display tests (FileFieldDisplayTestCase) [File]2000
LeafFile field file path tests (FileFieldPathTestCase) [File]2300
LeafFile field revision test (FileFieldRevisionTestCase) [File]6700
LeafFile field validation tests (FileFieldValidateTestCase) [File]10300
ExpandFile field widget test (FileFieldWidgetTestCase) [File]19010
MessageGroupFilenameLineFunctionStatus
Confirmed that access is denied for the file without the needed permission.Browserfile.test463FileFieldWidgetTestCase->testPrivateFileComment()
LeafFile loading (FileLoadTest) [File API]2900
LeafFile mimetypes (FileMimeTypeTest) [File API]3800
LeafFile moving (FileMoveTest) [File API]10500
LeafFile naming (FileNameMungingTest) [File API]500
LeafFile paths and directories (FileDirectoryTest) [File API]2000
LeafFile save data (FileSaveDataTest) [File API]8800
LeafFile saving (FileSaveTest) [File API]1400
LeafFile scan directory (FileScanDirectoryTest) [File API]2300
LeafFile space used tests (FileSpaceUsedTest) [File API]1100
LeafFile token replacement (FileTokenReplaceTestCase) [File]3500
ExpandFile uploading (FileSaveUploadTest) [File API]251120
MessageGroupFilenameLineFunctionStatus
Can't upload a disallowed extensionOtherfile.test675FileSaveUploadTest->testHandleExtension()
Found the failure message.Otherfile.test676FileSaveUploadTest->testHandleExtension()
Unexpected hooks were called: load, update.Otherfile.test679FileSaveUploadTest->testHandleExtension()
Dangerous file was renamed.Otherfile.test734FileSaveUploadTest->testHandleDangerousFile()
Dangerous file's MIME type was changed.Otherfile.test735FileSaveUploadTest->testHandleDangerousFile()
Found the success message.Otherfile.test736FileSaveUploadTest->testHandleDangerousFile()
Expected hooks validate, insert to be called but insert was not called.Otherfile.test739FileSaveUploadTest->testHandleDangerousFile()
Dangerous file was not renamed when insecure uploads is TRUE.Otherfile.test750FileSaveUploadTest->testHandleDangerousFile()
Found the success message.Otherfile.test751FileSaveUploadTest->testHandleDangerousFile()
Expected hooks validate, insert to be called but insert was not called.Otherfile.test754FileSaveUploadTest->testHandleDangerousFile()
Found security message.Otherfile.test783FileSaveUploadTest->testHandleFileMunge()
File was successfully munged.Otherfile.test784FileSaveUploadTest->testHandleFileMunge()
LeafFile URL rewriting (FileURLRewritingTest) [File]1500
LeafFile usage (FileUsageTest) [File]2100
LeafFile validate (FileValidateTest) [File API]1100
LeafFile validator tests (FileValidatorTest) [File API]2700
LeafFileTransfer unit tests (FileTranferTest) [System]200
ExpandFilter administration functionality (FilterAdminTestCase) [Filter]15410
MessageGroupFilenameLineFunctionStatus
Filter removed invalid tag.Otherfilter.test343FilterAdminTestCase->testFilterAdmin()
LeafFilter CRUD operations (FilterCRUDTestCase) [Filter]21400
ExpandFilter format access (FilterFormatAccessTestCase) [Filter]23860
MessageGroupFilenameLineFunctionStatus
A regular user does not have access to a text format they were not granted access to.Otherfilter.test482FilterFormatAccessTestCase->testFormatPermissions()
The disallowed format does not appear in the list of available formats for a regular user.Otherfilter.test488FilterFormatAccessTestCase->testFormatPermissions()
A regular user does not have permission to use the disallowed text format.Otherfilter.test494FilterFormatAccessTestCase->testFormatPermissions()
The disallowed text format does not appear as an option when adding a new node.Otherfilter.test510FilterFormatAccessTestCase->testFormatPermissions()
Text format access denied message found.Otherfilter.test564FilterFormatAccessTestCase->testFormatWidgetPermissions()
Text format access denied message found.Otherfilter.test585FilterFormatAccessTestCase->testFormatWidgetPermissions()
LeafFilter format hooks (FilterHooksTestCase) [Filter]3200
LeafFilter module filters (FilterUnitTestCase) [Filter]20200
LeafFingerprinting meta tag (AdminMetaTagTestCase) [System]300
LeafFlood control mechanism (FloodFunctionalTest) [System]600
LeafForm alter hooks (FormAlterTestCase) [Form API]300
ExpandForm API checkbox (FormCheckboxTestCase) [Form API]79170
MessageGroupFilenameLineFunctionStatus
All three in checkbox_off are zeroes: off.Otherform.test1410FormCheckboxTestCase->testFormCheckbox()
The first choice is on in checkbox_zero_defaultOtherform.test1411FormCheckboxTestCase->testFormCheckbox()
The first choice is on in checkbox_string_zero_defaultOtherform.test1412FormCheckboxTestCase->testFormCheckbox()
The first choice is on in checkbox_off but the rest is notOtherform.test1415FormCheckboxTestCase->testFormCheckbox()
Checkbox checkbox_off[0] correctly checkedOtherform.test1424FormCheckboxTestCase->testFormCheckbox()
Checkbox checkbox_off[1] correctly checkedOtherform.test1424FormCheckboxTestCase->testFormCheckbox()
Checkbox checkbox_off[2] correctly checkedOtherform.test1424FormCheckboxTestCase->testFormCheckbox()
Checkbox checkbox_zero_default[1] correctly checkedOtherform.test1424FormCheckboxTestCase->testFormCheckbox()
Checkbox checkbox_zero_default[2] correctly checkedOtherform.test1424FormCheckboxTestCase->testFormCheckbox()
Checkbox checkbox_string_zero_default[1] correctly checkedOtherform.test1424FormCheckboxTestCase->testFormCheckbox()
Checkbox checkbox_string_zero_default[2] correctly checkedOtherform.test1424FormCheckboxTestCase->testFormCheckbox()
Checkbox checkbox_off[1] correctly checkedOtherform.test1432FormCheckboxTestCase->testFormCheckbox()
Checkbox checkbox_off[2] correctly checkedOtherform.test1432FormCheckboxTestCase->testFormCheckbox()
Checkbox checkbox_zero_default[1] correctly checkedOtherform.test1432FormCheckboxTestCase->testFormCheckbox()
Checkbox checkbox_zero_default[2] correctly checkedOtherform.test1432FormCheckboxTestCase->testFormCheckbox()
Checkbox checkbox_string_zero_default[1] correctly checkedOtherform.test1432FormCheckboxTestCase->testFormCheckbox()
Checkbox checkbox_string_zero_default[2] correctly checkedOtherform.test1432FormCheckboxTestCase->testFormCheckbox()
LeafForm API file inclusion (FormsFileInclusionTestCase) [Form API]1400
LeafForm element and label output test (FormsElementsLabelsTestCase) [Form API]1500
ExpandForm element validation (FormsTestCase) [Form API]41790
MessageGroupFilenameLineFunctionStatus
Check empty(0) 'checkbox' field 'wluKAwaZ'Otherform.test96FormsTestCase->testRequiredFields()
Check empty(0) 'checkbox' field 'wluKAwaZ'Otherform.test96FormsTestCase->testRequiredFields()
A required checkbox is actually mandatoryOtherform.test134FormsTestCase->testCheckboxProcessing()
Failed to set field required_checkbox to 1Otherform.test137FormsTestCase->testCheckboxProcessing()
Found the Submit buttonOtherform.test137FormsTestCase->testCheckboxProcessing()
Found the requested form fields at Otherform.test137FormsTestCase->testCheckboxProcessing()
Checkbox 'disabled_checkbox_on' returns expected value (expected: 'disabled_checkbox_on', got: NULL)Otherform.test151FormsTestCase->testCheckboxProcessing()
Checkbox 'checkbox_on' returns expected value (expected: 'checkbox_on', got: NULL)Otherform.test151FormsTestCase->testCheckboxProcessing()
Checkbox 'zero_checkbox_on' returns expected value (expected: '0', got: NULL)Otherform.test151FormsTestCase->testCheckboxProcessing()
ExpandForm rebuilding (FormsRebuildTestCase) [Form API]9820
MessageGroupFilenameLineFunctionStatus
A submitted unchecked checkbox retained its unchecked state during a rebuild.Browserform.test1018FormsRebuildTestCase->testRebuildPreservesValues()
A submitted unchecked checkbox retained its unchecked state during a rebuild.Browserform.test1018FormsRebuildTestCase->testRebuildPreservesValues()
LeafForm state values clearance (FormStateValuesCleanTestCase) [Form API]2600
LeafForm triggering element determination (FormsTriggeringElementTestCase) [Form API]9000
LeafForm validation handlers (FormValidationTestCase) [Form API]5300
LeafForm wrapper callback (FormsFormWrapperTestCase) [Form API]400
LeafFormat date (FormatDateUnitTest) [System]4300
LeafForum functionality (ForumTestCase) [Forum]68200
LeafFront page (FrontPageTestCase) [System]3600
LeafGet filename test (BootstrapGetFilenameTestCase) [Bootstrap]400
LeafGraph (GraphUnitTest) [System]2800
LeafHelp functionality (HelpTestCase) [Help]34600
LeafHTML Attributes (DrupalAttributesUnitTest) [System]1200
LeafHTML identifiers (DrupalHTMLIdentifierTestCase) [System]1000
LeafHTML in page titles (PageTitleFiltering) [System]4000
LeafHTTP file retrieval (RetrieveFileTestCase) [System]700
LeafImage effects (ImageEffectsUnitTest) [Image]3300
LeafImage field display tests (ImageFieldDisplayTestCase) [Image]13400
LeafImage field validation tests (ImageFieldValidateTestCase) [Image]1800
LeafImage GD manipulation tests (ImageToolkitGdTestCase) [Image]100
LeafImage styles and effects UI configuration (ImageAdminStylesUnitTest) [Image]16700
LeafImage styles path and URL functions (ImageStylesPathAndUrlUnitTest) [Image]2100
LeafImage toolkit tests (ImageToolkitUnitTest) [Image]4400
LeafImport feeds from OPML functionality (ImportOPMLTestCase) [Aggregator]5300
LeafInfo file format parser (InfoFileParserTestCase) [System]900
LeafInsert tests (DatabaseInsertTestCase) [Database]4500
LeafInsert tests, default fields (DatabaseInsertDefaultsTestCase) [Database]1900
LeafInsert tests, LOB fields (DatabaseInsertLOBTestCase) [Database]1300
LeafInvalid data (DatabaseInvalidDataTestCase) [Database]700
LeafIP address and HTTP_HOST test (BootstrapIPAddressTestCase) [Bootstrap]1100
LeafIP address blocking (IPAddressBlockingTestCase) [System]4200
LeafJavaScript (JavaScriptTestCase) [System]3500
LeafJSON (DrupalJSONTest) [System]1400
LeafKeywords and conditions (SearchKeywordsConditions) [Search]2500
ExpandLanguage configuration (LocaleConfigurationTest) [Locale]7710
MessageGroupFilenameLineFunctionStatus
Language disabled.Browserlocale.test103LocaleConfigurationTest->testLanguageConfiguration()
LeafLanguage switching (LocaleLanguageSwitchingFunctionalTest) [Locale]2500
LeafList field (ListFieldTestCase) [Field types]1400
ExpandList field UI (ListFieldUITestCase) [Field types]3240
MessageGroupFilenameLineFunctionStatus
The 'On' and 'Off' form fields work for boolean fields.Otherlist.test168ListFieldUITestCase->testAllowedValues()
The 'On' value is stored correctly.Browserlist.test171ListFieldUITestCase->testAllowedValues()
The 'Off' value is stored correctly.Browserlist.test172ListFieldUITestCase->testAllowedValues()
The allowed value is correctOtherlist.test174ListFieldUITestCase->testAllowedValues()
LeafLoad multiple nodes (NodeLoadMultipleUnitTest) [Node]3600
LeafLocale uninstall (EN) (LocaleUninstallFunctionalTest) [Locale]3100
LeafLocale uninstall (FR) (LocaleUninstallFrenchFunctionalTest) [Locale]3100
LeafLocale upgrade path (LocaleUpgradePathTestCase) [Upgrade path]16300
LeafLocalize date formats (LocaleDateFormatsFunctionalTest) [Locale]3500
LeafLocking framework tests (LockFunctionalTest) [System]1700
LeafMail system (MailTestCase) [System]100
ExpandMain content rendering fallback (SystemMainContentFallback) [System]6080
MessageGroupFilenameLineFunctionStatus
Failed to set field modules[Core][block][enable] to Othersystem.test1268SystemMainContentFallback->testMainContentFallback()
Found the requested form fields at admin/modulesOthersystem.test1268SystemMainContentFallback->testMainContentFallback()
Modules status has been updated.Othersystem.test1269SystemMainContentFallback->testMainContentFallback()
Block module disabled.Othersystem.test1271SystemMainContentFallback->testMainContentFallback()
Main content not duplicated.Othersystem.test1291SystemMainContentFallback->testMainContentFallback()
Failed to set field modules[Core][block][enable] to blockOthersystem.test1302SystemMainContentFallback->testMainContentFallback()
Found the requested form fields at admin/modulesOthersystem.test1302SystemMainContentFallback->testMainContentFallback()
Modules status has been updated.Othersystem.test1303SystemMainContentFallback->testMainContentFallback()
ExpandManage display (FieldUIManageDisplayTestCase) [Field UI]8010
MessageGroupFilenameLineFunctionStatus
The field is displayed as expected when 'rss' mode is set back to 'default' settings.Otherfield_ui.test535FieldUIManageDisplayTestCase->testViewModeCustom()
LeafManage fields (FieldUIManageFieldsTestCase) [Field UI]15000
ExpandMenu link creation/deletion (MenuTestCase) [Menu]634100
MessageGroupFilenameLineFunctionStatus
Parameter hidden had expected value.Othermenu.test475MenuTestCase->disableMenuLink()
Menu link was not displayedOthermenu.test454MenuTestCase->toggleMenuLink()
Parameter hidden had expected value.Othermenu.test475MenuTestCase->disableMenuLink()
Menu link was not displayedOthermenu.test454MenuTestCase->toggleMenuLink()
Parameter hidden had expected value.Othermenu.test475MenuTestCase->disableMenuLink()
Parameter hidden had expected value.Othermenu.test475MenuTestCase->disableMenuLink()
Menu link was not displayedOthermenu.test454MenuTestCase->toggleMenuLink()
Parameter hidden had expected value.Othermenu.test475MenuTestCase->disableMenuLink()
Menu link was not displayedOthermenu.test454MenuTestCase->toggleMenuLink()
Parameter hidden had expected value.Othermenu.test475MenuTestCase->disableMenuLink()
LeafMenu rebuild test (MenuRebuildTestCase) [Menu]500
LeafMenu router (MenuRouterTestCase) [Menu]19100
ExpandMenu settings for nodes (MenuNodeTestCase) [Menu]4430
MessageGroupFilenameLineFunctionStatus
Link with label jClRnu0W not found.Othermenu.test635MenuNodeTestCase->testMenuNodeFormWidget()
Link with label jClRnu0W not found.Othermenu.test644MenuNodeTestCase->testMenuNodeFormWidget()
Link with label jClRnu0W not found.Othermenu.test667MenuNodeTestCase->testMenuNodeFormWidget()
LeafMenu tree generation (MenuTreeDataTestCase) [Menu]400
LeafMerge tests (DatabaseMergeTestCase) [Database]7500
LeafMiscellaneous AJAX tests (AJAXElementValidation) [AJAX]800
LeafMissing update dependencies (UpdateDependencyMissingTestCase) [Update API]300
LeafModule API (ModuleUnitTest) [Module]3300
ExpandModule dependencies (ModuleDependencyTestCase) [Module]100212
MessageGroupFilenameLineFunctionStatus
Dependency required.Othersystem.test224ModuleDependencyTestCase->testEnableWithoutDependency()
Module "translation" is not enabled.Othersystem.test226ModuleDependencyTestCase->testEnableWithoutDependency()
Module "locale" is not enabled.Othersystem.test226ModuleDependencyTestCase->testEnableWithoutDependency()
Tables matching "languages" not found.Othersystem.test229ModuleDependencyTestCase->testEnableWithoutDependency()
Tables matching "locale" not found.Othersystem.test230ModuleDependencyTestCase->testEnableWithoutDependency()
Invalid argument supplied for foreach()Warningdrupal_web_test_case.php1787DrupalWebTestCase->drupalPost()
Found the Continue buttonOthersystem.test232ModuleDependencyTestCase->testEnableWithoutDependency()
Found the requested form fields at Othersystem.test232ModuleDependencyTestCase->testEnableWithoutDependency()
Module "forum" is not enabled.Othersystem.test306ModuleDependencyTestCase->testEnableForumTaxonomyFieldDependency()
Failed to set field modules[Core][taxonomy][enable] to Othersystem.test311ModuleDependencyTestCase->testEnableForumTaxonomyFieldDependency()
Found the requested form fields at admin/modulesOthersystem.test311ModuleDependencyTestCase->testEnableForumTaxonomyFieldDependency()
Module "taxonomy" is not enabled.Othersystem.test312ModuleDependencyTestCase->testEnableForumTaxonomyFieldDependency()
Dependency required.Othersystem.test319ModuleDependencyTestCase->testEnableForumTaxonomyFieldDependency()
Invalid argument supplied for foreach()Warningdrupal_web_test_case.php1787DrupalWebTestCase->drupalPost()
Found the Continue buttonOthersystem.test320ModuleDependencyTestCase->testEnableForumTaxonomyFieldDependency()
Found the requested form fields at Othersystem.test320ModuleDependencyTestCase->testEnableForumTaxonomyFieldDependency()
Modules status has been updated.Othersystem.test321ModuleDependencyTestCase->testEnableForumTaxonomyFieldDependency()
Module "forum" is not enabled.Othersystem.test343ModuleDependencyTestCase->testModuleEnableOrder()
Dependency chain created.Othersystem.test344ModuleDependencyTestCase->testModuleEnableOrder()
Failed to set field modules[Core][poll][enable] to pollOthersystem.test347ModuleDependencyTestCase->testModuleEnableOrder()
Failed to set field modules[Core][php][enable] to phpOthersystem.test347ModuleDependencyTestCase->testModuleEnableOrder()
Found the requested form fields at admin/modulesOthersystem.test347ModuleDependencyTestCase->testModuleEnableOrder()
Modules enabled in the correct order.Othersystem.test351ModuleDependencyTestCase->testModuleEnableOrder()
LeafModule installation (ModuleInstallTestCase) [Module]200
LeafModule uninstallation (ModuleUninstallTestCase) [Module]100
LeafModule versions (ModuleVersionTestCase) [Module]5000
LeafMultilingual fields (LocaleMultilingualFieldsFunctionalTest) [Locale]6000
LeafMultistep form using form storage (FormsFormStorageTestCase) [Form API]15000
ExpandMultistep node form basic options (MultiStepNodeFormBasicOptionsTest) [Node]1320
MessageGroupFilenameLineFunctionStatus
status stayed uncheckedBrowsernode.test1644MultiStepNodeFormBasicOptionsTest->testMultiStepNodeFormBasicOptions()
promote stayed uncheckedBrowsernode.test1645MultiStepNodeFormBasicOptionsTest->testMultiStepNodeFormBasicOptions()
LeafNew default theme blocks (NewDefaultThemeBlocks) [Block]2400
LeafNo help (NoHelpTestCase) [Help]1100
LeafNode access (NodeAccessUnitTest) [Node]3100
LeafNode access rebuild (NodeAccessRebuildTestCase) [Node]1600
LeafNode access records (NodeAccessRecordsUnitTest) [Node]2300
LeafNode administration (NodeAdminTestCase) [Node]13900
ExpandNode blocks (NodeBlockFunctionalTest) [Node]7580
MessageGroupFilenameLineFunctionStatus
Block with "No content available." found.Othernode.test1528NodeBlockFunctionalTest->testRecentNodeBlock()
Node found in block.Othernode.test1559NodeBlockFunctionalTest->testRecentNodeBlock()
Node found in block.Othernode.test1560NodeBlockFunctionalTest->testRecentNodeBlock()
Nodes were ordered correctly in block.Othernode.test1563NodeBlockFunctionalTest->testRecentNodeBlock()
Node found in block.Othernode.test1579NodeBlockFunctionalTest->testRecentNodeBlock()
Node found in block.Othernode.test1580NodeBlockFunctionalTest->testRecentNodeBlock()
Node found in block.Othernode.test1581NodeBlockFunctionalTest->testRecentNodeBlock()
Node found in block.Othernode.test1582NodeBlockFunctionalTest->testRecentNodeBlock()
LeafNode body upgrade path (NodeBodyUpgradePathTestCase) [Upgrade path]3500
LeafNode creation (NodeCreationTestCase) [Node]2500
LeafNode edit (PageEditTestCase) [Node]9300
LeafNode edit permissions (PageViewTestCase) [Node]3200
LeafNode entity query alter (NodeEntityFieldQueryAlter) [Node]3000
LeafNode feed (NodeFeedTestCase) [Node]100
LeafNode post information display (NodePostSettingsTestCase) [Node]3400
LeafNode preview (PagePreviewTestCase) [Node]3500
LeafNode query alter (NodeQueryAlter) [Node]5100
LeafNode revisions (NodeRevisionsTestCase) [Node]4400
LeafNode RSS Content (NodeRSSContentTestCase) [Node]1600
LeafNode save (NodeSaveTestCase) [Node]2800
LeafNode title (NodeTitleTestCase) [Node]2000
LeafNode title XSS filtering (NodeTitleXSSTestCase) [Node]2000
LeafNode token replacement (NodeTokenReplaceTestCase) [Node]3400
ExpandNode type persist (NodeTypePersistenceTestCase) [Node]51120
MessageGroupFilenameLineFunctionStatus
Poll node type is not disabledOthernode.test1178NodeTypePersistenceTestCase->testNodeTypeCustomizationPersistence()
Customized description foundOthernode.test1191NodeTypePersistenceTestCase->testNodeTypeCustomizationPersistence()
poll type is not found on node/addOthernode.test1198NodeTypePersistenceTestCase->testNodeTypeCustomizationPersistence()
Poll node type is not disabledOthernode.test1205NodeTypePersistenceTestCase->testNodeTypeCustomizationPersistence()
Customized description foundOthernode.test1207NodeTypePersistenceTestCase->testNodeTypeCustomizationPersistence()
Failed to set field uninstall[poll] to pollOthernode.test1212NodeTypePersistenceTestCase->testNodeTypeCustomizationPersistence()
Found the Uninstall buttonOthernode.test1212NodeTypePersistenceTestCase->testNodeTypeCustomizationPersistence()
Found the requested form fields at admin/modules/uninstallOthernode.test1212NodeTypePersistenceTestCase->testNodeTypeCustomizationPersistence()
Found the Uninstall buttonOthernode.test1213NodeTypePersistenceTestCase->testNodeTypeCustomizationPersistence()
Found the requested form fields at Othernode.test1213NodeTypePersistenceTestCase->testNodeTypeCustomizationPersistence()
poll type is no longer found on node/addOthernode.test1217NodeTypePersistenceTestCase->testNodeTypeCustomizationPersistence()
Customized description is found even after uninstall and reenable.Othernode.test1223NodeTypePersistenceTestCase->testNodeTypeCustomizationPersistence()
LeafNode types (NodeTypeTestCase) [Node]8400
LeafNon default theme admin (NonDefaultBlockAdmin) [Block]1000
LeafNumber field (NumberFieldTestCase) [Field types]1500
ExpandOpenID account registration (OpenIDRegistrationTestCase) [OpenID]12740
MessageGroupFilenameLineFunctionStatus
User was asked to verify e-mail address.Otheropenid.test395OpenIDRegistrationTestCase->testRegisterUserWithInvalidSreg()
OpenID identity was registered.Otheropenid.test410OpenIDRegistrationTestCase->testRegisterUserWithInvalidSreg()
User was asked to verify e-mail address.Otheropenid.test431OpenIDRegistrationTestCase->testRegisterUserWithoutSreg()
OpenID identity was registered.Otheropenid.test446OpenIDRegistrationTestCase->testRegisterUserWithoutSreg()
LeafOpenID discovery and login (OpenIDFunctionalTestCase) [OpenID]24800
LeafOpenID helper functions (OpenIDUnitTest) [OpenID]3200
ExpandOptions widgets (OptionsWidgetsTestCase) [Field types]22720
MessageGroupFilenameLineFunctionStatus
Value 1 was saved correctly.Otheroptions.test451OptionsWidgetsTestCase->testOnOffCheckbox()
Checkbox field edit-bool-und is not checked.Browseroptions.test455OptionsWidgetsTestCase->testOnOffCheckbox()
LeafPage cache test (BootstrapPageCacheTestCase) [Bootstrap]7800
LeafPager query tests (DatabaseSelectPagerDefaultTestCase) [Database]4200
LeafParsing .info files (ParseInfoFilesTestCase) [System]300
LeafPath alias functionality (PathTestCase) [Path]10200
LeafPath aliases with languages (PathLanguageUITestCase) [Path]6900
LeafPath aliases with translated nodes (PathLanguageTestCase) [Path]6300
ExpandPath language settings (LocalePathFunctionalTest) [Locale]4210
MessageGroupFilenameLineFunctionStatus
The "xx" front page is not available yet.Browserlocale.test1534LocalePathFunctionalTest->testPathLanguageConfiguration()
ExpandPaths on non-English monolingual sites (PathMonolingualTestCase) [Path]3310
MessageGroupFilenameLineFunctionStatus
Site is mono-lingualOtherpath.test479PathMonolingualTestCase->setUp()
ExpandPersonal contact form (ContactPersonalTestCase) [Contact]14210
MessageGroupFilenameLineFunctionStatus
HTTP response expected 403, actual 200Browsercontact.test349ContactPersonalTestCase->testPersonalContactAccess()
LeafPHP filter access check (PHPAccessTestCase) [PHP]3700
LeafPHP filter functionality (PHPFilterTestCase) [PHP]4100
LeafPoll add choice (PollJSAddChoice) [Poll]1500
LeafPoll create (PollCreateTestCase) [Poll]14300
LeafPoll expiration (PollExpirationTestCase) [Poll]3200
LeafPoll token replacement (PollTokenReplaceTestCase) [Poll]11000
LeafPoll upgrade path (PollUpgradePathTestCase) [Upgrade path]21200
LeafPoll vote (PollVoteTestCase) [Poll]8400
LeafProfile browsing (ProfileTestBrowsing) [Profile]3200
ExpandProgrammatic form submissions (FormsProgrammaticTestCase) [Form API]993
MessageGroupFilenameLineFunctionStatus
Input values: Array ( [textfield] => dummy value [checkboxes] => Array ( [1] => 1 [2] => ) ) Validation handler errors: An illegal choice has been detected. Please contact the site administrator.Otherform.test1144FormsProgrammaticTestCase->submitForm()
Undefined index: storageNoticeform.test1150FormsProgrammaticTestCase->submitForm()
Submission handler correctly executed: textfield is dummy valueOtherform.test1152FormsProgrammaticTestCase->submitForm()
Submission handler correctly executed: checkboxes is Array ( [1] => 1 [2] => ) Otherform.test1152FormsProgrammaticTestCase->submitForm()
Input values: Array ( [textfield] => dummy value [checkboxes] => Array ( [1] => [2] => 2 ) ) Validation handler errors: An illegal choice has been detected. Please contact the site administrator.Otherform.test1144FormsProgrammaticTestCase->submitForm()
Undefined index: storageNoticeform.test1150FormsProgrammaticTestCase->submitForm()
Submission handler correctly executed: textfield is dummy valueOtherform.test1152FormsProgrammaticTestCase->submitForm()
Submission handler correctly executed: checkboxes is Array ( [1] => [2] => 2 ) Otherform.test1152FormsProgrammaticTestCase->submitForm()
Input values: Array ( [textfield] => dummy value [checkboxes] => Array ( [1] => [2] => ) ) Validation handler errors: An illegal choice has been detected. Please contact the site administrator.Otherform.test1144FormsProgrammaticTestCase->submitForm()
Undefined index: storageNoticeform.test1150FormsProgrammaticTestCase->submitForm()
Submission handler correctly executed: textfield is dummy valueOtherform.test1152FormsProgrammaticTestCase->submitForm()
Submission handler correctly executed: checkboxes is Array ( [1] => [2] => ) Otherform.test1152FormsProgrammaticTestCase->submitForm()
LeafQuery altering tests (DatabaseAlterTestCase) [Database]5500
LeafQuery logging (DatabaseLoggingTestCase) [Database]3800
LeafQuery tagging tests (DatabaseTaggingTestCase) [Database]2800
LeafQueue functionality (QueueTestCase) [System]700
LeafRange query test (DatabaseRangeQueryTestCase) [Database]200
LeafRDF comment mapping (RdfCommentAttributesTestCase) [RDF]20400
LeafRDF mapping CRUD functions (RdfCrudTestCase) [RDF]900
LeafRDF mapping definition functionality (RdfMappingDefinitionTestCase) [RDF]5800
LeafRDF mapping hook (RdfMappingHookTestCase) [RDF]500
LeafRDF namespaces (RdfGetRdfNamespacesTestCase) [RDF]400
LeafRDF namespaces XML serialization tests (DrupalGetRdfNamespacesTestCase) [System]600
LeafRDF tracker page mapping (RdfTrackerAttributesTestCase) [RDF]3200
LeafRDFa markup (RdfRdfaMarkupTestCase) [RDF]2100
LeafRebuild arbitrary forms (FormsArbitraryRebuildTestCase) [Form API]1400
LeafRebuild content (NodeBuildContent) [Node]100
LeafRegistry parse file test (RegistryParseFileTestCase) [System]200
LeafRegistry parse files test (RegistryParseFilesTestCase) [System]600
LeafRegression tests (DatabaseRegressionTestCase) [Database]2700
LeafRemove feed functionality (RemoveFeedTestCase) [Aggregator]2300
LeafRemove feed item functionality (RemoveFeedItemTestCase) [Aggregator]19600
LeafRequired modules (ModuleRequiredTestCase) [Module]1800
LeafRequirements hook failure (HookRequirementsTestCase) [Module]1500
LeafResettable static variables test (BootstrapResettableStaticTestCase) [Bootstrap]500
ExpandRole assignment (UserRolesAssignmentTestCase) [User]4950
MessageGroupFilenameLineFunctionStatus
Role is removed from user.Browseruser.test1850UserRolesAssignmentTestCase->testAssignAndRemoveRole()
The role is not present in the user object.Otheruser.test1897UserRolesAssignmentTestCase->userLoadAndCheckRoleAssigned()
"Created a new user account for h7kiKSMl." foundOtheruser.test1869UserRolesAssignmentTestCase->testCreateUserWithRole()
Role is removed from user.Browseruser.test1880UserRolesAssignmentTestCase->testCreateUserWithRole()
The role is not present in the user object.Otheruser.test1897UserRolesAssignmentTestCase->userLoadAndCheckRoleAssigned()
ExpandRole permissions (UserPermissionsTestCase) [User]4910
MessageGroupFilenameLineFunctionStatus
User no longer has "access user profiles" permission.Otheruser.test999UserPermissionsTestCase->testUserPermissionChanges()
LeafSchema API (SchemaTestCase) [Database]2800
LeafSearch engine phrase queries (SearchExactTestCase) [Search]2200
LeafSearch engine queries (SearchMatchTestCase) [Search]14400
LeafSearch engine ranking (SearchRankingTestCase) [Search]6000
LeafSearch excerpt extraction (SearchExcerptTestCase) [Search]500
LeafSearch expression insert/extract (SearchExpressionInsertExtractTestCase) [Search]2400
LeafSearch page override (SearchPageOverride) [Search]1200
LeafSearch page text (SearchPageText) [Search]2600
LeafSearch simplify (SearchSimplifyTestCase) [Search]33800
LeafSecurity (FilterSecurityTestCase) [Filter]2600
LeafSelect tests (DatabaseSelectTestCase) [Database]11700
LeafSelect tests, complex (DatabaseSelectComplexTestCase) [Database]11500
LeafSelect tests, complex 2 (DatabaseSelectComplexTestCase2) [Database]1400
LeafSelect tests, ordered (DatabaseSelectOrderedTestCase) [Database]2600
LeafSelect tests, subqueries (DatabaseSelectSubqueryTestCase) [Database]2400
LeafSequences API (DatabaseNextIdCase) [Database]200
LeafSession https handling (SessionHttpsTestCase) [Session]6800
LeafSession tests (SessionTestCase) [Session]17000
LeafShortcut link functionality (ShortcutLinksTestCase) [Shortcut]10300
LeafShortcut set functionality (ShortcutSetsTestCase) [Shortcut]19800
LeafShutdown functions (ShutdownFunctionsTest) [System]400
LeafSimpleTest browser (SimpleTestBrowserTestCase) [SimpleTest]1600
LeafSimpleTest e-mail capturing (SimpleTestMailCaptureTestCase) [SimpleTest]1300
LeafSimpleTest error collector (DrupalErrorCollectionUnitTest) [SimpleTest]1500
ExpandSimpleTest functionality (SimpleTestFunctionalTest) [SimpleTest]2342138
MessageGroupFilenameLineFunctionStatus
Undefined index: assertionsNoticesimpletest.test202SimpleTestFunctionalTest->assertAssertion()
Invalid argument supplied for foreach()Warningsimpletest.test202SimpleTestFunctionalTest->assertAssertion()
Found assertion {"SimpleTest pass.", "Other", "Pass", "simpletest.test", "SimpleTestFunctionalTest->stubTest()"}.Othersimpletest.test151SimpleTestFunctionalTest->confirmStubTestResults()
Undefined index: assertionsNoticesimpletest.test202SimpleTestFunctionalTest->assertAssertion()
Invalid argument supplied for foreach()Warningsimpletest.test202SimpleTestFunctionalTest->assertAssertion()
Found assertion {"SimpleTest fail.", "Other", "Fail", "simpletest.test", "SimpleTestFunctionalTest->stubTest()"}.Othersimpletest.test152SimpleTestFunctionalTest->confirmStubTestResults()
Undefined index: assertionsNoticesimpletest.test202SimpleTestFunctionalTest->assertAssertion()
Invalid argument supplied for foreach()Warningsimpletest.test202SimpleTestFunctionalTest->assertAssertion()
Found assertion {"Created permissions: access content", "Role", "Pass", "simpletest.test", "SimpleTestFunctionalTest->stubTest()"}.Othersimpletest.test154SimpleTestFunctionalTest->confirmStubTestResults()
Undefined index: assertionsNoticesimpletest.test202SimpleTestFunctionalTest->assertAssertion()
Invalid argument supplied for foreach()Warningsimpletest.test202SimpleTestFunctionalTest->assertAssertion()
Found assertion {"Invalid permission invalid permission.", "Role", "Fail", "simpletest.test", "SimpleTestFunctionalTest->stubTest()"}.Othersimpletest.test155SimpleTestFunctionalTest->confirmStubTestResults()
Undefined index: assertionsNoticesimpletest.test202SimpleTestFunctionalTest->assertAssertion()
Invalid argument supplied for foreach()Warningsimpletest.test202SimpleTestFunctionalTest->assertAssertion()
Found assertion {"Division by zero", "Warning", "Fail", "simpletest.test", "SimpleTestFunctionalTest->stubTest()"}.Othersimpletest.test158SimpleTestFunctionalTest->confirmStubTestResults()
Undefined index: assertionsNoticesimpletest.test202SimpleTestFunctionalTest->assertAssertion()
Invalid argument supplied for foreach()Warningsimpletest.test202SimpleTestFunctionalTest->assertAssertion()
Found assertion {"This is nothing.", "Other", "Pass", "simpletest.test", "SimpleTestFunctionalTest->stubTest()"}.Othersimpletest.test161SimpleTestFunctionalTest->confirmStubTestResults()
Undefined index: assertionsNoticesimpletest.test202SimpleTestFunctionalTest->assertAssertion()
Invalid argument supplied for foreach()Warningsimpletest.test202SimpleTestFunctionalTest->assertAssertion()
Found assertion {"array_key_exists", "Warning", "Fail", "simpletest.test", "SimpleTestFunctionalTest->stubTest()"}.Othersimpletest.test166SimpleTestFunctionalTest->confirmStubTestResults()
Undefined index: assertionsNoticesimpletest.test202SimpleTestFunctionalTest->assertAssertion()
Invalid argument supplied for foreach()Warningsimpletest.test202SimpleTestFunctionalTest->assertAssertion()
Found assertion {"Debug: 'Foo'", "Debug", "Fail", "simpletest.test", "SimpleTestFunctionalTest->stubTest()"}.Othersimpletest.test168SimpleTestFunctionalTest->confirmStubTestResults()
Undefined index: summaryNoticesimpletest.test170SimpleTestFunctionalTest->confirmStubTestResults()
Stub test summary is correctOthersimpletest.test170SimpleTestFunctionalTest->confirmStubTestResults()
Undefined index: assertionsNoticesimpletest.test180SimpleTestFunctionalTest->getTestIdFromResults()
Invalid argument supplied for foreach()Warningsimpletest.test180SimpleTestFunctionalTest->getTestIdFromResults()
Found test ID in results.Othersimpletest.test173SimpleTestFunctionalTest->confirmStubTestResults()
Undefined index: assertionsNoticesimpletest.test202SimpleTestFunctionalTest->assertAssertion()
Invalid argument supplied for foreach()Warningsimpletest.test202SimpleTestFunctionalTest->assertAssertion()
Found assertion {"SimpleTest pass.", "Other", "Pass", "simpletest.test", "SimpleTestFunctionalTest->stubTest()"}.Othersimpletest.test151SimpleTestFunctionalTest->confirmStubTestResults()
Undefined index: assertionsNoticesimpletest.test202SimpleTestFunctionalTest->assertAssertion()
Invalid argument supplied for foreach()Warningsimpletest.test202SimpleTestFunctionalTest->assertAssertion()
Found assertion {"SimpleTest fail.", "Other", "Fail", "simpletest.test", "SimpleTestFunctionalTest->stubTest()"}.Othersimpletest.test152SimpleTestFunctionalTest->confirmStubTestResults()
Undefined index: assertionsNoticesimpletest.test202SimpleTestFunctionalTest->assertAssertion()
Invalid argument supplied for foreach()Warningsimpletest.test202SimpleTestFunctionalTest->assertAssertion()
Found assertion {"Created permissions: access content", "Role", "Pass", "simpletest.test", "SimpleTestFunctionalTest->stubTest()"}.Othersimpletest.test154SimpleTestFunctionalTest->confirmStubTestResults()
Undefined index: assertionsNoticesimpletest.test202SimpleTestFunctionalTest->assertAssertion()
Invalid argument supplied for foreach()Warningsimpletest.test202SimpleTestFunctionalTest->assertAssertion()
Found assertion {"Invalid permission invalid permission.", "Role", "Fail", "simpletest.test", "SimpleTestFunctionalTest->stubTest()"}.Othersimpletest.test155SimpleTestFunctionalTest->confirmStubTestResults()
Undefined index: assertionsNoticesimpletest.test202SimpleTestFunctionalTest->assertAssertion()
Invalid argument supplied for foreach()Warningsimpletest.test202SimpleTestFunctionalTest->assertAssertion()
Found assertion {"Division by zero", "Warning", "Fail", "simpletest.test", "SimpleTestFunctionalTest->stubTest()"}.Othersimpletest.test158SimpleTestFunctionalTest->confirmStubTestResults()
Undefined index: assertionsNoticesimpletest.test202SimpleTestFunctionalTest->assertAssertion()
Invalid argument supplied for foreach()Warningsimpletest.test202SimpleTestFunctionalTest->assertAssertion()
Found assertion {"This is nothing.", "Other", "Pass", "simpletest.test", "SimpleTestFunctionalTest->stubTest()"}.Othersimpletest.test161SimpleTestFunctionalTest->confirmStubTestResults()
Undefined index: assertionsNoticesimpletest.test202SimpleTestFunctionalTest->assertAssertion()
Invalid argument supplied for foreach()Warningsimpletest.test202SimpleTestFunctionalTest->assertAssertion()
Found assertion {"array_key_exists", "Warning", "Fail", "simpletest.test", "SimpleTestFunctionalTest->stubTest()"}.Othersimpletest.test166SimpleTestFunctionalTest->confirmStubTestResults()
Undefined index: assertionsNoticesimpletest.test202SimpleTestFunctionalTest->assertAssertion()
Invalid argument supplied for foreach()Warningsimpletest.test202SimpleTestFunctionalTest->assertAssertion()
Found assertion {"Debug: 'Foo'", "Debug", "Fail", "simpletest.test", "SimpleTestFunctionalTest->stubTest()"}.Othersimpletest.test168SimpleTestFunctionalTest->confirmStubTestResults()
Undefined index: summaryNoticesimpletest.test170SimpleTestFunctionalTest->confirmStubTestResults()
Stub test summary is correctOthersimpletest.test170SimpleTestFunctionalTest->confirmStubTestResults()
Undefined index: assertionsNoticesimpletest.test180SimpleTestFunctionalTest->getTestIdFromResults()
Invalid argument supplied for foreach()Warningsimpletest.test180SimpleTestFunctionalTest->getTestIdFromResults()
Found test ID in results.Othersimpletest.test173SimpleTestFunctionalTest->confirmStubTestResults()
Test ID is incrementing.Othersimpletest.test112SimpleTestFunctionalTest->testWebTestRunner()
LeafSite maintenance mode functionality (SiteMaintenanceTestCase) [System]8000
LeafSite-wide contact form (ContactSitewideTestCase) [Contact]23700
LeafSize parsing test (CommonSizeTestCase) [System]3500
LeafStatistics logging tests (StatisticsLoggingTestCase) [Statistics]1200
LeafStatistics reports tests (StatisticsReportsTestCase) [Statistics]10800
LeafStatistics token replacement (StatisticsTokenReplaceTestCase) [Statistics]2900
LeafStream wrappers (StreamWrapperTest) [File API]1500
LeafString filtering tests (CommonXssUnitTest) [System]900
LeafString translate, search and validate (LocaleTranslationFunctionalTest) [Locale]25000
LeafString translation using st() (LocaleInstallTest) [Locale]100
LeafSummary length (SummaryLengthTestCase) [Node]1500
LeafSyslog functionality (SyslogTestCase) [Syslog]1600
LeafSystem info alter (SystemInfoAlterTestCase) [System]1000
ExpandTableselect form element type test (FormsElementsTableSelectFunctionalTest) [Form API]5330
MessageGroupFilenameLineFunctionStatus
Unchecked checkbox row2.Otherform.test631FormsElementsTableSelectFunctionalTest->testMultipleTrueSubmit()
Unchecked checkbox row3.Otherform.test632FormsElementsTableSelectFunctionalTest->testMultipleTrueSubmit()
Unchecked checkbox row2.Otherform.test640FormsElementsTableSelectFunctionalTest->testMultipleTrueSubmit()
LeafTablesort query tests (DatabaseSelectTableSortDefaultTestCase) [Database]4100
LeafTaxonomy term functions and forms. (TaxonomyTermTestCase) [Taxonomy]16800
LeafTaxonomy term hooks (TaxonomyHooksTestCase) [Taxonomy]1900
LeafTaxonomy term multiple loading (TaxonomyLoadMultipleUnitTest) [Taxonomy]1700
LeafTaxonomy term reference field (TaxonomyTermFieldTestCase) [Taxonomy]3600
LeafTaxonomy term unit tests (TaxonomyTermUnitTest) [Taxonomy]100
LeafTaxonomy term URL aliases (PathTaxonomyTermTestCase) [Path]3400
LeafTaxonomy token replacement (TaxonomyTokenReplaceTestCase) [Taxonomy]5300
LeafTaxonomy upgrade path (UpgradePathTaxonomyTestCase) [Upgrade path]126300
LeafTaxonomy vocabularies (TaxonomyVocabularyUnitTest) [Taxonomy]6100
LeafTaxonomy vocabulary interface (TaxonomyVocabularyFunctionalTest) [Taxonomy]9700
LeafTemporary query test (DatabaseTemporaryQueryTestCase) [Database]500
LeafTest date field (ProfileTestDate) [Profile]4900
ExpandTest field weights (ProfileTestWeights) [Profile]4850
MessageGroupFilenameLineFunctionStatus
Found profile field with title z5BPeE8GOtherprofile.test140ProfileTestCase->setProfileField()
Found profile field with value blDWP304Otherprofile.test144ProfileTestCase->setProfileField()
Found profile field with title y1eCIfL7Otherprofile.test140ProfileTestCase->setProfileField()
Found profile field with value f0y7Vkf6Otherprofile.test144ProfileTestCase->setProfileField()
Profile field weights are respected on the user profile page.Otherprofile.test307ProfileTestWeights->testProfileFieldWeights()
LeafTest select field (ProfileTestSelect) [Profile]4500
LeafTest single fields (ProfileTestFields) [Profile]18000
LeafTest statistics admin. (StatisticsAdminTestCase) [Statistics]12500
LeafTest user actions (TriggerUserActionTestCase) [Trigger]6500
ExpandTest user triggers (TriggerUserTokenTestCase) [Trigger]17830
MessageGroupFilenameLineFunctionStatus
Expected system message to contain token-replaced text "Action was triggered by trigger user_delete user:name=knF7uYVS user:uid=16 user:mail=knF7uYVS@example.com user:url=http://mysql.qa.damz.org/checkout/?q=user/16 user:edit-url=http://mysql.qa.damz.org/checkout/?q=user/16/edit user:created=Sun, 10/31/2010 - 20:29" found in configured system message actionOthertrigger.test473TriggerUserTokenTestCase->testUserTriggerTokenReplacement()
Expected text found in subject of email message: "Action was triggered by trigger user_delete user:name=knF7uYVS user:uid=16 user:mail=knF7uYVS@example.com user:url=http://mysql.qa.damz.org/checkout/?q=user/16 user:edit-url=http://mysql.qa.damz.org/checkout/?q=user/16/edit user:created=Sun, 10/31/2010 - 20:29".Othertrigger.test473TriggerUserTokenTestCase->testUserTriggerTokenReplacement()
Expected text found in body of email message: "Action was triggered by trigger user_delete user:name=knF7uYVS user:uid=16 user:mail=knF7uYVS@example.com user:url=http://mysql.qa.damz.org/checkout/?q=user/16 user:edit-url=http://mysql.qa.damz.org/checkout/?q=user/16/edit user:created=Sun, 10/31/2010 - 20:29".Othertrigger.test473TriggerUserTokenTestCase->testUserTriggerTokenReplacement()
LeafTesting SimpleTest setUp (SimpleTestFolderTestCase) [SimpleTest]100
ExpandText field (TextFieldTestCase) [Field types]19520
MessageGroupFilenameLineFunctionStatus
Value is displayed unfilteredOthertext.test232TextFieldTestCase->_testTextfieldWidgetsFormatted()
Value is displayed unfilteredOthertext.test232TextFieldTestCase->_testTextfieldWidgetsFormatted()
LeafText summary (TextSummaryTestCase) [Field types]13800
ExpandText translation (TextTranslationTestCase) [Field types]94122
MessageGroupFilenameLineFunctionStatus
Failed to set field body[en][0][value] to wOiYlZy5Othertext.test499TextTranslationTestCase->testTextFieldFormatted()
Failed to set field body[en][0][format] to full_htmlOthertext.test499TextTranslationTestCase->testTextFieldFormatted()
Found the Save buttonOthertext.test499TextTranslationTestCase->testTextFieldFormatted()
Found the requested form fields at node/1/editOthertext.test499TextTranslationTestCase->testTextFieldFormatted()
The body field with delta 0 has been saved.Othertext.test500TextTranslationTestCase->testTextFieldFormatted()
Failed to set field body[en][1][value] to gZ9UrAlqOthertext.test499TextTranslationTestCase->testTextFieldFormatted()
Failed to set field body[en][1][format] to filtered_htmlOthertext.test499TextTranslationTestCase->testTextFieldFormatted()
Found the Save buttonOthertext.test499TextTranslationTestCase->testTextFieldFormatted()
Found the requested form fields at node/1/editOthertext.test499TextTranslationTestCase->testTextFieldFormatted()
The body field with delta 1 has been saved.Othertext.test500TextTranslationTestCase->testTextFieldFormatted()
Trying to get property of non-objectNoticetext.test508TextTranslationTestCase->testTextFieldFormatted()
Undefined variable: url_targetNoticedrupal_web_test_case.php2327DrupalWebTestCase->clickLink()
Clicked link add translation () from http://mysql.qa.damz.org/checkout/?q=node//translateBrowsertext.test509TextTranslationTestCase->testTextFieldFormatted()
The body field with delta 1 is shown.Othertext.test511TextTranslationTestCase->testTextFieldFormatted()
LeafTheme API (ThemeUnitTest) [Theme]1600
LeafTheme fast initialization (ThemeFastTestCase) [Theme]1000
LeafTheme initialization in hook_init() (ThemeHookInitUnitTest) [Theme]400
ExpandTheme interface functionality (SystemThemeFunctionalTest) [System]6420
MessageGroupFilenameLineFunctionStatus
Logo path successfully changed.Othersystem.test1342SystemThemeFunctionalTest->testThemeSettings()
Site default theme used on the add content page.Othersystem.test1392SystemThemeFunctionalTest->testAdministrationTheme()
LeafTheme item list (ThemeItemListUnitTest) [Theme]100
LeafTheme Table (ThemeTableUnitTest) [Theme]600
LeafTimer test (BootstrapTimerTestCase) [Bootstrap]500
LeafToken replacement (TokenReplaceTestCase) [System]2700
LeafTop visitor blocking (StatisticsBlockVisitorsTestCase) [Statistics]4500
LeafTracker (TrackerTest) [Tracker]21900
LeafTransaction tests (DatabaseTransactionTestCase) [Database]3100
LeafTranslation export (LocaleExportFunctionalTest) [Locale]2900
ExpandTranslation functionality (TranslationTestCase) [Translation]16810
MessageGroupFilenameLineFunctionStatus
"EspaƱol" not foundOthertranslation.test96TranslationTestCase->testContentTranslation()
LeafTranslation import (LocaleImportFunctionalTest) [Locale]11600
ExpandTrigger content (node) actions (TriggerContentTestCase) [Trigger]35210
MessageGroupFilenameLineFunctionStatus
Action was triggered 2 times. Actual: 3Othertrigger.test131TriggerContentTestCase->testActionContentMultiple()
LeafTrigger cron (system) actions (TriggerCronTestCase) [Trigger]3300
LeafTrigger orphaned actions (TriggerOrphanedActionsTestCase) [Trigger]3700
LeafTrigger other actions (TriggerOtherTestCase) [Trigger]11300
LeafUI language negotiation (LocaleUILanguageNegotiationTest) [Locale]4700
LeafUnassigned text format functionality (FilterNoFormatTestCase) [Filter]100
LeafUnicode handling (UnicodeUnitTest) [System]17600
LeafUnmanaged file copying (FileUnmanagedCopyTest) [File API]3100
LeafUnmanaged file delete (FileUnmanagedDeleteTest) [File API]800
LeafUnmanaged file moving (FileUnmanagedMoveTest) [File API]2200
LeafUnmanaged file save data (FileUnmanagedSaveDataTest) [File API]700
LeafUnmanaged recursive file delete (FileUnmanagedDeleteRecursiveTest) [File API]1700
LeafUpdate contrib functionality (UpdateTestContribCase) [Update]18100
LeafUpdate core functionality (UpdateCoreTestCase) [Update]16000
LeafUpdate dependency hook invocation (UpdateDependencyHookInvocationTestCase) [Update API]300
LeafUpdate dependency ordering (UpdateDependencyOrderingTestCase) [Update API]300
LeafUpdate feed functionality (UpdateFeedTestCase) [Aggregator]7400
LeafUpdate feed item functionality (UpdateFeedItemTestCase) [Aggregator]6100
LeafUpdate functionality (UpdateScriptFunctionalTest) [System]5600
LeafUpdate on cron functionality (AggregatorCronTestCase) [Aggregator]5300
LeafUpdate tests (DatabaseUpdateTestCase) [Database]3500
LeafUpdate tests, Complex (DatabaseUpdateComplexTestCase) [Database]5200
LeafUpdate tests, LOB (DatabaseUpdateLOBTestCase) [Database]1300
LeafUpload and extract module functionality (UpdateTestUploadCase) [Update]6100
LeafUpload upgrade path (UploadUpgradePathTestCase) [Upgrade path]2800
LeafUpload user picture (UserPictureTestCase) [User]8900
LeafURL altering (UrlAlterFunctionalTest) [Path API]2800
LeafURL generation tests (CommonURLUnitTest) [System]6000
LeafUser account links (UserAccountLinksUnitTests) [User]2100
LeafUser administration (UserAdminTestCase) [User]6500
LeafUser autocompletion (UserAutocompleteTestCase) [User]2800
LeafUser blocks (UserBlocksUnitTests) [User]4300
ExpandUser create (UserCreateTestCase) [User]2430
MessageGroupFilenameLineFunctionStatus
User createdOtheruser.test1447UserCreateTestCase->testUserAdd()
Notification e-mail not sentOtheruser.test1448UserCreateTestCase->testUserAdd()
Notification e-mail sentOtheruser.test1444UserCreateTestCase->testUserAdd()
LeafUser creation (LocaleUserCreationTest) [Locale]6800
LeafUser edit (UserEditTestCase) [User]6800
LeafUser edited own account (UserEditedOwnAccountTestCase) [User]2300
ExpandUser language settings (LocaleUserLanguageFunctionalTest) [Locale]5010
MessageGroupFilenameLineFunctionStatus
Disabled language not present on form.Otherlocale.test1368LocaleUserLanguageFunctionalTest->testUserLanguageConfiguration()
LeafUser login (UserLoginTestCase) [User]13200
LeafUser poll vote capability. (PollVoteCheckHostname) [Poll]12400
LeafUser registration (UserRegistrationTestCase) [User]8100
LeafUser role administration (UserRoleAdminTestCase) [User]3900
LeafUser save test (UserSaveTestCase) [User]300
LeafUser search (UserUserSearchTestCase) [User]3800
LeafUser signatures (UserSignatureTestCase) [User]4500
LeafUser time zones (UserTimeZoneFunctionalTest) [User]3100
LeafUser token replacement (UserTokenReplaceTestCase) [User]4300
LeafUsername/e-mail validation (UserValidationTestCase) [User]1900
LeafValid Url (ValidUrlTestCase) [System]7900
LeafVariable test (BootstrapVariableTestCase) [Bootstrap]700
LeafXML-RPC basic (XMLRPCBasicTestCase) [XML-RPC]500
LeafXML-RPC message and alteration (XMLRPCMessagesTestCase) [XML-RPC]500
LeafXML-RPC validator (XMLRPCValidator1IncTestCase) [XML-RPC]900