field_form_state_info.patch

Test status
StatusResult
Last receivedSat, 10/23/2010 - 06:21:02
Last requestedSat, 10/23/2010 - 06:21:02
Last testedSat, 10/23/2010 - 06:21:03
Test count1
Environment status
MySQLfail
File information
Filefield_form_state_info.patch
BranchDrupal core - 7.x
LinkIssue Link
SummaryFAILED: [[SimpleTest]]: [MySQL] 26,034 pass(es), 218 fail(s), and 239 exception(s).
Details

MySQL

  1. Setup environment
  2. Detect an invalid patch URL
  3. Detect invalid repository information
  4. Detect invalid patch format
  5. Detect a non-applicable patch
  6. Detect invalid PHP syntax
  7. Detect a Drupal installation failure
  8. Detect a test run failure
  9. Detect a failing test
    Review the test failures below then if necessary run them locally until the problem has been fixed.
  10. Complete test suite with all tests passing
26,034 pass(es), 218 fail(s), and 239 exception(s)

Non-pass

Test namePassFailException
ExpandBreadcrumbs (MenuBreadcrumbTestCase) [Menu]3752917
MessageGroupFilenameLineFunctionStatus
Parsed page successfully.Browsermenu.test1131MenuBreadcrumbTestCase->getParts()
Breadcrumb Home » Parent j6Kz1htV found on http://pifr-mysql/checkout/?q=node/2/edit.Othermenu.test753MenuBreadcrumbTestCase->testBreadCrumbs()
Parsed page successfully.Browsermenu.test1131MenuBreadcrumbTestCase->getParts()
Breadcrumb Home » Parent j6Kz1htV » Child wgdnQT73 found on http://pifr-mysql/checkout/?q=node/3/edit.Othermenu.test780MenuBreadcrumbTestCase->testBreadCrumbs()
Parsed page successfully.Browsermenu.test1131MenuBreadcrumbTestCase->getParts()
Breadcrumb Home » Parent jZcVBLP0 found on http://pifr-mysql/checkout/?q=node/4/edit.Othermenu.test753MenuBreadcrumbTestCase->testBreadCrumbs()
Parsed page successfully.Browsermenu.test1131MenuBreadcrumbTestCase->getParts()
Breadcrumb Home » Parent jZcVBLP0 » Child iOMaTPya found on http://pifr-mysql/checkout/?q=node/5/edit.Othermenu.test780MenuBreadcrumbTestCase->testBreadCrumbs()
Parsed page successfully.Browsermenu.test805MenuBreadcrumbTestCase->testBreadCrumbs()
Parsed page successfully.Browsermenu.test1131MenuBreadcrumbTestCase->getParts()
Breadcrumb Home » Root found on http://pifr-mysql/checkout/?q=node/4/edit.Othermenu.test813MenuBreadcrumbTestCase->testBreadCrumbs()
Parsed page successfully.Browsermenu.test813MenuBreadcrumbTestCase->testBreadCrumbs()
current() expects parameter 1 to be array, boolean givenWarningdrupal_web_test_case.php2773DrupalWebTestCase->assertTitle()
Page title '' is equal to 'jZcVBLP0 | Drupal'.Othermenu.test813MenuBreadcrumbTestCase->testBreadCrumbs()
Parsed page successfully.Browsermenu.test813MenuBreadcrumbTestCase->testBreadCrumbs()
Active trail to current page was found in menu tree.Othermenu.test813MenuBreadcrumbTestCase->testBreadCrumbs()
Parsed page successfully.Browsermenu.test813MenuBreadcrumbTestCase->testBreadCrumbs()
Active link Parent jZcVBLP0 was found in menu tree, including active trail links Root.Othermenu.test813MenuBreadcrumbTestCase->testBreadCrumbs()
Breadcrumb Home » Root » Parent jZcVBLP0 found on http://pifr-mysql/checkout/?q=node/5.Othermenu.test820MenuBreadcrumbTestCase->testBreadCrumbs()
Active trail to current page was found in menu tree.Othermenu.test820MenuBreadcrumbTestCase->testBreadCrumbs()
Active link Child iOMaTPya was found in menu tree, including active trail links Root » Parent jZcVBLP0.Othermenu.test820MenuBreadcrumbTestCase->testBreadCrumbs()
Parsed page successfully.Browsermenu.test831MenuBreadcrumbTestCase->testBreadCrumbs()
Trying to get property of non-objectNoticemenu.test847MenuBreadcrumbTestCase->testBreadCrumbs()
Trying to get property of non-objectNoticemenu.test847MenuBreadcrumbTestCase->testBreadCrumbs()
Trying to get property of non-objectNoticemenu.test854MenuBreadcrumbTestCase->testBreadCrumbs()
Undefined index: mlidNoticemenu.test863MenuBreadcrumbTestCase->testBreadCrumbs()
Trying to get property of non-objectNoticemenu.test854MenuBreadcrumbTestCase->testBreadCrumbs()
Failed to set field parent to navigation:Othermenu.test857MenuBreadcrumbTestCase->testBreadCrumbs()
Found the requested form fields at admin/structure/menu/manage/navigation/addOthermenu.test857MenuBreadcrumbTestCase->testBreadCrumbs()
Undefined index: mlidNoticemenu.test863MenuBreadcrumbTestCase->testBreadCrumbs()
Undefined index: link_titleNoticemenu.test874MenuBreadcrumbTestCase->testBreadCrumbs()
Undefined index: link_titleNoticemenu.test877MenuBreadcrumbTestCase->testBreadCrumbs()
Breadcrumb Home found on http://pifr-mysql/checkout/?q=taxonomy/term/.Othermenu.test877MenuBreadcrumbTestCase->testBreadCrumbs()
SimpleXMLElement::xpath(): Invalid expressionWarningdrupal_web_test_case.php2189DrupalWebTestCase->xpath()
SimpleXMLElement::xpath(): xmlXPathEval: evaluation failedWarningdrupal_web_test_case.php2189DrupalWebTestCase->xpath()
Active link was found in menu tree, including active trail links .Othermenu.test877MenuBreadcrumbTestCase->testBreadCrumbs()
Tagged node found.Othermenu.test878MenuBreadcrumbTestCase->testBreadCrumbs()
Trying to get property of non-objectNoticemenu.test893MenuBreadcrumbTestCase->testBreadCrumbs()
Undefined index: link_titleNoticemenu.test874MenuBreadcrumbTestCase->testBreadCrumbs()
Undefined index: link_titleNoticemenu.test877MenuBreadcrumbTestCase->testBreadCrumbs()
Breadcrumb Home » found on http://pifr-mysql/checkout/?q=taxonomy/term/.Othermenu.test877MenuBreadcrumbTestCase->testBreadCrumbs()
SimpleXMLElement::xpath(): Invalid expressionWarningdrupal_web_test_case.php2189DrupalWebTestCase->xpath()
SimpleXMLElement::xpath(): xmlXPathEval: evaluation failedWarningdrupal_web_test_case.php2189DrupalWebTestCase->xpath()
Active link was found in menu tree, including active trail links .Othermenu.test877MenuBreadcrumbTestCase->testBreadCrumbs()
Tagged node found.Othermenu.test878MenuBreadcrumbTestCase->testBreadCrumbs()
Trying to get property of non-objectNoticemenu.test893MenuBreadcrumbTestCase->testBreadCrumbs()
ExpandCategorize feed item functionality (CategorizeFeedItemTestCase) [Aggregator]3750
MessageGroupFilenameLineFunctionStatus
Parsed page successfully.Browseraggregator.test277AggregatorTestCase->createSampleNodes()
Parsed page successfully.Browseraggregator.test277AggregatorTestCase->createSampleNodes()
Parsed page successfully.Browseraggregator.test277AggregatorTestCase->createSampleNodes()
Parsed page successfully.Browseraggregator.test277AggregatorTestCase->createSampleNodes()
Parsed page successfully.Browseraggregator.test277AggregatorTestCase->createSampleNodes()
ExpandChecks display of aggregator items (AggregatorRenderingTestCase) [Aggregator]5170
MessageGroupFilenameLineFunctionStatus
Parsed page successfully.Browseraggregator.test277AggregatorTestCase->createSampleNodes()
Parsed page successfully.Browseraggregator.test277AggregatorTestCase->createSampleNodes()
Parsed page successfully.Browseraggregator.test277AggregatorTestCase->createSampleNodes()
Parsed page successfully.Browseraggregator.test277AggregatorTestCase->createSampleNodes()
Parsed page successfully.Browseraggregator.test277AggregatorTestCase->createSampleNodes()
Feed block is displayed on the page.Otheraggregator.test799AggregatorRenderingTestCase->testBlockLinks()
Link to href aggregator/sources/1 found.Otheraggregator.test804AggregatorRenderingTestCase->testBlockLinks()
ExpandComment language (LocaleCommentLanguageFunctionalTest) [Locale]341816
MessageGroupFilenameLineFunctionStatus
Parsed page successfully.Browserlocale.test2001LocaleCommentLanguageFunctionalTest->testCommentLanguage()
Trying to get property of non-objectNoticelocale.test2008LocaleCommentLanguageFunctionalTest->testCommentLanguage()
Failed to set field comment_body[und][0][value] to qHno4u1AOtherlocale.test2008LocaleCommentLanguageFunctionalTest->testCommentLanguage()
Found the Save buttonOtherlocale.test2008LocaleCommentLanguageFunctionalTest->testCommentLanguage()
Found the requested form fields at node/Otherlocale.test2008LocaleCommentLanguageFunctionalTest->testCommentLanguage()
Trying to get property of non-objectNoticelocale.test2013LocaleCommentLanguageFunctionalTest->testCommentLanguage()
Trying to get property of non-objectNoticelocale.test2017LocaleCommentLanguageFunctionalTest->testCommentLanguage()
Trying to get property of non-objectNoticelocale.test2018LocaleCommentLanguageFunctionalTest->testCommentLanguage()
The comment posted with content language en and belonging to the node with language en has language Otherlocale.test2018LocaleCommentLanguageFunctionalTest->testCommentLanguage()
Trying to get property of non-objectNoticelocale.test2008LocaleCommentLanguageFunctionalTest->testCommentLanguage()
Failed to set field comment_body[und][0][value] to p70VfU08Otherlocale.test2008LocaleCommentLanguageFunctionalTest->testCommentLanguage()
Found the Save buttonOtherlocale.test2008LocaleCommentLanguageFunctionalTest->testCommentLanguage()
Found the requested form fields at fr/node/Otherlocale.test2008LocaleCommentLanguageFunctionalTest->testCommentLanguage()
Trying to get property of non-objectNoticelocale.test2013LocaleCommentLanguageFunctionalTest->testCommentLanguage()
Trying to get property of non-objectNoticelocale.test2017LocaleCommentLanguageFunctionalTest->testCommentLanguage()
Trying to get property of non-objectNoticelocale.test2018LocaleCommentLanguageFunctionalTest->testCommentLanguage()
The comment posted with content language fr and belonging to the node with language en has language Otherlocale.test2018LocaleCommentLanguageFunctionalTest->testCommentLanguage()
Parsed page successfully.Browserlocale.test2001LocaleCommentLanguageFunctionalTest->testCommentLanguage()
Trying to get property of non-objectNoticelocale.test2008LocaleCommentLanguageFunctionalTest->testCommentLanguage()
Failed to set field comment_body[und][0][value] to xEp8eGIGOtherlocale.test2008LocaleCommentLanguageFunctionalTest->testCommentLanguage()
Found the Save buttonOtherlocale.test2008LocaleCommentLanguageFunctionalTest->testCommentLanguage()
Found the requested form fields at node/Otherlocale.test2008LocaleCommentLanguageFunctionalTest->testCommentLanguage()
Trying to get property of non-objectNoticelocale.test2013LocaleCommentLanguageFunctionalTest->testCommentLanguage()
Trying to get property of non-objectNoticelocale.test2017LocaleCommentLanguageFunctionalTest->testCommentLanguage()
Trying to get property of non-objectNoticelocale.test2018LocaleCommentLanguageFunctionalTest->testCommentLanguage()
The comment posted with content language en and belonging to the node with language fr has language Otherlocale.test2018LocaleCommentLanguageFunctionalTest->testCommentLanguage()
Trying to get property of non-objectNoticelocale.test2008LocaleCommentLanguageFunctionalTest->testCommentLanguage()
Failed to set field comment_body[und][0][value] to i1gBep7nOtherlocale.test2008LocaleCommentLanguageFunctionalTest->testCommentLanguage()
Found the Save buttonOtherlocale.test2008LocaleCommentLanguageFunctionalTest->testCommentLanguage()
Found the requested form fields at fr/node/Otherlocale.test2008LocaleCommentLanguageFunctionalTest->testCommentLanguage()
Trying to get property of non-objectNoticelocale.test2013LocaleCommentLanguageFunctionalTest->testCommentLanguage()
Trying to get property of non-objectNoticelocale.test2017LocaleCommentLanguageFunctionalTest->testCommentLanguage()
Trying to get property of non-objectNoticelocale.test2018LocaleCommentLanguageFunctionalTest->testCommentLanguage()
The comment posted with content language fr and belonging to the node with language fr has language Otherlocale.test2018LocaleCommentLanguageFunctionalTest->testCommentLanguage()
ExpandContent language settings (LocaleContentFunctionalTest) [Locale]6310
MessageGroupFilenameLineFunctionStatus
Parsed page successfully.Browserlocale.test1584LocaleContentFunctionalTest->testContentTypeLanguageConfiguration()
ExpandDBLog functionality (DBLogTestCase) [DBLog]425144
MessageGroupFilenameLineFunctionStatus
Parsed page successfully.Browserdblog.test274DBLogTestCase->doNode()
HTTP response expected 200, actual 500Browserdblog.test275DBLogTestCase->doNode()
Node qcPidArb was loadedOtherdblog.test278DBLogTestCase->doNode()
Trying to get property of non-objectNoticedblog.test281DBLogTestCase->doNode()
Failed to set field body[und][0][value] to xAKeiNQU98Uw105VUMTaBxuJnERUYkPkOtherdblog.test281DBLogTestCase->doNode()
Found the Save buttonOtherdblog.test281DBLogTestCase->doNode()
Found the requested form fields at node//editOtherdblog.test281DBLogTestCase->doNode()
HTTP response expected 200, actual 404Browserdblog.test282DBLogTestCase->doNode()
Trying to get property of non-objectNoticedblog.test284DBLogTestCase->doNode()
Found the Delete buttonOtherdblog.test284DBLogTestCase->doNode()
Found the requested form fields at node//deleteOtherdblog.test284DBLogTestCase->doNode()
HTTP response expected 200, actual 404Browserdblog.test285DBLogTestCase->doNode()
Trying to get property of non-objectNoticedblog.test287DBLogTestCase->doNode()
HTTP response expected 404, actual 200Browserdblog.test288DBLogTestCase->doNode()
DBLog event was recorded: [content added]Otherdblog.test301DBLogTestCase->doNode()
DBLog event was recorded: [content updated]Otherdblog.test303DBLogTestCase->doNode()
DBLog event was recorded: [content deleted]Otherdblog.test305DBLogTestCase->doNode()
Trying to get property of non-objectNoticedblog.test317DBLogTestCase->doNode()
ExpandFile field display tests (FileFieldDisplayTestCase) [File]14513
MessageGroupFilenameLineFunctionStatus
Parsed page successfully.Browserfile.test125FileFieldTestCase->uploadNodeFile()
array_flip(): Can only flip STRING and INTEGER values!Warningentity.inc167DrupalDefaultEntityController->load()
Trying to get property of non-objectNoticefile.test621FileFieldDisplayTestCase->testNodeDisplay()
Undefined property: stdClass::$uriNoticefile.module696theme_file_link()
Undefined property: stdClass::$filemimeNoticefile.module734theme_file_icon()
Undefined property: stdClass::$filemimeNoticefile.module776file_icon_path()
Undefined property: stdClass::$filemimeNoticefile.module818file_icon_map()
Undefined property: stdClass::$filemimeNoticefile.module791file_icon_path()
Undefined property: stdClass::$filemimeNoticefile.module791file_icon_path()
Undefined property: stdClass::$filemimeNoticefile.module791file_icon_path()
Undefined property: stdClass::$filemimeNoticefile.module791file_icon_path()
Undefined property: stdClass::$filemimeNoticefile.module703theme_file_link()
Undefined property: stdClass::$filesizeNoticefile.module703theme_file_link()
Undefined property: stdClass::$filenameNoticefile.module709theme_file_link()
Default formatter displaying correctly on full node view.Otherfile.test623FileFieldDisplayTestCase->testNodeDisplay()
Failed to set field kss3umho[und][0][display] to Otherfile.test627FileFieldDisplayTestCase->testNodeDisplay()
Found the Save buttonOtherfile.test627FileFieldDisplayTestCase->testNodeDisplay()
Found the requested form fields at node//editOtherfile.test627FileFieldDisplayTestCase->testNodeDisplay()
ExpandFile field file path tests (FileFieldPathTestCase) [File]11612
MessageGroupFilenameLineFunctionStatus
Parsed page successfully.Browserfile.test125FileFieldTestCase->uploadNodeFile()
array_flip(): Can only flip STRING and INTEGER values!Warningentity.inc167DrupalDefaultEntityController->load()
Trying to get property of non-objectNoticefile.test821FileFieldPathTestCase->testUploadPath()
Undefined property: stdClass::$uriNoticefile.test822FileFieldPathTestCase->testUploadPath()
Undefined property: stdClass::$uriNoticefile.test822FileFieldPathTestCase->testUploadPath()
The file was uploaded to the correct path.Otherfile.test822FileFieldPathTestCase->testUploadPath()
Parsed page successfully.Browserfile.test125FileFieldTestCase->uploadNodeFile()
array_flip(): Can only flip STRING and INTEGER values!Warningentity.inc167DrupalDefaultEntityController->load()
Trying to get property of non-objectNoticefile.test832FileFieldPathTestCase->testUploadPath()
Undefined property: stdClass::$uriNoticefile.test833FileFieldPathTestCase->testUploadPath()
Undefined property: stdClass::$uriNoticefile.test833FileFieldPathTestCase->testUploadPath()
The file was uploaded to the correct path.Otherfile.test833FileFieldPathTestCase->testUploadPath()
Parsed page successfully.Browserfile.test125FileFieldTestCase->uploadNodeFile()
array_flip(): Can only flip STRING and INTEGER values!Warningentity.inc167DrupalDefaultEntityController->load()
Trying to get property of non-objectNoticefile.test844FileFieldPathTestCase->testUploadPath()
Undefined property: stdClass::$uriNoticefile.test847FileFieldPathTestCase->testUploadPath()
Undefined property: stdClass::$uriNoticefile.test847FileFieldPathTestCase->testUploadPath()
The file was uploaded to the correct path with token replacements.Otherfile.test847FileFieldPathTestCase->testUploadPath()
ExpandFile field revision test (FileFieldRevisionTestCase) [File]272448
MessageGroupFilenameLineFunctionStatus
Parsed page successfully.Browserfile.test125FileFieldTestCase->uploadNodeFile()
array_flip(): Can only flip STRING and INTEGER values!Warningentity.inc167DrupalDefaultEntityController->load()
Trying to get property of non-objectNoticefile.test508FileFieldRevisionTestCase->testRevisions()
Trying to get property of non-objectNoticefile.test509FileFieldRevisionTestCase->testRevisions()
Undefined property: stdClass::$uriNoticefile.test165FileFieldTestCase->assertFileExists()
New file saved to disk on node creation.Otherfile.test510FileFieldRevisionTestCase->testRevisions()
Undefined property: stdClass::$fidNoticefile.test173FileFieldTestCase->assertFileEntryExists()
array_flip(): Can only flip STRING and INTEGER values!Warningentity.inc167DrupalDefaultEntityController->load()
Trying to get property of non-objectNoticefile.test175FileFieldTestCase->assertFileEntryExists()
Undefined property: stdClass::$uriNoticefile.test175FileFieldTestCase->assertFileEntryExists()
Undefined property: stdClass::$statusNoticefile.test200FileFieldTestCase->assertFileIsPermanent()
File is permanent.Otherfile.test512FileFieldRevisionTestCase->testRevisions()
Found the Remove buttonOtherfile.test156FileFieldTestCase->replaceNodeFile()
Found the requested form fields at node//editOtherfile.test156FileFieldTestCase->replaceNodeFile()
Failed to set field files[rwgmilh8_und_0] to /var/lib/drupaltestbot/sites/default/files/checkout/sites/default/files/simpletest/887343/text-0.txtOtherfile.test157FileFieldTestCase->replaceNodeFile()
Failed to set field revision to 1Otherfile.test157FileFieldTestCase->replaceNodeFile()
Found the Save buttonOtherfile.test157FileFieldTestCase->replaceNodeFile()
Found the requested form fields at Otherfile.test157FileFieldTestCase->replaceNodeFile()
array_flip(): Can only flip STRING and INTEGER values!Warningentity.inc167DrupalDefaultEntityController->load()
Trying to get property of non-objectNoticefile.test517FileFieldRevisionTestCase->testRevisions()
Trying to get property of non-objectNoticefile.test518FileFieldRevisionTestCase->testRevisions()
Undefined property: stdClass::$uriNoticefile.test165FileFieldTestCase->assertFileExists()
Replacement file exists on disk after creating new revision.Otherfile.test519FileFieldRevisionTestCase->testRevisions()
Undefined property: stdClass::$fidNoticefile.test173FileFieldTestCase->assertFileEntryExists()
array_flip(): Can only flip STRING and INTEGER values!Warningentity.inc167DrupalDefaultEntityController->load()
Trying to get property of non-objectNoticefile.test175FileFieldTestCase->assertFileEntryExists()
Undefined property: stdClass::$uriNoticefile.test175FileFieldTestCase->assertFileEntryExists()
Undefined property: stdClass::$statusNoticefile.test200FileFieldTestCase->assertFileIsPermanent()
Replacement file is permanent.Otherfile.test521FileFieldRevisionTestCase->testRevisions()
array_flip(): Can only flip STRING and INTEGER values!Warningentity.inc167DrupalDefaultEntityController->load()
Trying to get property of non-objectNoticefile.test525FileFieldRevisionTestCase->testRevisions()
Undefined property: stdClass::$uriNoticefile.test165FileFieldTestCase->assertFileExists()
Original file still in place after replacing file in new revision.Otherfile.test526FileFieldRevisionTestCase->testRevisions()
Undefined property: stdClass::$fidNoticefile.test173FileFieldTestCase->assertFileEntryExists()
array_flip(): Can only flip STRING and INTEGER values!Warningentity.inc167DrupalDefaultEntityController->load()
Trying to get property of non-objectNoticefile.test175FileFieldTestCase->assertFileEntryExists()
Undefined property: stdClass::$uriNoticefile.test175FileFieldTestCase->assertFileEntryExists()
Undefined property: stdClass::$statusNoticefile.test200FileFieldTestCase->assertFileIsPermanent()
Original file is still permanent.Otherfile.test528FileFieldRevisionTestCase->testRevisions()
Failed to set field revision to 1Otherfile.test532FileFieldRevisionTestCase->testRevisions()
Found the Save buttonOtherfile.test532FileFieldRevisionTestCase->testRevisions()
Found the requested form fields at node//editOtherfile.test532FileFieldRevisionTestCase->testRevisions()
array_flip(): Can only flip STRING and INTEGER values!Warningentity.inc167DrupalDefaultEntityController->load()
Trying to get property of non-objectNoticefile.test534FileFieldRevisionTestCase->testRevisions()
Trying to get property of non-objectNoticefile.test535FileFieldRevisionTestCase->testRevisions()
Undefined property: stdClass::$statusNoticefile.test200FileFieldTestCase->assertFileIsPermanent()
New revision file is permanent.Otherfile.test537FileFieldRevisionTestCase->testRevisions()
Found the Revert buttonOtherfile.test540FileFieldRevisionTestCase->testRevisions()
Found the requested form fields at node//revisions//revertOtherfile.test540FileFieldRevisionTestCase->testRevisions()
array_flip(): Can only flip STRING and INTEGER values!Warningentity.inc167DrupalDefaultEntityController->load()
Trying to get property of non-objectNoticefile.test542FileFieldRevisionTestCase->testRevisions()
Trying to get property of non-objectNoticefile.test543FileFieldRevisionTestCase->testRevisions()
Undefined property: stdClass::$statusNoticefile.test200FileFieldTestCase->assertFileIsPermanent()
Original revision file still permanent after reverting to the original revision.Otherfile.test545FileFieldRevisionTestCase->testRevisions()
Found the Delete buttonOtherfile.test549FileFieldRevisionTestCase->testRevisions()
Found the requested form fields at node//revisions//deleteOtherfile.test549FileFieldRevisionTestCase->testRevisions()
Undefined property: stdClass::$uriNoticefile.test165FileFieldTestCase->assertFileExists()
Second file is still available after deleting second revision, since it is being used by the third revision.Otherfile.test550FileFieldRevisionTestCase->testRevisions()
Undefined property: stdClass::$fidNoticefile.test173FileFieldTestCase->assertFileEntryExists()
array_flip(): Can only flip STRING and INTEGER values!Warningentity.inc167DrupalDefaultEntityController->load()
Trying to get property of non-objectNoticefile.test175FileFieldTestCase->assertFileEntryExists()
Undefined property: stdClass::$uriNoticefile.test175FileFieldTestCase->assertFileEntryExists()
Undefined property: stdClass::$statusNoticefile.test200FileFieldTestCase->assertFileIsPermanent()
Second file entry is still permanent after deleting second revision, since it is being used by the third revision.Otherfile.test552FileFieldRevisionTestCase->testRevisions()
Undefined index: fidNoticefile.field.inc220file_field_presave()
array_flip(): Can only flip STRING and INTEGER values!Warningentity.inc167DrupalDefaultEntityController->load()
Trying to get property of non-objectNoticefile.field.inc221file_field_presave()
Undefined property: stdClass::$uriNoticefile.inc569file_save()
Undefined index: fidNoticefile.field.inc262file_field_update()
Undefined index: fidNoticefile.field.inc283file_field_update()
Undefined property: stdClass::$fidNoticefile.inc643file_usage_add()
PDOException: %message in file_usage_add() (line 650 of /var/lib/drupaltestbot/sites/default/files/checkout/includes/file.inc).Uncaught exceptiondatabase.inc1970PDOStatement->execute()
ExpandFile field validation tests (FileFieldValidateTestCase) [File]462956
MessageGroupFilenameLineFunctionStatus
Parsed page successfully.Browserfile.test664FileFieldValidateTestCase->testRequired()
Node save failed when required file field was empty.Otherfile.test665FileFieldValidateTestCase->testRequired()
Parsed page successfully.Browserfile.test125FileFieldTestCase->uploadNodeFile()
uploadNodeFile(public://text-0.txt, snidnqc5, article) succeededOtherfile.test669FileFieldValidateTestCase->testRequired()
array_flip(): Can only flip STRING and INTEGER values!Warningentity.inc167DrupalDefaultEntityController->load()
Trying to get property of non-objectNoticefile.test673FileFieldValidateTestCase->testRequired()
Undefined property: stdClass::$uriNoticefile.test165FileFieldTestCase->assertFileExists()
File exists after uploading to the required field.Otherfile.test674FileFieldValidateTestCase->testRequired()
Undefined property: stdClass::$fidNoticefile.test173FileFieldTestCase->assertFileEntryExists()
array_flip(): Can only flip STRING and INTEGER values!Warningentity.inc167DrupalDefaultEntityController->load()
Trying to get property of non-objectNoticefile.test175FileFieldTestCase->assertFileEntryExists()
Undefined property: stdClass::$uriNoticefile.test175FileFieldTestCase->assertFileEntryExists()
Parsed page successfully.Browserfile.test683FileFieldValidateTestCase->testRequired()
Node save failed when required multiple value file field was empty.Otherfile.test684FileFieldValidateTestCase->testRequired()
Parsed page successfully.Browserfile.test125FileFieldTestCase->uploadNodeFile()
array_flip(): Can only flip STRING and INTEGER values!Warningentity.inc167DrupalDefaultEntityController->load()
Trying to get property of non-objectNoticefile.test689FileFieldValidateTestCase->testRequired()
Undefined property: stdClass::$uriNoticefile.test165FileFieldTestCase->assertFileExists()
File exists after uploading to the required multiple value field.Otherfile.test690FileFieldValidateTestCase->testRequired()
Undefined property: stdClass::$fidNoticefile.test173FileFieldTestCase->assertFileEntryExists()
array_flip(): Can only flip STRING and INTEGER values!Warningentity.inc167DrupalDefaultEntityController->load()
Trying to get property of non-objectNoticefile.test175FileFieldTestCase->assertFileEntryExists()
Undefined property: stdClass::$uriNoticefile.test175FileFieldTestCase->assertFileEntryExists()
Parsed page successfully.Browserfile.test125FileFieldTestCase->uploadNodeFile()
array_flip(): Can only flip STRING and INTEGER values!Warningentity.inc167DrupalDefaultEntityController->load()
Trying to get property of non-objectNoticefile.test725FileFieldValidateTestCase->testFileMaxSize()
Undefined property: stdClass::$uriNoticefile.test165FileFieldTestCase->assertFileExists()
File exists after uploading a file (128 KB) under the max limit (1M).Otherfile.test726FileFieldValidateTestCase->testFileMaxSize()
Undefined property: stdClass::$fidNoticefile.test173FileFieldTestCase->assertFileEntryExists()
array_flip(): Can only flip STRING and INTEGER values!Warningentity.inc167DrupalDefaultEntityController->load()
Trying to get property of non-objectNoticefile.test175FileFieldTestCase->assertFileEntryExists()
Undefined property: stdClass::$uriNoticefile.test175FileFieldTestCase->assertFileEntryExists()
Parsed page successfully.Browserfile.test125FileFieldTestCase->uploadNodeFile()
Node save failed when file (1.25 MB) exceeded the max upload size (1M).Otherfile.test732FileFieldValidateTestCase->testFileMaxSize()
Parsed page successfully.Browserfile.test125FileFieldTestCase->uploadNodeFile()
array_flip(): Can only flip STRING and INTEGER values!Warningentity.inc167DrupalDefaultEntityController->load()
Trying to get property of non-objectNoticefile.test725FileFieldValidateTestCase->testFileMaxSize()
Undefined property: stdClass::$uriNoticefile.test165FileFieldTestCase->assertFileExists()
File exists after uploading a file (128 KB) under the max limit (1024K).Otherfile.test726FileFieldValidateTestCase->testFileMaxSize()
Undefined property: stdClass::$fidNoticefile.test173FileFieldTestCase->assertFileEntryExists()
array_flip(): Can only flip STRING and INTEGER values!Warningentity.inc167DrupalDefaultEntityController->load()
Trying to get property of non-objectNoticefile.test175FileFieldTestCase->assertFileEntryExists()
Undefined property: stdClass::$uriNoticefile.test175FileFieldTestCase->assertFileEntryExists()
Parsed page successfully.Browserfile.test125FileFieldTestCase->uploadNodeFile()
Node save failed when file (1.25 MB) exceeded the max upload size (1024K).Otherfile.test732FileFieldValidateTestCase->testFileMaxSize()
Parsed page successfully.Browserfile.test125FileFieldTestCase->uploadNodeFile()
array_flip(): Can only flip STRING and INTEGER values!Warningentity.inc167DrupalDefaultEntityController->load()
Trying to get property of non-objectNoticefile.test725FileFieldValidateTestCase->testFileMaxSize()
Undefined property: stdClass::$uriNoticefile.test165FileFieldTestCase->assertFileExists()
File exists after uploading a file (128 KB) under the max limit (1048576).Otherfile.test726FileFieldValidateTestCase->testFileMaxSize()
Undefined property: stdClass::$fidNoticefile.test173FileFieldTestCase->assertFileEntryExists()
array_flip(): Can only flip STRING and INTEGER values!Warningentity.inc167DrupalDefaultEntityController->load()
Trying to get property of non-objectNoticefile.test175FileFieldTestCase->assertFileEntryExists()
Undefined property: stdClass::$uriNoticefile.test175FileFieldTestCase->assertFileEntryExists()
Parsed page successfully.Browserfile.test125FileFieldTestCase->uploadNodeFile()
Node save failed when file (1.25 MB) exceeded the max upload size (1048576).Otherfile.test732FileFieldValidateTestCase->testFileMaxSize()
Parsed page successfully.Browserfile.test125FileFieldTestCase->uploadNodeFile()
array_flip(): Can only flip STRING and INTEGER values!Warningentity.inc167DrupalDefaultEntityController->load()
Trying to get property of non-objectNoticefile.test741FileFieldValidateTestCase->testFileMaxSize()
Undefined property: stdClass::$uriNoticefile.test165FileFieldTestCase->assertFileExists()
File exists after uploading a file (1.25 MB) with no max limit.Otherfile.test742FileFieldValidateTestCase->testFileMaxSize()
Undefined property: stdClass::$fidNoticefile.test173FileFieldTestCase->assertFileEntryExists()
array_flip(): Can only flip STRING and INTEGER values!Warningentity.inc167DrupalDefaultEntityController->load()
Trying to get property of non-objectNoticefile.test175FileFieldTestCase->assertFileEntryExists()
Undefined property: stdClass::$uriNoticefile.test175FileFieldTestCase->assertFileEntryExists()
Parsed page successfully.Browserfile.test125FileFieldTestCase->uploadNodeFile()
array_flip(): Can only flip STRING and INTEGER values!Warningentity.inc167DrupalDefaultEntityController->load()
Trying to get property of non-objectNoticefile.test768FileFieldValidateTestCase->testFileExtension()
Undefined property: stdClass::$uriNoticefile.test165FileFieldTestCase->assertFileExists()
File exists after uploading a file with no extension checking.Otherfile.test769FileFieldValidateTestCase->testFileExtension()
Undefined property: stdClass::$fidNoticefile.test173FileFieldTestCase->assertFileEntryExists()
array_flip(): Can only flip STRING and INTEGER values!Warningentity.inc167DrupalDefaultEntityController->load()
Trying to get property of non-objectNoticefile.test175FileFieldTestCase->assertFileEntryExists()
Undefined property: stdClass::$uriNoticefile.test175FileFieldTestCase->assertFileEntryExists()
Parsed page successfully.Browserfile.test125FileFieldTestCase->uploadNodeFile()
Node save failed when file uploaded with the wrong extension.Otherfile.test778FileFieldValidateTestCase->testFileExtension()
Parsed page successfully.Browserfile.test125FileFieldTestCase->uploadNodeFile()
array_flip(): Can only flip STRING and INTEGER values!Warningentity.inc167DrupalDefaultEntityController->load()
Trying to get property of non-objectNoticefile.test786FileFieldValidateTestCase->testFileExtension()
Undefined property: stdClass::$uriNoticefile.test165FileFieldTestCase->assertFileExists()
File exists after uploading a file with extension checking.Otherfile.test787FileFieldValidateTestCase->testFileExtension()
Undefined property: stdClass::$fidNoticefile.test173FileFieldTestCase->assertFileEntryExists()
array_flip(): Can only flip STRING and INTEGER values!Warningentity.inc167DrupalDefaultEntityController->load()
Trying to get property of non-objectNoticefile.test175FileFieldTestCase->assertFileEntryExists()
Undefined property: stdClass::$uriNoticefile.test175FileFieldTestCase->assertFileEntryExists()
ExpandFile field widget test (FileFieldWidgetTestCase) [File]18647
MessageGroupFilenameLineFunctionStatus
Parsed page successfully.Browserfile.test434FileFieldWidgetTestCase->testPrivateFileComment()
Parsed page successfully.Browserfile.test442FileFieldWidgetTestCase->testPrivateFileComment()
Undefined offset: 1Noticefile.test446FileFieldWidgetTestCase->testPrivateFileComment()
array_flip(): Can only flip STRING and INTEGER values!Warningentity.inc167DrupalDefaultEntityController->load()
Trying to get property of non-objectNoticefile.test452FileFieldWidgetTestCase->testPrivateFileComment()
Undefined property: stdClass::$uriNoticefile.test165FileFieldTestCase->assertFileExists()
New file saved to disk on node creation.Otherfile.test453FileFieldWidgetTestCase->testPrivateFileComment()
Undefined property: stdClass::$uriNoticefile.test455FileFieldWidgetTestCase->testPrivateFileComment()
Undefined property: stdClass::$uriNoticefile.test457FileFieldWidgetTestCase->testPrivateFileComment()
Undefined property: stdClass::$uriNoticefile.test462FileFieldWidgetTestCase->testPrivateFileComment()
Confirmed that access is denied for the file without the needed permission.Browserfile.test463FileFieldWidgetTestCase->testPrivateFileComment()
ExpandFile token replacement (FileTokenReplaceTestCase) [File]25853
MessageGroupFilenameLineFunctionStatus
Parsed page successfully.Browserfile.test125FileFieldTestCase->uploadNodeFile()
array_flip(): Can only flip STRING and INTEGER values!Warningentity.inc167DrupalDefaultEntityController->load()
Trying to get property of non-objectNoticefile.test909FileTokenReplaceTestCase->testFileTokenReplacement()
Undefined property: stdClass::$fidNoticefile.test914FileTokenReplaceTestCase->testFileTokenReplacement()
Undefined property: stdClass::$filenameNoticefile.test915FileTokenReplaceTestCase->testFileTokenReplacement()
Undefined property: stdClass::$uriNoticefile.test917FileTokenReplaceTestCase->testFileTokenReplacement()
Undefined property: stdClass::$filemimeNoticefile.test918FileTokenReplaceTestCase->testFileTokenReplacement()
Undefined property: stdClass::$filesizeNoticefile.test919FileTokenReplaceTestCase->testFileTokenReplacement()
Undefined property: stdClass::$uriNoticefile.test920FileTokenReplaceTestCase->testFileTokenReplacement()
Undefined property: stdClass::$timestampNoticefile.test921FileTokenReplaceTestCase->testFileTokenReplacement()
date_timezone_set() expects parameter 1 to be DateTime, boolean givenWarningcommon.inc1893format_date()
date_format() expects parameter 1 to be DateTime, boolean givenWarningcommon.inc1903format_date()
Undefined property: stdClass::$timestampNoticefile.test922FileTokenReplaceTestCase->testFileTokenReplacement()
date_timezone_set() expects parameter 1 to be DateTime, boolean givenWarningcommon.inc1893format_date()
date_format() expects parameter 1 to be DateTime, boolean givenWarningcommon.inc1903format_date()
Undefined property: stdClass::$uidNoticefile.test924FileTokenReplaceTestCase->testFileTokenReplacement()
No empty tokens generated.Otherfile.test927FileTokenReplaceTestCase->testFileTokenReplacement()
Undefined property: stdClass::$fidNoticesystem.tokens.inc224system_tokens()
Undefined property: stdClass::$filenameNoticesystem.tokens.inc229system_tokens()
Undefined property: stdClass::$uriNoticesystem.tokens.inc237system_tokens()
Undefined property: stdClass::$filemimeNoticesystem.tokens.inc241system_tokens()
Undefined property: stdClass::$filesizeNoticesystem.tokens.inc245system_tokens()
Undefined property: stdClass::$uriNoticesystem.tokens.inc249system_tokens()
Undefined property: stdClass::$timestampNoticesystem.tokens.inc254system_tokens()
date_timezone_set() expects parameter 1 to be DateTime, boolean givenWarningcommon.inc1893format_date()
date_format() expects parameter 1 to be DateTime, boolean givenWarningcommon.inc1903format_date()
Undefined property: stdClass::$timestampNoticesystem.tokens.inc265system_tokens()
Sanitized file token [file:timestamp:short] replaced.Otherfile.test931FileTokenReplaceTestCase->testFileTokenReplacement()
Undefined property: stdClass::$uidNoticesystem.tokens.inc258system_tokens()
array_flip(): Can only flip STRING and INTEGER values!Warningentity.inc167DrupalDefaultEntityController->load()
array_flip(): Can only flip STRING and INTEGER values!Warningentity.inc343DrupalDefaultEntityController->cacheGet()
Trying to get property of non-objectNoticesystem.tokens.inc259system_tokens()
Sanitized file token [file:owner] replaced.Otherfile.test931FileTokenReplaceTestCase->testFileTokenReplacement()
Undefined property: stdClass::$uidNoticesystem.tokens.inc268system_tokens()
array_flip(): Can only flip STRING and INTEGER values!Warningentity.inc167DrupalDefaultEntityController->load()
array_flip(): Can only flip STRING and INTEGER values!Warningentity.inc343DrupalDefaultEntityController->cacheGet()
Sanitized file token [file:owner:uid] replaced.Otherfile.test931FileTokenReplaceTestCase->testFileTokenReplacement()
Undefined property: stdClass::$filenameNoticefile.test935FileTokenReplaceTestCase->testFileTokenReplacement()
Undefined property: stdClass::$uriNoticefile.test937FileTokenReplaceTestCase->testFileTokenReplacement()
Undefined property: stdClass::$filemimeNoticefile.test938FileTokenReplaceTestCase->testFileTokenReplacement()
Undefined property: stdClass::$filesizeNoticefile.test939FileTokenReplaceTestCase->testFileTokenReplacement()
Undefined property: stdClass::$fidNoticesystem.tokens.inc224system_tokens()
Undefined property: stdClass::$filenameNoticesystem.tokens.inc229system_tokens()
Undefined property: stdClass::$uriNoticesystem.tokens.inc237system_tokens()
Undefined property: stdClass::$filemimeNoticesystem.tokens.inc241system_tokens()
Undefined property: stdClass::$filesizeNoticesystem.tokens.inc245system_tokens()
Undefined property: stdClass::$uriNoticesystem.tokens.inc249system_tokens()
Undefined property: stdClass::$timestampNoticesystem.tokens.inc254system_tokens()
date_timezone_set() expects parameter 1 to be DateTime, boolean givenWarningcommon.inc1893format_date()
date_format() expects parameter 1 to be DateTime, boolean givenWarningcommon.inc1903format_date()
Undefined property: stdClass::$timestampNoticesystem.tokens.inc265system_tokens()
Unsanitized file token [file:timestamp:short] replaced.Otherfile.test943FileTokenReplaceTestCase->testFileTokenReplacement()
Undefined property: stdClass::$uidNoticesystem.tokens.inc258system_tokens()
array_flip(): Can only flip STRING and INTEGER values!Warningentity.inc167DrupalDefaultEntityController->load()
array_flip(): Can only flip STRING and INTEGER values!Warningentity.inc343DrupalDefaultEntityController->cacheGet()
Trying to get property of non-objectNoticesystem.tokens.inc259system_tokens()
Unsanitized file token [file:owner] replaced.Otherfile.test943FileTokenReplaceTestCase->testFileTokenReplacement()
Undefined property: stdClass::$uidNoticesystem.tokens.inc268system_tokens()
array_flip(): Can only flip STRING and INTEGER values!Warningentity.inc167DrupalDefaultEntityController->load()
array_flip(): Can only flip STRING and INTEGER values!Warningentity.inc343DrupalDefaultEntityController->cacheGet()
Unsanitized file token [file:owner:uid] replaced.Otherfile.test943FileTokenReplaceTestCase->testFileTokenReplacement()
ExpandImage field display tests (ImageFieldDisplayTestCase) [Image]1562
MessageGroupFilenameLineFunctionStatus
The test did not complete due to a fatal error.Completion checkimage.test625ImageFieldDisplayTestCase->testImageFieldFormattersPublic()
Parsed page successfully.Browserimage.test98ImageFieldTestCase->uploadNodeImage()
array_flip(): Can only flip STRING and INTEGER values!Warningentity.inc167DrupalDefaultEntityController->load()
Trying to get property of non-objectNoticeimage.test650ImageFieldDisplayTestCase->_testImageFieldFormatters()
Default formatter displaying correctly on full node view.Otherimage.test655ImageFieldDisplayTestCase->_testImageFieldFormatters()
Image linked to file formatter displaying correctly on full node view.Otherimage.test664ImageFieldDisplayTestCase->_testImageFieldFormatters()
File was downloaded successfully.Otherimage.test666ImageFieldDisplayTestCase->_testImageFieldFormatters()
Image linked to content formatter displaying correctly on full node view.Otherimage.test688ImageFieldDisplayTestCase->_testImageFieldFormatters()
ExpandImage field validation tests (ImageFieldValidateTestCase) [Image]1040
MessageGroupFilenameLineFunctionStatus
Parsed page successfully.Browserimage.test98ImageFieldTestCase->uploadNodeImage()
Node save failed when minimum image resolution was not met.Otherimage.test863ImageFieldValidateTestCase->testResolution()
Parsed page successfully.Browserimage.test98ImageFieldTestCase->uploadNodeImage()
Image exceeding max resolution was properly resized.Otherimage.test865ImageFieldValidateTestCase->testResolution()
ExpandImage styles and effects UI configuration (ImageAdminStylesUnitTest) [Image]14722
MessageGroupFilenameLineFunctionStatus
The test did not complete due to a fatal error.Completion checkimage.test565ImageAdminStylesUnitTest->testStyleReplacement()
Parsed page successfully.Browserimage.test98ImageFieldTestCase->uploadNodeImage()
array_flip(): Can only flip STRING and INTEGER values!Warningentity.inc167DrupalDefaultEntityController->load()
Trying to get property of non-objectNoticeimage.test585ImageAdminStylesUnitTest->testStyleReplacement()
ExpandRDFa markup (RdfRdfaMarkupTestCase) [RDF]1630
MessageGroupFilenameLineFunctionStatus
Parsed page successfully.Browserrdf.test169RdfRdfaMarkupTestCase->testAttributesInMarkupFile()
Attribute 'rel' set on file field. Attribute 'resource' is also set.Otherrdf.test183RdfRdfaMarkupTestCase->testAttributesInMarkupFile()
Attribute 'rel' set on image field. Attribute 'resource' is also set.Otherrdf.test189RdfRdfaMarkupTestCase->testAttributesInMarkupFile()
ExpandTaxonomy term functions and forms. (TaxonomyTermTestCase) [Taxonomy]155175
MessageGroupFilenameLineFunctionStatus
Parsed page successfully.Browsertaxonomy.test481TaxonomyTermTestCase->testTaxonomyNode()
Trying to get property of non-objectNoticetaxonomy.test485TaxonomyTermTestCase->testTaxonomyNode()
Term is displayed when viewing the node.Othertaxonomy.test486TaxonomyTermTestCase->testTaxonomyNode()
Trying to get property of non-objectNoticetaxonomy.test490TaxonomyTermTestCase->testTaxonomyNode()
Failed to set field title to tOHkEhS2Othertaxonomy.test490TaxonomyTermTestCase->testTaxonomyNode()
Failed to set field body[und][0][value] to v209Q5B8Othertaxonomy.test490TaxonomyTermTestCase->testTaxonomyNode()
Failed to set field taxonomy_clf1yiw8[und][] to 2Othertaxonomy.test490TaxonomyTermTestCase->testTaxonomyNode()
Found the Save buttonOthertaxonomy.test490TaxonomyTermTestCase->testTaxonomyNode()
Found the requested form fields at node//editOthertaxonomy.test490TaxonomyTermTestCase->testTaxonomyNode()
Trying to get property of non-objectNoticetaxonomy.test492TaxonomyTermTestCase->testTaxonomyNode()
Term is displayed when viewing the node.Othertaxonomy.test493TaxonomyTermTestCase->testTaxonomyNode()
Trying to get property of non-objectNoticetaxonomy.test496TaxonomyTermTestCase->testTaxonomyNode()
Failed to set field title to tOHkEhS2Othertaxonomy.test496TaxonomyTermTestCase->testTaxonomyNode()
Failed to set field body[und][0][value] to v209Q5B8Othertaxonomy.test496TaxonomyTermTestCase->testTaxonomyNode()
Failed to set field taxonomy_clf1yiw8[und][] to 2Othertaxonomy.test496TaxonomyTermTestCase->testTaxonomyNode()
Found the Preview buttonOthertaxonomy.test496TaxonomyTermTestCase->testTaxonomyNode()
Found the requested form fields at node//editOthertaxonomy.test496TaxonomyTermTestCase->testTaxonomyNode()
Term is displayed when previewing the node.Othertaxonomy.test497TaxonomyTermTestCase->testTaxonomyNode()
Invalid argument supplied for foreach()Warningdrupal_web_test_case.php1785DrupalWebTestCase->drupalPost()
Found the Preview buttonOthertaxonomy.test498TaxonomyTermTestCase->testTaxonomyNode()
Found the requested form fields at Othertaxonomy.test498TaxonomyTermTestCase->testTaxonomyNode()
Term is displayed when previewing the node again.Othertaxonomy.test499TaxonomyTermTestCase->testTaxonomyNode()
ExpandTaxonomy token replacement (TaxonomyTokenReplaceTestCase) [Taxonomy]4650
MessageGroupFilenameLineFunctionStatus
Parsed page successfully.Browsertaxonomy.test1060TaxonomyTokenReplaceTestCase->testTaxonomyTokenReplacement()
Sanitized taxonomy term token [term:node-count] replaced.Othertaxonomy.test1094TaxonomyTokenReplaceTestCase->testTaxonomyTokenReplacement()
Unsanitized taxonomy term token [term:node-count] replaced.Othertaxonomy.test1105TaxonomyTokenReplaceTestCase->testTaxonomyTokenReplacement()
Sanitized taxonomy vocabulary token [vocabulary:node-count] replaced.Othertaxonomy.test1121TaxonomyTokenReplaceTestCase->testTaxonomyTokenReplacement()
Unsanitized taxonomy vocabulary token [vocabulary:node-count] replaced.Othertaxonomy.test1130TaxonomyTokenReplaceTestCase->testTaxonomyTokenReplacement()
ExpandText translation (TextTranslationTestCase) [Field types]82184
MessageGroupFilenameLineFunctionStatus
Parsed page successfully.Browsertext.test436TextTranslationTestCase->testTextField()
Trying to get property of non-objectNoticetext.test438TextTranslationTestCase->testTextField()
Undefined variable: url_targetNoticedrupal_web_test_case.php2324DrupalWebTestCase->clickLink()
Clicked link add translation () from http://pifr-mysql/checkout/?q=node//translateBrowsertext.test439TextTranslationTestCase->testTextField()
The textfield widget is populated.Othertext.test440TextTranslationTestCase->testTextField()
Parsed page successfully.Browsertext.test452TextTranslationTestCase->testTextFieldFormatted()
Body field cardinality set to multiple.Othertext.test452TextTranslationTestCase->testTextFieldFormatted()
Parsed page successfully.Browsertext.test466TextTranslationTestCase->testTextFieldFormatted()
Failed to set field body[en][0][value] to mz68PMsMOthertext.test476TextTranslationTestCase->testTextFieldFormatted()
Failed to set field body[en][0][format] to full_htmlOthertext.test476TextTranslationTestCase->testTextFieldFormatted()
Found the Save buttonOthertext.test476TextTranslationTestCase->testTextFieldFormatted()
Found the requested form fields at node/1/editOthertext.test476TextTranslationTestCase->testTextFieldFormatted()
The body field with delta 0 has been saved.Othertext.test477TextTranslationTestCase->testTextFieldFormatted()
Failed to set field body[en][1][value] to xdKM8UnCOthertext.test476TextTranslationTestCase->testTextFieldFormatted()
Failed to set field body[en][1][format] to filtered_htmlOthertext.test476TextTranslationTestCase->testTextFieldFormatted()
Found the Save buttonOthertext.test476TextTranslationTestCase->testTextFieldFormatted()
Found the requested form fields at node/1/editOthertext.test476TextTranslationTestCase->testTextFieldFormatted()
The body field with delta 1 has been saved.Othertext.test477TextTranslationTestCase->testTextFieldFormatted()
Trying to get property of non-objectNoticetext.test485TextTranslationTestCase->testTextFieldFormatted()
Undefined variable: url_targetNoticedrupal_web_test_case.php2324DrupalWebTestCase->clickLink()
Clicked link add translation () from http://pifr-mysql/checkout/?q=node//translateBrowsertext.test486TextTranslationTestCase->testTextFieldFormatted()
The body field with delta 1 is shown.Othertext.test488TextTranslationTestCase->testTextFieldFormatted()
ExpandUpdate feed item functionality (UpdateFeedItemTestCase) [Aggregator]4650
MessageGroupFilenameLineFunctionStatus
Parsed page successfully.Browseraggregator.test277AggregatorTestCase->createSampleNodes()
Parsed page successfully.Browseraggregator.test277AggregatorTestCase->createSampleNodes()
Parsed page successfully.Browseraggregator.test277AggregatorTestCase->createSampleNodes()
Parsed page successfully.Browseraggregator.test277AggregatorTestCase->createSampleNodes()
Parsed page successfully.Browseraggregator.test277AggregatorTestCase->createSampleNodes()
ExpandUpdate on cron functionality (AggregatorCronTestCase) [Aggregator]3580
MessageGroupFilenameLineFunctionStatus
Parsed page successfully.Browseraggregator.test277AggregatorTestCase->createSampleNodes()
Parsed page successfully.Browseraggregator.test277AggregatorTestCase->createSampleNodes()
Parsed page successfully.Browseraggregator.test277AggregatorTestCase->createSampleNodes()
Parsed page successfully.Browseraggregator.test277AggregatorTestCase->createSampleNodes()
Parsed page successfully.Browseraggregator.test277AggregatorTestCase->createSampleNodes()
Expected number of items in database.Otheraggregator.test725AggregatorCronTestCase->testCron()
Expected number of items in database.Otheraggregator.test729AggregatorCronTestCase->testCron()
Expected number of items in database.Otheraggregator.test748AggregatorCronTestCase->testCron()

All

Test namePassFailException
Leaf403 functionality (AccessDeniedTestCase) [System]7500
Leaf404 functionality (PageNotFoundTestCase) [System]1800
LeafActions configuration (ActionsConfigurationTestCase) [Actions]3800
LeafActions executing in a potentially infinite loop (ActionLoopTestCase) [Actions]2200
LeafAdd feed functionality (AddFeedTestCase) [Aggregator]2800
LeafAdmin theme block admin accessibility (BlockAdminThemeTestCase) [Block]1800
LeafAdministrative pages (SystemAdminTestCase) [System]19100
LeafAdvanced search form (SearchAdvancedSearchForm) [Search]3100
LeafAJAX command form values (AJAXFormValuesTestCase) [AJAX]2800
LeafAJAX commands (AJAXCommandsTestCase) [AJAX]6400
LeafAJAX framework (AJAXFrameworkTestCase) [AJAX]1000
LeafAJAX multi form (AJAXMultiFormTestCase) [AJAX]3500
LeafAnonymous comments (CommentAnonymous) [Comment]15600
LeafAutocompletion (ProfileTestAutocomplete) [Profile]5400
LeafBasic SQL syntax tests (DatabaseBasicSyntaxTestCase) [Database]2600
LeafBasic upgrade path (BasicUpgradePath) [Upgrade path]7200
LeafBatch percentages (BatchPercentagesUnitTestCase) [Batch API]1300
LeafBatch processing (BatchProcessingTestCase) [Batch API]15400
LeafBatch progress page (BatchPageTestCase) [Batch API]700
LeafBlock availability (NodeBlockTestCase) [Node]1800
LeafBlock availability (PollBlockTestCase) [Poll]10000
LeafBlock availability (ProfileBlockTestCase) [Profile]9000
LeafBlock availability (SearchBlockTestCase) [Search]5100
LeafBlock caching (BlockCacheTestCase) [Block]22800
LeafBlock functionality (BlockTestCase) [Block]26800
LeafBlock functionality (SystemBlockTestCase) [System]3400
LeafBlock HTML id (BlockHTMLIdTestCase) [Block]1500
LeafBlog functionality (BlogTestCase) [Blog]24100
LeafBook functionality (BookTestCase) [Book]34600
LeafBoot and exit hook invocation (HookBootExitTestCase) [Bootstrap]1800
ExpandBreadcrumbs (MenuBreadcrumbTestCase) [Menu]3752917
MessageGroupFilenameLineFunctionStatus
Parsed page successfully.Browsermenu.test1131MenuBreadcrumbTestCase->getParts()
Breadcrumb Home » Parent j6Kz1htV found on http://pifr-mysql/checkout/?q=node/2/edit.Othermenu.test753MenuBreadcrumbTestCase->testBreadCrumbs()
Parsed page successfully.Browsermenu.test1131MenuBreadcrumbTestCase->getParts()
Breadcrumb Home » Parent j6Kz1htV » Child wgdnQT73 found on http://pifr-mysql/checkout/?q=node/3/edit.Othermenu.test780MenuBreadcrumbTestCase->testBreadCrumbs()
Parsed page successfully.Browsermenu.test1131MenuBreadcrumbTestCase->getParts()
Breadcrumb Home » Parent jZcVBLP0 found on http://pifr-mysql/checkout/?q=node/4/edit.Othermenu.test753MenuBreadcrumbTestCase->testBreadCrumbs()
Parsed page successfully.Browsermenu.test1131MenuBreadcrumbTestCase->getParts()
Breadcrumb Home » Parent jZcVBLP0 » Child iOMaTPya found on http://pifr-mysql/checkout/?q=node/5/edit.Othermenu.test780MenuBreadcrumbTestCase->testBreadCrumbs()
Parsed page successfully.Browsermenu.test805MenuBreadcrumbTestCase->testBreadCrumbs()
Parsed page successfully.Browsermenu.test1131MenuBreadcrumbTestCase->getParts()
Breadcrumb Home » Root found on http://pifr-mysql/checkout/?q=node/4/edit.Othermenu.test813MenuBreadcrumbTestCase->testBreadCrumbs()
Parsed page successfully.Browsermenu.test813MenuBreadcrumbTestCase->testBreadCrumbs()
current() expects parameter 1 to be array, boolean givenWarningdrupal_web_test_case.php2773DrupalWebTestCase->assertTitle()
Page title '' is equal to 'jZcVBLP0 | Drupal'.Othermenu.test813MenuBreadcrumbTestCase->testBreadCrumbs()
Parsed page successfully.Browsermenu.test813MenuBreadcrumbTestCase->testBreadCrumbs()
Active trail to current page was found in menu tree.Othermenu.test813MenuBreadcrumbTestCase->testBreadCrumbs()
Parsed page successfully.Browsermenu.test813MenuBreadcrumbTestCase->testBreadCrumbs()
Active link Parent jZcVBLP0 was found in menu tree, including active trail links Root.Othermenu.test813MenuBreadcrumbTestCase->testBreadCrumbs()
Breadcrumb Home » Root » Parent jZcVBLP0 found on http://pifr-mysql/checkout/?q=node/5.Othermenu.test820MenuBreadcrumbTestCase->testBreadCrumbs()
Active trail to current page was found in menu tree.Othermenu.test820MenuBreadcrumbTestCase->testBreadCrumbs()
Active link Child iOMaTPya was found in menu tree, including active trail links Root » Parent jZcVBLP0.Othermenu.test820MenuBreadcrumbTestCase->testBreadCrumbs()
Parsed page successfully.Browsermenu.test831MenuBreadcrumbTestCase->testBreadCrumbs()
Trying to get property of non-objectNoticemenu.test847MenuBreadcrumbTestCase->testBreadCrumbs()
Trying to get property of non-objectNoticemenu.test847MenuBreadcrumbTestCase->testBreadCrumbs()
Trying to get property of non-objectNoticemenu.test854MenuBreadcrumbTestCase->testBreadCrumbs()
Undefined index: mlidNoticemenu.test863MenuBreadcrumbTestCase->testBreadCrumbs()
Trying to get property of non-objectNoticemenu.test854MenuBreadcrumbTestCase->testBreadCrumbs()
Failed to set field parent to navigation:Othermenu.test857MenuBreadcrumbTestCase->testBreadCrumbs()
Found the requested form fields at admin/structure/menu/manage/navigation/addOthermenu.test857MenuBreadcrumbTestCase->testBreadCrumbs()
Undefined index: mlidNoticemenu.test863MenuBreadcrumbTestCase->testBreadCrumbs()
Undefined index: link_titleNoticemenu.test874MenuBreadcrumbTestCase->testBreadCrumbs()
Undefined index: link_titleNoticemenu.test877MenuBreadcrumbTestCase->testBreadCrumbs()
Breadcrumb Home found on http://pifr-mysql/checkout/?q=taxonomy/term/.Othermenu.test877MenuBreadcrumbTestCase->testBreadCrumbs()
SimpleXMLElement::xpath(): Invalid expressionWarningdrupal_web_test_case.php2189DrupalWebTestCase->xpath()
SimpleXMLElement::xpath(): xmlXPathEval: evaluation failedWarningdrupal_web_test_case.php2189DrupalWebTestCase->xpath()
Active link was found in menu tree, including active trail links .Othermenu.test877MenuBreadcrumbTestCase->testBreadCrumbs()
Tagged node found.Othermenu.test878MenuBreadcrumbTestCase->testBreadCrumbs()
Trying to get property of non-objectNoticemenu.test893MenuBreadcrumbTestCase->testBreadCrumbs()
Undefined index: link_titleNoticemenu.test874MenuBreadcrumbTestCase->testBreadCrumbs()
Undefined index: link_titleNoticemenu.test877MenuBreadcrumbTestCase->testBreadCrumbs()
Breadcrumb Home » found on http://pifr-mysql/checkout/?q=taxonomy/term/.Othermenu.test877MenuBreadcrumbTestCase->testBreadCrumbs()
SimpleXMLElement::xpath(): Invalid expressionWarningdrupal_web_test_case.php2189DrupalWebTestCase->xpath()
SimpleXMLElement::xpath(): xmlXPathEval: evaluation failedWarningdrupal_web_test_case.php2189DrupalWebTestCase->xpath()
Active link was found in menu tree, including active trail links .Othermenu.test877MenuBreadcrumbTestCase->testBreadCrumbs()
Tagged node found.Othermenu.test878MenuBreadcrumbTestCase->testBreadCrumbs()
Trying to get property of non-objectNoticemenu.test893MenuBreadcrumbTestCase->testBreadCrumbs()
LeafCache clear test (CacheClearCase) [Cache]1300
LeafCache emptiness test (CacheIsEmptyCase) [Cache]500
LeafCache saving test (CacheSavingCase) [Cache]500
LeafCancel account (UserCancelTestCase) [User]23700
LeafCascading stylesheets (CascadingStylesheetsTestCase) [System]2800
LeafCategorize feed functionality (CategorizeFeedTestCase) [Aggregator]1900
ExpandCategorize feed item functionality (CategorizeFeedItemTestCase) [Aggregator]3750
MessageGroupFilenameLineFunctionStatus
Parsed page successfully.Browseraggregator.test277AggregatorTestCase->createSampleNodes()
Parsed page successfully.Browseraggregator.test277AggregatorTestCase->createSampleNodes()
Parsed page successfully.Browseraggregator.test277AggregatorTestCase->createSampleNodes()
Parsed page successfully.Browseraggregator.test277AggregatorTestCase->createSampleNodes()
Parsed page successfully.Browseraggregator.test277AggregatorTestCase->createSampleNodes()
ExpandChecks display of aggregator items (AggregatorRenderingTestCase) [Aggregator]5170
MessageGroupFilenameLineFunctionStatus
Parsed page successfully.Browseraggregator.test277AggregatorTestCase->createSampleNodes()
Parsed page successfully.Browseraggregator.test277AggregatorTestCase->createSampleNodes()
Parsed page successfully.Browseraggregator.test277AggregatorTestCase->createSampleNodes()
Parsed page successfully.Browseraggregator.test277AggregatorTestCase->createSampleNodes()
Parsed page successfully.Browseraggregator.test277AggregatorTestCase->createSampleNodes()
Feed block is displayed on the page.Otheraggregator.test799AggregatorRenderingTestCase->testBlockLinks()
Link to href aggregator/sources/1 found.Otheraggregator.test804AggregatorRenderingTestCase->testBlockLinks()
LeafCJK tokenizer (SearchTokenizerTestCase) [Search]200
LeafColor functionality (ColorTestCase) [Color]6100
LeafComment approval (CommentApprovalTest) [Comment]15400
LeafComment blocks (CommentBlockFunctionalTest) [Comment]11500
LeafComment count toggle (SearchCommentCountToggleTestCase) [Search]3000
LeafComment interface (CommentInterfaceTest) [Comment]22300
ExpandComment language (LocaleCommentLanguageFunctionalTest) [Locale]341816
MessageGroupFilenameLineFunctionStatus
Parsed page successfully.Browserlocale.test2001LocaleCommentLanguageFunctionalTest->testCommentLanguage()
Trying to get property of non-objectNoticelocale.test2008LocaleCommentLanguageFunctionalTest->testCommentLanguage()
Failed to set field comment_body[und][0][value] to qHno4u1AOtherlocale.test2008LocaleCommentLanguageFunctionalTest->testCommentLanguage()
Found the Save buttonOtherlocale.test2008LocaleCommentLanguageFunctionalTest->testCommentLanguage()
Found the requested form fields at node/Otherlocale.test2008LocaleCommentLanguageFunctionalTest->testCommentLanguage()
Trying to get property of non-objectNoticelocale.test2013LocaleCommentLanguageFunctionalTest->testCommentLanguage()
Trying to get property of non-objectNoticelocale.test2017LocaleCommentLanguageFunctionalTest->testCommentLanguage()
Trying to get property of non-objectNoticelocale.test2018LocaleCommentLanguageFunctionalTest->testCommentLanguage()
The comment posted with content language en and belonging to the node with language en has language Otherlocale.test2018LocaleCommentLanguageFunctionalTest->testCommentLanguage()
Trying to get property of non-objectNoticelocale.test2008LocaleCommentLanguageFunctionalTest->testCommentLanguage()
Failed to set field comment_body[und][0][value] to p70VfU08Otherlocale.test2008LocaleCommentLanguageFunctionalTest->testCommentLanguage()
Found the Save buttonOtherlocale.test2008LocaleCommentLanguageFunctionalTest->testCommentLanguage()
Found the requested form fields at fr/node/Otherlocale.test2008LocaleCommentLanguageFunctionalTest->testCommentLanguage()
Trying to get property of non-objectNoticelocale.test2013LocaleCommentLanguageFunctionalTest->testCommentLanguage()
Trying to get property of non-objectNoticelocale.test2017LocaleCommentLanguageFunctionalTest->testCommentLanguage()
Trying to get property of non-objectNoticelocale.test2018LocaleCommentLanguageFunctionalTest->testCommentLanguage()
The comment posted with content language fr and belonging to the node with language en has language Otherlocale.test2018LocaleCommentLanguageFunctionalTest->testCommentLanguage()
Parsed page successfully.Browserlocale.test2001LocaleCommentLanguageFunctionalTest->testCommentLanguage()
Trying to get property of non-objectNoticelocale.test2008LocaleCommentLanguageFunctionalTest->testCommentLanguage()
Failed to set field comment_body[und][0][value] to xEp8eGIGOtherlocale.test2008LocaleCommentLanguageFunctionalTest->testCommentLanguage()
Found the Save buttonOtherlocale.test2008LocaleCommentLanguageFunctionalTest->testCommentLanguage()
Found the requested form fields at node/Otherlocale.test2008LocaleCommentLanguageFunctionalTest->testCommentLanguage()
Trying to get property of non-objectNoticelocale.test2013LocaleCommentLanguageFunctionalTest->testCommentLanguage()
Trying to get property of non-objectNoticelocale.test2017LocaleCommentLanguageFunctionalTest->testCommentLanguage()
Trying to get property of non-objectNoticelocale.test2018LocaleCommentLanguageFunctionalTest->testCommentLanguage()
The comment posted with content language en and belonging to the node with language fr has language Otherlocale.test2018LocaleCommentLanguageFunctionalTest->testCommentLanguage()
Trying to get property of non-objectNoticelocale.test2008LocaleCommentLanguageFunctionalTest->testCommentLanguage()
Failed to set field comment_body[und][0][value] to i1gBep7nOtherlocale.test2008LocaleCommentLanguageFunctionalTest->testCommentLanguage()
Found the Save buttonOtherlocale.test2008LocaleCommentLanguageFunctionalTest->testCommentLanguage()
Found the requested form fields at fr/node/Otherlocale.test2008LocaleCommentLanguageFunctionalTest->testCommentLanguage()
Trying to get property of non-objectNoticelocale.test2013LocaleCommentLanguageFunctionalTest->testCommentLanguage()
Trying to get property of non-objectNoticelocale.test2017LocaleCommentLanguageFunctionalTest->testCommentLanguage()
Trying to get property of non-objectNoticelocale.test2018LocaleCommentLanguageFunctionalTest->testCommentLanguage()
The comment posted with content language fr and belonging to the node with language fr has language Otherlocale.test2018LocaleCommentLanguageFunctionalTest->testCommentLanguage()
LeafComment paging settings (CommentPagerTest) [Comment]20800
LeafComment preview (CommentPreviewTest) [Comment]7200
LeafComment Rebuild (CommentContentRebuild) [Comment]3200
LeafComment RSS (CommentRSSUnitTest) [Comment]2400
LeafComment Search tests (SearchCommentTestCase) [Search]13900
LeafComment token replacement (CommentTokenReplaceTestCase) [Comment]6400
LeafComment upgrade path (CommentUpgradePathTestCase) [Upgrade path]2600
LeafConfig settings form (SearchConfigSettingsForm) [Search]11600
LeafConnection tests (DatabaseConnectionTestCase) [Database]3400
ExpandContent language settings (LocaleContentFunctionalTest) [Locale]6310
MessageGroupFilenameLineFunctionStatus
Parsed page successfully.Browserlocale.test1584LocaleContentFunctionalTest->testContentTypeLanguageConfiguration()
LeafCron run (CronRunTestCase) [System]5400
LeafCSS Unit Tests (CascadingStylesheetsUnitTest) [System]600
LeafCustom query syntax tests (DatabaseQueryTestCase) [Database]600
LeafDashboard blocks (DashboardBlocksTestCase) [Dashboard]5000
LeafData API functions (DrupalDataApiTest) [System]4200
LeafDate and time (DateTimeFunctionalTest) [System]14000
ExpandDBLog functionality (DBLogTestCase) [DBLog]425144
MessageGroupFilenameLineFunctionStatus
Parsed page successfully.Browserdblog.test274DBLogTestCase->doNode()
HTTP response expected 200, actual 500Browserdblog.test275DBLogTestCase->doNode()
Node qcPidArb was loadedOtherdblog.test278DBLogTestCase->doNode()
Trying to get property of non-objectNoticedblog.test281DBLogTestCase->doNode()
Failed to set field body[und][0][value] to xAKeiNQU98Uw105VUMTaBxuJnERUYkPkOtherdblog.test281DBLogTestCase->doNode()
Found the Save buttonOtherdblog.test281DBLogTestCase->doNode()
Found the requested form fields at node//editOtherdblog.test281DBLogTestCase->doNode()
HTTP response expected 200, actual 404Browserdblog.test282DBLogTestCase->doNode()
Trying to get property of non-objectNoticedblog.test284DBLogTestCase->doNode()
Found the Delete buttonOtherdblog.test284DBLogTestCase->doNode()
Found the requested form fields at node//deleteOtherdblog.test284DBLogTestCase->doNode()
HTTP response expected 200, actual 404Browserdblog.test285DBLogTestCase->doNode()
Trying to get property of non-objectNoticedblog.test287DBLogTestCase->doNode()
HTTP response expected 404, actual 200Browserdblog.test288DBLogTestCase->doNode()
DBLog event was recorded: [content added]Otherdblog.test301DBLogTestCase->doNode()
DBLog event was recorded: [content updated]Otherdblog.test303DBLogTestCase->doNode()
DBLog event was recorded: [content deleted]Otherdblog.test305DBLogTestCase->doNode()
Trying to get property of non-objectNoticedblog.test317DBLogTestCase->doNode()
LeafDefault text format functionality (FilterDefaultFormatTestCase) [Filter]3300
LeafDelete/Truncate tests (DatabaseDeleteTruncateTestCase) [Database]2000
LeafDrupal error handlers (DrupalErrorHandlerUnitTest) [System]5600
LeafDrupal goto (DrupalGotoTest) [System]3200
LeafDrupal HTTP request (DrupalHTTPRequestTestCase) [System]4200
LeafDrupal match path (DrupalMatchPathTestCase) [Path API]4100
LeafDrupal set/get regions (DrupalSetContentTestCase) [System]7600
LeafDrupal tags handling (DrupalTagsHandlingTestCase) [System]1600
Leafdrupal_alter() tests (DrupalAlterTestCase) [System]500
Leafdrupal_render() (DrupalRenderTestCase) [System]4000
LeafEmbedded forms (SearchEmbedForm) [Search]2900
LeafEmpty statement (DatabaseEmptyStatementTestCase) [Database]400
LeafEnable/disable modules (EnableDisableTestCase) [Module]5600
LeafEntity CRUD hooks (EntityCrudHookTestCase) [Entity API]4800
LeafEntity properties (EntityPropertiesTestCase) [Entity API]300
LeafEntity query (EntityFieldQueryTestCase) [Entity API]8500
LeafFeed parser functionality (FeedParserTestCase) [Aggregator]4000
LeafFetch tests (DatabaseFetchTestCase) [Database]3300
LeafFetch tests, part 2 (DatabaseFetch2TestCase) [Database]2600
LeafFetching multiple cache items (CacheGetMultipleUnitTest) [Cache]700
LeafField attach tests (other) (FieldAttachOtherTestCase) [Field API]4400
LeafField attach tests (storage-related) (FieldAttachStorageTestCase) [Field API]8300
LeafField bulk delete tests (FieldBulkDeleteTestCase) [Field API]4000
LeafField CRUD tests (FieldCrudTestCase) [Field API]5900
LeafField Display API tests (FieldDisplayAPITestCase) [Field API]4200
LeafField form tests (FieldFormTestCase) [Field API]16600
LeafField info tests (FieldInfoTestCase) [Field API]7900
LeafField instance CRUD tests (FieldInstanceCrudTestCase) [Field API]3200
LeafField SQL storage tests (FieldSqlStorageTestCase) [Field API]8800
LeafField translations tests (FieldTranslationsTestCase) [Field API]5000
LeafFile copying (FileCopyTest) [File API]10600
LeafFile delete (FileDeleteTest) [File API]1800
LeafFile download (FileDownloadTest) [File API]3500
ExpandFile field display tests (FileFieldDisplayTestCase) [File]14513
MessageGroupFilenameLineFunctionStatus
Parsed page successfully.Browserfile.test125FileFieldTestCase->uploadNodeFile()
array_flip(): Can only flip STRING and INTEGER values!Warningentity.inc167DrupalDefaultEntityController->load()
Trying to get property of non-objectNoticefile.test621FileFieldDisplayTestCase->testNodeDisplay()
Undefined property: stdClass::$uriNoticefile.module696theme_file_link()
Undefined property: stdClass::$filemimeNoticefile.module734theme_file_icon()
Undefined property: stdClass::$filemimeNoticefile.module776file_icon_path()
Undefined property: stdClass::$filemimeNoticefile.module818file_icon_map()
Undefined property: stdClass::$filemimeNoticefile.module791file_icon_path()
Undefined property: stdClass::$filemimeNoticefile.module791file_icon_path()
Undefined property: stdClass::$filemimeNoticefile.module791file_icon_path()
Undefined property: stdClass::$filemimeNoticefile.module791file_icon_path()
Undefined property: stdClass::$filemimeNoticefile.module703theme_file_link()
Undefined property: stdClass::$filesizeNoticefile.module703theme_file_link()
Undefined property: stdClass::$filenameNoticefile.module709theme_file_link()
Default formatter displaying correctly on full node view.Otherfile.test623FileFieldDisplayTestCase->testNodeDisplay()
Failed to set field kss3umho[und][0][display] to Otherfile.test627FileFieldDisplayTestCase->testNodeDisplay()
Found the Save buttonOtherfile.test627FileFieldDisplayTestCase->testNodeDisplay()
Found the requested form fields at node//editOtherfile.test627FileFieldDisplayTestCase->testNodeDisplay()
ExpandFile field file path tests (FileFieldPathTestCase) [File]11612
MessageGroupFilenameLineFunctionStatus
Parsed page successfully.Browserfile.test125FileFieldTestCase->uploadNodeFile()
array_flip(): Can only flip STRING and INTEGER values!Warningentity.inc167DrupalDefaultEntityController->load()
Trying to get property of non-objectNoticefile.test821FileFieldPathTestCase->testUploadPath()
Undefined property: stdClass::$uriNoticefile.test822FileFieldPathTestCase->testUploadPath()
Undefined property: stdClass::$uriNoticefile.test822FileFieldPathTestCase->testUploadPath()
The file was uploaded to the correct path.Otherfile.test822FileFieldPathTestCase->testUploadPath()
Parsed page successfully.Browserfile.test125FileFieldTestCase->uploadNodeFile()
array_flip(): Can only flip STRING and INTEGER values!Warningentity.inc167DrupalDefaultEntityController->load()
Trying to get property of non-objectNoticefile.test832FileFieldPathTestCase->testUploadPath()
Undefined property: stdClass::$uriNoticefile.test833FileFieldPathTestCase->testUploadPath()
Undefined property: stdClass::$uriNoticefile.test833FileFieldPathTestCase->testUploadPath()
The file was uploaded to the correct path.Otherfile.test833FileFieldPathTestCase->testUploadPath()
Parsed page successfully.Browserfile.test125FileFieldTestCase->uploadNodeFile()
array_flip(): Can only flip STRING and INTEGER values!Warningentity.inc167DrupalDefaultEntityController->load()
Trying to get property of non-objectNoticefile.test844FileFieldPathTestCase->testUploadPath()
Undefined property: stdClass::$uriNoticefile.test847FileFieldPathTestCase->testUploadPath()
Undefined property: stdClass::$uriNoticefile.test847FileFieldPathTestCase->testUploadPath()
The file was uploaded to the correct path with token replacements.Otherfile.test847FileFieldPathTestCase->testUploadPath()
ExpandFile field revision test (FileFieldRevisionTestCase) [File]272448
MessageGroupFilenameLineFunctionStatus
Parsed page successfully.Browserfile.test125FileFieldTestCase->uploadNodeFile()
array_flip(): Can only flip STRING and INTEGER values!Warningentity.inc167DrupalDefaultEntityController->load()
Trying to get property of non-objectNoticefile.test508FileFieldRevisionTestCase->testRevisions()
Trying to get property of non-objectNoticefile.test509FileFieldRevisionTestCase->testRevisions()
Undefined property: stdClass::$uriNoticefile.test165FileFieldTestCase->assertFileExists()
New file saved to disk on node creation.Otherfile.test510FileFieldRevisionTestCase->testRevisions()
Undefined property: stdClass::$fidNoticefile.test173FileFieldTestCase->assertFileEntryExists()
array_flip(): Can only flip STRING and INTEGER values!Warningentity.inc167DrupalDefaultEntityController->load()
Trying to get property of non-objectNoticefile.test175FileFieldTestCase->assertFileEntryExists()
Undefined property: stdClass::$uriNoticefile.test175FileFieldTestCase->assertFileEntryExists()
Undefined property: stdClass::$statusNoticefile.test200FileFieldTestCase->assertFileIsPermanent()
File is permanent.Otherfile.test512FileFieldRevisionTestCase->testRevisions()
Found the Remove buttonOtherfile.test156FileFieldTestCase->replaceNodeFile()
Found the requested form fields at node//editOtherfile.test156FileFieldTestCase->replaceNodeFile()
Failed to set field files[rwgmilh8_und_0] to /var/lib/drupaltestbot/sites/default/files/checkout/sites/default/files/simpletest/887343/text-0.txtOtherfile.test157FileFieldTestCase->replaceNodeFile()
Failed to set field revision to 1Otherfile.test157FileFieldTestCase->replaceNodeFile()
Found the Save buttonOtherfile.test157FileFieldTestCase->replaceNodeFile()
Found the requested form fields at Otherfile.test157FileFieldTestCase->replaceNodeFile()
array_flip(): Can only flip STRING and INTEGER values!Warningentity.inc167DrupalDefaultEntityController->load()
Trying to get property of non-objectNoticefile.test517FileFieldRevisionTestCase->testRevisions()
Trying to get property of non-objectNoticefile.test518FileFieldRevisionTestCase->testRevisions()
Undefined property: stdClass::$uriNoticefile.test165FileFieldTestCase->assertFileExists()
Replacement file exists on disk after creating new revision.Otherfile.test519FileFieldRevisionTestCase->testRevisions()
Undefined property: stdClass::$fidNoticefile.test173FileFieldTestCase->assertFileEntryExists()
array_flip(): Can only flip STRING and INTEGER values!Warningentity.inc167DrupalDefaultEntityController->load()
Trying to get property of non-objectNoticefile.test175FileFieldTestCase->assertFileEntryExists()
Undefined property: stdClass::$uriNoticefile.test175FileFieldTestCase->assertFileEntryExists()
Undefined property: stdClass::$statusNoticefile.test200FileFieldTestCase->assertFileIsPermanent()
Replacement file is permanent.Otherfile.test521FileFieldRevisionTestCase->testRevisions()
array_flip(): Can only flip STRING and INTEGER values!Warningentity.inc167DrupalDefaultEntityController->load()
Trying to get property of non-objectNoticefile.test525FileFieldRevisionTestCase->testRevisions()
Undefined property: stdClass::$uriNoticefile.test165FileFieldTestCase->assertFileExists()
Original file still in place after replacing file in new revision.Otherfile.test526FileFieldRevisionTestCase->testRevisions()
Undefined property: stdClass::$fidNoticefile.test173FileFieldTestCase->assertFileEntryExists()
array_flip(): Can only flip STRING and INTEGER values!Warningentity.inc167DrupalDefaultEntityController->load()
Trying to get property of non-objectNoticefile.test175FileFieldTestCase->assertFileEntryExists()
Undefined property: stdClass::$uriNoticefile.test175FileFieldTestCase->assertFileEntryExists()
Undefined property: stdClass::$statusNoticefile.test200FileFieldTestCase->assertFileIsPermanent()
Original file is still permanent.Otherfile.test528FileFieldRevisionTestCase->testRevisions()
Failed to set field revision to 1Otherfile.test532FileFieldRevisionTestCase->testRevisions()
Found the Save buttonOtherfile.test532FileFieldRevisionTestCase->testRevisions()
Found the requested form fields at node//editOtherfile.test532FileFieldRevisionTestCase->testRevisions()
array_flip(): Can only flip STRING and INTEGER values!Warningentity.inc167DrupalDefaultEntityController->load()
Trying to get property of non-objectNoticefile.test534FileFieldRevisionTestCase->testRevisions()
Trying to get property of non-objectNoticefile.test535FileFieldRevisionTestCase->testRevisions()
Undefined property: stdClass::$statusNoticefile.test200FileFieldTestCase->assertFileIsPermanent()
New revision file is permanent.Otherfile.test537FileFieldRevisionTestCase->testRevisions()
Found the Revert buttonOtherfile.test540FileFieldRevisionTestCase->testRevisions()
Found the requested form fields at node//revisions//revertOtherfile.test540FileFieldRevisionTestCase->testRevisions()
array_flip(): Can only flip STRING and INTEGER values!Warningentity.inc167DrupalDefaultEntityController->load()
Trying to get property of non-objectNoticefile.test542FileFieldRevisionTestCase->testRevisions()
Trying to get property of non-objectNoticefile.test543FileFieldRevisionTestCase->testRevisions()
Undefined property: stdClass::$statusNoticefile.test200FileFieldTestCase->assertFileIsPermanent()
Original revision file still permanent after reverting to the original revision.Otherfile.test545FileFieldRevisionTestCase->testRevisions()
Found the Delete buttonOtherfile.test549FileFieldRevisionTestCase->testRevisions()
Found the requested form fields at node//revisions//deleteOtherfile.test549FileFieldRevisionTestCase->testRevisions()
Undefined property: stdClass::$uriNoticefile.test165FileFieldTestCase->assertFileExists()
Second file is still available after deleting second revision, since it is being used by the third revision.Otherfile.test550FileFieldRevisionTestCase->testRevisions()
Undefined property: stdClass::$fidNoticefile.test173FileFieldTestCase->assertFileEntryExists()
array_flip(): Can only flip STRING and INTEGER values!Warningentity.inc167DrupalDefaultEntityController->load()
Trying to get property of non-objectNoticefile.test175FileFieldTestCase->assertFileEntryExists()
Undefined property: stdClass::$uriNoticefile.test175FileFieldTestCase->assertFileEntryExists()
Undefined property: stdClass::$statusNoticefile.test200FileFieldTestCase->assertFileIsPermanent()
Second file entry is still permanent after deleting second revision, since it is being used by the third revision.Otherfile.test552FileFieldRevisionTestCase->testRevisions()
Undefined index: fidNoticefile.field.inc220file_field_presave()
array_flip(): Can only flip STRING and INTEGER values!Warningentity.inc167DrupalDefaultEntityController->load()
Trying to get property of non-objectNoticefile.field.inc221file_field_presave()
Undefined property: stdClass::$uriNoticefile.inc569file_save()
Undefined index: fidNoticefile.field.inc262file_field_update()
Undefined index: fidNoticefile.field.inc283file_field_update()
Undefined property: stdClass::$fidNoticefile.inc643file_usage_add()
PDOException: %message in file_usage_add() (line 650 of /var/lib/drupaltestbot/sites/default/files/checkout/includes/file.inc).Uncaught exceptiondatabase.inc1970PDOStatement->execute()
ExpandFile field validation tests (FileFieldValidateTestCase) [File]462956
MessageGroupFilenameLineFunctionStatus
Parsed page successfully.Browserfile.test664FileFieldValidateTestCase->testRequired()
Node save failed when required file field was empty.Otherfile.test665FileFieldValidateTestCase->testRequired()
Parsed page successfully.Browserfile.test125FileFieldTestCase->uploadNodeFile()
uploadNodeFile(public://text-0.txt, snidnqc5, article) succeededOtherfile.test669FileFieldValidateTestCase->testRequired()
array_flip(): Can only flip STRING and INTEGER values!Warningentity.inc167DrupalDefaultEntityController->load()
Trying to get property of non-objectNoticefile.test673FileFieldValidateTestCase->testRequired()
Undefined property: stdClass::$uriNoticefile.test165FileFieldTestCase->assertFileExists()
File exists after uploading to the required field.Otherfile.test674FileFieldValidateTestCase->testRequired()
Undefined property: stdClass::$fidNoticefile.test173FileFieldTestCase->assertFileEntryExists()
array_flip(): Can only flip STRING and INTEGER values!Warningentity.inc167DrupalDefaultEntityController->load()
Trying to get property of non-objectNoticefile.test175FileFieldTestCase->assertFileEntryExists()
Undefined property: stdClass::$uriNoticefile.test175FileFieldTestCase->assertFileEntryExists()
Parsed page successfully.Browserfile.test683FileFieldValidateTestCase->testRequired()
Node save failed when required multiple value file field was empty.Otherfile.test684FileFieldValidateTestCase->testRequired()
Parsed page successfully.Browserfile.test125FileFieldTestCase->uploadNodeFile()
array_flip(): Can only flip STRING and INTEGER values!Warningentity.inc167DrupalDefaultEntityController->load()
Trying to get property of non-objectNoticefile.test689FileFieldValidateTestCase->testRequired()
Undefined property: stdClass::$uriNoticefile.test165FileFieldTestCase->assertFileExists()
File exists after uploading to the required multiple value field.Otherfile.test690FileFieldValidateTestCase->testRequired()
Undefined property: stdClass::$fidNoticefile.test173FileFieldTestCase->assertFileEntryExists()
array_flip(): Can only flip STRING and INTEGER values!Warningentity.inc167DrupalDefaultEntityController->load()
Trying to get property of non-objectNoticefile.test175FileFieldTestCase->assertFileEntryExists()
Undefined property: stdClass::$uriNoticefile.test175FileFieldTestCase->assertFileEntryExists()
Parsed page successfully.Browserfile.test125FileFieldTestCase->uploadNodeFile()
array_flip(): Can only flip STRING and INTEGER values!Warningentity.inc167DrupalDefaultEntityController->load()
Trying to get property of non-objectNoticefile.test725FileFieldValidateTestCase->testFileMaxSize()
Undefined property: stdClass::$uriNoticefile.test165FileFieldTestCase->assertFileExists()
File exists after uploading a file (128 KB) under the max limit (1M).Otherfile.test726FileFieldValidateTestCase->testFileMaxSize()
Undefined property: stdClass::$fidNoticefile.test173FileFieldTestCase->assertFileEntryExists()
array_flip(): Can only flip STRING and INTEGER values!Warningentity.inc167DrupalDefaultEntityController->load()
Trying to get property of non-objectNoticefile.test175FileFieldTestCase->assertFileEntryExists()
Undefined property: stdClass::$uriNoticefile.test175FileFieldTestCase->assertFileEntryExists()
Parsed page successfully.Browserfile.test125FileFieldTestCase->uploadNodeFile()
Node save failed when file (1.25 MB) exceeded the max upload size (1M).Otherfile.test732FileFieldValidateTestCase->testFileMaxSize()
Parsed page successfully.Browserfile.test125FileFieldTestCase->uploadNodeFile()
array_flip(): Can only flip STRING and INTEGER values!Warningentity.inc167DrupalDefaultEntityController->load()
Trying to get property of non-objectNoticefile.test725FileFieldValidateTestCase->testFileMaxSize()
Undefined property: stdClass::$uriNoticefile.test165FileFieldTestCase->assertFileExists()
File exists after uploading a file (128 KB) under the max limit (1024K).Otherfile.test726FileFieldValidateTestCase->testFileMaxSize()
Undefined property: stdClass::$fidNoticefile.test173FileFieldTestCase->assertFileEntryExists()
array_flip(): Can only flip STRING and INTEGER values!Warningentity.inc167DrupalDefaultEntityController->load()
Trying to get property of non-objectNoticefile.test175FileFieldTestCase->assertFileEntryExists()
Undefined property: stdClass::$uriNoticefile.test175FileFieldTestCase->assertFileEntryExists()
Parsed page successfully.Browserfile.test125FileFieldTestCase->uploadNodeFile()
Node save failed when file (1.25 MB) exceeded the max upload size (1024K).Otherfile.test732FileFieldValidateTestCase->testFileMaxSize()
Parsed page successfully.Browserfile.test125FileFieldTestCase->uploadNodeFile()
array_flip(): Can only flip STRING and INTEGER values!Warningentity.inc167DrupalDefaultEntityController->load()
Trying to get property of non-objectNoticefile.test725FileFieldValidateTestCase->testFileMaxSize()
Undefined property: stdClass::$uriNoticefile.test165FileFieldTestCase->assertFileExists()
File exists after uploading a file (128 KB) under the max limit (1048576).Otherfile.test726FileFieldValidateTestCase->testFileMaxSize()
Undefined property: stdClass::$fidNoticefile.test173FileFieldTestCase->assertFileEntryExists()
array_flip(): Can only flip STRING and INTEGER values!Warningentity.inc167DrupalDefaultEntityController->load()
Trying to get property of non-objectNoticefile.test175FileFieldTestCase->assertFileEntryExists()
Undefined property: stdClass::$uriNoticefile.test175FileFieldTestCase->assertFileEntryExists()
Parsed page successfully.Browserfile.test125FileFieldTestCase->uploadNodeFile()
Node save failed when file (1.25 MB) exceeded the max upload size (1048576).Otherfile.test732FileFieldValidateTestCase->testFileMaxSize()
Parsed page successfully.Browserfile.test125FileFieldTestCase->uploadNodeFile()
array_flip(): Can only flip STRING and INTEGER values!Warningentity.inc167DrupalDefaultEntityController->load()
Trying to get property of non-objectNoticefile.test741FileFieldValidateTestCase->testFileMaxSize()
Undefined property: stdClass::$uriNoticefile.test165FileFieldTestCase->assertFileExists()
File exists after uploading a file (1.25 MB) with no max limit.Otherfile.test742FileFieldValidateTestCase->testFileMaxSize()
Undefined property: stdClass::$fidNoticefile.test173FileFieldTestCase->assertFileEntryExists()
array_flip(): Can only flip STRING and INTEGER values!Warningentity.inc167DrupalDefaultEntityController->load()
Trying to get property of non-objectNoticefile.test175FileFieldTestCase->assertFileEntryExists()
Undefined property: stdClass::$uriNoticefile.test175FileFieldTestCase->assertFileEntryExists()
Parsed page successfully.Browserfile.test125FileFieldTestCase->uploadNodeFile()
array_flip(): Can only flip STRING and INTEGER values!Warningentity.inc167DrupalDefaultEntityController->load()
Trying to get property of non-objectNoticefile.test768FileFieldValidateTestCase->testFileExtension()
Undefined property: stdClass::$uriNoticefile.test165FileFieldTestCase->assertFileExists()
File exists after uploading a file with no extension checking.Otherfile.test769FileFieldValidateTestCase->testFileExtension()
Undefined property: stdClass::$fidNoticefile.test173FileFieldTestCase->assertFileEntryExists()
array_flip(): Can only flip STRING and INTEGER values!Warningentity.inc167DrupalDefaultEntityController->load()
Trying to get property of non-objectNoticefile.test175FileFieldTestCase->assertFileEntryExists()
Undefined property: stdClass::$uriNoticefile.test175FileFieldTestCase->assertFileEntryExists()
Parsed page successfully.Browserfile.test125FileFieldTestCase->uploadNodeFile()
Node save failed when file uploaded with the wrong extension.Otherfile.test778FileFieldValidateTestCase->testFileExtension()
Parsed page successfully.Browserfile.test125FileFieldTestCase->uploadNodeFile()
array_flip(): Can only flip STRING and INTEGER values!Warningentity.inc167DrupalDefaultEntityController->load()
Trying to get property of non-objectNoticefile.test786FileFieldValidateTestCase->testFileExtension()
Undefined property: stdClass::$uriNoticefile.test165FileFieldTestCase->assertFileExists()
File exists after uploading a file with extension checking.Otherfile.test787FileFieldValidateTestCase->testFileExtension()
Undefined property: stdClass::$fidNoticefile.test173FileFieldTestCase->assertFileEntryExists()
array_flip(): Can only flip STRING and INTEGER values!Warningentity.inc167DrupalDefaultEntityController->load()
Trying to get property of non-objectNoticefile.test175FileFieldTestCase->assertFileEntryExists()
Undefined property: stdClass::$uriNoticefile.test175FileFieldTestCase->assertFileEntryExists()
ExpandFile field widget test (FileFieldWidgetTestCase) [File]18647
MessageGroupFilenameLineFunctionStatus
Parsed page successfully.Browserfile.test434FileFieldWidgetTestCase->testPrivateFileComment()
Parsed page successfully.Browserfile.test442FileFieldWidgetTestCase->testPrivateFileComment()
Undefined offset: 1Noticefile.test446FileFieldWidgetTestCase->testPrivateFileComment()
array_flip(): Can only flip STRING and INTEGER values!Warningentity.inc167DrupalDefaultEntityController->load()
Trying to get property of non-objectNoticefile.test452FileFieldWidgetTestCase->testPrivateFileComment()
Undefined property: stdClass::$uriNoticefile.test165FileFieldTestCase->assertFileExists()
New file saved to disk on node creation.Otherfile.test453FileFieldWidgetTestCase->testPrivateFileComment()
Undefined property: stdClass::$uriNoticefile.test455FileFieldWidgetTestCase->testPrivateFileComment()
Undefined property: stdClass::$uriNoticefile.test457FileFieldWidgetTestCase->testPrivateFileComment()
Undefined property: stdClass::$uriNoticefile.test462FileFieldWidgetTestCase->testPrivateFileComment()
Confirmed that access is denied for the file without the needed permission.Browserfile.test463FileFieldWidgetTestCase->testPrivateFileComment()
LeafFile loading (FileLoadTest) [File API]2900
LeafFile mimetypes (FileMimeTypeTest) [File API]3800
LeafFile moving (FileMoveTest) [File API]10500
LeafFile naming (FileNameMungingTest) [File API]500
LeafFile paths and directories (FileDirectoryTest) [File API]2000
LeafFile save data (FileSaveDataTest) [File API]8800
LeafFile saving (FileSaveTest) [File API]1400
LeafFile scan directory (FileScanDirectoryTest) [File API]2300
LeafFile space used tests (FileSpaceUsedTest) [File API]1100
ExpandFile token replacement (FileTokenReplaceTestCase) [File]25853
MessageGroupFilenameLineFunctionStatus
Parsed page successfully.Browserfile.test125FileFieldTestCase->uploadNodeFile()
array_flip(): Can only flip STRING and INTEGER values!Warningentity.inc167DrupalDefaultEntityController->load()
Trying to get property of non-objectNoticefile.test909FileTokenReplaceTestCase->testFileTokenReplacement()
Undefined property: stdClass::$fidNoticefile.test914FileTokenReplaceTestCase->testFileTokenReplacement()
Undefined property: stdClass::$filenameNoticefile.test915FileTokenReplaceTestCase->testFileTokenReplacement()
Undefined property: stdClass::$uriNoticefile.test917FileTokenReplaceTestCase->testFileTokenReplacement()
Undefined property: stdClass::$filemimeNoticefile.test918FileTokenReplaceTestCase->testFileTokenReplacement()
Undefined property: stdClass::$filesizeNoticefile.test919FileTokenReplaceTestCase->testFileTokenReplacement()
Undefined property: stdClass::$uriNoticefile.test920FileTokenReplaceTestCase->testFileTokenReplacement()
Undefined property: stdClass::$timestampNoticefile.test921FileTokenReplaceTestCase->testFileTokenReplacement()
date_timezone_set() expects parameter 1 to be DateTime, boolean givenWarningcommon.inc1893format_date()
date_format() expects parameter 1 to be DateTime, boolean givenWarningcommon.inc1903format_date()
Undefined property: stdClass::$timestampNoticefile.test922FileTokenReplaceTestCase->testFileTokenReplacement()
date_timezone_set() expects parameter 1 to be DateTime, boolean givenWarningcommon.inc1893format_date()
date_format() expects parameter 1 to be DateTime, boolean givenWarningcommon.inc1903format_date()
Undefined property: stdClass::$uidNoticefile.test924FileTokenReplaceTestCase->testFileTokenReplacement()
No empty tokens generated.Otherfile.test927FileTokenReplaceTestCase->testFileTokenReplacement()
Undefined property: stdClass::$fidNoticesystem.tokens.inc224system_tokens()
Undefined property: stdClass::$filenameNoticesystem.tokens.inc229system_tokens()
Undefined property: stdClass::$uriNoticesystem.tokens.inc237system_tokens()
Undefined property: stdClass::$filemimeNoticesystem.tokens.inc241system_tokens()
Undefined property: stdClass::$filesizeNoticesystem.tokens.inc245system_tokens()
Undefined property: stdClass::$uriNoticesystem.tokens.inc249system_tokens()
Undefined property: stdClass::$timestampNoticesystem.tokens.inc254system_tokens()
date_timezone_set() expects parameter 1 to be DateTime, boolean givenWarningcommon.inc1893format_date()
date_format() expects parameter 1 to be DateTime, boolean givenWarningcommon.inc1903format_date()
Undefined property: stdClass::$timestampNoticesystem.tokens.inc265system_tokens()
Sanitized file token [file:timestamp:short] replaced.Otherfile.test931FileTokenReplaceTestCase->testFileTokenReplacement()
Undefined property: stdClass::$uidNoticesystem.tokens.inc258system_tokens()
array_flip(): Can only flip STRING and INTEGER values!Warningentity.inc167DrupalDefaultEntityController->load()
array_flip(): Can only flip STRING and INTEGER values!Warningentity.inc343DrupalDefaultEntityController->cacheGet()
Trying to get property of non-objectNoticesystem.tokens.inc259system_tokens()
Sanitized file token [file:owner] replaced.Otherfile.test931FileTokenReplaceTestCase->testFileTokenReplacement()
Undefined property: stdClass::$uidNoticesystem.tokens.inc268system_tokens()
array_flip(): Can only flip STRING and INTEGER values!Warningentity.inc167DrupalDefaultEntityController->load()
array_flip(): Can only flip STRING and INTEGER values!Warningentity.inc343DrupalDefaultEntityController->cacheGet()
Sanitized file token [file:owner:uid] replaced.Otherfile.test931FileTokenReplaceTestCase->testFileTokenReplacement()
Undefined property: stdClass::$filenameNoticefile.test935FileTokenReplaceTestCase->testFileTokenReplacement()
Undefined property: stdClass::$uriNoticefile.test937FileTokenReplaceTestCase->testFileTokenReplacement()
Undefined property: stdClass::$filemimeNoticefile.test938FileTokenReplaceTestCase->testFileTokenReplacement()
Undefined property: stdClass::$filesizeNoticefile.test939FileTokenReplaceTestCase->testFileTokenReplacement()
Undefined property: stdClass::$fidNoticesystem.tokens.inc224system_tokens()
Undefined property: stdClass::$filenameNoticesystem.tokens.inc229system_tokens()
Undefined property: stdClass::$uriNoticesystem.tokens.inc237system_tokens()
Undefined property: stdClass::$filemimeNoticesystem.tokens.inc241system_tokens()
Undefined property: stdClass::$filesizeNoticesystem.tokens.inc245system_tokens()
Undefined property: stdClass::$uriNoticesystem.tokens.inc249system_tokens()
Undefined property: stdClass::$timestampNoticesystem.tokens.inc254system_tokens()
date_timezone_set() expects parameter 1 to be DateTime, boolean givenWarningcommon.inc1893format_date()
date_format() expects parameter 1 to be DateTime, boolean givenWarningcommon.inc1903format_date()
Undefined property: stdClass::$timestampNoticesystem.tokens.inc265system_tokens()
Unsanitized file token [file:timestamp:short] replaced.Otherfile.test943FileTokenReplaceTestCase->testFileTokenReplacement()
Undefined property: stdClass::$uidNoticesystem.tokens.inc258system_tokens()
array_flip(): Can only flip STRING and INTEGER values!Warningentity.inc167DrupalDefaultEntityController->load()
array_flip(): Can only flip STRING and INTEGER values!Warningentity.inc343DrupalDefaultEntityController->cacheGet()
Trying to get property of non-objectNoticesystem.tokens.inc259system_tokens()
Unsanitized file token [file:owner] replaced.Otherfile.test943FileTokenReplaceTestCase->testFileTokenReplacement()
Undefined property: stdClass::$uidNoticesystem.tokens.inc268system_tokens()
array_flip(): Can only flip STRING and INTEGER values!Warningentity.inc167DrupalDefaultEntityController->load()
array_flip(): Can only flip STRING and INTEGER values!Warningentity.inc343DrupalDefaultEntityController->cacheGet()
Unsanitized file token [file:owner:uid] replaced.Otherfile.test943FileTokenReplaceTestCase->testFileTokenReplacement()
LeafFile uploading (FileSaveUploadTest) [File API]26300
LeafFile URL rewriting (FileURLRewritingTest) [File]1500
LeafFile usage (FileUsageTest) [File]2100
LeafFile validate (FileValidateTest) [File API]1100
LeafFile validator tests (FileValidatorTest) [File API]2700
LeafFileTransfer unit tests (FileTranferTest) [System]400
LeafFilter administration functionality (FilterAdminTestCase) [Filter]15500
LeafFilter CRUD operations (FilterCRUDTestCase) [Filter]21400
LeafFilter format access (FilterFormatAccessTestCase) [Filter]24400
LeafFilter format hooks (FilterHooksTestCase) [Filter]3200
LeafFilter module filters (FilterUnitTestCase) [Filter]20200
LeafFingerprinting meta tag (AdminMetaTagTestCase) [System]300
LeafFlood control mechanism (FloodFunctionalTest) [System]1200
LeafForm alter hooks (FormAlterTestCase) [Form API]300
LeafForm API file inclusion (FormsFileInclusionTestCase) [Form API]900
LeafForm element and label output test (FormsElementsLabelsTestCase) [Form API]1500
LeafForm element validation (FormsTestCase) [Form API]41500
LeafForm rebuilding (FormsRebuildTestCase) [Form API]8200
LeafForm state values clearance (FormStateValuesCleanTestCase) [Form API]2600
LeafForm triggering element determination (FormsTriggeringElementTestCase) [Form API]9000
LeafForm validation handlers (FormValidationTestCase) [Form API]5300
LeafForm wrapper callback (FormsFormWrapperTestCase) [Form API]400
LeafFormat date (FormatDateUnitTest) [System]4300
LeafForum functionality (ForumTestCase) [Forum]77200
LeafFront page (FrontPageTestCase) [System]3600
LeafGet filename test (BootstrapGetFilenameTestCase) [Bootstrap]400
LeafGraph (GraphUnitTest) [System]3300
LeafHelp functionality (HelpTestCase) [Help]31100
LeafHTML Attributes (DrupalAttributesUnitTest) [System]600
LeafHTML identifiers (DrupalHTMLIdentifierTestCase) [System]2000
LeafHTML in page titles (PageTitleFiltering) [System]4000
LeafHTTP file retrieval (RetrieveFileTestCase) [System]700
LeafImage effects (ImageEffectsUnitTest) [Image]3300
ExpandImage field display tests (ImageFieldDisplayTestCase) [Image]1562
MessageGroupFilenameLineFunctionStatus
The test did not complete due to a fatal error.Completion checkimage.test625ImageFieldDisplayTestCase->testImageFieldFormattersPublic()
Parsed page successfully.Browserimage.test98ImageFieldTestCase->uploadNodeImage()
array_flip(): Can only flip STRING and INTEGER values!Warningentity.inc167DrupalDefaultEntityController->load()
Trying to get property of non-objectNoticeimage.test650ImageFieldDisplayTestCase->_testImageFieldFormatters()
Default formatter displaying correctly on full node view.Otherimage.test655ImageFieldDisplayTestCase->_testImageFieldFormatters()
Image linked to file formatter displaying correctly on full node view.Otherimage.test664ImageFieldDisplayTestCase->_testImageFieldFormatters()
File was downloaded successfully.Otherimage.test666ImageFieldDisplayTestCase->_testImageFieldFormatters()
Image linked to content formatter displaying correctly on full node view.Otherimage.test688ImageFieldDisplayTestCase->_testImageFieldFormatters()
ExpandImage field validation tests (ImageFieldValidateTestCase) [Image]1040
MessageGroupFilenameLineFunctionStatus
Parsed page successfully.Browserimage.test98ImageFieldTestCase->uploadNodeImage()
Node save failed when minimum image resolution was not met.Otherimage.test863ImageFieldValidateTestCase->testResolution()
Parsed page successfully.Browserimage.test98ImageFieldTestCase->uploadNodeImage()
Image exceeding max resolution was properly resized.Otherimage.test865ImageFieldValidateTestCase->testResolution()
LeafImage GD manipulation tests (ImageToolkitGdTestCase) [Image]100
ExpandImage styles and effects UI configuration (ImageAdminStylesUnitTest) [Image]14722
MessageGroupFilenameLineFunctionStatus
The test did not complete due to a fatal error.Completion checkimage.test565ImageAdminStylesUnitTest->testStyleReplacement()
Parsed page successfully.Browserimage.test98ImageFieldTestCase->uploadNodeImage()
array_flip(): Can only flip STRING and INTEGER values!Warningentity.inc167DrupalDefaultEntityController->load()
Trying to get property of non-objectNoticeimage.test585ImageAdminStylesUnitTest->testStyleReplacement()
LeafImage styles path and URL functions (ImageStylesPathAndUrlUnitTest) [Image]2100
LeafImage toolkit tests (ImageToolkitUnitTest) [Image]4400
LeafImport feeds from OPML functionality (ImportOPMLTestCase) [Aggregator]5300
LeafInfo file format parser (InfoFileParserTestCase) [System]900
LeafInsert tests (DatabaseInsertTestCase) [Database]4500
LeafInsert tests, default fields (DatabaseInsertDefaultsTestCase) [Database]1900
LeafInsert tests, LOB fields (DatabaseInsertLOBTestCase) [Database]1300
LeafInvalid data (DatabaseInvalidDataTestCase) [Database]700
LeafIP address and HTTP_HOST test (BootstrapIPAddressTestCase) [Bootstrap]1100
LeafIP address blocking (IPAddressBlockingTestCase) [System]4200
LeafJavaScript (JavaScriptTestCase) [System]3500
LeafJSON (DrupalJSONTest) [System]2800
LeafKeywords and conditions (SearchKeywordsConditions) [Search]2500
LeafLanguage configuration (LocaleConfigurationTest) [Locale]7800
LeafLanguage switching (LocaleLanguageSwitchingFunctionalTest) [Locale]2500
LeafList field (ListFieldTestCase) [Field types]1400
LeafList field UI (ListFieldUITestCase) [Field types]3600
LeafLoad multiple nodes (NodeLoadMultipleUnitTest) [Node]3600
LeafLocale uninstall (EN) (LocaleUninstallFunctionalTest) [Locale]3100
LeafLocale uninstall (FR) (LocaleUninstallFrenchFunctionalTest) [Locale]3100
LeafLocale upgrade path (LocaleUpgradePathTestCase) [Upgrade path]15500
LeafLocalize date formats (LocaleDateFormatsFunctionalTest) [Locale]3500
LeafLocking framework tests (LockFunctionalTest) [System]1700
LeafMail system (MailTestCase) [System]100
LeafMain content rendering fallback (SystemMainContentFallback) [System]6600
LeafManage display (FieldUIManageDisplayTestCase) [Field UI]3300
LeafManage fields (FieldUIManageFieldsTestCase) [Field UI]15000
LeafMenu link creation/deletion (MenuTestCase) [Menu]64400
LeafMenu rebuild test (MenuRebuildTestCase) [Menu]500
LeafMenu router (MenuRouterTestCase) [Menu]19100
LeafMenu settings for nodes (MenuNodeTestCase) [Menu]4700
LeafMenu tree generation (MenuTreeDataTestCase) [Menu]400
LeafMerge tests (DatabaseMergeTestCase) [Database]7500
LeafMiscellaneous AJAX tests (AJAXElementValidation) [AJAX]800
LeafMissing update dependencies (UpdateDependencyMissingTestCase) [Update API]300
LeafModule API (ModuleUnitTest) [Module]3300
LeafModule dependencies (ModuleDependencyTestCase) [Module]11800
LeafModule installation (ModuleInstallTestCase) [Module]200
LeafModule uninstallation (ModuleUninstallTestCase) [Module]100
LeafModule versions (ModuleVersionTestCase) [Module]5000
LeafMultilingual fields (LocaleMultilingualFieldsFunctionalTest) [Locale]6000
LeafMultistep form using form storage (FormsFormStorageTestCase) [Form API]12800
LeafMultistep node form basic options (MultiStepNodeFormBasicOptionsTest) [Node]1500
LeafNew default theme blocks (NewDefaultThemeBlocks) [Block]2400
LeafNo help (NoHelpTestCase) [Help]1100
LeafNode access (NodeAccessUnitTest) [Node]3100
LeafNode access rebuild (NodeAccessRebuildTestCase) [Node]1600
LeafNode access records (NodeAccessRecordsUnitTest) [Node]2300
LeafNode administration (NodeAdminTestCase) [Node]13900
LeafNode blocks (NodeBlockFunctionalTest) [Node]8300
LeafNode body upgrade path (NodeBodyUpgradePathTestCase) [Upgrade path]3500
LeafNode creation (NodeCreationTestCase) [Node]2500
LeafNode edit (PageEditTestCase) [Node]9300
LeafNode edit permissions (PageViewTestCase) [Node]3200
LeafNode entity query alter (NodeEntityFieldQueryAlter) [Node]3000
LeafNode feed (NodeFeedTestCase) [Node]100
LeafNode post information display (NodePostSettingsTestCase) [Node]3400
LeafNode preview (PagePreviewTestCase) [Node]3500
LeafNode query alter (NodeQueryAlter) [Node]5100
LeafNode revisions (NodeRevisionsTestCase) [Node]4400
LeafNode RSS Content (NodeRSSContentTestCase) [Node]1600
LeafNode save (NodeSaveTestCase) [Node]2800
LeafNode title (NodeTitleTestCase) [Node]2000
LeafNode title XSS filtering (NodeTitleXSSTestCase) [Node]2000
LeafNode token replacement (NodeTokenReplaceTestCase) [Node]3400
LeafNode type persist (NodeTypePersistenceTestCase) [Node]6200
LeafNode types (NodeTypeTestCase) [Node]8400
LeafNon default theme admin (NonDefaultBlockAdmin) [Block]1000
LeafOpenID account registration (OpenIDRegistrationTestCase) [OpenID]13100
LeafOpenID discovery and login (OpenIDFunctionalTestCase) [OpenID]24800
LeafOpenID helper functions (OpenIDUnitTest) [OpenID]3200
LeafOptions widgets (OptionsWidgetsTestCase) [Field types]22900
LeafPage cache test (BootstrapPageCacheTestCase) [Bootstrap]7800
LeafPager query tests (DatabaseSelectPagerDefaultTestCase) [Database]4200
LeafParsing .info files (ParseInfoFilesTestCase) [System]300
LeafPath alias functionality (PathTestCase) [Path]10200
LeafPath aliases with languages (PathLanguageUITestCase) [Path]6900
LeafPath aliases with translated nodes (PathLanguageTestCase) [Path]6300
LeafPath language settings (LocalePathFunctionalTest) [Locale]4300
LeafPaths on non-English monolingual sites (PathMonolingualTestCase) [Path]3400
LeafPersonal contact form (ContactPersonalTestCase) [Contact]14200
LeafPHP filter access check (PHPAccessTestCase) [PHP]3700
LeafPHP filter functionality (PHPFilterTestCase) [PHP]4100
LeafPoll add choice (PollJSAddChoice) [Poll]1500
LeafPoll create (PollCreateTestCase) [Poll]12100
LeafPoll expiration (PollExpirationTestCase) [Poll]3200
LeafPoll token replacement (PollTokenReplaceTestCase) [Poll]10600
LeafPoll upgrade path (PollUpgradePathTestCase) [Upgrade path]21400
LeafPoll vote (PollVoteTestCase) [Poll]8000
LeafProfile browsing (ProfileTestBrowsing) [Profile]3200
LeafProgrammatic form submissions (FormsProgrammaticTestCase) [Form API]1800
LeafQuery altering tests (DatabaseAlterTestCase) [Database]5500
LeafQuery logging (DatabaseLoggingTestCase) [Database]3800
LeafQuery tagging tests (DatabaseTaggingTestCase) [Database]2800
LeafQueue functionality (QueueTestCase) [System]700
LeafRange query test (DatabaseRangeQueryTestCase) [Database]200
LeafRDF comment mapping (RdfCommentAttributesTestCase) [RDF]20400
LeafRDF mapping CRUD functions (RdfCrudTestCase) [RDF]900
LeafRDF mapping definition functionality (RdfMappingDefinitionTestCase) [RDF]5800
LeafRDF mapping hook (RdfMappingHookTestCase) [RDF]500
LeafRDF namespaces (RdfGetRdfNamespacesTestCase) [RDF]400
LeafRDF namespaces XML serialization tests (DrupalGetRdfNamespacesTestCase) [System]1200
LeafRDF tracker page mapping (RdfTrackerAttributesTestCase) [RDF]3200
ExpandRDFa markup (RdfRdfaMarkupTestCase) [RDF]1630
MessageGroupFilenameLineFunctionStatus
Parsed page successfully.Browserrdf.test169RdfRdfaMarkupTestCase->testAttributesInMarkupFile()
Attribute 'rel' set on file field. Attribute 'resource' is also set.Otherrdf.test183RdfRdfaMarkupTestCase->testAttributesInMarkupFile()
Attribute 'rel' set on image field. Attribute 'resource' is also set.Otherrdf.test189RdfRdfaMarkupTestCase->testAttributesInMarkupFile()
LeafRebuild arbitrary forms (FormsArbitraryRebuildTestCase) [Form API]1400
LeafRebuild content (NodeBuildContent) [Node]100
LeafRegistry parse file test (RegistryParseFileTestCase) [System]200
LeafRegistry parse files test (RegistryParseFilesTestCase) [System]600
LeafRegression tests (DatabaseRegressionTestCase) [Database]2700
LeafRemove feed functionality (RemoveFeedTestCase) [Aggregator]2300
LeafRemove feed item functionality (RemoveFeedItemTestCase) [Aggregator]19600
LeafRequired modules (ModuleRequiredTestCase) [Module]2100
LeafRequirements hook failure (HookRequirementsTestCase) [Module]1500
LeafResettable static variables test (BootstrapResettableStaticTestCase) [Bootstrap]500
LeafRole assignment (UserRolesAssignmentTestCase) [User]5300
LeafRole permissions (UserPermissionsTestCase) [User]5000
LeafSchema API (SchemaTestCase) [Database]2800
LeafSearch engine phrase queries (SearchExactTestCase) [Search]2200
LeafSearch engine queries (SearchMatchTestCase) [Search]14400
LeafSearch engine ranking (SearchRankingTestCase) [Search]6000
LeafSearch excerpt extraction (SearchExcerptTestCase) [Search]500
LeafSearch expression insert/extract (SearchExpressionInsertExtractTestCase) [Search]2400
LeafSearch page override (SearchPageOverride) [Search]1200
LeafSearch page text (SearchPageText) [Search]2600
LeafSearch simplify (SearchSimplifyTestCase) [Search]33800
LeafSecurity (FilterSecurityTestCase) [Filter]2600
LeafSelect tests (DatabaseSelectTestCase) [Database]11700
LeafSelect tests, complex (DatabaseSelectComplexTestCase) [Database]11500
LeafSelect tests, complex 2 (DatabaseSelectComplexTestCase2) [Database]1400
LeafSelect tests, ordered (DatabaseSelectOrderedTestCase) [Database]2600
LeafSelect tests, subqueries (DatabaseSelectSubqueryTestCase) [Database]2400
LeafSequences API (DatabaseNextIdCase) [Database]200
LeafSession https handling (SessionHttpsTestCase) [Session]6800
LeafSession tests (SessionTestCase) [Session]17000
LeafShortcut link functionality (ShortcutLinksTestCase) [Shortcut]10300
LeafShortcut set functionality (ShortcutSetsTestCase) [Shortcut]18900
LeafShutdown functions (ShutdownFunctionsTest) [System]400
LeafSimpleTest browser (SimpleTestBrowserTestCase) [SimpleTest]1600
LeafSimpleTest e-mail capturing (SimpleTestMailCaptureTestCase) [SimpleTest]1300
LeafSimpleTest error collector (DrupalErrorCollectionUnitTest) [SimpleTest]1500
LeafSimpleTest functionality (SimpleTestFunctionalTest) [SimpleTest]9100
LeafSite maintenance mode functionality (SiteMaintenanceTestCase) [System]8000
LeafSite-wide contact form (ContactSitewideTestCase) [Contact]23700
LeafSize parsing test (CommonSizeTestCase) [System]3500
LeafStatistics logging tests (StatisticsLoggingTestCase) [Statistics]1200
LeafStatistics reports tests (StatisticsReportsTestCase) [Statistics]9700
LeafStatistics token replacement (StatisticsTokenReplaceTestCase) [Statistics]2900
LeafStream wrappers (StreamWrapperTest) [File API]1500
LeafString filtering tests (CommonXssUnitTest) [System]900
LeafString translate, search and validate (LocaleTranslationFunctionalTest) [Locale]25000
LeafString translation using st() (LocaleInstallTest) [Locale]100
LeafSummary length (SummaryLengthTestCase) [Node]1500
LeafSyslog functionality (SyslogTestCase) [Syslog]1600
LeafSystem info alter (SystemInfoAlterTestCase) [System]1000
LeafTableselect form element type test (FormsElementsTableSelectFunctionalTest) [Form API]5500
LeafTablesort query tests (DatabaseSelectTableSortDefaultTestCase) [Database]4100
ExpandTaxonomy term functions and forms. (TaxonomyTermTestCase) [Taxonomy]155175
MessageGroupFilenameLineFunctionStatus
Parsed page successfully.Browsertaxonomy.test481TaxonomyTermTestCase->testTaxonomyNode()
Trying to get property of non-objectNoticetaxonomy.test485TaxonomyTermTestCase->testTaxonomyNode()
Term is displayed when viewing the node.Othertaxonomy.test486TaxonomyTermTestCase->testTaxonomyNode()
Trying to get property of non-objectNoticetaxonomy.test490TaxonomyTermTestCase->testTaxonomyNode()
Failed to set field title to tOHkEhS2Othertaxonomy.test490TaxonomyTermTestCase->testTaxonomyNode()
Failed to set field body[und][0][value] to v209Q5B8Othertaxonomy.test490TaxonomyTermTestCase->testTaxonomyNode()
Failed to set field taxonomy_clf1yiw8[und][] to 2Othertaxonomy.test490TaxonomyTermTestCase->testTaxonomyNode()
Found the Save buttonOthertaxonomy.test490TaxonomyTermTestCase->testTaxonomyNode()
Found the requested form fields at node//editOthertaxonomy.test490TaxonomyTermTestCase->testTaxonomyNode()
Trying to get property of non-objectNoticetaxonomy.test492TaxonomyTermTestCase->testTaxonomyNode()
Term is displayed when viewing the node.Othertaxonomy.test493TaxonomyTermTestCase->testTaxonomyNode()
Trying to get property of non-objectNoticetaxonomy.test496TaxonomyTermTestCase->testTaxonomyNode()
Failed to set field title to tOHkEhS2Othertaxonomy.test496TaxonomyTermTestCase->testTaxonomyNode()
Failed to set field body[und][0][value] to v209Q5B8Othertaxonomy.test496TaxonomyTermTestCase->testTaxonomyNode()
Failed to set field taxonomy_clf1yiw8[und][] to 2Othertaxonomy.test496TaxonomyTermTestCase->testTaxonomyNode()
Found the Preview buttonOthertaxonomy.test496TaxonomyTermTestCase->testTaxonomyNode()
Found the requested form fields at node//editOthertaxonomy.test496TaxonomyTermTestCase->testTaxonomyNode()
Term is displayed when previewing the node.Othertaxonomy.test497TaxonomyTermTestCase->testTaxonomyNode()
Invalid argument supplied for foreach()Warningdrupal_web_test_case.php1785DrupalWebTestCase->drupalPost()
Found the Preview buttonOthertaxonomy.test498TaxonomyTermTestCase->testTaxonomyNode()
Found the requested form fields at Othertaxonomy.test498TaxonomyTermTestCase->testTaxonomyNode()
Term is displayed when previewing the node again.Othertaxonomy.test499TaxonomyTermTestCase->testTaxonomyNode()
LeafTaxonomy term hooks (TaxonomyHooksTestCase) [Taxonomy]1900
LeafTaxonomy term multiple loading (TaxonomyLoadMultipleUnitTest) [Taxonomy]1700
LeafTaxonomy term reference field (TaxonomyTermFieldTestCase) [Taxonomy]3600
LeafTaxonomy term unit tests (TaxonomyTermUnitTest) [Taxonomy]100
LeafTaxonomy term URL aliases (PathTaxonomyTermTestCase) [Path]3400
ExpandTaxonomy token replacement (TaxonomyTokenReplaceTestCase) [Taxonomy]4650
MessageGroupFilenameLineFunctionStatus
Parsed page successfully.Browsertaxonomy.test1060TaxonomyTokenReplaceTestCase->testTaxonomyTokenReplacement()
Sanitized taxonomy term token [term:node-count] replaced.Othertaxonomy.test1094TaxonomyTokenReplaceTestCase->testTaxonomyTokenReplacement()
Unsanitized taxonomy term token [term:node-count] replaced.Othertaxonomy.test1105TaxonomyTokenReplaceTestCase->testTaxonomyTokenReplacement()
Sanitized taxonomy vocabulary token [vocabulary:node-count] replaced.Othertaxonomy.test1121TaxonomyTokenReplaceTestCase->testTaxonomyTokenReplacement()
Unsanitized taxonomy vocabulary token [vocabulary:node-count] replaced.Othertaxonomy.test1130TaxonomyTokenReplaceTestCase->testTaxonomyTokenReplacement()
LeafTaxonomy upgrade path (UpgradePathTaxonomyTestCase) [Upgrade path]126500
LeafTaxonomy vocabularies (TaxonomyVocabularyUnitTest) [Taxonomy]6100
LeafTaxonomy vocabulary interface (TaxonomyVocabularyFunctionalTest) [Taxonomy]9700
LeafTemporary query test (DatabaseTemporaryQueryTestCase) [Database]500
LeafTest date field (ProfileTestDate) [Profile]4900
LeafTest field weights (ProfileTestWeights) [Profile]5300
LeafTest select field (ProfileTestSelect) [Profile]4500
LeafTest single fields (ProfileTestFields) [Profile]18000
LeafTest statistics admin. (StatisticsAdminTestCase) [Statistics]10400
LeafTest user actions (TriggerUserActionTestCase) [Trigger]6500
LeafTest user triggers (TriggerUserTokenTestCase) [Trigger]18500
LeafTesting SimpleTest setUp (SimpleTestFolderTestCase) [SimpleTest]100
LeafText field (TextFieldTestCase) [Field types]19700
LeafText summary (TextSummaryTestCase) [Field types]11600
ExpandText translation (TextTranslationTestCase) [Field types]82184
MessageGroupFilenameLineFunctionStatus
Parsed page successfully.Browsertext.test436TextTranslationTestCase->testTextField()
Trying to get property of non-objectNoticetext.test438TextTranslationTestCase->testTextField()
Undefined variable: url_targetNoticedrupal_web_test_case.php2324DrupalWebTestCase->clickLink()
Clicked link add translation () from http://pifr-mysql/checkout/?q=node//translateBrowsertext.test439TextTranslationTestCase->testTextField()
The textfield widget is populated.Othertext.test440TextTranslationTestCase->testTextField()
Parsed page successfully.Browsertext.test452TextTranslationTestCase->testTextFieldFormatted()
Body field cardinality set to multiple.Othertext.test452TextTranslationTestCase->testTextFieldFormatted()
Parsed page successfully.Browsertext.test466TextTranslationTestCase->testTextFieldFormatted()
Failed to set field body[en][0][value] to mz68PMsMOthertext.test476TextTranslationTestCase->testTextFieldFormatted()
Failed to set field body[en][0][format] to full_htmlOthertext.test476TextTranslationTestCase->testTextFieldFormatted()
Found the Save buttonOthertext.test476TextTranslationTestCase->testTextFieldFormatted()
Found the requested form fields at node/1/editOthertext.test476TextTranslationTestCase->testTextFieldFormatted()
The body field with delta 0 has been saved.Othertext.test477TextTranslationTestCase->testTextFieldFormatted()
Failed to set field body[en][1][value] to xdKM8UnCOthertext.test476TextTranslationTestCase->testTextFieldFormatted()
Failed to set field body[en][1][format] to filtered_htmlOthertext.test476TextTranslationTestCase->testTextFieldFormatted()
Found the Save buttonOthertext.test476TextTranslationTestCase->testTextFieldFormatted()
Found the requested form fields at node/1/editOthertext.test476TextTranslationTestCase->testTextFieldFormatted()
The body field with delta 1 has been saved.Othertext.test477TextTranslationTestCase->testTextFieldFormatted()
Trying to get property of non-objectNoticetext.test485TextTranslationTestCase->testTextFieldFormatted()
Undefined variable: url_targetNoticedrupal_web_test_case.php2324DrupalWebTestCase->clickLink()
Clicked link add translation () from http://pifr-mysql/checkout/?q=node//translateBrowsertext.test486TextTranslationTestCase->testTextFieldFormatted()
The body field with delta 1 is shown.Othertext.test488TextTranslationTestCase->testTextFieldFormatted()
LeafTheme API (ThemeUnitTest) [Theme]1600
LeafTheme fast initialization (ThemeFastTestCase) [Theme]1000
LeafTheme initialization in hook_init() (ThemeHookInitUnitTest) [Theme]400
LeafTheme interface functionality (SystemThemeFunctionalTest) [System]6600
LeafTheme item list (ThemeItemListUnitTest) [Theme]100
LeafTheme Table (ThemeTableUnitTest) [Theme]600
LeafTimer test (BootstrapTimerTestCase) [Bootstrap]500
LeafToken replacement (TokenReplaceTestCase) [System]2700
LeafTop visitor blocking (StatisticsBlockVisitorsTestCase) [Statistics]4500
LeafTracker (TrackerTest) [Tracker]21900
LeafTransaction tests (DatabaseTransactionTestCase) [Database]3100
LeafTranslation export (LocaleExportFunctionalTest) [Locale]2900
LeafTranslation functionality (TranslationTestCase) [Translation]16900
LeafTranslation import (LocaleImportFunctionalTest) [Locale]9100
LeafTrigger content (node) actions (TriggerContentTestCase) [Trigger]35300
LeafTrigger cron (system) actions (TriggerCronTestCase) [Trigger]3300
LeafTrigger orphaned actions (TriggerOrphanedActionsTestCase) [Trigger]3700
LeafTrigger other actions (TriggerOtherTestCase) [Trigger]11200
LeafUI language negotiation (LocaleUILanguageNegotiationTest) [Locale]4700
LeafUnassigned text format functionality (FilterNoFormatTestCase) [Filter]100
LeafUnicode handling (UnicodeUnitTest) [System]17600
LeafUnmanaged file copying (FileUnmanagedCopyTest) [File API]3100
LeafUnmanaged file delete (FileUnmanagedDeleteTest) [File API]800
LeafUnmanaged file moving (FileUnmanagedMoveTest) [File API]2200
LeafUnmanaged file save data (FileUnmanagedSaveDataTest) [File API]700
LeafUnmanaged recursive file delete (FileUnmanagedDeleteRecursiveTest) [File API]1700
LeafUpdate contrib functionality (UpdateTestContribCase) [Update]18100
LeafUpdate core functionality (UpdateCoreTestCase) [Update]16000
LeafUpdate dependency hook invocation (UpdateDependencyHookInvocationTestCase) [Update API]300
LeafUpdate dependency ordering (UpdateDependencyOrderingTestCase) [Update API]300
LeafUpdate feed functionality (UpdateFeedTestCase) [Aggregator]7400
ExpandUpdate feed item functionality (UpdateFeedItemTestCase) [Aggregator]4650
MessageGroupFilenameLineFunctionStatus
Parsed page successfully.Browseraggregator.test277AggregatorTestCase->createSampleNodes()
Parsed page successfully.Browseraggregator.test277AggregatorTestCase->createSampleNodes()
Parsed page successfully.Browseraggregator.test277AggregatorTestCase->createSampleNodes()
Parsed page successfully.Browseraggregator.test277AggregatorTestCase->createSampleNodes()
Parsed page successfully.Browseraggregator.test277AggregatorTestCase->createSampleNodes()
LeafUpdate functionality (UpdateScriptFunctionalTest) [System]5600
ExpandUpdate on cron functionality (AggregatorCronTestCase) [Aggregator]3580
MessageGroupFilenameLineFunctionStatus
Parsed page successfully.Browseraggregator.test277AggregatorTestCase->createSampleNodes()
Parsed page successfully.Browseraggregator.test277AggregatorTestCase->createSampleNodes()
Parsed page successfully.Browseraggregator.test277AggregatorTestCase->createSampleNodes()
Parsed page successfully.Browseraggregator.test277AggregatorTestCase->createSampleNodes()
Parsed page successfully.Browseraggregator.test277AggregatorTestCase->createSampleNodes()
Expected number of items in database.Otheraggregator.test725AggregatorCronTestCase->testCron()
Expected number of items in database.Otheraggregator.test729AggregatorCronTestCase->testCron()
Expected number of items in database.Otheraggregator.test748AggregatorCronTestCase->testCron()
LeafUpdate tests (DatabaseUpdateTestCase) [Database]3500
LeafUpdate tests, Complex (DatabaseUpdateComplexTestCase) [Database]5200
LeafUpdate tests, LOB (DatabaseUpdateLOBTestCase) [Database]1300
LeafUpload and extract module functionality (UpdateTestUploadCase) [Update]6100
LeafUpload upgrade path (UploadUpgradePathTestCase) [Upgrade path]3000
LeafUpload user picture (UserPictureTestCase) [User]8900
LeafURL altering (UrlAlterFunctionalTest) [Path API]2800
LeafURL generation tests (CommonURLUnitTest) [System]7500
LeafUser account links (UserAccountLinksUnitTests) [User]2100
LeafUser administration (UserAdminTestCase) [User]6500
LeafUser autocompletion (UserAutocompleteTestCase) [User]2800
LeafUser blocks (UserBlocksUnitTests) [User]4300
LeafUser create (UserCreateTestCase) [User]2700
LeafUser creation (LocaleUserCreationTest) [Locale]6800
LeafUser edit (UserEditTestCase) [User]6800
LeafUser edited own account (UserEditedOwnAccountTestCase) [User]2300
LeafUser language settings (LocaleUserLanguageFunctionalTest) [Locale]5100
LeafUser login (UserLoginTestCase) [User]13200
LeafUser poll vote capability. (PollVoteCheckHostname) [Poll]12000
LeafUser registration (UserRegistrationTestCase) [User]8100
LeafUser role administration (UserRoleAdminTestCase) [User]3900
LeafUser save test (UserSaveTestCase) [User]300
LeafUser search (UserUserSearchTestCase) [User]3800
LeafUser signatures (UserSignatureTestCase) [User]4500
LeafUser time zones (UserTimeZoneFunctionalTest) [User]3100
LeafUser token replacement (UserTokenReplaceTestCase) [User]4300
LeafUsername/e-mail validation (UserValidationTestCase) [User]1900
LeafValid Url (ValidUrlTestCase) [System]7900
LeafVariable test (BootstrapVariableTestCase) [Bootstrap]700
LeafXML-RPC basic (XMLRPCBasicTestCase) [XML-RPC]500
LeafXML-RPC message and alteration (XMLRPCMessagesTestCase) [XML-RPC]500
LeafXML-RPC validator (XMLRPCValidator1IncTestCase) [XML-RPC]900