1754246-language-configurables-126.patch

Test status
StatusResult
Last receivedThu, 06/27/2013 - 23:51:26
Last requestedThu, 06/27/2013 - 23:52:02
Last testedFri, 06/28/2013 - 00:47:13
Test count1
Environment status
MySQLfail
File information
File1754246-language-configurables-126.patch
BranchDrupal core - 8.x
LinkIssue Link
SummaryFAILED: [[SimpleTest]]: [MySQL] 56,717 pass(es), 187 fail(s), and 68 exception(s).
Details

MySQL

  1. Setup environment
  2. Detect an invalid patch URL
  3. Detect invalid repository information
  4. Detect invalid patch format
  5. Detect a non-applicable patch
  6. Detect invalid PHP syntax
  7. Detect a Drupal installation failure
  8. Detect a test run failure
  9. Detect a failing test
    Review the test failures below then if necessary run them locally until the problem has been fixed.
  10. Complete test suite with all tests passing
56,717 pass(es), 187 fail(s), and 68 exception(s)

Non-pass

Test namePassFailException
ExpandDrupal\contact\Tests\ContactUpgradePathTest523
MessageGroupFilenameLineFunctionStatus
Invoking hooks entity_info is not supported during updatesLogicExceptionUpdateModuleHandler.php50Drupal\Core\Extension\UpdateModuleHandler->getImplementations()
simplexml_import_dom(): Invalid Nodetype to importsimplexml_import_dom(Object) Drupal\simpletest\WebTestBase->parse() Drupal\simpletest\WebTestBase->xpath('//input[@type="submit"]') Drupal\simpletest\WebTestBase->assertFieldByXPath('//input[@type="submit"]') Drupal\system\Tests\Upgrade\UpgradePathTestBase->performUpgrade() Drupal\contact\Tests\ContactUpgradePathTest->testContactUpgrade() Drupal\simpletest\TestBase->run() simpletest_script_run_one_test('136', 'Drupal\contact\Tests\ContactUpgradePathTest') WarningWebTestBase.php1184Drupal\simpletest\WebTestBase->parse()
Parsed page successfully.BrowserUpgradePathTestBase.php239Drupal\system\Tests\Upgrade\UpgradePathTestBase->performUpgrade()
Value false is TRUE.OtherUpgradePathTestBase.php239Drupal\system\Tests\Upgrade\UpgradePathTestBase->performUpgrade()
Exception: An error was encountered during the first access to update.php. in Drupal\system\Tests\Upgrade\UpgradePathTestBase->performUpgrade() (line 240 of /var/lib/drupaltestbot/sites/default/files/checkout/core/modules/system/lib/Drupal/system/Tests/Upgrade/UpgradePathTestBase.php). Drupal\system\Tests\Upgrade\UpgradePathTestBase->performUpgrade() Drupal\contact\Tests\ContactUpgradePathTest->testContactUpgrade() Drupal\simpletest\TestBase->run() simpletest_script_run_one_test('136', 'Drupal\contact\Tests\ContactUpgradePathTest') Uncaught exceptionUpgradePathTestBase.php240Drupal\system\Tests\Upgrade\UpgradePathTestBase->performUpgrade()
ExpandDrupal\field\Tests\TranslationTest410
MessageGroupFilenameLineFunctionStatus
The test did not complete due to a fatal error.Completion checkTranslationTest.php117Drupal\field\Tests\TranslationTest->testFieldAvailableLanguages()
ExpandDrupal\locale\Tests\LocaleExportTest43180
MessageGroupFilenameLineFunctionStatus
Failed to set field langcode to frOtherLocaleExportTest.php65Drupal\locale\Tests\LocaleExportTest->testExportTranslation()
Found the requested form fields at admin/config/regional/translate/exportOtherLocaleExportTest.php65Drupal\locale\Tests\LocaleExportTest->testExportTranslation()
Exported French translation file.OtherLocaleExportTest.php68Drupal\locale\Tests\LocaleExportTest->testExportTranslation()
French translations present in exported file.OtherLocaleExportTest.php70Drupal\locale\Tests\LocaleExportTest->testExportTranslation()
Failed to set field langcode to frOtherLocaleExportTest.php95Drupal\locale\Tests\LocaleExportTest->testExportTranslation()
Failed to set field content_options[not_customized] to OtherLocaleExportTest.php95Drupal\locale\Tests\LocaleExportTest->testExportTranslation()
Failed to set field content_options[customized] to 1OtherLocaleExportTest.php95Drupal\locale\Tests\LocaleExportTest->testExportTranslation()
Failed to set field content_options[not_translated] to OtherLocaleExportTest.php95Drupal\locale\Tests\LocaleExportTest->testExportTranslation()
Found the requested form fields at admin/config/regional/translate/exportOtherLocaleExportTest.php95Drupal\locale\Tests\LocaleExportTest->testExportTranslation()
Exported French translation file with only customized strings.OtherLocaleExportTest.php98Drupal\locale\Tests\LocaleExportTest->testExportTranslation()
French custom translation present in exported file.OtherLocaleExportTest.php100Drupal\locale\Tests\LocaleExportTest->testExportTranslation()
Failed to set field langcode to frOtherLocaleExportTest.php110Drupal\locale\Tests\LocaleExportTest->testExportTranslation()
Failed to set field content_options[not_customized] to OtherLocaleExportTest.php110Drupal\locale\Tests\LocaleExportTest->testExportTranslation()
Failed to set field content_options[customized] to OtherLocaleExportTest.php110Drupal\locale\Tests\LocaleExportTest->testExportTranslation()
Failed to set field content_options[not_translated] to 1OtherLocaleExportTest.php110Drupal\locale\Tests\LocaleExportTest->testExportTranslation()
Found the requested form fields at admin/config/regional/translate/exportOtherLocaleExportTest.php110Drupal\locale\Tests\LocaleExportTest->testExportTranslation()
Exported French translation file with only untranslated strings.OtherLocaleExportTest.php113Drupal\locale\Tests\LocaleExportTest->testExportTranslation()
Untranslated string present in exported file.OtherLocaleExportTest.php117Drupal\locale\Tests\LocaleExportTest->testExportTranslation()
ExpandDrupal\locale\Tests\LocaleImportFunctionalTest192483
MessageGroupFilenameLineFunctionStatus
The language has been automatically created.OtherLocaleImportFunctionalTest.php58Drupal\locale\Tests\LocaleImportFunctionalTest->testStandalonePoFile()
The translation file was successfully imported.OtherLocaleImportFunctionalTest.php61Drupal\locale\Tests\LocaleImportFunctionalTest->testStandalonePoFile()
Undefined index: frDrupal\locale\Tests\LocaleImportFunctionalTest->testStandalonePoFile() Drupal\simpletest\TestBase->run() simpletest_script_run_one_test('397', 'Drupal\locale\Tests\LocaleImportFunctionalTest') NoticeLocaleImportFunctionalTest.php65Drupal\locale\Tests\LocaleImportFunctionalTest->testStandalonePoFile()
Plural number initialized.OtherLocaleImportFunctionalTest.php65Drupal\locale\Tests\LocaleImportFunctionalTest->testStandalonePoFile()
Correct page redirection.OtherLocaleImportFunctionalTest.php68Drupal\locale\Tests\LocaleImportFunctionalTest->testStandalonePoFile()
The translation file was successfully imported.OtherLocaleImportFunctionalTest.php77Drupal\locale\Tests\LocaleImportFunctionalTest->testStandalonePoFile()
Unsafe strings were skipped.OtherLocaleImportFunctionalTest.php80Drupal\locale\Tests\LocaleImportFunctionalTest->testStandalonePoFile()
The empty translation file was successfully imported.OtherLocaleImportFunctionalTest.php88Drupal\locale\Tests\LocaleImportFunctionalTest->testStandalonePoFile()
The translation file was successfully imported.OtherLocaleImportFunctionalTest.php107Drupal\locale\Tests\LocaleImportFunctionalTest->testStandalonePoFile()
Failed to set field string to MontagOtherLocaleImportFunctionalTest.php114Drupal\locale\Tests\LocaleImportFunctionalTest->testStandalonePoFile()
Failed to set field langcode to frOtherLocaleImportFunctionalTest.php114Drupal\locale\Tests\LocaleImportFunctionalTest->testStandalonePoFile()
Failed to set field translation to translatedOtherLocaleImportFunctionalTest.php114Drupal\locale\Tests\LocaleImportFunctionalTest->testStandalonePoFile()
Found the Filter buttonOtherLocaleImportFunctionalTest.php114Drupal\locale\Tests\LocaleImportFunctionalTest->testStandalonePoFile()
Found the requested form fields at admin/config/regional/translate/translateOtherLocaleImportFunctionalTest.php114Drupal\locale\Tests\LocaleImportFunctionalTest->testStandalonePoFile()
Undefined index: frDrupal\locale\Tests\LocaleImportFunctionalTest->testStandalonePoFile() Drupal\simpletest\TestBase->run() simpletest_script_run_one_test('397', 'Drupal\locale\Tests\LocaleImportFunctionalTest') NoticeLocaleImportFunctionalTest.php119Drupal\locale\Tests\LocaleImportFunctionalTest->testStandalonePoFile()
Plural numbers untouched.OtherLocaleImportFunctionalTest.php119Drupal\locale\Tests\LocaleImportFunctionalTest->testStandalonePoFile()
The translation file was successfully imported.OtherLocaleImportFunctionalTest.php129Drupal\locale\Tests\LocaleImportFunctionalTest->testStandalonePoFile()
Failed to set field string to MontagOtherLocaleImportFunctionalTest.php136Drupal\locale\Tests\LocaleImportFunctionalTest->testStandalonePoFile()
Failed to set field langcode to frOtherLocaleImportFunctionalTest.php136Drupal\locale\Tests\LocaleImportFunctionalTest->testStandalonePoFile()
Failed to set field translation to translatedOtherLocaleImportFunctionalTest.php136Drupal\locale\Tests\LocaleImportFunctionalTest->testStandalonePoFile()
Found the Filter buttonOtherLocaleImportFunctionalTest.php136Drupal\locale\Tests\LocaleImportFunctionalTest->testStandalonePoFile()
Found the requested form fields at admin/config/regional/translate/translateOtherLocaleImportFunctionalTest.php136Drupal\locale\Tests\LocaleImportFunctionalTest->testStandalonePoFile()
String overwritten by imported string.OtherLocaleImportFunctionalTest.php137Drupal\locale\Tests\LocaleImportFunctionalTest->testStandalonePoFile()
Undefined index: frDrupal\locale\Tests\LocaleImportFunctionalTest->testStandalonePoFile() Drupal\simpletest\TestBase->run() simpletest_script_run_one_test('397', 'Drupal\locale\Tests\LocaleImportFunctionalTest') NoticeLocaleImportFunctionalTest.php140Drupal\locale\Tests\LocaleImportFunctionalTest->testStandalonePoFile()
Plural numbers changed.OtherLocaleImportFunctionalTest.php140Drupal\locale\Tests\LocaleImportFunctionalTest->testStandalonePoFile()
The customized translation file was successfully imported.OtherLocaleImportFunctionalTest.php149Drupal\locale\Tests\LocaleImportFunctionalTest->testStandalonePoFile()
Customized translations succesfully imported.OtherLocaleImportFunctionalTest.php154Drupal\locale\Tests\LocaleImportFunctionalTest->testStandalonePoFile()
The customized translation file was successfully imported.OtherLocaleImportFunctionalTest.php165Drupal\locale\Tests\LocaleImportFunctionalTest->testStandalonePoFile()
Failed to set field string to januariOtherLocaleImportFunctionalTest.php172Drupal\locale\Tests\LocaleImportFunctionalTest->testStandalonePoFile()
Failed to set field langcode to frOtherLocaleImportFunctionalTest.php172Drupal\locale\Tests\LocaleImportFunctionalTest->testStandalonePoFile()
Failed to set field translation to translatedOtherLocaleImportFunctionalTest.php172Drupal\locale\Tests\LocaleImportFunctionalTest->testStandalonePoFile()
Found the Filter buttonOtherLocaleImportFunctionalTest.php172Drupal\locale\Tests\LocaleImportFunctionalTest->testStandalonePoFile()
Found the requested form fields at admin/config/regional/translate/translateOtherLocaleImportFunctionalTest.php172Drupal\locale\Tests\LocaleImportFunctionalTest->testStandalonePoFile()
The customized translation file was successfully imported.OtherLocaleImportFunctionalTest.php184Drupal\locale\Tests\LocaleImportFunctionalTest->testStandalonePoFile()
Failed to set field string to januariOtherLocaleImportFunctionalTest.php191Drupal\locale\Tests\LocaleImportFunctionalTest->testStandalonePoFile()
Failed to set field langcode to frOtherLocaleImportFunctionalTest.php191Drupal\locale\Tests\LocaleImportFunctionalTest->testStandalonePoFile()
Failed to set field translation to translatedOtherLocaleImportFunctionalTest.php191Drupal\locale\Tests\LocaleImportFunctionalTest->testStandalonePoFile()
Found the Filter buttonOtherLocaleImportFunctionalTest.php191Drupal\locale\Tests\LocaleImportFunctionalTest->testStandalonePoFile()
Found the requested form fields at admin/config/regional/translate/translateOtherLocaleImportFunctionalTest.php191Drupal\locale\Tests\LocaleImportFunctionalTest->testStandalonePoFile()
Customized string overwritten by imported string.OtherLocaleImportFunctionalTest.php192Drupal\locale\Tests\LocaleImportFunctionalTest->testStandalonePoFile()
Long month name context is working.OtherLocaleImportFunctionalTest.php205Drupal\locale\Tests\LocaleImportFunctionalTest->testLanguageContext()
Default context is working.OtherLocaleImportFunctionalTest.php206Drupal\locale\Tests\LocaleImportFunctionalTest->testLanguageContext()
The translation file was successfully imported.OtherLocaleImportFunctionalTest.php220Drupal\locale\Tests\LocaleImportFunctionalTest->testEmptyMsgstr()
String imported and translated.OtherLocaleImportFunctionalTest.php221Drupal\locale\Tests\LocaleImportFunctionalTest->testEmptyMsgstr()
The translation file was successfully imported.OtherLocaleImportFunctionalTest.php228Drupal\locale\Tests\LocaleImportFunctionalTest->testEmptyMsgstr()
Failed to set field string to OperationsOtherLocaleImportFunctionalTest.php236Drupal\locale\Tests\LocaleImportFunctionalTest->testEmptyMsgstr()
Failed to set field langcode to huOtherLocaleImportFunctionalTest.php236Drupal\locale\Tests\LocaleImportFunctionalTest->testEmptyMsgstr()
Failed to set field translation to untranslatedOtherLocaleImportFunctionalTest.php236Drupal\locale\Tests\LocaleImportFunctionalTest->testEmptyMsgstr()
Found the Filter buttonOtherLocaleImportFunctionalTest.php236Drupal\locale\Tests\LocaleImportFunctionalTest->testEmptyMsgstr()
Found the requested form fields at admin/config/regional/translate/translateOtherLocaleImportFunctionalTest.php236Drupal\locale\Tests\LocaleImportFunctionalTest->testEmptyMsgstr()
Search found the string as untranslated.OtherLocaleImportFunctionalTest.php237Drupal\locale\Tests\LocaleImportFunctionalTest->testEmptyMsgstr()
ExpandDrupal\locale\Tests\LocalePluralFormatTest86730
MessageGroupFilenameLineFunctionStatus
Computed plural index for fr for count 1 is 0OtherLocalePluralFormatTest.php124Drupal\locale\Tests\LocalePluralFormatTest->testGetPluralFormat()
Plural translation of 1 hours / @count hours for count 1 in fr is 1 heureOtherLocalePluralFormatTest.php129Drupal\locale\Tests\LocalePluralFormatTest->testGetPluralFormat()
Computed plural index for fr for count 0 is 0OtherLocalePluralFormatTest.php124Drupal\locale\Tests\LocalePluralFormatTest->testGetPluralFormat()
Plural translation of 1 hours / @count hours for count 0 in fr is 0 heureOtherLocalePluralFormatTest.php129Drupal\locale\Tests\LocalePluralFormatTest->testGetPluralFormat()
Computed plural index for fr for count 5 is 1OtherLocalePluralFormatTest.php124Drupal\locale\Tests\LocalePluralFormatTest->testGetPluralFormat()
Plural translation of 1 hours / @count hours for count 5 in fr is 5 heuresOtherLocalePluralFormatTest.php129Drupal\locale\Tests\LocalePluralFormatTest->testGetPluralFormat()
Computed plural index for hr for count 1 is 0OtherLocalePluralFormatTest.php124Drupal\locale\Tests\LocalePluralFormatTest->testGetPluralFormat()
Plural translation of 1 hours / @count hours for count 1 in hr is 1 satOtherLocalePluralFormatTest.php129Drupal\locale\Tests\LocalePluralFormatTest->testGetPluralFormat()
Computed plural index for hr for count 21 is 0OtherLocalePluralFormatTest.php124Drupal\locale\Tests\LocalePluralFormatTest->testGetPluralFormat()
Plural translation of 1 hours / @count hours for count 21 in hr is 21 satOtherLocalePluralFormatTest.php129Drupal\locale\Tests\LocalePluralFormatTest->testGetPluralFormat()
Computed plural index for hr for count 0 is 2OtherLocalePluralFormatTest.php124Drupal\locale\Tests\LocalePluralFormatTest->testGetPluralFormat()
Plural translation of 1 hours / @count hours for count 0 in hr is 0 satiOtherLocalePluralFormatTest.php129Drupal\locale\Tests\LocalePluralFormatTest->testGetPluralFormat()
Computed plural index for hr for count 2 is 1OtherLocalePluralFormatTest.php124Drupal\locale\Tests\LocalePluralFormatTest->testGetPluralFormat()
Plural translation of 1 hours / @count hours for count 2 in hr is 2 sataOtherLocalePluralFormatTest.php129Drupal\locale\Tests\LocalePluralFormatTest->testGetPluralFormat()
Computed plural index for hr for count 8 is 2OtherLocalePluralFormatTest.php124Drupal\locale\Tests\LocalePluralFormatTest->testGetPluralFormat()
Plural translation of 1 hours / @count hours for count 8 in hr is 8 satiOtherLocalePluralFormatTest.php129Drupal\locale\Tests\LocalePluralFormatTest->testGetPluralFormat()
Failed to set field langcode to frOtherLocalePluralFormatTest.php150Drupal\locale\Tests\LocalePluralFormatTest->testPluralEditExport()
Found the requested form fields at admin/config/regional/translate/exportOtherLocalePluralFormatTest.php150Drupal\locale\Tests\LocalePluralFormatTest->testPluralEditExport()
Exported French translation file.OtherLocalePluralFormatTest.php152Drupal\locale\Tests\LocalePluralFormatTest->testPluralEditExport()
French translations present in exported file.OtherLocalePluralFormatTest.php154Drupal\locale\Tests\LocalePluralFormatTest->testPluralEditExport()
Plural translations exported properly.OtherLocalePluralFormatTest.php156Drupal\locale\Tests\LocalePluralFormatTest->testPluralEditExport()
Failed to set field langcode to hrOtherLocalePluralFormatTest.php161Drupal\locale\Tests\LocalePluralFormatTest->testPluralEditExport()
Found the requested form fields at admin/config/regional/translate/exportOtherLocalePluralFormatTest.php161Drupal\locale\Tests\LocalePluralFormatTest->testPluralEditExport()
Exported Croatian translation file.OtherLocalePluralFormatTest.php163Drupal\locale\Tests\LocalePluralFormatTest->testPluralEditExport()
Croatian translations present in exported file.OtherLocalePluralFormatTest.php165Drupal\locale\Tests\LocalePluralFormatTest->testPluralEditExport()
Plural translations exported properly.OtherLocalePluralFormatTest.php167Drupal\locale\Tests\LocalePluralFormatTest->testPluralEditExport()
"1 hour" foundOtherLocalePluralFormatTest.php171Drupal\locale\Tests\LocalePluralFormatTest->testPluralEditExport()
"@count hours" foundOtherLocalePluralFormatTest.php172Drupal\locale\Tests\LocalePluralFormatTest->testPluralEditExport()
Failed to set field langcode to hrOtherLocalePluralFormatTest.php179Drupal\locale\Tests\LocalePluralFormatTest->testPluralEditExport()
Found the Filter buttonOtherLocalePluralFormatTest.php179Drupal\locale\Tests\LocalePluralFormatTest->testPluralEditExport()
Found the requested form fields at admin/config/regional/translate/OtherLocalePluralFormatTest.php179Drupal\locale\Tests\LocalePluralFormatTest->testPluralEditExport()
"Singular form" foundOtherLocalePluralFormatTest.php181Drupal\locale\Tests\LocalePluralFormatTest->testPluralEditExport()
"First plural form" foundOtherLocalePluralFormatTest.php182Drupal\locale\Tests\LocalePluralFormatTest->testPluralEditExport()
"2. plural form" foundOtherLocalePluralFormatTest.php183Drupal\locale\Tests\LocalePluralFormatTest->testPluralEditExport()
"@count sat" foundOtherLocalePluralFormatTest.php187Drupal\locale\Tests\LocalePluralFormatTest->testPluralEditExport()
"@count sata" foundOtherLocalePluralFormatTest.php188Drupal\locale\Tests\LocalePluralFormatTest->testPluralEditExport()
"@count sati" foundOtherLocalePluralFormatTest.php189Drupal\locale\Tests\LocalePluralFormatTest->testPluralEditExport()
Failed to set field strings[][translations][1] to @count sata editedOtherLocalePluralFormatTest.php196Drupal\locale\Tests\LocalePluralFormatTest->testPluralEditExport()
Found the Save translations buttonOtherLocalePluralFormatTest.php196Drupal\locale\Tests\LocalePluralFormatTest->testPluralEditExport()
Found the requested form fields at admin/config/regional/translate/OtherLocalePluralFormatTest.php196Drupal\locale\Tests\LocalePluralFormatTest->testPluralEditExport()
Failed to set field langcode to frOtherLocalePluralFormatTest.php201Drupal\locale\Tests\LocalePluralFormatTest->testPluralEditExport()
Found the Filter buttonOtherLocalePluralFormatTest.php201Drupal\locale\Tests\LocalePluralFormatTest->testPluralEditExport()
Found the requested form fields at admin/config/regional/translate/translateOtherLocalePluralFormatTest.php201Drupal\locale\Tests\LocalePluralFormatTest->testPluralEditExport()
"@count heure" foundOtherLocalePluralFormatTest.php203Drupal\locale\Tests\LocalePluralFormatTest->testPluralEditExport()
"@count heures" foundOtherLocalePluralFormatTest.php204Drupal\locale\Tests\LocalePluralFormatTest->testPluralEditExport()
Failed to set field strings[][translations][0] to @count heure editedOtherLocalePluralFormatTest.php211Drupal\locale\Tests\LocalePluralFormatTest->testPluralEditExport()
Found the Save translations buttonOtherLocalePluralFormatTest.php211Drupal\locale\Tests\LocalePluralFormatTest->testPluralEditExport()
Found the requested form fields at admin/config/regional/translate/OtherLocalePluralFormatTest.php211Drupal\locale\Tests\LocalePluralFormatTest->testPluralEditExport()
Failed to set field string to 1 dayOtherLocalePluralFormatTest.php224Drupal\locale\Tests\LocalePluralFormatTest->testPluralEditExport()
Failed to set field langcode to frOtherLocalePluralFormatTest.php224Drupal\locale\Tests\LocalePluralFormatTest->testPluralEditExport()
Found the Filter buttonOtherLocalePluralFormatTest.php224Drupal\locale\Tests\LocalePluralFormatTest->testPluralEditExport()
Found the requested form fields at admin/config/regional/translate/translateOtherLocalePluralFormatTest.php224Drupal\locale\Tests\LocalePluralFormatTest->testPluralEditExport()
Failed to set field strings[11][translations][0] to 1 jourOtherLocalePluralFormatTest.php231Drupal\locale\Tests\LocalePluralFormatTest->testPluralEditExport()
Failed to set field strings[11][translations][1] to @count joursOtherLocalePluralFormatTest.php231Drupal\locale\Tests\LocalePluralFormatTest->testPluralEditExport()
Found the Save translations buttonOtherLocalePluralFormatTest.php231Drupal\locale\Tests\LocalePluralFormatTest->testPluralEditExport()
Found the requested form fields at admin/config/regional/translate/OtherLocalePluralFormatTest.php231Drupal\locale\Tests\LocalePluralFormatTest->testPluralEditExport()
Failed to set field string to 1 dayOtherLocalePluralFormatTest.php238Drupal\locale\Tests\LocalePluralFormatTest->testPluralEditExport()
Failed to set field langcode to hrOtherLocalePluralFormatTest.php238Drupal\locale\Tests\LocalePluralFormatTest->testPluralEditExport()
Found the Filter buttonOtherLocalePluralFormatTest.php238Drupal\locale\Tests\LocalePluralFormatTest->testPluralEditExport()
Found the requested form fields at admin/config/regional/translate/translateOtherLocalePluralFormatTest.php238Drupal\locale\Tests\LocalePluralFormatTest->testPluralEditExport()
Failed to set field strings[11][translations][0] to @count danOtherLocalePluralFormatTest.php245Drupal\locale\Tests\LocalePluralFormatTest->testPluralEditExport()
Failed to set field strings[11][translations][1] to @count danaOtherLocalePluralFormatTest.php245Drupal\locale\Tests\LocalePluralFormatTest->testPluralEditExport()
Failed to set field strings[11][translations][2] to @count danaOtherLocalePluralFormatTest.php245Drupal\locale\Tests\LocalePluralFormatTest->testPluralEditExport()
Found the Save translations buttonOtherLocalePluralFormatTest.php245Drupal\locale\Tests\LocalePluralFormatTest->testPluralEditExport()
Found the requested form fields at admin/config/regional/translate/OtherLocalePluralFormatTest.php245Drupal\locale\Tests\LocalePluralFormatTest->testPluralEditExport()
Failed to set field langcode to frOtherLocalePluralFormatTest.php250Drupal\locale\Tests\LocalePluralFormatTest->testPluralEditExport()
Found the requested form fields at admin/config/regional/translate/exportOtherLocalePluralFormatTest.php250Drupal\locale\Tests\LocalePluralFormatTest->testPluralEditExport()
Edited French plural translations for hours exported properly.OtherLocalePluralFormatTest.php252Drupal\locale\Tests\LocalePluralFormatTest->testPluralEditExport()
Added French plural translations for days exported properly.OtherLocalePluralFormatTest.php253Drupal\locale\Tests\LocalePluralFormatTest->testPluralEditExport()
Failed to set field langcode to hrOtherLocalePluralFormatTest.php258Drupal\locale\Tests\LocalePluralFormatTest->testPluralEditExport()
Found the requested form fields at admin/config/regional/translate/exportOtherLocalePluralFormatTest.php258Drupal\locale\Tests\LocalePluralFormatTest->testPluralEditExport()
Edited Croatian plural translations exported properly.OtherLocalePluralFormatTest.php260Drupal\locale\Tests\LocalePluralFormatTest->testPluralEditExport()
Added Croatian plural translations exported properly.OtherLocalePluralFormatTest.php261Drupal\locale\Tests\LocalePluralFormatTest->testPluralEditExport()
ExpandDrupal\rdf\Tests\RdfMappingUpgradePathTest523
MessageGroupFilenameLineFunctionStatus
Invoking hooks entity_info is not supported during updatesLogicExceptionUpdateModuleHandler.php50Drupal\Core\Extension\UpdateModuleHandler->getImplementations()
simplexml_import_dom(): Invalid Nodetype to importsimplexml_import_dom(Object) Drupal\simpletest\WebTestBase->parse() Drupal\simpletest\WebTestBase->xpath('//input[@type="submit"]') Drupal\simpletest\WebTestBase->assertFieldByXPath('//input[@type="submit"]') Drupal\system\Tests\Upgrade\UpgradePathTestBase->performUpgrade() Drupal\rdf\Tests\RdfMappingUpgradePathTest->testRdfMappingUpgrade() Drupal\simpletest\TestBase->run() simpletest_script_run_one_test('513', 'Drupal\rdf\Tests\RdfMappingUpgradePathTest') WarningWebTestBase.php1184Drupal\simpletest\WebTestBase->parse()
Parsed page successfully.BrowserUpgradePathTestBase.php239Drupal\system\Tests\Upgrade\UpgradePathTestBase->performUpgrade()
Value false is TRUE.OtherUpgradePathTestBase.php239Drupal\system\Tests\Upgrade\UpgradePathTestBase->performUpgrade()
Exception: An error was encountered during the first access to update.php. in Drupal\system\Tests\Upgrade\UpgradePathTestBase->performUpgrade() (line 240 of /var/lib/drupaltestbot/sites/default/files/checkout/core/modules/system/lib/Drupal/system/Tests/Upgrade/UpgradePathTestBase.php). Drupal\system\Tests\Upgrade\UpgradePathTestBase->performUpgrade() Drupal\rdf\Tests\RdfMappingUpgradePathTest->testRdfMappingUpgrade() Drupal\simpletest\TestBase->run() simpletest_script_run_one_test('513', 'Drupal\rdf\Tests\RdfMappingUpgradePathTest') Uncaught exceptionUpgradePathTestBase.php240Drupal\system\Tests\Upgrade\UpgradePathTestBase->performUpgrade()
ExpandDrupal\system\Tests\Upgrade\BareStandardUpgradePathTest423
MessageGroupFilenameLineFunctionStatus
Invoking hooks entity_info is not supported during updatesLogicExceptionUpdateModuleHandler.php50Drupal\Core\Extension\UpdateModuleHandler->getImplementations()
simplexml_import_dom(): Invalid Nodetype to importsimplexml_import_dom(Object) Drupal\simpletest\WebTestBase->parse() Drupal\simpletest\WebTestBase->xpath('//input[@type="submit"]') Drupal\simpletest\WebTestBase->assertFieldByXPath('//input[@type="submit"]') Drupal\system\Tests\Upgrade\UpgradePathTestBase->performUpgrade() Drupal\system\Tests\Upgrade\BareStandardUpgradePathTest->testBasicStandardUpgrade() Drupal\simpletest\TestBase->run() simpletest_script_run_one_test('660', 'Drupal\system\Tests\Upgrade\BareStandardUpgradePathTest') WarningWebTestBase.php1184Drupal\simpletest\WebTestBase->parse()
Parsed page successfully.BrowserUpgradePathTestBase.php239Drupal\system\Tests\Upgrade\UpgradePathTestBase->performUpgrade()
Value false is TRUE.OtherUpgradePathTestBase.php239Drupal\system\Tests\Upgrade\UpgradePathTestBase->performUpgrade()
Exception: An error was encountered during the first access to update.php. in Drupal\system\Tests\Upgrade\UpgradePathTestBase->performUpgrade() (line 240 of /var/lib/drupaltestbot/sites/default/files/checkout/core/modules/system/lib/Drupal/system/Tests/Upgrade/UpgradePathTestBase.php). Drupal\system\Tests\Upgrade\UpgradePathTestBase->performUpgrade() Drupal\system\Tests\Upgrade\BareStandardUpgradePathTest->testBasicStandardUpgrade() Drupal\simpletest\TestBase->run() simpletest_script_run_one_test('660', 'Drupal\system\Tests\Upgrade\BareStandardUpgradePathTest') Uncaught exceptionUpgradePathTestBase.php240Drupal\system\Tests\Upgrade\UpgradePathTestBase->performUpgrade()
ExpandDrupal\system\Tests\Upgrade\DateUpgradePathTest423
MessageGroupFilenameLineFunctionStatus
Invoking hooks entity_info is not supported during updatesLogicExceptionUpdateModuleHandler.php50Drupal\Core\Extension\UpdateModuleHandler->getImplementations()
simplexml_import_dom(): Invalid Nodetype to importsimplexml_import_dom(Object) Drupal\simpletest\WebTestBase->parse() Drupal\simpletest\WebTestBase->xpath('//input[@type="submit"]') Drupal\simpletest\WebTestBase->assertFieldByXPath('//input[@type="submit"]') Drupal\system\Tests\Upgrade\UpgradePathTestBase->performUpgrade() Drupal\system\Tests\Upgrade\DateUpgradePathTest->testDateUpgrade() Drupal\simpletest\TestBase->run() simpletest_script_run_one_test('662', 'Drupal\system\Tests\Upgrade\DateUpgradePathTest') WarningWebTestBase.php1184Drupal\simpletest\WebTestBase->parse()
Parsed page successfully.BrowserUpgradePathTestBase.php239Drupal\system\Tests\Upgrade\UpgradePathTestBase->performUpgrade()
Value false is TRUE.OtherUpgradePathTestBase.php239Drupal\system\Tests\Upgrade\UpgradePathTestBase->performUpgrade()
Exception: An error was encountered during the first access to update.php. in Drupal\system\Tests\Upgrade\UpgradePathTestBase->performUpgrade() (line 240 of /var/lib/drupaltestbot/sites/default/files/checkout/core/modules/system/lib/Drupal/system/Tests/Upgrade/UpgradePathTestBase.php). Drupal\system\Tests\Upgrade\UpgradePathTestBase->performUpgrade() Drupal\system\Tests\Upgrade\DateUpgradePathTest->testDateUpgrade() Drupal\simpletest\TestBase->run() simpletest_script_run_one_test('662', 'Drupal\system\Tests\Upgrade\DateUpgradePathTest') Uncaught exceptionUpgradePathTestBase.php240Drupal\system\Tests\Upgrade\UpgradePathTestBase->performUpgrade()
ExpandDrupal\system\Tests\Upgrade\FieldUIUpgradePathTest423
MessageGroupFilenameLineFunctionStatus
Invoking hooks entity_info is not supported during updatesLogicExceptionUpdateModuleHandler.php50Drupal\Core\Extension\UpdateModuleHandler->getImplementations()
simplexml_import_dom(): Invalid Nodetype to importsimplexml_import_dom(Object) Drupal\simpletest\WebTestBase->parse() Drupal\simpletest\WebTestBase->xpath('//input[@type="submit"]') Drupal\simpletest\WebTestBase->assertFieldByXPath('//input[@type="submit"]') Drupal\system\Tests\Upgrade\UpgradePathTestBase->performUpgrade() Drupal\system\Tests\Upgrade\FieldUIUpgradePathTest->testFieldUIPermissions() Drupal\simpletest\TestBase->run() simpletest_script_run_one_test('664', 'Drupal\system\Tests\Upgrade\FieldUIUpgradePathTest') WarningWebTestBase.php1184Drupal\simpletest\WebTestBase->parse()
Parsed page successfully.BrowserUpgradePathTestBase.php239Drupal\system\Tests\Upgrade\UpgradePathTestBase->performUpgrade()
Value false is TRUE.OtherUpgradePathTestBase.php239Drupal\system\Tests\Upgrade\UpgradePathTestBase->performUpgrade()
Exception: An error was encountered during the first access to update.php. in Drupal\system\Tests\Upgrade\UpgradePathTestBase->performUpgrade() (line 240 of /var/lib/drupaltestbot/sites/default/files/checkout/core/modules/system/lib/Drupal/system/Tests/Upgrade/UpgradePathTestBase.php). Drupal\system\Tests\Upgrade\UpgradePathTestBase->performUpgrade() Drupal\system\Tests\Upgrade\FieldUIUpgradePathTest->testFieldUIPermissions() Drupal\simpletest\TestBase->run() simpletest_script_run_one_test('664', 'Drupal\system\Tests\Upgrade\FieldUIUpgradePathTest') Uncaught exceptionUpgradePathTestBase.php240Drupal\system\Tests\Upgrade\UpgradePathTestBase->performUpgrade()
ExpandDrupal\system\Tests\Upgrade\FieldUpgradePathTest1269
MessageGroupFilenameLineFunctionStatus
Invoking hooks entity_info is not supported during updatesLogicExceptionUpdateModuleHandler.php50Drupal\Core\Extension\UpdateModuleHandler->getImplementations()
simplexml_import_dom(): Invalid Nodetype to importsimplexml_import_dom(Object) Drupal\simpletest\WebTestBase->parse() Drupal\simpletest\WebTestBase->xpath('//input[@type="submit"]') Drupal\simpletest\WebTestBase->assertFieldByXPath('//input[@type="submit"]') Drupal\system\Tests\Upgrade\UpgradePathTestBase->performUpgrade() Drupal\system\Tests\Upgrade\FieldUpgradePathTest->testEntityDisplayUpgrade() Drupal\simpletest\TestBase->run() simpletest_script_run_one_test('665', 'Drupal\system\Tests\Upgrade\FieldUpgradePathTest') WarningWebTestBase.php1184Drupal\simpletest\WebTestBase->parse()
Parsed page successfully.BrowserUpgradePathTestBase.php239Drupal\system\Tests\Upgrade\UpgradePathTestBase->performUpgrade()
Value false is TRUE.OtherUpgradePathTestBase.php239Drupal\system\Tests\Upgrade\UpgradePathTestBase->performUpgrade()
Exception: An error was encountered during the first access to update.php. in Drupal\system\Tests\Upgrade\UpgradePathTestBase->performUpgrade() (line 240 of /var/lib/drupaltestbot/sites/default/files/checkout/core/modules/system/lib/Drupal/system/Tests/Upgrade/UpgradePathTestBase.php). Drupal\system\Tests\Upgrade\UpgradePathTestBase->performUpgrade() Drupal\system\Tests\Upgrade\FieldUpgradePathTest->testEntityDisplayUpgrade() Drupal\simpletest\TestBase->run() simpletest_script_run_one_test('665', 'Drupal\system\Tests\Upgrade\FieldUpgradePathTest') Uncaught exceptionUpgradePathTestBase.php240Drupal\system\Tests\Upgrade\UpgradePathTestBase->performUpgrade()
Invoking hooks entity_info is not supported during updatesLogicExceptionUpdateModuleHandler.php50Drupal\Core\Extension\UpdateModuleHandler->getImplementations()
simplexml_import_dom(): Invalid Nodetype to importsimplexml_import_dom(Object) Drupal\simpletest\WebTestBase->parse() Drupal\simpletest\WebTestBase->xpath('//input[@type="submit"]') Drupal\simpletest\WebTestBase->assertFieldByXPath('//input[@type="submit"]') Drupal\system\Tests\Upgrade\UpgradePathTestBase->performUpgrade() Drupal\system\Tests\Upgrade\FieldUpgradePathTest->testEntityFormDisplayUpgrade() Drupal\simpletest\TestBase->run() simpletest_script_run_one_test('665', 'Drupal\system\Tests\Upgrade\FieldUpgradePathTest') WarningWebTestBase.php1184Drupal\simpletest\WebTestBase->parse()
Parsed page successfully.BrowserUpgradePathTestBase.php239Drupal\system\Tests\Upgrade\UpgradePathTestBase->performUpgrade()
Value false is TRUE.OtherUpgradePathTestBase.php239Drupal\system\Tests\Upgrade\UpgradePathTestBase->performUpgrade()
Exception: An error was encountered during the first access to update.php. in Drupal\system\Tests\Upgrade\UpgradePathTestBase->performUpgrade() (line 240 of /var/lib/drupaltestbot/sites/default/files/checkout/core/modules/system/lib/Drupal/system/Tests/Upgrade/UpgradePathTestBase.php). Drupal\system\Tests\Upgrade\UpgradePathTestBase->performUpgrade() Drupal\system\Tests\Upgrade\FieldUpgradePathTest->testEntityFormDisplayUpgrade() Drupal\simpletest\TestBase->run() simpletest_script_run_one_test('665', 'Drupal\system\Tests\Upgrade\FieldUpgradePathTest') Uncaught exceptionUpgradePathTestBase.php240Drupal\system\Tests\Upgrade\UpgradePathTestBase->performUpgrade()
Invoking hooks entity_info is not supported during updatesLogicExceptionUpdateModuleHandler.php50Drupal\Core\Extension\UpdateModuleHandler->getImplementations()
simplexml_import_dom(): Invalid Nodetype to importsimplexml_import_dom(Object) Drupal\simpletest\WebTestBase->parse() Drupal\simpletest\WebTestBase->xpath('//input[@type="submit"]') Drupal\simpletest\WebTestBase->assertFieldByXPath('//input[@type="submit"]') Drupal\system\Tests\Upgrade\UpgradePathTestBase->performUpgrade() Drupal\system\Tests\Upgrade\FieldUpgradePathTest->testFieldUpgradeToConfig() Drupal\simpletest\TestBase->run() simpletest_script_run_one_test('665', 'Drupal\system\Tests\Upgrade\FieldUpgradePathTest') WarningWebTestBase.php1184Drupal\simpletest\WebTestBase->parse()
Parsed page successfully.BrowserUpgradePathTestBase.php239Drupal\system\Tests\Upgrade\UpgradePathTestBase->performUpgrade()
Value false is TRUE.OtherUpgradePathTestBase.php239Drupal\system\Tests\Upgrade\UpgradePathTestBase->performUpgrade()
Exception: An error was encountered during the first access to update.php. in Drupal\system\Tests\Upgrade\UpgradePathTestBase->performUpgrade() (line 240 of /var/lib/drupaltestbot/sites/default/files/checkout/core/modules/system/lib/Drupal/system/Tests/Upgrade/UpgradePathTestBase.php). Drupal\system\Tests\Upgrade\UpgradePathTestBase->performUpgrade() Drupal\system\Tests\Upgrade\FieldUpgradePathTest->testFieldUpgradeToConfig() Drupal\simpletest\TestBase->run() simpletest_script_run_one_test('665', 'Drupal\system\Tests\Upgrade\FieldUpgradePathTest') Uncaught exceptionUpgradePathTestBase.php240Drupal\system\Tests\Upgrade\UpgradePathTestBase->performUpgrade()
ExpandDrupal\system\Tests\Upgrade\FilledStandardUpgradePathTest423
MessageGroupFilenameLineFunctionStatus
Invoking hooks entity_info is not supported during updatesLogicExceptionUpdateModuleHandler.php50Drupal\Core\Extension\UpdateModuleHandler->getImplementations()
simplexml_import_dom(): Invalid Nodetype to importsimplexml_import_dom(Object) Drupal\simpletest\WebTestBase->parse() Drupal\simpletest\WebTestBase->xpath('//input[@type="submit"]') Drupal\simpletest\WebTestBase->assertFieldByXPath('//input[@type="submit"]') Drupal\system\Tests\Upgrade\UpgradePathTestBase->performUpgrade() Drupal\system\Tests\Upgrade\FilledStandardUpgradePathTest->testFilledStandardUpgrade() Drupal\simpletest\TestBase->run() simpletest_script_run_one_test('667', 'Drupal\system\Tests\Upgrade\FilledStandardUpgradePathTest') WarningWebTestBase.php1184Drupal\simpletest\WebTestBase->parse()
Parsed page successfully.BrowserUpgradePathTestBase.php239Drupal\system\Tests\Upgrade\UpgradePathTestBase->performUpgrade()
Value false is TRUE.OtherUpgradePathTestBase.php239Drupal\system\Tests\Upgrade\UpgradePathTestBase->performUpgrade()
Exception: An error was encountered during the first access to update.php. in Drupal\system\Tests\Upgrade\UpgradePathTestBase->performUpgrade() (line 240 of /var/lib/drupaltestbot/sites/default/files/checkout/core/modules/system/lib/Drupal/system/Tests/Upgrade/UpgradePathTestBase.php). Drupal\system\Tests\Upgrade\UpgradePathTestBase->performUpgrade() Drupal\system\Tests\Upgrade\FilledStandardUpgradePathTest->testFilledStandardUpgrade() Drupal\simpletest\TestBase->run() simpletest_script_run_one_test('667', 'Drupal\system\Tests\Upgrade\FilledStandardUpgradePathTest') Uncaught exceptionUpgradePathTestBase.php240Drupal\system\Tests\Upgrade\UpgradePathTestBase->performUpgrade()
ExpandDrupal\system\Tests\Upgrade\FilterFormatUpgradePathTest423
MessageGroupFilenameLineFunctionStatus
Invoking hooks entity_info is not supported during updatesLogicExceptionUpdateModuleHandler.php50Drupal\Core\Extension\UpdateModuleHandler->getImplementations()
simplexml_import_dom(): Invalid Nodetype to importsimplexml_import_dom(Object) Drupal\simpletest\WebTestBase->parse() Drupal\simpletest\WebTestBase->xpath('//input[@type="submit"]') Drupal\simpletest\WebTestBase->assertFieldByXPath('//input[@type="submit"]') Drupal\system\Tests\Upgrade\UpgradePathTestBase->performUpgrade() Drupal\system\Tests\Upgrade\FilterFormatUpgradePathTest->testFilterFormatUpgrade() Drupal\simpletest\TestBase->run() simpletest_script_run_one_test('668', 'Drupal\system\Tests\Upgrade\FilterFormatUpgradePathTest') WarningWebTestBase.php1184Drupal\simpletest\WebTestBase->parse()
Parsed page successfully.BrowserUpgradePathTestBase.php239Drupal\system\Tests\Upgrade\UpgradePathTestBase->performUpgrade()
Value false is TRUE.OtherUpgradePathTestBase.php239Drupal\system\Tests\Upgrade\UpgradePathTestBase->performUpgrade()
Exception: An error was encountered during the first access to update.php. in Drupal\system\Tests\Upgrade\UpgradePathTestBase->performUpgrade() (line 240 of /var/lib/drupaltestbot/sites/default/files/checkout/core/modules/system/lib/Drupal/system/Tests/Upgrade/UpgradePathTestBase.php). Drupal\system\Tests\Upgrade\UpgradePathTestBase->performUpgrade() Drupal\system\Tests\Upgrade\FilterFormatUpgradePathTest->testFilterFormatUpgrade() Drupal\simpletest\TestBase->run() simpletest_script_run_one_test('668', 'Drupal\system\Tests\Upgrade\FilterFormatUpgradePathTest') Uncaught exceptionUpgradePathTestBase.php240Drupal\system\Tests\Upgrade\UpgradePathTestBase->performUpgrade()
ExpandDrupal\system\Tests\Upgrade\ImageUpgradePathTest423
MessageGroupFilenameLineFunctionStatus
Invoking hooks entity_info is not supported during updatesLogicExceptionUpdateModuleHandler.php50Drupal\Core\Extension\UpdateModuleHandler->getImplementations()
simplexml_import_dom(): Invalid Nodetype to importsimplexml_import_dom(Object) Drupal\simpletest\WebTestBase->parse() Drupal\simpletest\WebTestBase->xpath('//input[@type="submit"]') Drupal\simpletest\WebTestBase->assertFieldByXPath('//input[@type="submit"]') Drupal\system\Tests\Upgrade\UpgradePathTestBase->performUpgrade() Drupal\system\Tests\Upgrade\ImageUpgradePathTest->testImageStyleUpgrade() Drupal\simpletest\TestBase->run() simpletest_script_run_one_test('669', 'Drupal\system\Tests\Upgrade\ImageUpgradePathTest') WarningWebTestBase.php1184Drupal\simpletest\WebTestBase->parse()
Parsed page successfully.BrowserUpgradePathTestBase.php239Drupal\system\Tests\Upgrade\UpgradePathTestBase->performUpgrade()
Value false is TRUE.OtherUpgradePathTestBase.php239Drupal\system\Tests\Upgrade\UpgradePathTestBase->performUpgrade()
Exception: An error was encountered during the first access to update.php. in Drupal\system\Tests\Upgrade\UpgradePathTestBase->performUpgrade() (line 240 of /var/lib/drupaltestbot/sites/default/files/checkout/core/modules/system/lib/Drupal/system/Tests/Upgrade/UpgradePathTestBase.php). Drupal\system\Tests\Upgrade\UpgradePathTestBase->performUpgrade() Drupal\system\Tests\Upgrade\ImageUpgradePathTest->testImageStyleUpgrade() Drupal\simpletest\TestBase->run() simpletest_script_run_one_test('669', 'Drupal\system\Tests\Upgrade\ImageUpgradePathTest') Uncaught exceptionUpgradePathTestBase.php240Drupal\system\Tests\Upgrade\UpgradePathTestBase->performUpgrade()
ExpandDrupal\system\Tests\Upgrade\LanguageUpgradePathTest844
MessageGroupFilenameLineFunctionStatus
HTTP response expected 200, actual 500BrowserUpgradePathTestBase.php234Drupal\system\Tests\Upgrade\UpgradePathTestBase->performUpgrade()
Exception: Initial GET to update.php did not return HTTP 200 status. in Drupal\system\Tests\Upgrade\UpgradePathTestBase->performUpgrade() (line 235 of /var/lib/drupaltestbot/sites/default/files/checkout/core/modules/system/lib/Drupal/system/Tests/Upgrade/UpgradePathTestBase.php). Drupal\system\Tests\Upgrade\UpgradePathTestBase->performUpgrade() Drupal\system\Tests\Upgrade\LanguageUpgradePathTest->testLanguageUpgrade() Drupal\simpletest\TestBase->run() simpletest_script_run_one_test('670', 'Drupal\system\Tests\Upgrade\LanguageUpgradePathTest') Uncaught exceptionUpgradePathTestBase.php235Drupal\system\Tests\Upgrade\UpgradePathTestBase->performUpgrade()
HTTP response expected 200, actual 500BrowserUpgradePathTestBase.php234Drupal\system\Tests\Upgrade\UpgradePathTestBase->performUpgrade()
Exception: Initial GET to update.php did not return HTTP 200 status. in Drupal\system\Tests\Upgrade\UpgradePathTestBase->performUpgrade() (line 235 of /var/lib/drupaltestbot/sites/default/files/checkout/core/modules/system/lib/Drupal/system/Tests/Upgrade/UpgradePathTestBase.php). Drupal\system\Tests\Upgrade\UpgradePathTestBase->performUpgrade() Drupal\system\Tests\Upgrade\LanguageUpgradePathTest->testLanguageUrlUpgrade() Drupal\simpletest\TestBase->run() simpletest_script_run_one_test('670', 'Drupal\system\Tests\Upgrade\LanguageUpgradePathTest') Uncaught exceptionUpgradePathTestBase.php235Drupal\system\Tests\Upgrade\UpgradePathTestBase->performUpgrade()
HTTP response expected 200, actual 500BrowserUpgradePathTestBase.php234Drupal\system\Tests\Upgrade\UpgradePathTestBase->performUpgrade()
Exception: Initial GET to update.php did not return HTTP 200 status. in Drupal\system\Tests\Upgrade\UpgradePathTestBase->performUpgrade() (line 235 of /var/lib/drupaltestbot/sites/default/files/checkout/core/modules/system/lib/Drupal/system/Tests/Upgrade/UpgradePathTestBase.php). Drupal\system\Tests\Upgrade\UpgradePathTestBase->performUpgrade() Drupal\system\Tests\Upgrade\LanguageUpgradePathTest->testLanguageNoPluralsUpgrade() Drupal\simpletest\TestBase->run() simpletest_script_run_one_test('670', 'Drupal\system\Tests\Upgrade\LanguageUpgradePathTest') Uncaught exceptionUpgradePathTestBase.php235Drupal\system\Tests\Upgrade\UpgradePathTestBase->performUpgrade()
HTTP response expected 200, actual 500BrowserUpgradePathTestBase.php234Drupal\system\Tests\Upgrade\UpgradePathTestBase->performUpgrade()
Exception: Initial GET to update.php did not return HTTP 200 status. in Drupal\system\Tests\Upgrade\UpgradePathTestBase->performUpgrade() (line 235 of /var/lib/drupaltestbot/sites/default/files/checkout/core/modules/system/lib/Drupal/system/Tests/Upgrade/UpgradePathTestBase.php). Drupal\system\Tests\Upgrade\UpgradePathTestBase->performUpgrade() Drupal\system\Tests\Upgrade\LanguageUpgradePathTest->testLanguagePermissionsUpgrade() Drupal\simpletest\TestBase->run() simpletest_script_run_one_test('670', 'Drupal\system\Tests\Upgrade\LanguageUpgradePathTest') Uncaught exceptionUpgradePathTestBase.php235Drupal\system\Tests\Upgrade\UpgradePathTestBase->performUpgrade()
ExpandDrupal\system\Tests\Upgrade\MailUpgradePathTest423
MessageGroupFilenameLineFunctionStatus
Invoking hooks entity_info is not supported during updatesLogicExceptionUpdateModuleHandler.php50Drupal\Core\Extension\UpdateModuleHandler->getImplementations()
simplexml_import_dom(): Invalid Nodetype to importsimplexml_import_dom(Object) Drupal\simpletest\WebTestBase->parse() Drupal\simpletest\WebTestBase->xpath('//input[@type="submit"]') Drupal\simpletest\WebTestBase->assertFieldByXPath('//input[@type="submit"]') Drupal\system\Tests\Upgrade\UpgradePathTestBase->performUpgrade(1) Drupal\system\Tests\Upgrade\MailUpgradePathTest->testMailSystemUpgrade() Drupal\simpletest\TestBase->run() simpletest_script_run_one_test('671', 'Drupal\system\Tests\Upgrade\MailUpgradePathTest') WarningWebTestBase.php1184Drupal\simpletest\WebTestBase->parse()
Parsed page successfully.BrowserUpgradePathTestBase.php239Drupal\system\Tests\Upgrade\UpgradePathTestBase->performUpgrade()
Value false is TRUE.OtherUpgradePathTestBase.php239Drupal\system\Tests\Upgrade\UpgradePathTestBase->performUpgrade()
Exception: An error was encountered during the first access to update.php. in Drupal\system\Tests\Upgrade\UpgradePathTestBase->performUpgrade() (line 240 of /var/lib/drupaltestbot/sites/default/files/checkout/core/modules/system/lib/Drupal/system/Tests/Upgrade/UpgradePathTestBase.php). Drupal\system\Tests\Upgrade\UpgradePathTestBase->performUpgrade(1) Drupal\system\Tests\Upgrade\MailUpgradePathTest->testMailSystemUpgrade() Drupal\simpletest\TestBase->run() simpletest_script_run_one_test('671', 'Drupal\system\Tests\Upgrade\MailUpgradePathTest') Uncaught exceptionUpgradePathTestBase.php240Drupal\system\Tests\Upgrade\UpgradePathTestBase->performUpgrade()
ExpandDrupal\system\Tests\Upgrade\ModulesDisabledUpgradePathTest423
MessageGroupFilenameLineFunctionStatus
Invoking hooks entity_info is not supported during updatesLogicExceptionUpdateModuleHandler.php50Drupal\Core\Extension\UpdateModuleHandler->getImplementations()
simplexml_import_dom(): Invalid Nodetype to importsimplexml_import_dom(Object) Drupal\simpletest\WebTestBase->parse() Drupal\simpletest\WebTestBase->xpath('//input[@type="submit"]') Drupal\simpletest\WebTestBase->assertFieldByXPath('//input[@type="submit"]') Drupal\system\Tests\Upgrade\UpgradePathTestBase->performUpgrade() Drupal\system\Tests\Upgrade\ModulesDisabledUpgradePathTest->testDisabledUpgrade() Drupal\simpletest\TestBase->run() simpletest_script_run_one_test('673', 'Drupal\system\Tests\Upgrade\ModulesDisabledUpgradePathTest') WarningWebTestBase.php1184Drupal\simpletest\WebTestBase->parse()
Parsed page successfully.BrowserUpgradePathTestBase.php239Drupal\system\Tests\Upgrade\UpgradePathTestBase->performUpgrade()
Value false is TRUE.OtherUpgradePathTestBase.php239Drupal\system\Tests\Upgrade\UpgradePathTestBase->performUpgrade()
Exception: An error was encountered during the first access to update.php. in Drupal\system\Tests\Upgrade\UpgradePathTestBase->performUpgrade() (line 240 of /var/lib/drupaltestbot/sites/default/files/checkout/core/modules/system/lib/Drupal/system/Tests/Upgrade/UpgradePathTestBase.php). Drupal\system\Tests\Upgrade\UpgradePathTestBase->performUpgrade() Drupal\system\Tests\Upgrade\ModulesDisabledUpgradePathTest->testDisabledUpgrade() Drupal\simpletest\TestBase->run() simpletest_script_run_one_test('673', 'Drupal\system\Tests\Upgrade\ModulesDisabledUpgradePathTest') Uncaught exceptionUpgradePathTestBase.php240Drupal\system\Tests\Upgrade\UpgradePathTestBase->performUpgrade()
ExpandDrupal\system\Tests\Upgrade\ShortcutUpgradePathTest523
MessageGroupFilenameLineFunctionStatus
Invoking hooks entity_info is not supported during updatesLogicExceptionUpdateModuleHandler.php50Drupal\Core\Extension\UpdateModuleHandler->getImplementations()
simplexml_import_dom(): Invalid Nodetype to importsimplexml_import_dom(Object) Drupal\simpletest\WebTestBase->parse() Drupal\simpletest\WebTestBase->xpath('//input[@type="submit"]') Drupal\simpletest\WebTestBase->assertFieldByXPath('//input[@type="submit"]') Drupal\system\Tests\Upgrade\UpgradePathTestBase->performUpgrade() Drupal\system\Tests\Upgrade\ShortcutUpgradePathTest->testContactUpgrade() Drupal\simpletest\TestBase->run() simpletest_script_run_one_test('674', 'Drupal\system\Tests\Upgrade\ShortcutUpgradePathTest') WarningWebTestBase.php1184Drupal\simpletest\WebTestBase->parse()
Parsed page successfully.BrowserUpgradePathTestBase.php239Drupal\system\Tests\Upgrade\UpgradePathTestBase->performUpgrade()
Value false is TRUE.OtherUpgradePathTestBase.php239Drupal\system\Tests\Upgrade\UpgradePathTestBase->performUpgrade()
Exception: An error was encountered during the first access to update.php. in Drupal\system\Tests\Upgrade\UpgradePathTestBase->performUpgrade() (line 240 of /var/lib/drupaltestbot/sites/default/files/checkout/core/modules/system/lib/Drupal/system/Tests/Upgrade/UpgradePathTestBase.php). Drupal\system\Tests\Upgrade\UpgradePathTestBase->performUpgrade() Drupal\system\Tests\Upgrade\ShortcutUpgradePathTest->testContactUpgrade() Drupal\simpletest\TestBase->run() simpletest_script_run_one_test('674', 'Drupal\system\Tests\Upgrade\ShortcutUpgradePathTest') Uncaught exceptionUpgradePathTestBase.php240Drupal\system\Tests\Upgrade\UpgradePathTestBase->performUpgrade()
ExpandDrupal\system\Tests\Upgrade\StateSystemUpgradePathTest423
MessageGroupFilenameLineFunctionStatus
Invoking hooks entity_info is not supported during updatesLogicExceptionUpdateModuleHandler.php50Drupal\Core\Extension\UpdateModuleHandler->getImplementations()
simplexml_import_dom(): Invalid Nodetype to importsimplexml_import_dom(Object) Drupal\simpletest\WebTestBase->parse() Drupal\simpletest\WebTestBase->xpath('//input[@type="submit"]') Drupal\simpletest\WebTestBase->assertFieldByXPath('//input[@type="submit"]') Drupal\system\Tests\Upgrade\UpgradePathTestBase->performUpgrade() Drupal\system\Tests\Upgrade\StateSystemUpgradePathTest->testSystemVariableUpgrade() Drupal\simpletest\TestBase->run() simpletest_script_run_one_test('675', 'Drupal\system\Tests\Upgrade\StateSystemUpgradePathTest') WarningWebTestBase.php1184Drupal\simpletest\WebTestBase->parse()
Parsed page successfully.BrowserUpgradePathTestBase.php239Drupal\system\Tests\Upgrade\UpgradePathTestBase->performUpgrade()
Value false is TRUE.OtherUpgradePathTestBase.php239Drupal\system\Tests\Upgrade\UpgradePathTestBase->performUpgrade()
Exception: An error was encountered during the first access to update.php. in Drupal\system\Tests\Upgrade\UpgradePathTestBase->performUpgrade() (line 240 of /var/lib/drupaltestbot/sites/default/files/checkout/core/modules/system/lib/Drupal/system/Tests/Upgrade/UpgradePathTestBase.php). Drupal\system\Tests\Upgrade\UpgradePathTestBase->performUpgrade() Drupal\system\Tests\Upgrade\StateSystemUpgradePathTest->testSystemVariableUpgrade() Drupal\simpletest\TestBase->run() simpletest_script_run_one_test('675', 'Drupal\system\Tests\Upgrade\StateSystemUpgradePathTest') Uncaught exceptionUpgradePathTestBase.php240Drupal\system\Tests\Upgrade\UpgradePathTestBase->performUpgrade()
ExpandDrupal\system\Tests\Upgrade\SystemUpgradePathTest846
MessageGroupFilenameLineFunctionStatus
Invoking hooks entity_info is not supported during updatesLogicExceptionUpdateModuleHandler.php50Drupal\Core\Extension\UpdateModuleHandler->getImplementations()
simplexml_import_dom(): Invalid Nodetype to importsimplexml_import_dom(Object) Drupal\simpletest\WebTestBase->parse() Drupal\simpletest\WebTestBase->xpath('//input[@type="submit"]') Drupal\simpletest\WebTestBase->assertFieldByXPath('//input[@type="submit"]') Drupal\system\Tests\Upgrade\UpgradePathTestBase->performUpgrade() Drupal\system\Tests\Upgrade\SystemUpgradePathTest->testVariableUpgrade() Drupal\simpletest\TestBase->run() simpletest_script_run_one_test('676', 'Drupal\system\Tests\Upgrade\SystemUpgradePathTest') WarningWebTestBase.php1184Drupal\simpletest\WebTestBase->parse()
Parsed page successfully.BrowserUpgradePathTestBase.php239Drupal\system\Tests\Upgrade\UpgradePathTestBase->performUpgrade()
Value false is TRUE.OtherUpgradePathTestBase.php239Drupal\system\Tests\Upgrade\UpgradePathTestBase->performUpgrade()
Exception: An error was encountered during the first access to update.php. in Drupal\system\Tests\Upgrade\UpgradePathTestBase->performUpgrade() (line 240 of /var/lib/drupaltestbot/sites/default/files/checkout/core/modules/system/lib/Drupal/system/Tests/Upgrade/UpgradePathTestBase.php). Drupal\system\Tests\Upgrade\UpgradePathTestBase->performUpgrade() Drupal\system\Tests\Upgrade\SystemUpgradePathTest->testVariableUpgrade() Drupal\simpletest\TestBase->run() simpletest_script_run_one_test('676', 'Drupal\system\Tests\Upgrade\SystemUpgradePathTest') Uncaught exceptionUpgradePathTestBase.php240Drupal\system\Tests\Upgrade\UpgradePathTestBase->performUpgrade()
Invoking hooks entity_info is not supported during updatesLogicExceptionUpdateModuleHandler.php50Drupal\Core\Extension\UpdateModuleHandler->getImplementations()
simplexml_import_dom(): Invalid Nodetype to importsimplexml_import_dom(Object) Drupal\simpletest\WebTestBase->parse() Drupal\simpletest\WebTestBase->xpath('//input[@type="submit"]') Drupal\simpletest\WebTestBase->assertFieldByXPath('//input[@type="submit"]') Drupal\system\Tests\Upgrade\UpgradePathTestBase->performUpgrade() Drupal\system\Tests\Upgrade\SystemUpgradePathTest->testFrontpageUpgrade() Drupal\simpletest\TestBase->run() simpletest_script_run_one_test('676', 'Drupal\system\Tests\Upgrade\SystemUpgradePathTest') WarningWebTestBase.php1184Drupal\simpletest\WebTestBase->parse()
Parsed page successfully.BrowserUpgradePathTestBase.php239Drupal\system\Tests\Upgrade\UpgradePathTestBase->performUpgrade()
Value false is TRUE.OtherUpgradePathTestBase.php239Drupal\system\Tests\Upgrade\UpgradePathTestBase->performUpgrade()
Exception: An error was encountered during the first access to update.php. in Drupal\system\Tests\Upgrade\UpgradePathTestBase->performUpgrade() (line 240 of /var/lib/drupaltestbot/sites/default/files/checkout/core/modules/system/lib/Drupal/system/Tests/Upgrade/UpgradePathTestBase.php). Drupal\system\Tests\Upgrade\UpgradePathTestBase->performUpgrade() Drupal\system\Tests\Upgrade\SystemUpgradePathTest->testFrontpageUpgrade() Drupal\simpletest\TestBase->run() simpletest_script_run_one_test('676', 'Drupal\system\Tests\Upgrade\SystemUpgradePathTest') Uncaught exceptionUpgradePathTestBase.php240Drupal\system\Tests\Upgrade\UpgradePathTestBase->performUpgrade()
ExpandDrupal\system\Tests\Upgrade\UserPictureUpgradePathTest423
MessageGroupFilenameLineFunctionStatus
Invoking hooks entity_info is not supported during updatesLogicExceptionUpdateModuleHandler.php50Drupal\Core\Extension\UpdateModuleHandler->getImplementations()
simplexml_import_dom(): Invalid Nodetype to importsimplexml_import_dom(Object) Drupal\simpletest\WebTestBase->parse() Drupal\simpletest\WebTestBase->xpath('//input[@type="submit"]') Drupal\simpletest\WebTestBase->assertFieldByXPath('//input[@type="submit"]') Drupal\system\Tests\Upgrade\UpgradePathTestBase->performUpgrade() Drupal\system\Tests\Upgrade\UserPictureUpgradePathTest->testUserPictureUpgrade() Drupal\simpletest\TestBase->run() simpletest_script_run_one_test('677', 'Drupal\system\Tests\Upgrade\UserPictureUpgradePathTest') WarningWebTestBase.php1184Drupal\simpletest\WebTestBase->parse()
Parsed page successfully.BrowserUpgradePathTestBase.php239Drupal\system\Tests\Upgrade\UpgradePathTestBase->performUpgrade()
Value false is TRUE.OtherUpgradePathTestBase.php239Drupal\system\Tests\Upgrade\UpgradePathTestBase->performUpgrade()
Exception: An error was encountered during the first access to update.php. in Drupal\system\Tests\Upgrade\UpgradePathTestBase->performUpgrade() (line 240 of /var/lib/drupaltestbot/sites/default/files/checkout/core/modules/system/lib/Drupal/system/Tests/Upgrade/UpgradePathTestBase.php). Drupal\system\Tests\Upgrade\UpgradePathTestBase->performUpgrade() Drupal\system\Tests\Upgrade\UserPictureUpgradePathTest->testUserPictureUpgrade() Drupal\simpletest\TestBase->run() simpletest_script_run_one_test('677', 'Drupal\system\Tests\Upgrade\UserPictureUpgradePathTest') Uncaught exceptionUpgradePathTestBase.php240Drupal\system\Tests\Upgrade\UpgradePathTestBase->performUpgrade()
ExpandDrupal\system\Tests\Upgrade\UserRoleUpgradePathTest846
MessageGroupFilenameLineFunctionStatus
Invoking hooks entity_info is not supported during updatesLogicExceptionUpdateModuleHandler.php50Drupal\Core\Extension\UpdateModuleHandler->getImplementations()
simplexml_import_dom(): Invalid Nodetype to importsimplexml_import_dom(Object) Drupal\simpletest\WebTestBase->parse() Drupal\simpletest\WebTestBase->xpath('//input[@type="submit"]') Drupal\simpletest\WebTestBase->assertFieldByXPath('//input[@type="submit"]') Drupal\system\Tests\Upgrade\UpgradePathTestBase->performUpgrade() Drupal\system\Tests\Upgrade\UserRoleUpgradePathTest->testRoleUpgrade() Drupal\simpletest\TestBase->run() simpletest_script_run_one_test('678', 'Drupal\system\Tests\Upgrade\UserRoleUpgradePathTest') WarningWebTestBase.php1184Drupal\simpletest\WebTestBase->parse()
Parsed page successfully.BrowserUpgradePathTestBase.php239Drupal\system\Tests\Upgrade\UpgradePathTestBase->performUpgrade()
Value false is TRUE.OtherUpgradePathTestBase.php239Drupal\system\Tests\Upgrade\UpgradePathTestBase->performUpgrade()
Exception: An error was encountered during the first access to update.php. in Drupal\system\Tests\Upgrade\UpgradePathTestBase->performUpgrade() (line 240 of /var/lib/drupaltestbot/sites/default/files/checkout/core/modules/system/lib/Drupal/system/Tests/Upgrade/UpgradePathTestBase.php). Drupal\system\Tests\Upgrade\UpgradePathTestBase->performUpgrade() Drupal\system\Tests\Upgrade\UserRoleUpgradePathTest->testRoleUpgrade() Drupal\simpletest\TestBase->run() simpletest_script_run_one_test('678', 'Drupal\system\Tests\Upgrade\UserRoleUpgradePathTest') Uncaught exceptionUpgradePathTestBase.php240Drupal\system\Tests\Upgrade\UpgradePathTestBase->performUpgrade()
Invoking hooks entity_info is not supported during updatesLogicExceptionUpdateModuleHandler.php50Drupal\Core\Extension\UpdateModuleHandler->getImplementations()
simplexml_import_dom(): Invalid Nodetype to importsimplexml_import_dom(Object) Drupal\simpletest\WebTestBase->parse() Drupal\simpletest\WebTestBase->xpath('//input[@type="submit"]') Drupal\simpletest\WebTestBase->assertFieldByXPath('//input[@type="submit"]') Drupal\system\Tests\Upgrade\UpgradePathTestBase->performUpgrade() Drupal\system\Tests\Upgrade\UserRoleUpgradePathTest->testRoleUpgradeToConfig() Drupal\simpletest\TestBase->run() simpletest_script_run_one_test('678', 'Drupal\system\Tests\Upgrade\UserRoleUpgradePathTest') WarningWebTestBase.php1184Drupal\simpletest\WebTestBase->parse()
Parsed page successfully.BrowserUpgradePathTestBase.php239Drupal\system\Tests\Upgrade\UpgradePathTestBase->performUpgrade()
Value false is TRUE.OtherUpgradePathTestBase.php239Drupal\system\Tests\Upgrade\UpgradePathTestBase->performUpgrade()
Exception: An error was encountered during the first access to update.php. in Drupal\system\Tests\Upgrade\UpgradePathTestBase->performUpgrade() (line 240 of /var/lib/drupaltestbot/sites/default/files/checkout/core/modules/system/lib/Drupal/system/Tests/Upgrade/UpgradePathTestBase.php). Drupal\system\Tests\Upgrade\UpgradePathTestBase->performUpgrade() Drupal\system\Tests\Upgrade\UserRoleUpgradePathTest->testRoleUpgradeToConfig() Drupal\simpletest\TestBase->run() simpletest_script_run_one_test('678', 'Drupal\system\Tests\Upgrade\UserRoleUpgradePathTest') Uncaught exceptionUpgradePathTestBase.php240Drupal\system\Tests\Upgrade\UpgradePathTestBase->performUpgrade()
ExpandDrupal\system\Tests\Upgrade\UuidUpgradePathTest211
MessageGroupFilenameLineFunctionStatus
HTTP response expected 200, actual 500BrowserUpgradePathTestBase.php234Drupal\system\Tests\Upgrade\UpgradePathTestBase->performUpgrade()
Exception: Initial GET to update.php did not return HTTP 200 status. in Drupal\system\Tests\Upgrade\UpgradePathTestBase->performUpgrade() (line 235 of /var/lib/drupaltestbot/sites/default/files/checkout/core/modules/system/lib/Drupal/system/Tests/Upgrade/UpgradePathTestBase.php). Drupal\system\Tests\Upgrade\UpgradePathTestBase->performUpgrade() Drupal\system\Tests\Upgrade\UuidUpgradePathTest->testUuidUpgrade() Drupal\simpletest\TestBase->run() simpletest_script_run_one_test('679', 'Drupal\system\Tests\Upgrade\UuidUpgradePathTest') Uncaught exceptionUpgradePathTestBase.php235Drupal\system\Tests\Upgrade\UpgradePathTestBase->performUpgrade()
ExpandDrupal\Tests\Core\Plugin\DefaultPluginManagerTest220
MessageGroupFilenameLineFunctionStatus
Parameter 0 for invocation Drupal\Core\Cache\MemoryBackend::get('x2xgVbxM:', false) does not match expected value.OtherDefaultPluginManagerTest.php100Drupal\Tests\Core\Plugin\DefaultPluginManagerTest->testDefaultPluginManagerWithEmptyCache()
Parameter 0 for invocation Drupal\Core\Cache\MemoryBackend::get('lNZtTn2f:', false) does not match expected value.OtherDefaultPluginManagerTest.php132Drupal\Tests\Core\Plugin\DefaultPluginManagerTest->testDefaultPluginManagerWithFilledCache()

All

Test namePassFailException
Leaf40000
LeafDrupal\action\Tests\BulkFormTest4200
LeafDrupal\action\Tests\ConfigurationTest5100
LeafDrupal\aggregator\Tests\AddFeedTest7300
LeafDrupal\aggregator\Tests\AggregatorConfigurationTest3800
LeafDrupal\aggregator\Tests\AggregatorCronTest5500
LeafDrupal\aggregator\Tests\AggregatorRenderingTest22700
LeafDrupal\aggregator\Tests\CategorizeFeedItemTest6100
LeafDrupal\aggregator\Tests\CategorizeFeedTest2500
LeafDrupal\aggregator\Tests\FeedFetcherPluginTest6300
LeafDrupal\aggregator\Tests\FeedLanguageTest5700
LeafDrupal\aggregator\Tests\FeedParserTest9900
LeafDrupal\aggregator\Tests\FeedProcessorPluginTest15200
LeafDrupal\aggregator\Tests\ImportOpmlTest6800
LeafDrupal\aggregator\Tests\RemoveFeedItemTest27000
LeafDrupal\aggregator\Tests\RemoveFeedTest2500
LeafDrupal\aggregator\Tests\UpdateFeedItemTest7600
LeafDrupal\aggregator\Tests\UpdateFeedTest7600
LeafDrupal\aggregator\Tests\Views\IntegrationTest3600
LeafDrupal\ban\Tests\IpAddressBlockingTest4300
LeafDrupal\block\Tests\BlockAdminThemeTest1900
LeafDrupal\block\Tests\BlockCacheTest18500
LeafDrupal\block\Tests\BlockHiddenRegionTest1800
LeafDrupal\block\Tests\BlockHtmlIdTest1000
LeafDrupal\block\Tests\BlockInterfaceTest500
LeafDrupal\block\Tests\BlockInvalidRegionTest2400
LeafDrupal\block\Tests\BlockLanguageCacheTest8200
LeafDrupal\block\Tests\BlockLanguageTest5100
LeafDrupal\block\Tests\BlockLibrarySearchTest1900
LeafDrupal\block\Tests\BlockStorageUnitTest2000
LeafDrupal\block\Tests\BlockTemplateSuggestionsUnitTest300
LeafDrupal\block\Tests\BlockTest22100
LeafDrupal\block\Tests\BlockTitleXSSTest1500
LeafDrupal\block\Tests\BlockUiTest3700
LeafDrupal\block\Tests\NewDefaultThemeBlocksTest1700
LeafDrupal\block\Tests\NonDefaultBlockAdminTest1200
LeafDrupal\block\Tests\Views\DisplayBlockTest6400
LeafDrupal\book\Tests\BookTest63600
LeafDrupal\breakpoint\Tests\BreakpointAPITest600
LeafDrupal\breakpoint\Tests\BreakpointCRUDTest2100
LeafDrupal\breakpoint\Tests\BreakpointGroupAPITest400
LeafDrupal\breakpoint\Tests\BreakpointGroupCRUDTest1200
LeafDrupal\breakpoint\Tests\BreakpointMediaQueryTest200
LeafDrupal\breakpoint\Tests\BreakpointThemeTest2300
LeafDrupal\ckeditor\Tests\CKEditorAdminTest5800
LeafDrupal\ckeditor\Tests\CKEditorLoadingTest5100
LeafDrupal\ckeditor\Tests\CKEditorPluginManagerTest1600
LeafDrupal\ckeditor\Tests\CKEditorTest3700
LeafDrupal\color\Tests\ColorTest8700
LeafDrupal\comment\Tests\CommentActionsTest4800
LeafDrupal\comment\Tests\CommentAnonymousTest16300
LeafDrupal\comment\Tests\CommentApprovalTest15200
LeafDrupal\comment\Tests\CommentBlockTest9300
LeafDrupal\comment\Tests\CommentContentRebuildTest3300
LeafDrupal\comment\Tests\CommentCSSTest50100
LeafDrupal\comment\Tests\CommentFieldsTest9800
LeafDrupal\comment\Tests\CommentInterfaceTest24800
LeafDrupal\comment\Tests\CommentLanguageTest7300
ExpandDrupal\comment\Tests\CommentLinksTest109300
MessageGroupFilenameLineFunctionStatus
Changed environment:array ( 'authenticated' => false, 'comment count' => false, 'form' => 'below', 'user_register' => 'visitors', 'contact' => 'optional', 'comments' => 'open', 'access comments' => 0, 'post comments' => 0, 'skip comment approval' => 1, 'edit own comments' => 0, )DebugCommentLinksTest.php208Drupal\comment\Tests\CommentLinksTest->setEnvironment()
Changed environment:array ( 'authenticated' => true, 'comment count' => false, 'form' => 'below', 'user_register' => 'visitors', 'contact' => 'optional', 'comments' => 'open', 'access comments' => 0, 'post comments' => 0, 'skip comment approval' => 1, 'edit own comments' => 0, )DebugCommentLinksTest.php208Drupal\comment\Tests\CommentLinksTest->setEnvironment()
Changed environment:array ( 'authenticated' => false, 'comment count' => true, 'form' => 'below', 'user_register' => 'visitors', 'contact' => 'optional', 'comments' => 'open', 'access comments' => 0, 'post comments' => 0, 'skip comment approval' => 1, 'edit own comments' => 0, )DebugCommentLinksTest.php208Drupal\comment\Tests\CommentLinksTest->setEnvironment()
Changed environment:array ( 'authenticated' => true, 'comment count' => true, 'form' => 'below', 'user_register' => 'visitors', 'contact' => 'optional', 'comments' => 'open', 'access comments' => 0, 'post comments' => 0, 'skip comment approval' => 1, 'edit own comments' => 0, )DebugCommentLinksTest.php208Drupal\comment\Tests\CommentLinksTest->setEnvironment()
Changed environment:array ( 'authenticated' => false, 'comment count' => false, 'form' => 'below', 'user_register' => 'visitors', 'contact' => 'optional', 'comments' => 'open', 'access comments' => 1, 'post comments' => 0, 'skip comment approval' => 1, 'edit own comments' => 0, )DebugCommentLinksTest.php208Drupal\comment\Tests\CommentLinksTest->setEnvironment()
Changed environment:array ( 'authenticated' => true, 'comment count' => false, 'form' => 'below', 'user_register' => 'visitors', 'contact' => 'optional', 'comments' => 'open', 'access comments' => 1, 'post comments' => 0, 'skip comment approval' => 1, 'edit own comments' => 0, )DebugCommentLinksTest.php208Drupal\comment\Tests\CommentLinksTest->setEnvironment()
Changed environment:array ( 'authenticated' => false, 'comment count' => true, 'form' => 'below', 'user_register' => 'visitors', 'contact' => 'optional', 'comments' => 'open', 'access comments' => 1, 'post comments' => 0, 'skip comment approval' => 1, 'edit own comments' => 0, )DebugCommentLinksTest.php208Drupal\comment\Tests\CommentLinksTest->setEnvironment()
Changed environment:array ( 'authenticated' => true, 'comment count' => true, 'form' => 'below', 'user_register' => 'visitors', 'contact' => 'optional', 'comments' => 'open', 'access comments' => 1, 'post comments' => 0, 'skip comment approval' => 1, 'edit own comments' => 0, )DebugCommentLinksTest.php208Drupal\comment\Tests\CommentLinksTest->setEnvironment()
Changed environment:array ( 'authenticated' => false, 'comment count' => false, 'form' => 'below', 'user_register' => 'visitors', 'contact' => 'optional', 'comments' => 'open', 'access comments' => 0, 'post comments' => 1, 'skip comment approval' => 1, 'edit own comments' => 0, )DebugCommentLinksTest.php208Drupal\comment\Tests\CommentLinksTest->setEnvironment()
Changed environment:array ( 'authenticated' => true, 'comment count' => false, 'form' => 'below', 'user_register' => 'visitors', 'contact' => 'optional', 'comments' => 'open', 'access comments' => 0, 'post comments' => 1, 'skip comment approval' => 1, 'edit own comments' => 0, )DebugCommentLinksTest.php208Drupal\comment\Tests\CommentLinksTest->setEnvironment()
Changed environment:array ( 'authenticated' => false, 'comment count' => true, 'form' => 'below', 'user_register' => 'visitors', 'contact' => 'optional', 'comments' => 'open', 'access comments' => 0, 'post comments' => 1, 'skip comment approval' => 1, 'edit own comments' => 0, )DebugCommentLinksTest.php208Drupal\comment\Tests\CommentLinksTest->setEnvironment()
Changed environment:array ( 'authenticated' => true, 'comment count' => true, 'form' => 'below', 'user_register' => 'visitors', 'contact' => 'optional', 'comments' => 'open', 'access comments' => 0, 'post comments' => 1, 'skip comment approval' => 1, 'edit own comments' => 0, )DebugCommentLinksTest.php208Drupal\comment\Tests\CommentLinksTest->setEnvironment()
Changed environment:array ( 'authenticated' => false, 'comment count' => false, 'form' => 'below', 'user_register' => 'visitors', 'contact' => 'optional', 'comments' => 'open', 'access comments' => 1, 'post comments' => 1, 'skip comment approval' => 1, 'edit own comments' => 0, )DebugCommentLinksTest.php208Drupal\comment\Tests\CommentLinksTest->setEnvironment()
Changed environment:array ( 'authenticated' => true, 'comment count' => false, 'form' => 'below', 'user_register' => 'visitors', 'contact' => 'optional', 'comments' => 'open', 'access comments' => 1, 'post comments' => 1, 'skip comment approval' => 1, 'edit own comments' => 0, )DebugCommentLinksTest.php208Drupal\comment\Tests\CommentLinksTest->setEnvironment()
Changed environment:array ( 'authenticated' => false, 'comment count' => true, 'form' => 'below', 'user_register' => 'visitors', 'contact' => 'optional', 'comments' => 'open', 'access comments' => 1, 'post comments' => 1, 'skip comment approval' => 1, 'edit own comments' => 0, )DebugCommentLinksTest.php208Drupal\comment\Tests\CommentLinksTest->setEnvironment()
Changed environment:array ( 'authenticated' => true, 'comment count' => true, 'form' => 'below', 'user_register' => 'visitors', 'contact' => 'optional', 'comments' => 'open', 'access comments' => 1, 'post comments' => 1, 'skip comment approval' => 1, 'edit own comments' => 0, )DebugCommentLinksTest.php208Drupal\comment\Tests\CommentLinksTest->setEnvironment()
Changed environment:array ( 'authenticated' => false, 'comment count' => false, 'form' => 'separate page', 'user_register' => 'visitors', 'contact' => 'optional', 'comments' => 'open', 'access comments' => 0, 'post comments' => 0, 'skip comment approval' => 1, 'edit own comments' => 0, )DebugCommentLinksTest.php208Drupal\comment\Tests\CommentLinksTest->setEnvironment()
Changed environment:array ( 'authenticated' => true, 'comment count' => false, 'form' => 'separate page', 'user_register' => 'visitors', 'contact' => 'optional', 'comments' => 'open', 'access comments' => 0, 'post comments' => 0, 'skip comment approval' => 1, 'edit own comments' => 0, )DebugCommentLinksTest.php208Drupal\comment\Tests\CommentLinksTest->setEnvironment()
Changed environment:array ( 'authenticated' => false, 'comment count' => true, 'form' => 'separate page', 'user_register' => 'visitors', 'contact' => 'optional', 'comments' => 'open', 'access comments' => 0, 'post comments' => 0, 'skip comment approval' => 1, 'edit own comments' => 0, )DebugCommentLinksTest.php208Drupal\comment\Tests\CommentLinksTest->setEnvironment()
Changed environment:array ( 'authenticated' => true, 'comment count' => true, 'form' => 'separate page', 'user_register' => 'visitors', 'contact' => 'optional', 'comments' => 'open', 'access comments' => 0, 'post comments' => 0, 'skip comment approval' => 1, 'edit own comments' => 0, )DebugCommentLinksTest.php208Drupal\comment\Tests\CommentLinksTest->setEnvironment()
Changed environment:array ( 'authenticated' => false, 'comment count' => false, 'form' => 'separate page', 'user_register' => 'visitors', 'contact' => 'optional', 'comments' => 'open', 'access comments' => 1, 'post comments' => 0, 'skip comment approval' => 1, 'edit own comments' => 0, )DebugCommentLinksTest.php208Drupal\comment\Tests\CommentLinksTest->setEnvironment()
Changed environment:array ( 'authenticated' => true, 'comment count' => false, 'form' => 'separate page', 'user_register' => 'visitors', 'contact' => 'optional', 'comments' => 'open', 'access comments' => 1, 'post comments' => 0, 'skip comment approval' => 1, 'edit own comments' => 0, )DebugCommentLinksTest.php208Drupal\comment\Tests\CommentLinksTest->setEnvironment()
Changed environment:array ( 'authenticated' => false, 'comment count' => true, 'form' => 'separate page', 'user_register' => 'visitors', 'contact' => 'optional', 'comments' => 'open', 'access comments' => 1, 'post comments' => 0, 'skip comment approval' => 1, 'edit own comments' => 0, )DebugCommentLinksTest.php208Drupal\comment\Tests\CommentLinksTest->setEnvironment()
Changed environment:array ( 'authenticated' => true, 'comment count' => true, 'form' => 'separate page', 'user_register' => 'visitors', 'contact' => 'optional', 'comments' => 'open', 'access comments' => 1, 'post comments' => 0, 'skip comment approval' => 1, 'edit own comments' => 0, )DebugCommentLinksTest.php208Drupal\comment\Tests\CommentLinksTest->setEnvironment()
Changed environment:array ( 'authenticated' => false, 'comment count' => false, 'form' => 'separate page', 'user_register' => 'visitors', 'contact' => 'optional', 'comments' => 'open', 'access comments' => 0, 'post comments' => 1, 'skip comment approval' => 1, 'edit own comments' => 0, )DebugCommentLinksTest.php208Drupal\comment\Tests\CommentLinksTest->setEnvironment()
Changed environment:array ( 'authenticated' => true, 'comment count' => false, 'form' => 'separate page', 'user_register' => 'visitors', 'contact' => 'optional', 'comments' => 'open', 'access comments' => 0, 'post comments' => 1, 'skip comment approval' => 1, 'edit own comments' => 0, )DebugCommentLinksTest.php208Drupal\comment\Tests\CommentLinksTest->setEnvironment()
Changed environment:array ( 'authenticated' => false, 'comment count' => true, 'form' => 'separate page', 'user_register' => 'visitors', 'contact' => 'optional', 'comments' => 'open', 'access comments' => 0, 'post comments' => 1, 'skip comment approval' => 1, 'edit own comments' => 0, )DebugCommentLinksTest.php208Drupal\comment\Tests\CommentLinksTest->setEnvironment()
Changed environment:array ( 'authenticated' => true, 'comment count' => true, 'form' => 'separate page', 'user_register' => 'visitors', 'contact' => 'optional', 'comments' => 'open', 'access comments' => 0, 'post comments' => 1, 'skip comment approval' => 1, 'edit own comments' => 0, )DebugCommentLinksTest.php208Drupal\comment\Tests\CommentLinksTest->setEnvironment()
Changed environment:array ( 'authenticated' => false, 'comment count' => false, 'form' => 'separate page', 'user_register' => 'visitors', 'contact' => 'optional', 'comments' => 'open', 'access comments' => 1, 'post comments' => 1, 'skip comment approval' => 1, 'edit own comments' => 0, )DebugCommentLinksTest.php208Drupal\comment\Tests\CommentLinksTest->setEnvironment()
Changed environment:array ( 'authenticated' => true, 'comment count' => false, 'form' => 'separate page', 'user_register' => 'visitors', 'contact' => 'optional', 'comments' => 'open', 'access comments' => 1, 'post comments' => 1, 'skip comment approval' => 1, 'edit own comments' => 0, )DebugCommentLinksTest.php208Drupal\comment\Tests\CommentLinksTest->setEnvironment()
Changed environment:array ( 'authenticated' => false, 'comment count' => true, 'form' => 'separate page', 'user_register' => 'visitors', 'contact' => 'optional', 'comments' => 'open', 'access comments' => 1, 'post comments' => 1, 'skip comment approval' => 1, 'edit own comments' => 0, )DebugCommentLinksTest.php208Drupal\comment\Tests\CommentLinksTest->setEnvironment()
Changed environment:array ( 'authenticated' => true, 'comment count' => true, 'form' => 'separate page', 'user_register' => 'visitors', 'contact' => 'optional', 'comments' => 'open', 'access comments' => 1, 'post comments' => 1, 'skip comment approval' => 1, 'edit own comments' => 0, )DebugCommentLinksTest.php208Drupal\comment\Tests\CommentLinksTest->setEnvironment()
Changed environment:array ( 'authenticated' => false, 'comment count' => false, 'form' => 'below', 'user_register' => 'admin_only', 'contact' => 'optional', 'comments' => 'open', 'access comments' => 0, 'post comments' => 0, 'skip comment approval' => 1, 'edit own comments' => 0, )DebugCommentLinksTest.php208Drupal\comment\Tests\CommentLinksTest->setEnvironment()
Changed environment:array ( 'authenticated' => true, 'comment count' => false, 'form' => 'below', 'user_register' => 'admin_only', 'contact' => 'optional', 'comments' => 'open', 'access comments' => 0, 'post comments' => 0, 'skip comment approval' => 1, 'edit own comments' => 0, )DebugCommentLinksTest.php208Drupal\comment\Tests\CommentLinksTest->setEnvironment()
Changed environment:array ( 'authenticated' => false, 'comment count' => true, 'form' => 'below', 'user_register' => 'admin_only', 'contact' => 'optional', 'comments' => 'open', 'access comments' => 0, 'post comments' => 0, 'skip comment approval' => 1, 'edit own comments' => 0, )DebugCommentLinksTest.php208Drupal\comment\Tests\CommentLinksTest->setEnvironment()
Changed environment:array ( 'authenticated' => true, 'comment count' => true, 'form' => 'below', 'user_register' => 'admin_only', 'contact' => 'optional', 'comments' => 'open', 'access comments' => 0, 'post comments' => 0, 'skip comment approval' => 1, 'edit own comments' => 0, )DebugCommentLinksTest.php208Drupal\comment\Tests\CommentLinksTest->setEnvironment()
Changed environment:array ( 'authenticated' => false, 'comment count' => false, 'form' => 'below', 'user_register' => 'admin_only', 'contact' => 'optional', 'comments' => 'open', 'access comments' => 1, 'post comments' => 0, 'skip comment approval' => 1, 'edit own comments' => 0, )DebugCommentLinksTest.php208Drupal\comment\Tests\CommentLinksTest->setEnvironment()
Changed environment:array ( 'authenticated' => true, 'comment count' => false, 'form' => 'below', 'user_register' => 'admin_only', 'contact' => 'optional', 'comments' => 'open', 'access comments' => 1, 'post comments' => 0, 'skip comment approval' => 1, 'edit own comments' => 0, )DebugCommentLinksTest.php208Drupal\comment\Tests\CommentLinksTest->setEnvironment()
Changed environment:array ( 'authenticated' => false, 'comment count' => true, 'form' => 'below', 'user_register' => 'admin_only', 'contact' => 'optional', 'comments' => 'open', 'access comments' => 1, 'post comments' => 0, 'skip comment approval' => 1, 'edit own comments' => 0, )DebugCommentLinksTest.php208Drupal\comment\Tests\CommentLinksTest->setEnvironment()
Changed environment:array ( 'authenticated' => true, 'comment count' => true, 'form' => 'below', 'user_register' => 'admin_only', 'contact' => 'optional', 'comments' => 'open', 'access comments' => 1, 'post comments' => 0, 'skip comment approval' => 1, 'edit own comments' => 0, )DebugCommentLinksTest.php208Drupal\comment\Tests\CommentLinksTest->setEnvironment()
Changed environment:array ( 'authenticated' => false, 'comment count' => false, 'form' => 'below', 'user_register' => 'admin_only', 'contact' => 'optional', 'comments' => 'open', 'access comments' => 0, 'post comments' => 1, 'skip comment approval' => 1, 'edit own comments' => 0, )DebugCommentLinksTest.php208Drupal\comment\Tests\CommentLinksTest->setEnvironment()
Changed environment:array ( 'authenticated' => true, 'comment count' => false, 'form' => 'below', 'user_register' => 'admin_only', 'contact' => 'optional', 'comments' => 'open', 'access comments' => 0, 'post comments' => 1, 'skip comment approval' => 1, 'edit own comments' => 0, )DebugCommentLinksTest.php208Drupal\comment\Tests\CommentLinksTest->setEnvironment()
Changed environment:array ( 'authenticated' => false, 'comment count' => true, 'form' => 'below', 'user_register' => 'admin_only', 'contact' => 'optional', 'comments' => 'open', 'access comments' => 0, 'post comments' => 1, 'skip comment approval' => 1, 'edit own comments' => 0, )DebugCommentLinksTest.php208Drupal\comment\Tests\CommentLinksTest->setEnvironment()
Changed environment:array ( 'authenticated' => true, 'comment count' => true, 'form' => 'below', 'user_register' => 'admin_only', 'contact' => 'optional', 'comments' => 'open', 'access comments' => 0, 'post comments' => 1, 'skip comment approval' => 1, 'edit own comments' => 0, )DebugCommentLinksTest.php208Drupal\comment\Tests\CommentLinksTest->setEnvironment()
Changed environment:array ( 'authenticated' => false, 'comment count' => false, 'form' => 'below', 'user_register' => 'admin_only', 'contact' => 'optional', 'comments' => 'open', 'access comments' => 1, 'post comments' => 1, 'skip comment approval' => 1, 'edit own comments' => 0, )DebugCommentLinksTest.php208Drupal\comment\Tests\CommentLinksTest->setEnvironment()
Changed environment:array ( 'authenticated' => true, 'comment count' => false, 'form' => 'below', 'user_register' => 'admin_only', 'contact' => 'optional', 'comments' => 'open', 'access comments' => 1, 'post comments' => 1, 'skip comment approval' => 1, 'edit own comments' => 0, )DebugCommentLinksTest.php208Drupal\comment\Tests\CommentLinksTest->setEnvironment()
Changed environment:array ( 'authenticated' => false, 'comment count' => true, 'form' => 'below', 'user_register' => 'admin_only', 'contact' => 'optional', 'comments' => 'open', 'access comments' => 1, 'post comments' => 1, 'skip comment approval' => 1, 'edit own comments' => 0, )DebugCommentLinksTest.php208Drupal\comment\Tests\CommentLinksTest->setEnvironment()
Changed environment:array ( 'authenticated' => true, 'comment count' => true, 'form' => 'below', 'user_register' => 'admin_only', 'contact' => 'optional', 'comments' => 'open', 'access comments' => 1, 'post comments' => 1, 'skip comment approval' => 1, 'edit own comments' => 0, )DebugCommentLinksTest.php208Drupal\comment\Tests\CommentLinksTest->setEnvironment()
Changed environment:array ( 'authenticated' => false, 'comment count' => false, 'form' => 'separate page', 'user_register' => 'admin_only', 'contact' => 'optional', 'comments' => 'open', 'access comments' => 0, 'post comments' => 0, 'skip comment approval' => 1, 'edit own comments' => 0, )DebugCommentLinksTest.php208Drupal\comment\Tests\CommentLinksTest->setEnvironment()
Changed environment:array ( 'authenticated' => true, 'comment count' => false, 'form' => 'separate page', 'user_register' => 'admin_only', 'contact' => 'optional', 'comments' => 'open', 'access comments' => 0, 'post comments' => 0, 'skip comment approval' => 1, 'edit own comments' => 0, )DebugCommentLinksTest.php208Drupal\comment\Tests\CommentLinksTest->setEnvironment()
Changed environment:array ( 'authenticated' => false, 'comment count' => true, 'form' => 'separate page', 'user_register' => 'admin_only', 'contact' => 'optional', 'comments' => 'open', 'access comments' => 0, 'post comments' => 0, 'skip comment approval' => 1, 'edit own comments' => 0, )DebugCommentLinksTest.php208Drupal\comment\Tests\CommentLinksTest->setEnvironment()
Changed environment:array ( 'authenticated' => true, 'comment count' => true, 'form' => 'separate page', 'user_register' => 'admin_only', 'contact' => 'optional', 'comments' => 'open', 'access comments' => 0, 'post comments' => 0, 'skip comment approval' => 1, 'edit own comments' => 0, )DebugCommentLinksTest.php208Drupal\comment\Tests\CommentLinksTest->setEnvironment()
Changed environment:array ( 'authenticated' => false, 'comment count' => false, 'form' => 'separate page', 'user_register' => 'admin_only', 'contact' => 'optional', 'comments' => 'open', 'access comments' => 1, 'post comments' => 0, 'skip comment approval' => 1, 'edit own comments' => 0, )DebugCommentLinksTest.php208Drupal\comment\Tests\CommentLinksTest->setEnvironment()
Changed environment:array ( 'authenticated' => true, 'comment count' => false, 'form' => 'separate page', 'user_register' => 'admin_only', 'contact' => 'optional', 'comments' => 'open', 'access comments' => 1, 'post comments' => 0, 'skip comment approval' => 1, 'edit own comments' => 0, )DebugCommentLinksTest.php208Drupal\comment\Tests\CommentLinksTest->setEnvironment()
Changed environment:array ( 'authenticated' => false, 'comment count' => true, 'form' => 'separate page', 'user_register' => 'admin_only', 'contact' => 'optional', 'comments' => 'open', 'access comments' => 1, 'post comments' => 0, 'skip comment approval' => 1, 'edit own comments' => 0, )DebugCommentLinksTest.php208Drupal\comment\Tests\CommentLinksTest->setEnvironment()
Changed environment:array ( 'authenticated' => true, 'comment count' => true, 'form' => 'separate page', 'user_register' => 'admin_only', 'contact' => 'optional', 'comments' => 'open', 'access comments' => 1, 'post comments' => 0, 'skip comment approval' => 1, 'edit own comments' => 0, )DebugCommentLinksTest.php208Drupal\comment\Tests\CommentLinksTest->setEnvironment()
Changed environment:array ( 'authenticated' => false, 'comment count' => false, 'form' => 'separate page', 'user_register' => 'admin_only', 'contact' => 'optional', 'comments' => 'open', 'access comments' => 0, 'post comments' => 1, 'skip comment approval' => 1, 'edit own comments' => 0, )DebugCommentLinksTest.php208Drupal\comment\Tests\CommentLinksTest->setEnvironment()
Changed environment:array ( 'authenticated' => true, 'comment count' => false, 'form' => 'separate page', 'user_register' => 'admin_only', 'contact' => 'optional', 'comments' => 'open', 'access comments' => 0, 'post comments' => 1, 'skip comment approval' => 1, 'edit own comments' => 0, )DebugCommentLinksTest.php208Drupal\comment\Tests\CommentLinksTest->setEnvironment()
Changed environment:array ( 'authenticated' => false, 'comment count' => true, 'form' => 'separate page', 'user_register' => 'admin_only', 'contact' => 'optional', 'comments' => 'open', 'access comments' => 0, 'post comments' => 1, 'skip comment approval' => 1, 'edit own comments' => 0, )DebugCommentLinksTest.php208Drupal\comment\Tests\CommentLinksTest->setEnvironment()
Changed environment:array ( 'authenticated' => true, 'comment count' => true, 'form' => 'separate page', 'user_register' => 'admin_only', 'contact' => 'optional', 'comments' => 'open', 'access comments' => 0, 'post comments' => 1, 'skip comment approval' => 1, 'edit own comments' => 0, )DebugCommentLinksTest.php208Drupal\comment\Tests\CommentLinksTest->setEnvironment()
Changed environment:array ( 'authenticated' => false, 'comment count' => false, 'form' => 'separate page', 'user_register' => 'admin_only', 'contact' => 'optional', 'comments' => 'open', 'access comments' => 1, 'post comments' => 1, 'skip comment approval' => 1, 'edit own comments' => 0, )DebugCommentLinksTest.php208Drupal\comment\Tests\CommentLinksTest->setEnvironment()
Changed environment:array ( 'authenticated' => true, 'comment count' => false, 'form' => 'separate page', 'user_register' => 'admin_only', 'contact' => 'optional', 'comments' => 'open', 'access comments' => 1, 'post comments' => 1, 'skip comment approval' => 1, 'edit own comments' => 0, )DebugCommentLinksTest.php208Drupal\comment\Tests\CommentLinksTest->setEnvironment()
Changed environment:array ( 'authenticated' => false, 'comment count' => true, 'form' => 'separate page', 'user_register' => 'admin_only', 'contact' => 'optional', 'comments' => 'open', 'access comments' => 1, 'post comments' => 1, 'skip comment approval' => 1, 'edit own comments' => 0, )DebugCommentLinksTest.php208Drupal\comment\Tests\CommentLinksTest->setEnvironment()
Changed environment:array ( 'authenticated' => true, 'comment count' => true, 'form' => 'separate page', 'user_register' => 'admin_only', 'contact' => 'optional', 'comments' => 'open', 'access comments' => 1, 'post comments' => 1, 'skip comment approval' => 1, 'edit own comments' => 0, )DebugCommentLinksTest.php208Drupal\comment\Tests\CommentLinksTest->setEnvironment()
LeafDrupal\comment\Tests\CommentNewIndicatorTest4200
LeafDrupal\comment\Tests\CommentNodeAccessTest5700
LeafDrupal\comment\Tests\CommentNodeChangesTest2400
LeafDrupal\comment\Tests\CommentPagerTest21300
LeafDrupal\comment\Tests\CommentPreviewTest10000
LeafDrupal\comment\Tests\CommentRssTest2600
LeafDrupal\comment\Tests\CommentStatisticsTest9800
LeafDrupal\comment\Tests\CommentThreadingTest15900
LeafDrupal\comment\Tests\CommentTokenReplaceTest6600
LeafDrupal\comment\Tests\CommentTranslationUITest18300
LeafDrupal\comment\Tests\CommentUninstallTest800
LeafDrupal\comment\Tests\Views\ArgumentUserUIDTest900
LeafDrupal\comment\Tests\Views\CommentRowTest1100
LeafDrupal\comment\Tests\Views\DefaultViewRecentComments800
LeafDrupal\comment\Tests\Views\FilterUserUIDTest900
LeafDrupal\comment\Tests\Views\RowRssTest1200
LeafDrupal\comment\Tests\Views\WizardTest3300
LeafDrupal\config\Tests\ConfigCRUDTest3200
LeafDrupal\config\Tests\ConfigDiffTest1200
LeafDrupal\config\Tests\ConfigEntityListTest7100
LeafDrupal\config\Tests\ConfigEntityStatusTest600
LeafDrupal\config\Tests\ConfigEntityStatusUITest1500
LeafDrupal\config\Tests\ConfigEntityStorageControllerTest300
LeafDrupal\config\Tests\ConfigEntityTest13600
LeafDrupal\config\Tests\ConfigEntityUnitTest600
LeafDrupal\config\Tests\ConfigExportUITest1800
LeafDrupal\config\Tests\ConfigFileContentTest3300
LeafDrupal\config\Tests\ConfigImporterTest4800
LeafDrupal\config\Tests\ConfigImportUITest6100
LeafDrupal\config\Tests\ConfigInstallTest1400
LeafDrupal\config\Tests\ConfigInstallWebTest1700
LeafDrupal\config\Tests\ConfigLocaleOverride4400
LeafDrupal\config\Tests\ConfigLocaleOverrideWebTest10700
LeafDrupal\config\Tests\ConfigOverrideTest2600
LeafDrupal\config\Tests\ConfigSchemaTest2900
LeafDrupal\config\Tests\ConfigSnapshotTest900
LeafDrupal\config\Tests\ConfigUpgradeTest1200
LeafDrupal\config\Tests\Storage\DatabaseStorageTest2200
LeafDrupal\config\Tests\Storage\FileStorageTest2400
LeafDrupal\contact\Tests\ContactAuthenticatedUserTest1300
LeafDrupal\contact\Tests\ContactPersonalTest23000
LeafDrupal\contact\Tests\ContactSitewideTest33800
ExpandDrupal\contact\Tests\ContactUpgradePathTest523
MessageGroupFilenameLineFunctionStatus
Invoking hooks entity_info is not supported during updatesLogicExceptionUpdateModuleHandler.php50Drupal\Core\Extension\UpdateModuleHandler->getImplementations()
simplexml_import_dom(): Invalid Nodetype to importsimplexml_import_dom(Object) Drupal\simpletest\WebTestBase->parse() Drupal\simpletest\WebTestBase->xpath('//input[@type="submit"]') Drupal\simpletest\WebTestBase->assertFieldByXPath('//input[@type="submit"]') Drupal\system\Tests\Upgrade\UpgradePathTestBase->performUpgrade() Drupal\contact\Tests\ContactUpgradePathTest->testContactUpgrade() Drupal\simpletest\TestBase->run() simpletest_script_run_one_test('136', 'Drupal\contact\Tests\ContactUpgradePathTest') WarningWebTestBase.php1184Drupal\simpletest\WebTestBase->parse()
Parsed page successfully.BrowserUpgradePathTestBase.php239Drupal\system\Tests\Upgrade\UpgradePathTestBase->performUpgrade()
Value false is TRUE.OtherUpgradePathTestBase.php239Drupal\system\Tests\Upgrade\UpgradePathTestBase->performUpgrade()
Exception: An error was encountered during the first access to update.php. in Drupal\system\Tests\Upgrade\UpgradePathTestBase->performUpgrade() (line 240 of /var/lib/drupaltestbot/sites/default/files/checkout/core/modules/system/lib/Drupal/system/Tests/Upgrade/UpgradePathTestBase.php). Drupal\system\Tests\Upgrade\UpgradePathTestBase->performUpgrade() Drupal\contact\Tests\ContactUpgradePathTest->testContactUpgrade() Drupal\simpletest\TestBase->run() simpletest_script_run_one_test('136', 'Drupal\contact\Tests\ContactUpgradePathTest') Uncaught exceptionUpgradePathTestBase.php240Drupal\system\Tests\Upgrade\UpgradePathTestBase->performUpgrade()
LeafDrupal\contact\Tests\MessageEntityTest1200
LeafDrupal\contact\Tests\Views\ContactFieldsTest600
LeafDrupal\contact\Tests\Views\ContactLinkTest5300
LeafDrupal\content_translation\Tests\ConfigTestTranslationUITest1700
LeafDrupal\content_translation\Tests\ContentTestTranslationUITest14800
LeafDrupal\content_translation\Tests\ContentTranslationSettingsTest4900
LeafDrupal\content_translation\Tests\ContentTranslationSyncImageTest3700
LeafDrupal\content_translation\Tests\ContentTranslationSyncUnitTest1100
LeafDrupal\content_translation\Tests\ContentTranslationWorkflowsTest30900
LeafDrupal\content_translation\Tests\Views\ContentTranslationViewsUITest1500
LeafDrupal\content_translation\Tests\Views\TranslationLinkTest1700
LeafDrupal\contextual\Tests\ContextualDynamicContextTest7800
LeafDrupal\contextual\Tests\ContextualUnitTest2000
LeafDrupal\custom_block\Tests\CustomBlockBuildContentTest900
LeafDrupal\custom_block\Tests\CustomBlockCreationTest7900
LeafDrupal\custom_block\Tests\CustomBlockFieldTest2000
LeafDrupal\custom_block\Tests\CustomBlockLoadHooksTest800
LeafDrupal\custom_block\Tests\CustomBlockPageViewTest1200
LeafDrupal\custom_block\Tests\CustomBlockRevisionsTest1300
LeafDrupal\custom_block\Tests\CustomBlockSaveTest3300
LeafDrupal\custom_block\Tests\CustomBlockTranslationUITest12800
LeafDrupal\custom_block\Tests\CustomBlockTypeTest7200
LeafDrupal\custom_block\Tests\PageEditTest3000
LeafDrupal\datetime\Tests\DatetimeFieldTest13100
LeafDrupal\dblog\Tests\DbLogTest37700
LeafDrupal\editor\Tests\EditIntegrationTest2600
LeafDrupal\editor\Tests\EditorAdminTest8500
LeafDrupal\editor\Tests\EditorLoadingTest6600
LeafDrupal\editor\Tests\EditorManagerTest1100
LeafDrupal\edit\Tests\EditLoadingTest5600
LeafDrupal\edit\Tests\EditorSelectionTest2300
LeafDrupal\edit\Tests\MetadataGeneratorTest1400
LeafDrupal\email\Tests\EmailFieldTest1900
LeafDrupal\email\Tests\EmailItemTest1000
LeafDrupal\entity\Tests\EntityDisplayTest5100
LeafDrupal\entity\Tests\EntityFormDisplayTest1700
LeafDrupal\entity_reference\Tests\EntityReferenceAdminTest2900
LeafDrupal\entity_reference\Tests\EntityReferenceAutocompleteTest1000
LeafDrupal\entity_reference\Tests\EntityReferenceAutoCreateTest1800
LeafDrupal\entity_reference\Tests\EntityReferenceItemTest2500
LeafDrupal\entity_reference\Tests\EntityReferenceSelectionAccessTest6900
LeafDrupal\entity_reference\Tests\EntityReferenceSelectionSortTest700
LeafDrupal\entity_reference\Tests\Views\SelectionTest300
LeafDrupal\field\Tests\ActiveTest1400
LeafDrupal\field\Tests\BulkDeleteTest10700
LeafDrupal\field\Tests\CrudTest8500
LeafDrupal\field\Tests\DisplayApiTest5900
LeafDrupal\field\Tests\FieldAccessTest2100
LeafDrupal\field\Tests\FieldAttachOtherTest7800
LeafDrupal\field\Tests\FieldAttachStorageTest12700
LeafDrupal\field\Tests\FieldImportChangeTest600
LeafDrupal\field\Tests\FieldImportCreateTest3300
LeafDrupal\field\Tests\FieldImportDeleteTest1800
LeafDrupal\field\Tests\FieldInfoTest9800
LeafDrupal\field\Tests\FieldInstanceCrudTest3600
LeafDrupal\field\Tests\FieldValidationTest1300
LeafDrupal\field\Tests\FormTest23700
LeafDrupal\field\Tests\NestedFormTest7200
LeafDrupal\field\Tests\ShapeItemTest1400
LeafDrupal\field\Tests\TestItemTest1000
ExpandDrupal\field\Tests\TranslationTest410
MessageGroupFilenameLineFunctionStatus
The test did not complete due to a fatal error.Completion checkTranslationTest.php117Drupal\field\Tests\TranslationTest->testFieldAvailableLanguages()
LeafDrupal\field\Tests\TranslationWebTest2300
LeafDrupal\field\Tests\Views\ApiDataTest1500
LeafDrupal\field\Tests\Views\FieldUITest2800
LeafDrupal\field\Tests\Views\HandlerFieldFieldTest2400
LeafDrupal\field_sql_storage\Tests\FieldSqlStorageTest13300
LeafDrupal\field_ui\Tests\FieldUIRouteTest1200
LeafDrupal\field_ui\Tests\ManageDisplayTest19200
LeafDrupal\field_ui\Tests\ManageFieldsTest38500
LeafDrupal\file\Tests\CopyTest11000
LeafDrupal\file\Tests\DeleteTest2400
LeafDrupal\file\Tests\DownloadTest4500
LeafDrupal\file\Tests\FileFieldDisplayTest5400
LeafDrupal\file\Tests\FileFieldPathTest2800
LeafDrupal\file\Tests\FileFieldRevisionTest6800
LeafDrupal\file\Tests\FileFieldRSSContentTest2400
LeafDrupal\file\Tests\FileFieldValidateTest12100
LeafDrupal\file\Tests\FileFieldWidgetTest34500
LeafDrupal\file\Tests\FileItemTest1600
LeafDrupal\file\Tests\FileManagedFileElementTest54200
LeafDrupal\file\Tests\FilePrivateTest3800
LeafDrupal\file\Tests\FileTokenReplaceTest3600
LeafDrupal\file\Tests\LoadTest4700
LeafDrupal\file\Tests\MoveTest13600
LeafDrupal\file\Tests\RemoteFileSaveUploadTest27000
LeafDrupal\file\Tests\SaveDataTest11100
LeafDrupal\file\Tests\SaveTest1600
LeafDrupal\file\Tests\SaveUploadTest41100
LeafDrupal\file\Tests\SpaceUsedTest1200
LeafDrupal\file\Tests\UsageTest5000
LeafDrupal\file\Tests\ValidateTest1200
LeafDrupal\file\Tests\ValidatorTest5300
LeafDrupal\file\Tests\Views\ExtensionViewsFieldTest1200
LeafDrupal\filter\Tests\FilterAdminTest19800
LeafDrupal\filter\Tests\FilterAPITest1500
LeafDrupal\filter\Tests\FilterCrudTest13800
LeafDrupal\filter\Tests\FilterDefaultConfigTest3000
LeafDrupal\filter\Tests\FilterDefaultFormatTest3300
LeafDrupal\filter\Tests\FilterFormatAccessTest28400
LeafDrupal\filter\Tests\FilterHooksTest3300
LeafDrupal\filter\Tests\FilterHtmlImageSecureTest4600
LeafDrupal\filter\Tests\FilterNoFormatTest100
LeafDrupal\filter\Tests\FilterSecurityTest4000
LeafDrupal\filter\Tests\FilterSettingsTest1300
LeafDrupal\filter\Tests\FilterUnitTest17800
LeafDrupal\forum\Tests\ForumBlockTest12200
LeafDrupal\forum\Tests\ForumIndexTest2700
LeafDrupal\forum\Tests\ForumNodeAccessTest5100
LeafDrupal\forum\Tests\ForumTest65000
LeafDrupal\forum\Tests\ForumUninstallTest600
LeafDrupal\forum\Tests\Views\ForumIntegrationTest200
LeafDrupal\hal\Tests\DenormalizeTest2400
LeafDrupal\hal\Tests\NormalizeTest1200
LeafDrupal\help\Tests\HelpTest30500
LeafDrupal\help\Tests\NoHelpTest1200
LeafDrupal\history\Tests\Views\HistoryTimestampTest1200
LeafDrupal\image\Tests\FileMoveTest400
LeafDrupal\image\Tests\ImageAdminStylesTest22500
LeafDrupal\image\Tests\ImageDimensionsTest5600
LeafDrupal\image\Tests\ImageEffectsTest4300
LeafDrupal\image\Tests\ImageFieldDefaultImagesTest4000
LeafDrupal\image\Tests\ImageFieldDisplayTest15900
LeafDrupal\image\Tests\ImageFieldValidateTest3800
LeafDrupal\image\Tests\ImageItemTest2000
LeafDrupal\image\Tests\ImageStyleFlushTest4100
LeafDrupal\image\Tests\ImageStylesPathAndUrlTest13900
LeafDrupal\image\Tests\ImageThemeFunctionTest500
LeafDrupal\language\Tests\Condition\LanguageConditionTest1500
LeafDrupal\language\Tests\LanguageBrowserDetectionUnitTest10700
LeafDrupal\language\Tests\LanguageConfigurationElementTest5400
LeafDrupal\language\Tests\LanguageConfigurationTest7500
LeafDrupal\language\Tests\LanguageCustomLanguageConfigurationTest3600
LeafDrupal\language\Tests\LanguageDependencyInjectionTest1600
LeafDrupal\language\Tests\LanguageListTest10200
LeafDrupal\language\Tests\LanguageNegotiationInfoTest4900
LeafDrupal\language\Tests\LanguagePathMonolingualTest3500
LeafDrupal\language\Tests\LanguageSwitchingTest4900
LeafDrupal\language\Tests\LanguageUILanguageNegotiationTest14500
LeafDrupal\language\Tests\LanguageUrlRewritingTest4700
LeafDrupal\language\Tests\Views\ArgumentLanguageTest800
LeafDrupal\language\Tests\Views\FieldLanguageTest800
LeafDrupal\language\Tests\Views\FilterLanguageTest800
LeafDrupal\layout\Tests\DisplayInternalLogicTest1100
LeafDrupal\layout\Tests\LayoutDerivativesTest2400
LeafDrupal\link\Tests\LinkFieldTest14400
LeafDrupal\link\Tests\LinkFieldUITest2100
LeafDrupal\link\Tests\LinkItemTest1700
LeafDrupal\locale\Tests\LocaleConfigTranslationTest13400
LeafDrupal\locale\Tests\LocaleContentTest50100
ExpandDrupal\locale\Tests\LocaleExportTest43180
MessageGroupFilenameLineFunctionStatus
Failed to set field langcode to frOtherLocaleExportTest.php65Drupal\locale\Tests\LocaleExportTest->testExportTranslation()
Found the requested form fields at admin/config/regional/translate/exportOtherLocaleExportTest.php65Drupal\locale\Tests\LocaleExportTest->testExportTranslation()
Exported French translation file.OtherLocaleExportTest.php68Drupal\locale\Tests\LocaleExportTest->testExportTranslation()
French translations present in exported file.OtherLocaleExportTest.php70Drupal\locale\Tests\LocaleExportTest->testExportTranslation()
Failed to set field langcode to frOtherLocaleExportTest.php95Drupal\locale\Tests\LocaleExportTest->testExportTranslation()
Failed to set field content_options[not_customized] to OtherLocaleExportTest.php95Drupal\locale\Tests\LocaleExportTest->testExportTranslation()
Failed to set field content_options[customized] to 1OtherLocaleExportTest.php95Drupal\locale\Tests\LocaleExportTest->testExportTranslation()
Failed to set field content_options[not_translated] to OtherLocaleExportTest.php95Drupal\locale\Tests\LocaleExportTest->testExportTranslation()
Found the requested form fields at admin/config/regional/translate/exportOtherLocaleExportTest.php95Drupal\locale\Tests\LocaleExportTest->testExportTranslation()
Exported French translation file with only customized strings.OtherLocaleExportTest.php98Drupal\locale\Tests\LocaleExportTest->testExportTranslation()
French custom translation present in exported file.OtherLocaleExportTest.php100Drupal\locale\Tests\LocaleExportTest->testExportTranslation()
Failed to set field langcode to frOtherLocaleExportTest.php110Drupal\locale\Tests\LocaleExportTest->testExportTranslation()
Failed to set field content_options[not_customized] to OtherLocaleExportTest.php110Drupal\locale\Tests\LocaleExportTest->testExportTranslation()
Failed to set field content_options[customized] to OtherLocaleExportTest.php110Drupal\locale\Tests\LocaleExportTest->testExportTranslation()
Failed to set field content_options[not_translated] to 1OtherLocaleExportTest.php110Drupal\locale\Tests\LocaleExportTest->testExportTranslation()
Found the requested form fields at admin/config/regional/translate/exportOtherLocaleExportTest.php110Drupal\locale\Tests\LocaleExportTest->testExportTranslation()
Exported French translation file with only untranslated strings.OtherLocaleExportTest.php113Drupal\locale\Tests\LocaleExportTest->testExportTranslation()
Untranslated string present in exported file.OtherLocaleExportTest.php117Drupal\locale\Tests\LocaleExportTest->testExportTranslation()
ExpandDrupal\locale\Tests\LocaleImportFunctionalTest192483
MessageGroupFilenameLineFunctionStatus
The language has been automatically created.OtherLocaleImportFunctionalTest.php58Drupal\locale\Tests\LocaleImportFunctionalTest->testStandalonePoFile()
The translation file was successfully imported.OtherLocaleImportFunctionalTest.php61Drupal\locale\Tests\LocaleImportFunctionalTest->testStandalonePoFile()
Undefined index: frDrupal\locale\Tests\LocaleImportFunctionalTest->testStandalonePoFile() Drupal\simpletest\TestBase->run() simpletest_script_run_one_test('397', 'Drupal\locale\Tests\LocaleImportFunctionalTest') NoticeLocaleImportFunctionalTest.php65Drupal\locale\Tests\LocaleImportFunctionalTest->testStandalonePoFile()
Plural number initialized.OtherLocaleImportFunctionalTest.php65Drupal\locale\Tests\LocaleImportFunctionalTest->testStandalonePoFile()
Correct page redirection.OtherLocaleImportFunctionalTest.php68Drupal\locale\Tests\LocaleImportFunctionalTest->testStandalonePoFile()
The translation file was successfully imported.OtherLocaleImportFunctionalTest.php77Drupal\locale\Tests\LocaleImportFunctionalTest->testStandalonePoFile()
Unsafe strings were skipped.OtherLocaleImportFunctionalTest.php80Drupal\locale\Tests\LocaleImportFunctionalTest->testStandalonePoFile()
The empty translation file was successfully imported.OtherLocaleImportFunctionalTest.php88Drupal\locale\Tests\LocaleImportFunctionalTest->testStandalonePoFile()
The translation file was successfully imported.OtherLocaleImportFunctionalTest.php107Drupal\locale\Tests\LocaleImportFunctionalTest->testStandalonePoFile()
Failed to set field string to MontagOtherLocaleImportFunctionalTest.php114Drupal\locale\Tests\LocaleImportFunctionalTest->testStandalonePoFile()
Failed to set field langcode to frOtherLocaleImportFunctionalTest.php114Drupal\locale\Tests\LocaleImportFunctionalTest->testStandalonePoFile()
Failed to set field translation to translatedOtherLocaleImportFunctionalTest.php114Drupal\locale\Tests\LocaleImportFunctionalTest->testStandalonePoFile()
Found the Filter buttonOtherLocaleImportFunctionalTest.php114Drupal\locale\Tests\LocaleImportFunctionalTest->testStandalonePoFile()
Found the requested form fields at admin/config/regional/translate/translateOtherLocaleImportFunctionalTest.php114Drupal\locale\Tests\LocaleImportFunctionalTest->testStandalonePoFile()
Undefined index: frDrupal\locale\Tests\LocaleImportFunctionalTest->testStandalonePoFile() Drupal\simpletest\TestBase->run() simpletest_script_run_one_test('397', 'Drupal\locale\Tests\LocaleImportFunctionalTest') NoticeLocaleImportFunctionalTest.php119Drupal\locale\Tests\LocaleImportFunctionalTest->testStandalonePoFile()
Plural numbers untouched.OtherLocaleImportFunctionalTest.php119Drupal\locale\Tests\LocaleImportFunctionalTest->testStandalonePoFile()
The translation file was successfully imported.OtherLocaleImportFunctionalTest.php129Drupal\locale\Tests\LocaleImportFunctionalTest->testStandalonePoFile()
Failed to set field string to MontagOtherLocaleImportFunctionalTest.php136Drupal\locale\Tests\LocaleImportFunctionalTest->testStandalonePoFile()
Failed to set field langcode to frOtherLocaleImportFunctionalTest.php136Drupal\locale\Tests\LocaleImportFunctionalTest->testStandalonePoFile()
Failed to set field translation to translatedOtherLocaleImportFunctionalTest.php136Drupal\locale\Tests\LocaleImportFunctionalTest->testStandalonePoFile()
Found the Filter buttonOtherLocaleImportFunctionalTest.php136Drupal\locale\Tests\LocaleImportFunctionalTest->testStandalonePoFile()
Found the requested form fields at admin/config/regional/translate/translateOtherLocaleImportFunctionalTest.php136Drupal\locale\Tests\LocaleImportFunctionalTest->testStandalonePoFile()
String overwritten by imported string.OtherLocaleImportFunctionalTest.php137Drupal\locale\Tests\LocaleImportFunctionalTest->testStandalonePoFile()
Undefined index: frDrupal\locale\Tests\LocaleImportFunctionalTest->testStandalonePoFile() Drupal\simpletest\TestBase->run() simpletest_script_run_one_test('397', 'Drupal\locale\Tests\LocaleImportFunctionalTest') NoticeLocaleImportFunctionalTest.php140Drupal\locale\Tests\LocaleImportFunctionalTest->testStandalonePoFile()
Plural numbers changed.OtherLocaleImportFunctionalTest.php140Drupal\locale\Tests\LocaleImportFunctionalTest->testStandalonePoFile()
The customized translation file was successfully imported.OtherLocaleImportFunctionalTest.php149Drupal\locale\Tests\LocaleImportFunctionalTest->testStandalonePoFile()
Customized translations succesfully imported.OtherLocaleImportFunctionalTest.php154Drupal\locale\Tests\LocaleImportFunctionalTest->testStandalonePoFile()
The customized translation file was successfully imported.OtherLocaleImportFunctionalTest.php165Drupal\locale\Tests\LocaleImportFunctionalTest->testStandalonePoFile()
Failed to set field string to januariOtherLocaleImportFunctionalTest.php172Drupal\locale\Tests\LocaleImportFunctionalTest->testStandalonePoFile()
Failed to set field langcode to frOtherLocaleImportFunctionalTest.php172Drupal\locale\Tests\LocaleImportFunctionalTest->testStandalonePoFile()
Failed to set field translation to translatedOtherLocaleImportFunctionalTest.php172Drupal\locale\Tests\LocaleImportFunctionalTest->testStandalonePoFile()
Found the Filter buttonOtherLocaleImportFunctionalTest.php172Drupal\locale\Tests\LocaleImportFunctionalTest->testStandalonePoFile()
Found the requested form fields at admin/config/regional/translate/translateOtherLocaleImportFunctionalTest.php172Drupal\locale\Tests\LocaleImportFunctionalTest->testStandalonePoFile()
The customized translation file was successfully imported.OtherLocaleImportFunctionalTest.php184Drupal\locale\Tests\LocaleImportFunctionalTest->testStandalonePoFile()
Failed to set field string to januariOtherLocaleImportFunctionalTest.php191Drupal\locale\Tests\LocaleImportFunctionalTest->testStandalonePoFile()
Failed to set field langcode to frOtherLocaleImportFunctionalTest.php191Drupal\locale\Tests\LocaleImportFunctionalTest->testStandalonePoFile()
Failed to set field translation to translatedOtherLocaleImportFunctionalTest.php191Drupal\locale\Tests\LocaleImportFunctionalTest->testStandalonePoFile()
Found the Filter buttonOtherLocaleImportFunctionalTest.php191Drupal\locale\Tests\LocaleImportFunctionalTest->testStandalonePoFile()
Found the requested form fields at admin/config/regional/translate/translateOtherLocaleImportFunctionalTest.php191Drupal\locale\Tests\LocaleImportFunctionalTest->testStandalonePoFile()
Customized string overwritten by imported string.OtherLocaleImportFunctionalTest.php192Drupal\locale\Tests\LocaleImportFunctionalTest->testStandalonePoFile()
Long month name context is working.OtherLocaleImportFunctionalTest.php205Drupal\locale\Tests\LocaleImportFunctionalTest->testLanguageContext()
Default context is working.OtherLocaleImportFunctionalTest.php206Drupal\locale\Tests\LocaleImportFunctionalTest->testLanguageContext()
The translation file was successfully imported.OtherLocaleImportFunctionalTest.php220Drupal\locale\Tests\LocaleImportFunctionalTest->testEmptyMsgstr()
String imported and translated.OtherLocaleImportFunctionalTest.php221Drupal\locale\Tests\LocaleImportFunctionalTest->testEmptyMsgstr()
The translation file was successfully imported.OtherLocaleImportFunctionalTest.php228Drupal\locale\Tests\LocaleImportFunctionalTest->testEmptyMsgstr()
Failed to set field string to OperationsOtherLocaleImportFunctionalTest.php236Drupal\locale\Tests\LocaleImportFunctionalTest->testEmptyMsgstr()
Failed to set field langcode to huOtherLocaleImportFunctionalTest.php236Drupal\locale\Tests\LocaleImportFunctionalTest->testEmptyMsgstr()
Failed to set field translation to untranslatedOtherLocaleImportFunctionalTest.php236Drupal\locale\Tests\LocaleImportFunctionalTest->testEmptyMsgstr()
Found the Filter buttonOtherLocaleImportFunctionalTest.php236Drupal\locale\Tests\LocaleImportFunctionalTest->testEmptyMsgstr()
Found the requested form fields at admin/config/regional/translate/translateOtherLocaleImportFunctionalTest.php236Drupal\locale\Tests\LocaleImportFunctionalTest->testEmptyMsgstr()
Search found the string as untranslated.OtherLocaleImportFunctionalTest.php237Drupal\locale\Tests\LocaleImportFunctionalTest->testEmptyMsgstr()
LeafDrupal\locale\Tests\LocaleJavascriptTranslation6600
LeafDrupal\locale\Tests\LocaleLibraryInfoAlterTest200
LeafDrupal\locale\Tests\LocalePathTest12100
ExpandDrupal\locale\Tests\LocalePluralFormatTest86730
MessageGroupFilenameLineFunctionStatus
Computed plural index for fr for count 1 is 0OtherLocalePluralFormatTest.php124Drupal\locale\Tests\LocalePluralFormatTest->testGetPluralFormat()
Plural translation of 1 hours / @count hours for count 1 in fr is 1 heureOtherLocalePluralFormatTest.php129Drupal\locale\Tests\LocalePluralFormatTest->testGetPluralFormat()
Computed plural index for fr for count 0 is 0OtherLocalePluralFormatTest.php124Drupal\locale\Tests\LocalePluralFormatTest->testGetPluralFormat()
Plural translation of 1 hours / @count hours for count 0 in fr is 0 heureOtherLocalePluralFormatTest.php129Drupal\locale\Tests\LocalePluralFormatTest->testGetPluralFormat()
Computed plural index for fr for count 5 is 1OtherLocalePluralFormatTest.php124Drupal\locale\Tests\LocalePluralFormatTest->testGetPluralFormat()
Plural translation of 1 hours / @count hours for count 5 in fr is 5 heuresOtherLocalePluralFormatTest.php129Drupal\locale\Tests\LocalePluralFormatTest->testGetPluralFormat()
Computed plural index for hr for count 1 is 0OtherLocalePluralFormatTest.php124Drupal\locale\Tests\LocalePluralFormatTest->testGetPluralFormat()
Plural translation of 1 hours / @count hours for count 1 in hr is 1 satOtherLocalePluralFormatTest.php129Drupal\locale\Tests\LocalePluralFormatTest->testGetPluralFormat()
Computed plural index for hr for count 21 is 0OtherLocalePluralFormatTest.php124Drupal\locale\Tests\LocalePluralFormatTest->testGetPluralFormat()
Plural translation of 1 hours / @count hours for count 21 in hr is 21 satOtherLocalePluralFormatTest.php129Drupal\locale\Tests\LocalePluralFormatTest->testGetPluralFormat()
Computed plural index for hr for count 0 is 2OtherLocalePluralFormatTest.php124Drupal\locale\Tests\LocalePluralFormatTest->testGetPluralFormat()
Plural translation of 1 hours / @count hours for count 0 in hr is 0 satiOtherLocalePluralFormatTest.php129Drupal\locale\Tests\LocalePluralFormatTest->testGetPluralFormat()
Computed plural index for hr for count 2 is 1OtherLocalePluralFormatTest.php124Drupal\locale\Tests\LocalePluralFormatTest->testGetPluralFormat()
Plural translation of 1 hours / @count hours for count 2 in hr is 2 sataOtherLocalePluralFormatTest.php129Drupal\locale\Tests\LocalePluralFormatTest->testGetPluralFormat()
Computed plural index for hr for count 8 is 2OtherLocalePluralFormatTest.php124Drupal\locale\Tests\LocalePluralFormatTest->testGetPluralFormat()
Plural translation of 1 hours / @count hours for count 8 in hr is 8 satiOtherLocalePluralFormatTest.php129Drupal\locale\Tests\LocalePluralFormatTest->testGetPluralFormat()
Failed to set field langcode to frOtherLocalePluralFormatTest.php150Drupal\locale\Tests\LocalePluralFormatTest->testPluralEditExport()
Found the requested form fields at admin/config/regional/translate/exportOtherLocalePluralFormatTest.php150Drupal\locale\Tests\LocalePluralFormatTest->testPluralEditExport()
Exported French translation file.OtherLocalePluralFormatTest.php152Drupal\locale\Tests\LocalePluralFormatTest->testPluralEditExport()
French translations present in exported file.OtherLocalePluralFormatTest.php154Drupal\locale\Tests\LocalePluralFormatTest->testPluralEditExport()
Plural translations exported properly.OtherLocalePluralFormatTest.php156Drupal\locale\Tests\LocalePluralFormatTest->testPluralEditExport()
Failed to set field langcode to hrOtherLocalePluralFormatTest.php161Drupal\locale\Tests\LocalePluralFormatTest->testPluralEditExport()
Found the requested form fields at admin/config/regional/translate/exportOtherLocalePluralFormatTest.php161Drupal\locale\Tests\LocalePluralFormatTest->testPluralEditExport()
Exported Croatian translation file.OtherLocalePluralFormatTest.php163Drupal\locale\Tests\LocalePluralFormatTest->testPluralEditExport()
Croatian translations present in exported file.OtherLocalePluralFormatTest.php165Drupal\locale\Tests\LocalePluralFormatTest->testPluralEditExport()
Plural translations exported properly.OtherLocalePluralFormatTest.php167Drupal\locale\Tests\LocalePluralFormatTest->testPluralEditExport()
"1 hour" foundOtherLocalePluralFormatTest.php171Drupal\locale\Tests\LocalePluralFormatTest->testPluralEditExport()
"@count hours" foundOtherLocalePluralFormatTest.php172Drupal\locale\Tests\LocalePluralFormatTest->testPluralEditExport()
Failed to set field langcode to hrOtherLocalePluralFormatTest.php179Drupal\locale\Tests\LocalePluralFormatTest->testPluralEditExport()
Found the Filter buttonOtherLocalePluralFormatTest.php179Drupal\locale\Tests\LocalePluralFormatTest->testPluralEditExport()
Found the requested form fields at admin/config/regional/translate/OtherLocalePluralFormatTest.php179Drupal\locale\Tests\LocalePluralFormatTest->testPluralEditExport()
"Singular form" foundOtherLocalePluralFormatTest.php181Drupal\locale\Tests\LocalePluralFormatTest->testPluralEditExport()
"First plural form" foundOtherLocalePluralFormatTest.php182Drupal\locale\Tests\LocalePluralFormatTest->testPluralEditExport()
"2. plural form" foundOtherLocalePluralFormatTest.php183Drupal\locale\Tests\LocalePluralFormatTest->testPluralEditExport()
"@count sat" foundOtherLocalePluralFormatTest.php187Drupal\locale\Tests\LocalePluralFormatTest->testPluralEditExport()
"@count sata" foundOtherLocalePluralFormatTest.php188Drupal\locale\Tests\LocalePluralFormatTest->testPluralEditExport()
"@count sati" foundOtherLocalePluralFormatTest.php189Drupal\locale\Tests\LocalePluralFormatTest->testPluralEditExport()
Failed to set field strings[][translations][1] to @count sata editedOtherLocalePluralFormatTest.php196Drupal\locale\Tests\LocalePluralFormatTest->testPluralEditExport()
Found the Save translations buttonOtherLocalePluralFormatTest.php196Drupal\locale\Tests\LocalePluralFormatTest->testPluralEditExport()
Found the requested form fields at admin/config/regional/translate/OtherLocalePluralFormatTest.php196Drupal\locale\Tests\LocalePluralFormatTest->testPluralEditExport()
Failed to set field langcode to frOtherLocalePluralFormatTest.php201Drupal\locale\Tests\LocalePluralFormatTest->testPluralEditExport()
Found the Filter buttonOtherLocalePluralFormatTest.php201Drupal\locale\Tests\LocalePluralFormatTest->testPluralEditExport()
Found the requested form fields at admin/config/regional/translate/translateOtherLocalePluralFormatTest.php201Drupal\locale\Tests\LocalePluralFormatTest->testPluralEditExport()
"@count heure" foundOtherLocalePluralFormatTest.php203Drupal\locale\Tests\LocalePluralFormatTest->testPluralEditExport()
"@count heures" foundOtherLocalePluralFormatTest.php204Drupal\locale\Tests\LocalePluralFormatTest->testPluralEditExport()
Failed to set field strings[][translations][0] to @count heure editedOtherLocalePluralFormatTest.php211Drupal\locale\Tests\LocalePluralFormatTest->testPluralEditExport()
Found the Save translations buttonOtherLocalePluralFormatTest.php211Drupal\locale\Tests\LocalePluralFormatTest->testPluralEditExport()
Found the requested form fields at admin/config/regional/translate/OtherLocalePluralFormatTest.php211Drupal\locale\Tests\LocalePluralFormatTest->testPluralEditExport()
Failed to set field string to 1 dayOtherLocalePluralFormatTest.php224Drupal\locale\Tests\LocalePluralFormatTest->testPluralEditExport()
Failed to set field langcode to frOtherLocalePluralFormatTest.php224Drupal\locale\Tests\LocalePluralFormatTest->testPluralEditExport()
Found the Filter buttonOtherLocalePluralFormatTest.php224Drupal\locale\Tests\LocalePluralFormatTest->testPluralEditExport()
Found the requested form fields at admin/config/regional/translate/translateOtherLocalePluralFormatTest.php224Drupal\locale\Tests\LocalePluralFormatTest->testPluralEditExport()
Failed to set field strings[11][translations][0] to 1 jourOtherLocalePluralFormatTest.php231Drupal\locale\Tests\LocalePluralFormatTest->testPluralEditExport()
Failed to set field strings[11][translations][1] to @count joursOtherLocalePluralFormatTest.php231Drupal\locale\Tests\LocalePluralFormatTest->testPluralEditExport()
Found the Save translations buttonOtherLocalePluralFormatTest.php231Drupal\locale\Tests\LocalePluralFormatTest->testPluralEditExport()
Found the requested form fields at admin/config/regional/translate/OtherLocalePluralFormatTest.php231Drupal\locale\Tests\LocalePluralFormatTest->testPluralEditExport()
Failed to set field string to 1 dayOtherLocalePluralFormatTest.php238Drupal\locale\Tests\LocalePluralFormatTest->testPluralEditExport()
Failed to set field langcode to hrOtherLocalePluralFormatTest.php238Drupal\locale\Tests\LocalePluralFormatTest->testPluralEditExport()
Found the Filter buttonOtherLocalePluralFormatTest.php238Drupal\locale\Tests\LocalePluralFormatTest->testPluralEditExport()
Found the requested form fields at admin/config/regional/translate/translateOtherLocalePluralFormatTest.php238Drupal\locale\Tests\LocalePluralFormatTest->testPluralEditExport()
Failed to set field strings[11][translations][0] to @count danOtherLocalePluralFormatTest.php245Drupal\locale\Tests\LocalePluralFormatTest->testPluralEditExport()
Failed to set field strings[11][translations][1] to @count danaOtherLocalePluralFormatTest.php245Drupal\locale\Tests\LocalePluralFormatTest->testPluralEditExport()
Failed to set field strings[11][translations][2] to @count danaOtherLocalePluralFormatTest.php245Drupal\locale\Tests\LocalePluralFormatTest->testPluralEditExport()
Found the Save translations buttonOtherLocalePluralFormatTest.php245Drupal\locale\Tests\LocalePluralFormatTest->testPluralEditExport()
Found the requested form fields at admin/config/regional/translate/OtherLocalePluralFormatTest.php245Drupal\locale\Tests\LocalePluralFormatTest->testPluralEditExport()
Failed to set field langcode to frOtherLocalePluralFormatTest.php250Drupal\locale\Tests\LocalePluralFormatTest->testPluralEditExport()
Found the requested form fields at admin/config/regional/translate/exportOtherLocalePluralFormatTest.php250Drupal\locale\Tests\LocalePluralFormatTest->testPluralEditExport()
Edited French plural translations for hours exported properly.OtherLocalePluralFormatTest.php252Drupal\locale\Tests\LocalePluralFormatTest->testPluralEditExport()
Added French plural translations for days exported properly.OtherLocalePluralFormatTest.php253Drupal\locale\Tests\LocalePluralFormatTest->testPluralEditExport()
Failed to set field langcode to hrOtherLocalePluralFormatTest.php258Drupal\locale\Tests\LocalePluralFormatTest->testPluralEditExport()
Found the requested form fields at admin/config/regional/translate/exportOtherLocalePluralFormatTest.php258Drupal\locale\Tests\LocalePluralFormatTest->testPluralEditExport()
Edited Croatian plural translations exported properly.OtherLocalePluralFormatTest.php260Drupal\locale\Tests\LocalePluralFormatTest->testPluralEditExport()
Added Croatian plural translations exported properly.OtherLocalePluralFormatTest.php261Drupal\locale\Tests\LocalePluralFormatTest->testPluralEditExport()
LeafDrupal\locale\Tests\LocaleStringTest2600
LeafDrupal\locale\Tests\LocaleTranslationTest100
LeafDrupal\locale\Tests\LocaleTranslationUiTest67700
LeafDrupal\locale\Tests\LocaleUninstallFrenchTest3400
LeafDrupal\locale\Tests\LocaleUninstallTest3400
LeafDrupal\locale\Tests\LocaleUpdateCronTest11000
LeafDrupal\locale\Tests\LocaleUpdateInterfaceTest11100
LeafDrupal\locale\Tests\LocaleUpdateTest124900
LeafDrupal\menu\Tests\MenuLanguageTest5800
LeafDrupal\menu\Tests\MenuNodeTest11100
LeafDrupal\menu\Tests\MenuTest187800
LeafDrupal\minimal\Tests\MinimalTest1600
LeafDrupal\node\Tests\Condition\NodeConditionTest1400
LeafDrupal\node\Tests\Config\NodeImportChangeTest400
LeafDrupal\node\Tests\Config\NodeImportCreateTest1000
LeafDrupal\node\Tests\MultiStepNodeFormBasicOptionsTest1700
LeafDrupal\node\Tests\NodeAccessBaseTableTest15900
LeafDrupal\node\Tests\NodeAccessFieldTest5000
LeafDrupal\node\Tests\NodeAccessLanguageAwareCombinationTest14200
LeafDrupal\node\Tests\NodeAccessLanguageAwareTest9100
LeafDrupal\node\Tests\NodeAccessLanguageTest9800
LeafDrupal\node\Tests\NodeAccessPagerTest3000
LeafDrupal\node\Tests\NodeAccessRebuildTest1900
LeafDrupal\node\Tests\NodeAccessRecordsTest2600
LeafDrupal\node\Tests\NodeAccessTest3400
LeafDrupal\node\Tests\NodeAdminTest15200
LeafDrupal\node\Tests\NodeBlockFunctionalTest6300
LeafDrupal\node\Tests\NodeBuildContentTest400
LeafDrupal\node\Tests\NodeCreationTest4900
LeafDrupal\node\Tests\NodeEntityFieldQueryAlterTest3200
LeafDrupal\node\Tests\NodeEntityViewModeAlterTest2000
LeafDrupal\node\Tests\NodeFieldMultilingualTestCase6400
LeafDrupal\node\Tests\NodeFormButtonsTest12500
LeafDrupal\node\Tests\NodeLoadHooksTest700
LeafDrupal\node\Tests\NodeLoadMultipleTest2700
LeafDrupal\node\Tests\NodePostSettingsTest2900
LeafDrupal\node\Tests\NodeQueryAlterTest9900
LeafDrupal\node\Tests\NodeRevisionPermissionsTest4600
LeafDrupal\node\Tests\NodeRevisionsAllTestCase4900
LeafDrupal\node\Tests\NodeRevisionsTest6400
LeafDrupal\node\Tests\NodeRSSContentTest1900
LeafDrupal\node\Tests\NodeSaveTest6000
LeafDrupal\node\Tests\NodeSyndicateBlockTest1400
LeafDrupal\node\Tests\NodeTitleTest2300
LeafDrupal\node\Tests\NodeTitleXSSTest2300
LeafDrupal\node\Tests\NodeTokenReplaceTest4000
LeafDrupal\node\Tests\NodeTranslationUITest20700
LeafDrupal\node\Tests\NodeTypeInitialLanguageTest8000
LeafDrupal\node\Tests\NodeTypePersistenceTest6500
LeafDrupal\node\Tests\NodeTypeTest16700
LeafDrupal\node\Tests\PageEditTest9700
LeafDrupal\node\Tests\PagePreviewTest8300
LeafDrupal\node\Tests\PageViewTest3400
LeafDrupal\node\Tests\SummaryLengthTest1200
LeafDrupal\node\Tests\Views\BulkFormTest1600
LeafDrupal\node\Tests\Views\FieldTypeTest200
LeafDrupal\node\Tests\Views\FilterUidRevisionTest400
LeafDrupal\node\Tests\Views\FrontPageTest600
LeafDrupal\node\Tests\Views\NodeIntegrationTest1600
LeafDrupal\node\Tests\Views\RevisionRelationships300
LeafDrupal\node\Tests\Views\RowPluginTest3600
LeafDrupal\node\Tests\Views\StatusExtraTest6800
LeafDrupal\number\Tests\NumberFieldTest8800
LeafDrupal\number\Tests\NumberItemTest2200
LeafDrupal\options\Tests\OptionsDynamicValuesValidationTest900
LeafDrupal\options\Tests\OptionsFieldTest2000
LeafDrupal\options\Tests\OptionsFieldUITest25500
LeafDrupal\options\Tests\OptionsFormattersTest900
LeafDrupal\options\Tests\OptionsSelectDynamicValuesTest1600
LeafDrupal\options\Tests\OptionsWidgetsTest26400
LeafDrupal\overlay\Tests\OverlayCloseTest1800
LeafDrupal\path\Tests\PathAliasTest14000
LeafDrupal\path\Tests\PathLanguageTest13700
LeafDrupal\path\Tests\PathLanguageUiTest30500
LeafDrupal\path\Tests\PathTaxonomyTermTest3700
LeafDrupal\php\Tests\Condition\PhpConditionTest600
LeafDrupal\php\Tests\PhpAccessTest3800
LeafDrupal\php\Tests\PhpFilterTest4200
LeafDrupal\picture\Tests\PictureAdminUITest5400
LeafDrupal\picture\Tests\PictureFieldDisplayTest11500
LeafDrupal\rdf\Tests\CommentAttributesTest11800
LeafDrupal\rdf\Tests\CrudTest800
LeafDrupal\rdf\Tests\FileFieldAttributesTest1800
LeafDrupal\rdf\Tests\GetNamespacesTest700
LeafDrupal\rdf\Tests\GetRdfNamespacesTest500
LeafDrupal\rdf\Tests\ImageFieldAttributesTest1700
LeafDrupal\rdf\Tests\NodeAttributesTest1000
LeafDrupal\rdf\Tests\RdfaAttributesTest800
ExpandDrupal\rdf\Tests\RdfMappingUpgradePathTest523
MessageGroupFilenameLineFunctionStatus
Invoking hooks entity_info is not supported during updatesLogicExceptionUpdateModuleHandler.php50Drupal\Core\Extension\UpdateModuleHandler->getImplementations()
simplexml_import_dom(): Invalid Nodetype to importsimplexml_import_dom(Object) Drupal\simpletest\WebTestBase->parse() Drupal\simpletest\WebTestBase->xpath('//input[@type="submit"]') Drupal\simpletest\WebTestBase->assertFieldByXPath('//input[@type="submit"]') Drupal\system\Tests\Upgrade\UpgradePathTestBase->performUpgrade() Drupal\rdf\Tests\RdfMappingUpgradePathTest->testRdfMappingUpgrade() Drupal\simpletest\TestBase->run() simpletest_script_run_one_test('513', 'Drupal\rdf\Tests\RdfMappingUpgradePathTest') WarningWebTestBase.php1184Drupal\simpletest\WebTestBase->parse()
Parsed page successfully.BrowserUpgradePathTestBase.php239Drupal\system\Tests\Upgrade\UpgradePathTestBase->performUpgrade()
Value false is TRUE.OtherUpgradePathTestBase.php239Drupal\system\Tests\Upgrade\UpgradePathTestBase->performUpgrade()
Exception: An error was encountered during the first access to update.php. in Drupal\system\Tests\Upgrade\UpgradePathTestBase->performUpgrade() (line 240 of /var/lib/drupaltestbot/sites/default/files/checkout/core/modules/system/lib/Drupal/system/Tests/Upgrade/UpgradePathTestBase.php). Drupal\system\Tests\Upgrade\UpgradePathTestBase->performUpgrade() Drupal\rdf\Tests\RdfMappingUpgradePathTest->testRdfMappingUpgrade() Drupal\simpletest\TestBase->run() simpletest_script_run_one_test('513', 'Drupal\rdf\Tests\RdfMappingUpgradePathTest') Uncaught exceptionUpgradePathTestBase.php240Drupal\system\Tests\Upgrade\UpgradePathTestBase->performUpgrade()
LeafDrupal\rdf\Tests\TaxonomyAttributesTest700
LeafDrupal\rdf\Tests\TaxonomyTermFieldAttributesTest1600
LeafDrupal\rdf\Tests\TrackerAttributesTest3000
LeafDrupal\rdf\Tests\UserAttributesTest4000
LeafDrupal\rest\Tests\CreateTest4400
LeafDrupal\rest\Tests\DBLogTest1800
LeafDrupal\rest\Tests\DeleteTest3700
LeafDrupal\rest\Tests\ReadTest3900
LeafDrupal\rest\Tests\UpdateTest4500
LeafDrupal\rest\Tests\Views\StyleSerializerTest11400
LeafDrupal\search\Tests\SearchAdvancedSearchFormTest3400
LeafDrupal\search\Tests\SearchBlockTest3800
LeafDrupal\search\Tests\SearchCommentCountToggleTest3100
LeafDrupal\search\Tests\SearchCommentTest19300
LeafDrupal\search\Tests\SearchConfigSettingsFormTest20500
LeafDrupal\search\Tests\SearchEmbedFormTest5200
LeafDrupal\search\Tests\SearchExactTest2700
LeafDrupal\search\Tests\SearchExcerptTest1800
LeafDrupal\search\Tests\SearchKeywordsConditionsTest2800
LeafDrupal\search\Tests\SearchLanguageTest4300
LeafDrupal\search\Tests\SearchMatchTest14700
LeafDrupal\search\Tests\SearchMultilingualEntityTest1000
LeafDrupal\search\Tests\SearchNodeAccessTest1600
LeafDrupal\search\Tests\SearchNumberMatchingTest29500
LeafDrupal\search\Tests\SearchNumbersTest17500
LeafDrupal\search\Tests\SearchPageOverrideTest1500
LeafDrupal\search\Tests\SearchPageTextTest3700
LeafDrupal\search\Tests\SearchPreprocessLangcodeTest3900
LeafDrupal\search\Tests\SearchRankingTest5900
LeafDrupal\search\Tests\SearchSimplifyTest65700
LeafDrupal\search\Tests\SearchTokenizerTest800
LeafDrupal\serialization\Tests\EntityResolverTest500
LeafDrupal\serialization\Tests\EntitySerializationTest2600
LeafDrupal\serialization\Tests\SerializationTest200
LeafDrupal\shortcut\Tests\ShortcutLinksTest15000
LeafDrupal\shortcut\Tests\ShortcutSetsTest21900
LeafDrupal\simpletest\Tests\BrokenSetUpTest2100
LeafDrupal\simpletest\Tests\BrowserTest1600
LeafDrupal\simpletest\Tests\DrupalUnitTestBaseTest6800
LeafDrupal\simpletest\Tests\FolderTest200
LeafDrupal\simpletest\Tests\InstallationProfileModuleTestsTest1900
LeafDrupal\simpletest\Tests\MailCaptureTest1200
LeafDrupal\simpletest\Tests\MissingCheckedRequirementsTest1900
LeafDrupal\simpletest\Tests\OtherInstallationProfileModuleTestsTest1200
LeafDrupal\simpletest\Tests\PhpUnitAutoloaderTest100
LeafDrupal\simpletest\Tests\PhpUnitErrorTest100
LeafDrupal\simpletest\Tests\SimpleTestTest11500
LeafDrupal\simpletest\Tests\UserHelpersTest4600
LeafDrupal\standard\Tests\StandardTest3400
LeafDrupal\statistics\Tests\StatisticsAdminTest5800
LeafDrupal\statistics\Tests\StatisticsLoggingTest2100
LeafDrupal\statistics\Tests\StatisticsReportsTest1900
LeafDrupal\statistics\Tests\StatisticsTokenReplaceTest3000
LeafDrupal\statistics\Tests\Views\IntegrationTest1600
LeafDrupal\syslog\Tests\SyslogTest1700
LeafDrupal\system\Tests\Action\ActionUnitTest1100
LeafDrupal\system\Tests\Ajax\AjaxCommandsUnitTest4600
LeafDrupal\system\Tests\Ajax\CommandsTest7700
LeafDrupal\system\Tests\Ajax\DialogTest5400
LeafDrupal\system\Tests\Ajax\ElementValidationTest1400
LeafDrupal\system\Tests\Ajax\FormValuesTest2900
LeafDrupal\system\Tests\Ajax\FrameworkTest3800
LeafDrupal\system\Tests\Ajax\MultiFormTest3700
LeafDrupal\system\Tests\Batch\PageTest1600
LeafDrupal\system\Tests\Batch\ProcessingTest16100
LeafDrupal\system\Tests\Bootstrap\GetFilenameUnitTest700
LeafDrupal\system\Tests\Bootstrap\MiscUnitTest400
LeafDrupal\system\Tests\Bootstrap\OverrideServerVariablesUnitTest600
LeafDrupal\system\Tests\Bootstrap\PageCacheTest8700
LeafDrupal\system\Tests\Bootstrap\ResettableStaticUnitTest500
LeafDrupal\system\Tests\Bootstrap\VariableTest900
LeafDrupal\system\Tests\Bundle\BundleTest900
LeafDrupal\system\Tests\Cache\BackendChainUnitTest13700
LeafDrupal\system\Tests\Cache\ClearTest1000
LeafDrupal\system\Tests\Cache\DatabaseBackendUnitTest13700
LeafDrupal\system\Tests\Cache\MemoryBackendUnitTest13700
LeafDrupal\system\Tests\Common\AddFeedTest700
LeafDrupal\system\Tests\Common\AlterTest700
LeafDrupal\system\Tests\Common\CascadingStylesheetsTest2900
LeafDrupal\system\Tests\Common\CascadingStylesheetsUnitTest1200
LeafDrupal\system\Tests\Common\FormatDateTest7300
LeafDrupal\system\Tests\Common\HtmlIdentifierUnitTest1100
LeafDrupal\system\Tests\Common\HtmlTagTest200
LeafDrupal\system\Tests\Common\JavaScriptTest9200
LeafDrupal\system\Tests\Common\ParseInfoFileUnitTest300
LeafDrupal\system\Tests\Common\RegionContentTest1800
LeafDrupal\system\Tests\Common\RenderTest6200
LeafDrupal\system\Tests\Common\SimpleTestErrorCollectorTest1600
LeafDrupal\system\Tests\Common\SizeUnitTest3500
LeafDrupal\system\Tests\Common\SystemListingTest600
LeafDrupal\system\Tests\Common\TableSortExtenderUnitTest600
LeafDrupal\system\Tests\Common\UrlTest5200
LeafDrupal\system\Tests\Common\ValidNumberStepUnitTest2400
LeafDrupal\system\Tests\Common\WriteRecordTest3400
LeafDrupal\system\Tests\Common\XssUnitTest800
LeafDrupal\system\Tests\Condition\ConditionFormTest1100
LeafDrupal\system\Tests\Database\AlterTest3400
LeafDrupal\system\Tests\Database\BasicSyntaxTest1400
LeafDrupal\system\Tests\Database\CaseSensitivityTest400
LeafDrupal\system\Tests\Database\ConnectionTest2200
LeafDrupal\system\Tests\Database\ConnectionUnitTest3300
LeafDrupal\system\Tests\Database\DatabaseExceptionWrapperTest100
LeafDrupal\system\Tests\Database\DeleteTruncateTest1100
LeafDrupal\system\Tests\Database\FetchTest3800
LeafDrupal\system\Tests\Database\InsertDefaultsTest1000
LeafDrupal\system\Tests\Database\InsertLobTest700
LeafDrupal\system\Tests\Database\InsertTest2700
LeafDrupal\system\Tests\Database\InvalidDataTest400
LeafDrupal\system\Tests\Database\LoggingTest2400
LeafDrupal\system\Tests\Database\MergeTest5200
LeafDrupal\system\Tests\Database\NextIdTest400
LeafDrupal\system\Tests\Database\QueryTest300
LeafDrupal\system\Tests\Database\RangeQueryTest400
LeafDrupal\system\Tests\Database\RegressionTest1500
LeafDrupal\system\Tests\Database\SchemaTest58800
LeafDrupal\system\Tests\Database\SelectCloneTest400
LeafDrupal\system\Tests\Database\SelectComplexTest9300
LeafDrupal\system\Tests\Database\SelectOrderedTest1700
LeafDrupal\system\Tests\Database\SelectPagerDefaultTest2200
LeafDrupal\system\Tests\Database\SelectSubqueryTest1900
LeafDrupal\system\Tests\Database\SelectTableSortDefaultTest3000
LeafDrupal\system\Tests\Database\SelectTest9000
LeafDrupal\system\Tests\Database\SerializeQueryTest300
LeafDrupal\system\Tests\Database\TaggingTest1600
LeafDrupal\system\Tests\Database\TemporaryQueryTest600
LeafDrupal\system\Tests\Database\TransactionTest5400
LeafDrupal\system\Tests\Database\UpdateComplexTest3500
LeafDrupal\system\Tests\Database\UpdateLobTest700
LeafDrupal\system\Tests\Database\UpdateTest3500
LeafDrupal\system\Tests\Datetime\DateTimePlusIntlTest1400
LeafDrupal\system\Tests\Datetime\DateTimePlusTest5400
LeafDrupal\system\Tests\Datetime\DrupalDateTimeTest1400
LeafDrupal\system\Tests\DrupalKernel\ContentNegotiationTest4000
LeafDrupal\system\Tests\DrupalKernel\DrupalKernelTest900
LeafDrupal\system\Tests\DrupalKernel\ServiceDestructionTest800
LeafDrupal\system\Tests\Entity\ConfigEntityQueryTest12600
LeafDrupal\system\Tests\Entity\EntityAccessTest3800
LeafDrupal\system\Tests\Entity\EntityApiInfoTest600
LeafDrupal\system\Tests\Entity\EntityApiTest4000
LeafDrupal\system\Tests\Entity\EntityBCDecoratorTest1700
LeafDrupal\system\Tests\Entity\EntityCrudHookTest21600
LeafDrupal\system\Tests\Entity\EntityFieldDefaultValueTest1700
LeafDrupal\system\Tests\Entity\EntityFieldTest72300
LeafDrupal\system\Tests\Entity\EntityFormTest8900
LeafDrupal\system\Tests\Entity\EntityLabelTest800
LeafDrupal\system\Tests\Entity\EntityManagerTest1000
LeafDrupal\system\Tests\Entity\EntityOperationsTest1700
LeafDrupal\system\Tests\Entity\EntityQueryAggregateTest4900
LeafDrupal\system\Tests\Entity\EntityQueryRelationshipTest2300
LeafDrupal\system\Tests\Entity\EntityQueryTest9700
LeafDrupal\system\Tests\Entity\EntityRevisionsTest5300
LeafDrupal\system\Tests\Entity\EntityTranslationFormTest3600
LeafDrupal\system\Tests\Entity\EntityTranslationTest15200
LeafDrupal\system\Tests\Entity\EntityUriTest700
LeafDrupal\system\Tests\Entity\EntityUUIDTest8800
LeafDrupal\system\Tests\Entity\EntityValidationTest5600
LeafDrupal\system\Tests\Entity\FieldAccessTest600
LeafDrupal\system\Tests\FileTransfer\FileTransferTest200
LeafDrupal\system\Tests\File\ConfigTest4200
LeafDrupal\system\Tests\File\DirectoryTest5200
LeafDrupal\system\Tests\File\MimeTypeTest8400
LeafDrupal\system\Tests\File\NameMungingTest1100
LeafDrupal\system\Tests\File\ReadOnlyStreamWrapperTest3200
LeafDrupal\system\Tests\File\RemoteFileDirectoryTest3200
LeafDrupal\system\Tests\File\RemoteFileScanDirectoryTest2900
LeafDrupal\system\Tests\File\RemoteFileUnmanagedCopyTest3200
LeafDrupal\system\Tests\File\RemoteFileUnmanagedDeleteRecursiveTest2100
LeafDrupal\system\Tests\File\RemoteFileUnmanagedDeleteTest1000
LeafDrupal\system\Tests\File\RemoteFileUnmanagedMoveTest2300
LeafDrupal\system\Tests\File\RemoteFileUnmanagedSaveDataTest800
LeafDrupal\system\Tests\File\ScanDirectoryTest4700
LeafDrupal\system\Tests\File\StreamWrapperTest2600
LeafDrupal\system\Tests\File\UnmanagedCopyTest4300
LeafDrupal\system\Tests\File\UnmanagedDeleteRecursiveTest1700
LeafDrupal\system\Tests\File\UnmanagedDeleteTest700
LeafDrupal\system\Tests\File\UnmanagedMoveTest2000
LeafDrupal\system\Tests\File\UnmanagedSaveDataTest700
LeafDrupal\system\Tests\File\UrlRewritingTest1400
LeafDrupal\system\Tests\Form\AlterTest400
LeafDrupal\system\Tests\Form\ArbitraryRebuildTest1600
LeafDrupal\system\Tests\Form\CheckboxTest9700
LeafDrupal\system\Tests\Form\ConfirmFormTest2700
LeafDrupal\system\Tests\Form\ElementsLabelsTest2000
LeafDrupal\system\Tests\Form\ElementsTableSelectTest6900
LeafDrupal\system\Tests\Form\ElementsVerticalTabsTest3900
LeafDrupal\system\Tests\Form\ElementTest5700
LeafDrupal\system\Tests\Form\EmailTest1700
LeafDrupal\system\Tests\Form\FileInclusionTest1100
LeafDrupal\system\Tests\Form\FormCacheTest1400
LeafDrupal\system\Tests\Form\FormObjectTest4300
LeafDrupal\system\Tests\Form\FormTest65600
LeafDrupal\system\Tests\Form\HTMLIdTest700
LeafDrupal\system\Tests\Form\LanguageSelectElementTest4400
LeafDrupal\system\Tests\Form\ProgrammaticTest2400
LeafDrupal\system\Tests\Form\RebuildTest5300
LeafDrupal\system\Tests\Form\RedirectTest3100
LeafDrupal\system\Tests\Form\StateValuesCleanAdvancedTest700
LeafDrupal\system\Tests\Form\StateValuesCleanTest1400
LeafDrupal\system\Tests\Form\StorageTest12000
LeafDrupal\system\Tests\Form\SystemConfigFormTest700
LeafDrupal\system\Tests\Form\TriggeringElementTest5000
LeafDrupal\system\Tests\Form\UrlTest1700
LeafDrupal\system\Tests\Form\ValidationTest11200
LeafDrupal\system\Tests\Form\WrapperTest500
LeafDrupal\system\Tests\Image\ToolkitGdTest20500
LeafDrupal\system\Tests\Image\ToolkitTest5300
LeafDrupal\system\Tests\InstallerTest1500
LeafDrupal\system\Tests\Installer\InstallerLanguageTest800
LeafDrupal\system\Tests\Installer\SiteNameTest300
LeafDrupal\system\Tests\KeyValueStore\DatabaseStorageExpirableTest6800
LeafDrupal\system\Tests\KeyValueStore\DatabaseStorageTest3600
LeafDrupal\system\Tests\KeyValueStore\GarbageCollectionTest200
LeafDrupal\system\Tests\KeyValueStore\MemoryStorageTest3600
LeafDrupal\system\Tests\Lock\LockFunctionalTest1800
LeafDrupal\system\Tests\Lock\LockUnitTest1300
LeafDrupal\system\Tests\Mail\HtmlToTextTest8600
LeafDrupal\system\Tests\Mail\MailTest700
LeafDrupal\system\Tests\Mail\WrapMailUnitTest200
LeafDrupal\system\Tests\Menu\BreadcrumbTest44400
LeafDrupal\system\Tests\Menu\LinksTest5000
LeafDrupal\system\Tests\Menu\LocalActionTest900
LeafDrupal\system\Tests\Menu\LocalTasksTest5700
LeafDrupal\system\Tests\Menu\MenuRouterTest24000
LeafDrupal\system\Tests\Menu\MenuTranslateTest2500
LeafDrupal\system\Tests\Menu\RebuildTest1000
LeafDrupal\system\Tests\Menu\TrailTest6800
LeafDrupal\system\Tests\Menu\TreeAccessTest600
LeafDrupal\system\Tests\Menu\TreeDataUnitTest800
LeafDrupal\system\Tests\Menu\TreeOutputTest1800
LeafDrupal\system\Tests\Module\ClassLoaderTest1200
LeafDrupal\system\Tests\Module\DependencyTest16200
LeafDrupal\system\Tests\Module\EnableDisableTest228200
LeafDrupal\system\Tests\Module\HookRequirementsTest1600
LeafDrupal\system\Tests\Module\InstallTest300
LeafDrupal\system\Tests\Module\ModuleApiTest6800
LeafDrupal\system\Tests\Module\ModuleEnable500
LeafDrupal\system\Tests\Module\RequiredTest2000
LeafDrupal\system\Tests\Module\UninstallTest200
LeafDrupal\system\Tests\Module\VersionTest5100
LeafDrupal\system\Tests\Pager\PagerTest12300
LeafDrupal\system\Tests\ParamConverter\UpcastingTest1700
LeafDrupal\system\Tests\Path\AliasTest4200
LeafDrupal\system\Tests\Path\MatchPathTest4100
LeafDrupal\system\Tests\Path\UrlAlterFunctionalTest3700
LeafDrupal\system\Tests\Plugin\AlterDecoratorTest300
LeafDrupal\system\Tests\Plugin\CacheDecoratorLanguageTest3800
LeafDrupal\system\Tests\Plugin\CacheDecoratorTest1400
LeafDrupal\system\Tests\Plugin\ContextPluginTest2400
LeafDrupal\system\Tests\Plugin\DerivativeTest1200
LeafDrupal\system\Tests\Plugin\Discovery\AnnotatedClassDiscoveryTest700
LeafDrupal\system\Tests\Plugin\Discovery\CustomAnnotationClassDiscoveryTest500
LeafDrupal\system\Tests\Plugin\Discovery\StaticDiscoveryTest600
LeafDrupal\system\Tests\Plugin\FactoryTest900
LeafDrupal\system\Tests\Plugin\InspectionTest1500
LeafDrupal\system\Tests\Plugin\PluginBagTest2800
LeafDrupal\system\Tests\Queue\QueueTest1700
LeafDrupal\system\Tests\Routing\ControllerResolverTest100
LeafDrupal\system\Tests\Routing\MatcherDumperTest800
LeafDrupal\system\Tests\Routing\MimeTypeMatcherTest1000
LeafDrupal\system\Tests\Routing\RouteProviderTest4600
LeafDrupal\system\Tests\Routing\RouterPermissionTest2300
LeafDrupal\system\Tests\Routing\RouterTest7400
LeafDrupal\system\Tests\Routing\RouteTest600
LeafDrupal\system\Tests\Session\SessionHttpsTest3500
LeafDrupal\system\Tests\Session\SessionTest18700
LeafDrupal\system\Tests\System\AccessDeniedTest6400
LeafDrupal\system\Tests\System\AdminMetaTagTest300
LeafDrupal\system\Tests\System\AdminTest18100
LeafDrupal\system\Tests\System\CronRunTest5200
LeafDrupal\system\Tests\System\DateFormatsLanguageTest11600
LeafDrupal\system\Tests\System\DateTimeTest8800
LeafDrupal\system\Tests\System\DefaultMobileMetaTagsTest1200
LeafDrupal\system\Tests\System\ErrorHandlerTest4000
LeafDrupal\system\Tests\System\ExceptionControllerTest200
LeafDrupal\system\Tests\System\FloodTest1000
LeafDrupal\system\Tests\System\FrontPageTest3700
LeafDrupal\system\Tests\System\IgnoreSlaveSubscriberTest100
LeafDrupal\system\Tests\System\IndexPhpTest600
LeafDrupal\system\Tests\System\InfoAlterTest1000
LeafDrupal\system\Tests\System\MainContentFallbackTest6000
LeafDrupal\system\Tests\System\PageNotFoundTest1800
LeafDrupal\system\Tests\System\PageTitleFilteringTest4400
LeafDrupal\system\Tests\System\PasswordHashingTest1000
LeafDrupal\system\Tests\System\RetrieveFileTest700
LeafDrupal\system\Tests\System\SettingsRewriteTest500
LeafDrupal\system\Tests\System\ShutdownFunctionsTest500
LeafDrupal\system\Tests\System\SiteMaintenanceTest7700
LeafDrupal\system\Tests\System\SystemAuthorizeTest1600
LeafDrupal\system\Tests\System\ThemeTest20500
LeafDrupal\system\Tests\System\TokenReplaceTest3600
LeafDrupal\system\Tests\System\TokenScanTest400
LeafDrupal\system\Tests\Theme\EntityFilteringThemeTest5600
LeafDrupal\system\Tests\Theme\FastTest1200
LeafDrupal\system\Tests\Theme\FunctionsTest2600
LeafDrupal\system\Tests\Theme\HtmlTplPhpAttributesTest500
LeafDrupal\system\Tests\Theme\RegistryTest600
LeafDrupal\system\Tests\Theme\TableTest800
LeafDrupal\system\Tests\Theme\ThemeEarlyInitializationTest500
LeafDrupal\system\Tests\Theme\ThemeInfoStylesTest1300
LeafDrupal\system\Tests\Theme\ThemeTest5300
LeafDrupal\system\Tests\Theme\ThemeTestPhpTemplate400
LeafDrupal\system\Tests\Theme\ThemeTestTwig1000
LeafDrupal\system\Tests\Theme\TwigDebugMarkupTest900
LeafDrupal\system\Tests\Theme\TwigReferenceUnitTest1500
LeafDrupal\system\Tests\Theme\TwigSettingsTest1300
LeafDrupal\system\Tests\Transliteration\TransliterationTest3100
LeafDrupal\system\Tests\TypedData\TypedDataTest22000
LeafDrupal\system\Tests\Update\DependencyHookInvocationTest400
LeafDrupal\system\Tests\Update\DependencyMissingTest400
LeafDrupal\system\Tests\Update\DependencyOrderingTest500
LeafDrupal\system\Tests\Update\UpdateScriptTest20100
LeafDrupal\system\Tests\Upgrade\ActionUpgradePathTest2700
LeafDrupal\system\Tests\Upgrade\BareMinimalAnonymousUpgradePathTest5600
LeafDrupal\system\Tests\Upgrade\BareMinimalNoConfigUpgradePathTest6700
LeafDrupal\system\Tests\Upgrade\BareMinimalUpgradePathTest6700
ExpandDrupal\system\Tests\Upgrade\BareStandardUpgradePathTest423
MessageGroupFilenameLineFunctionStatus
Invoking hooks entity_info is not supported during updatesLogicExceptionUpdateModuleHandler.php50Drupal\Core\Extension\UpdateModuleHandler->getImplementations()
simplexml_import_dom(): Invalid Nodetype to importsimplexml_import_dom(Object) Drupal\simpletest\WebTestBase->parse() Drupal\simpletest\WebTestBase->xpath('//input[@type="submit"]') Drupal\simpletest\WebTestBase->assertFieldByXPath('//input[@type="submit"]') Drupal\system\Tests\Upgrade\UpgradePathTestBase->performUpgrade() Drupal\system\Tests\Upgrade\BareStandardUpgradePathTest->testBasicStandardUpgrade() Drupal\simpletest\TestBase->run() simpletest_script_run_one_test('660', 'Drupal\system\Tests\Upgrade\BareStandardUpgradePathTest') WarningWebTestBase.php1184Drupal\simpletest\WebTestBase->parse()
Parsed page successfully.BrowserUpgradePathTestBase.php239Drupal\system\Tests\Upgrade\UpgradePathTestBase->performUpgrade()
Value false is TRUE.OtherUpgradePathTestBase.php239Drupal\system\Tests\Upgrade\UpgradePathTestBase->performUpgrade()
Exception: An error was encountered during the first access to update.php. in Drupal\system\Tests\Upgrade\UpgradePathTestBase->performUpgrade() (line 240 of /var/lib/drupaltestbot/sites/default/files/checkout/core/modules/system/lib/Drupal/system/Tests/Upgrade/UpgradePathTestBase.php). Drupal\system\Tests\Upgrade\UpgradePathTestBase->performUpgrade() Drupal\system\Tests\Upgrade\BareStandardUpgradePathTest->testBasicStandardUpgrade() Drupal\simpletest\TestBase->run() simpletest_script_run_one_test('660', 'Drupal\system\Tests\Upgrade\BareStandardUpgradePathTest') Uncaught exceptionUpgradePathTestBase.php240Drupal\system\Tests\Upgrade\UpgradePathTestBase->performUpgrade()
LeafDrupal\system\Tests\Upgrade\BlockUpgradePathTest3400
ExpandDrupal\system\Tests\Upgrade\DateUpgradePathTest423
MessageGroupFilenameLineFunctionStatus
Invoking hooks entity_info is not supported during updatesLogicExceptionUpdateModuleHandler.php50Drupal\Core\Extension\UpdateModuleHandler->getImplementations()
simplexml_import_dom(): Invalid Nodetype to importsimplexml_import_dom(Object) Drupal\simpletest\WebTestBase->parse() Drupal\simpletest\WebTestBase->xpath('//input[@type="submit"]') Drupal\simpletest\WebTestBase->assertFieldByXPath('//input[@type="submit"]') Drupal\system\Tests\Upgrade\UpgradePathTestBase->performUpgrade() Drupal\system\Tests\Upgrade\DateUpgradePathTest->testDateUpgrade() Drupal\simpletest\TestBase->run() simpletest_script_run_one_test('662', 'Drupal\system\Tests\Upgrade\DateUpgradePathTest') WarningWebTestBase.php1184Drupal\simpletest\WebTestBase->parse()
Parsed page successfully.BrowserUpgradePathTestBase.php239Drupal\system\Tests\Upgrade\UpgradePathTestBase->performUpgrade()
Value false is TRUE.OtherUpgradePathTestBase.php239Drupal\system\Tests\Upgrade\UpgradePathTestBase->performUpgrade()
Exception: An error was encountered during the first access to update.php. in Drupal\system\Tests\Upgrade\UpgradePathTestBase->performUpgrade() (line 240 of /var/lib/drupaltestbot/sites/default/files/checkout/core/modules/system/lib/Drupal/system/Tests/Upgrade/UpgradePathTestBase.php). Drupal\system\Tests\Upgrade\UpgradePathTestBase->performUpgrade() Drupal\system\Tests\Upgrade\DateUpgradePathTest->testDateUpgrade() Drupal\simpletest\TestBase->run() simpletest_script_run_one_test('662', 'Drupal\system\Tests\Upgrade\DateUpgradePathTest') Uncaught exceptionUpgradePathTestBase.php240Drupal\system\Tests\Upgrade\UpgradePathTestBase->performUpgrade()
LeafDrupal\system\Tests\Upgrade\ExistingModuleNameLengthUpgradePathTest600
ExpandDrupal\system\Tests\Upgrade\FieldUIUpgradePathTest423
MessageGroupFilenameLineFunctionStatus
Invoking hooks entity_info is not supported during updatesLogicExceptionUpdateModuleHandler.php50Drupal\Core\Extension\UpdateModuleHandler->getImplementations()
simplexml_import_dom(): Invalid Nodetype to importsimplexml_import_dom(Object) Drupal\simpletest\WebTestBase->parse() Drupal\simpletest\WebTestBase->xpath('//input[@type="submit"]') Drupal\simpletest\WebTestBase->assertFieldByXPath('//input[@type="submit"]') Drupal\system\Tests\Upgrade\UpgradePathTestBase->performUpgrade() Drupal\system\Tests\Upgrade\FieldUIUpgradePathTest->testFieldUIPermissions() Drupal\simpletest\TestBase->run() simpletest_script_run_one_test('664', 'Drupal\system\Tests\Upgrade\FieldUIUpgradePathTest') WarningWebTestBase.php1184Drupal\simpletest\WebTestBase->parse()
Parsed page successfully.BrowserUpgradePathTestBase.php239Drupal\system\Tests\Upgrade\UpgradePathTestBase->performUpgrade()
Value false is TRUE.OtherUpgradePathTestBase.php239Drupal\system\Tests\Upgrade\UpgradePathTestBase->performUpgrade()
Exception: An error was encountered during the first access to update.php. in Drupal\system\Tests\Upgrade\UpgradePathTestBase->performUpgrade() (line 240 of /var/lib/drupaltestbot/sites/default/files/checkout/core/modules/system/lib/Drupal/system/Tests/Upgrade/UpgradePathTestBase.php). Drupal\system\Tests\Upgrade\UpgradePathTestBase->performUpgrade() Drupal\system\Tests\Upgrade\FieldUIUpgradePathTest->testFieldUIPermissions() Drupal\simpletest\TestBase->run() simpletest_script_run_one_test('664', 'Drupal\system\Tests\Upgrade\FieldUIUpgradePathTest') Uncaught exceptionUpgradePathTestBase.php240Drupal\system\Tests\Upgrade\UpgradePathTestBase->performUpgrade()
ExpandDrupal\system\Tests\Upgrade\FieldUpgradePathTest1269
MessageGroupFilenameLineFunctionStatus
Invoking hooks entity_info is not supported during updatesLogicExceptionUpdateModuleHandler.php50Drupal\Core\Extension\UpdateModuleHandler->getImplementations()
simplexml_import_dom(): Invalid Nodetype to importsimplexml_import_dom(Object) Drupal\simpletest\WebTestBase->parse() Drupal\simpletest\WebTestBase->xpath('//input[@type="submit"]') Drupal\simpletest\WebTestBase->assertFieldByXPath('//input[@type="submit"]') Drupal\system\Tests\Upgrade\UpgradePathTestBase->performUpgrade() Drupal\system\Tests\Upgrade\FieldUpgradePathTest->testEntityDisplayUpgrade() Drupal\simpletest\TestBase->run() simpletest_script_run_one_test('665', 'Drupal\system\Tests\Upgrade\FieldUpgradePathTest') WarningWebTestBase.php1184Drupal\simpletest\WebTestBase->parse()
Parsed page successfully.BrowserUpgradePathTestBase.php239Drupal\system\Tests\Upgrade\UpgradePathTestBase->performUpgrade()
Value false is TRUE.OtherUpgradePathTestBase.php239Drupal\system\Tests\Upgrade\UpgradePathTestBase->performUpgrade()
Exception: An error was encountered during the first access to update.php. in Drupal\system\Tests\Upgrade\UpgradePathTestBase->performUpgrade() (line 240 of /var/lib/drupaltestbot/sites/default/files/checkout/core/modules/system/lib/Drupal/system/Tests/Upgrade/UpgradePathTestBase.php). Drupal\system\Tests\Upgrade\UpgradePathTestBase->performUpgrade() Drupal\system\Tests\Upgrade\FieldUpgradePathTest->testEntityDisplayUpgrade() Drupal\simpletest\TestBase->run() simpletest_script_run_one_test('665', 'Drupal\system\Tests\Upgrade\FieldUpgradePathTest') Uncaught exceptionUpgradePathTestBase.php240Drupal\system\Tests\Upgrade\UpgradePathTestBase->performUpgrade()
Invoking hooks entity_info is not supported during updatesLogicExceptionUpdateModuleHandler.php50Drupal\Core\Extension\UpdateModuleHandler->getImplementations()
simplexml_import_dom(): Invalid Nodetype to importsimplexml_import_dom(Object) Drupal\simpletest\WebTestBase->parse() Drupal\simpletest\WebTestBase->xpath('//input[@type="submit"]') Drupal\simpletest\WebTestBase->assertFieldByXPath('//input[@type="submit"]') Drupal\system\Tests\Upgrade\UpgradePathTestBase->performUpgrade() Drupal\system\Tests\Upgrade\FieldUpgradePathTest->testEntityFormDisplayUpgrade() Drupal\simpletest\TestBase->run() simpletest_script_run_one_test('665', 'Drupal\system\Tests\Upgrade\FieldUpgradePathTest') WarningWebTestBase.php1184Drupal\simpletest\WebTestBase->parse()
Parsed page successfully.BrowserUpgradePathTestBase.php239Drupal\system\Tests\Upgrade\UpgradePathTestBase->performUpgrade()
Value false is TRUE.OtherUpgradePathTestBase.php239Drupal\system\Tests\Upgrade\UpgradePathTestBase->performUpgrade()
Exception: An error was encountered during the first access to update.php. in Drupal\system\Tests\Upgrade\UpgradePathTestBase->performUpgrade() (line 240 of /var/lib/drupaltestbot/sites/default/files/checkout/core/modules/system/lib/Drupal/system/Tests/Upgrade/UpgradePathTestBase.php). Drupal\system\Tests\Upgrade\UpgradePathTestBase->performUpgrade() Drupal\system\Tests\Upgrade\FieldUpgradePathTest->testEntityFormDisplayUpgrade() Drupal\simpletest\TestBase->run() simpletest_script_run_one_test('665', 'Drupal\system\Tests\Upgrade\FieldUpgradePathTest') Uncaught exceptionUpgradePathTestBase.php240Drupal\system\Tests\Upgrade\UpgradePathTestBase->performUpgrade()
Invoking hooks entity_info is not supported during updatesLogicExceptionUpdateModuleHandler.php50Drupal\Core\Extension\UpdateModuleHandler->getImplementations()
simplexml_import_dom(): Invalid Nodetype to importsimplexml_import_dom(Object) Drupal\simpletest\WebTestBase->parse() Drupal\simpletest\WebTestBase->xpath('//input[@type="submit"]') Drupal\simpletest\WebTestBase->assertFieldByXPath('//input[@type="submit"]') Drupal\system\Tests\Upgrade\UpgradePathTestBase->performUpgrade() Drupal\system\Tests\Upgrade\FieldUpgradePathTest->testFieldUpgradeToConfig() Drupal\simpletest\TestBase->run() simpletest_script_run_one_test('665', 'Drupal\system\Tests\Upgrade\FieldUpgradePathTest') WarningWebTestBase.php1184Drupal\simpletest\WebTestBase->parse()
Parsed page successfully.BrowserUpgradePathTestBase.php239Drupal\system\Tests\Upgrade\UpgradePathTestBase->performUpgrade()
Value false is TRUE.OtherUpgradePathTestBase.php239Drupal\system\Tests\Upgrade\UpgradePathTestBase->performUpgrade()
Exception: An error was encountered during the first access to update.php. in Drupal\system\Tests\Upgrade\UpgradePathTestBase->performUpgrade() (line 240 of /var/lib/drupaltestbot/sites/default/files/checkout/core/modules/system/lib/Drupal/system/Tests/Upgrade/UpgradePathTestBase.php). Drupal\system\Tests\Upgrade\UpgradePathTestBase->performUpgrade() Drupal\system\Tests\Upgrade\FieldUpgradePathTest->testFieldUpgradeToConfig() Drupal\simpletest\TestBase->run() simpletest_script_run_one_test('665', 'Drupal\system\Tests\Upgrade\FieldUpgradePathTest') Uncaught exceptionUpgradePathTestBase.php240Drupal\system\Tests\Upgrade\UpgradePathTestBase->performUpgrade()
LeafDrupal\system\Tests\Upgrade\FilledMinimalUpgradePathTest6400
ExpandDrupal\system\Tests\Upgrade\FilledStandardUpgradePathTest423
MessageGroupFilenameLineFunctionStatus
Invoking hooks entity_info is not supported during updatesLogicExceptionUpdateModuleHandler.php50Drupal\Core\Extension\UpdateModuleHandler->getImplementations()
simplexml_import_dom(): Invalid Nodetype to importsimplexml_import_dom(Object) Drupal\simpletest\WebTestBase->parse() Drupal\simpletest\WebTestBase->xpath('//input[@type="submit"]') Drupal\simpletest\WebTestBase->assertFieldByXPath('//input[@type="submit"]') Drupal\system\Tests\Upgrade\UpgradePathTestBase->performUpgrade() Drupal\system\Tests\Upgrade\FilledStandardUpgradePathTest->testFilledStandardUpgrade() Drupal\simpletest\TestBase->run() simpletest_script_run_one_test('667', 'Drupal\system\Tests\Upgrade\FilledStandardUpgradePathTest') WarningWebTestBase.php1184Drupal\simpletest\WebTestBase->parse()
Parsed page successfully.BrowserUpgradePathTestBase.php239Drupal\system\Tests\Upgrade\UpgradePathTestBase->performUpgrade()
Value false is TRUE.OtherUpgradePathTestBase.php239Drupal\system\Tests\Upgrade\UpgradePathTestBase->performUpgrade()
Exception: An error was encountered during the first access to update.php. in Drupal\system\Tests\Upgrade\UpgradePathTestBase->performUpgrade() (line 240 of /var/lib/drupaltestbot/sites/default/files/checkout/core/modules/system/lib/Drupal/system/Tests/Upgrade/UpgradePathTestBase.php). Drupal\system\Tests\Upgrade\UpgradePathTestBase->performUpgrade() Drupal\system\Tests\Upgrade\FilledStandardUpgradePathTest->testFilledStandardUpgrade() Drupal\simpletest\TestBase->run() simpletest_script_run_one_test('667', 'Drupal\system\Tests\Upgrade\FilledStandardUpgradePathTest') Uncaught exceptionUpgradePathTestBase.php240Drupal\system\Tests\Upgrade\UpgradePathTestBase->performUpgrade()
ExpandDrupal\system\Tests\Upgrade\FilterFormatUpgradePathTest423
MessageGroupFilenameLineFunctionStatus
Invoking hooks entity_info is not supported during updatesLogicExceptionUpdateModuleHandler.php50Drupal\Core\Extension\UpdateModuleHandler->getImplementations()
simplexml_import_dom(): Invalid Nodetype to importsimplexml_import_dom(Object) Drupal\simpletest\WebTestBase->parse() Drupal\simpletest\WebTestBase->xpath('//input[@type="submit"]') Drupal\simpletest\WebTestBase->assertFieldByXPath('//input[@type="submit"]') Drupal\system\Tests\Upgrade\UpgradePathTestBase->performUpgrade() Drupal\system\Tests\Upgrade\FilterFormatUpgradePathTest->testFilterFormatUpgrade() Drupal\simpletest\TestBase->run() simpletest_script_run_one_test('668', 'Drupal\system\Tests\Upgrade\FilterFormatUpgradePathTest') WarningWebTestBase.php1184Drupal\simpletest\WebTestBase->parse()
Parsed page successfully.BrowserUpgradePathTestBase.php239Drupal\system\Tests\Upgrade\UpgradePathTestBase->performUpgrade()
Value false is TRUE.OtherUpgradePathTestBase.php239Drupal\system\Tests\Upgrade\UpgradePathTestBase->performUpgrade()
Exception: An error was encountered during the first access to update.php. in Drupal\system\Tests\Upgrade\UpgradePathTestBase->performUpgrade() (line 240 of /var/lib/drupaltestbot/sites/default/files/checkout/core/modules/system/lib/Drupal/system/Tests/Upgrade/UpgradePathTestBase.php). Drupal\system\Tests\Upgrade\UpgradePathTestBase->performUpgrade() Drupal\system\Tests\Upgrade\FilterFormatUpgradePathTest->testFilterFormatUpgrade() Drupal\simpletest\TestBase->run() simpletest_script_run_one_test('668', 'Drupal\system\Tests\Upgrade\FilterFormatUpgradePathTest') Uncaught exceptionUpgradePathTestBase.php240Drupal\system\Tests\Upgrade\UpgradePathTestBase->performUpgrade()
ExpandDrupal\system\Tests\Upgrade\ImageUpgradePathTest423
MessageGroupFilenameLineFunctionStatus
Invoking hooks entity_info is not supported during updatesLogicExceptionUpdateModuleHandler.php50Drupal\Core\Extension\UpdateModuleHandler->getImplementations()
simplexml_import_dom(): Invalid Nodetype to importsimplexml_import_dom(Object) Drupal\simpletest\WebTestBase->parse() Drupal\simpletest\WebTestBase->xpath('//input[@type="submit"]') Drupal\simpletest\WebTestBase->assertFieldByXPath('//input[@type="submit"]') Drupal\system\Tests\Upgrade\UpgradePathTestBase->performUpgrade() Drupal\system\Tests\Upgrade\ImageUpgradePathTest->testImageStyleUpgrade() Drupal\simpletest\TestBase->run() simpletest_script_run_one_test('669', 'Drupal\system\Tests\Upgrade\ImageUpgradePathTest') WarningWebTestBase.php1184Drupal\simpletest\WebTestBase->parse()
Parsed page successfully.BrowserUpgradePathTestBase.php239Drupal\system\Tests\Upgrade\UpgradePathTestBase->performUpgrade()
Value false is TRUE.OtherUpgradePathTestBase.php239Drupal\system\Tests\Upgrade\UpgradePathTestBase->performUpgrade()
Exception: An error was encountered during the first access to update.php. in Drupal\system\Tests\Upgrade\UpgradePathTestBase->performUpgrade() (line 240 of /var/lib/drupaltestbot/sites/default/files/checkout/core/modules/system/lib/Drupal/system/Tests/Upgrade/UpgradePathTestBase.php). Drupal\system\Tests\Upgrade\UpgradePathTestBase->performUpgrade() Drupal\system\Tests\Upgrade\ImageUpgradePathTest->testImageStyleUpgrade() Drupal\simpletest\TestBase->run() simpletest_script_run_one_test('669', 'Drupal\system\Tests\Upgrade\ImageUpgradePathTest') Uncaught exceptionUpgradePathTestBase.php240Drupal\system\Tests\Upgrade\UpgradePathTestBase->performUpgrade()
ExpandDrupal\system\Tests\Upgrade\LanguageUpgradePathTest844
MessageGroupFilenameLineFunctionStatus
HTTP response expected 200, actual 500BrowserUpgradePathTestBase.php234Drupal\system\Tests\Upgrade\UpgradePathTestBase->performUpgrade()
Exception: Initial GET to update.php did not return HTTP 200 status. in Drupal\system\Tests\Upgrade\UpgradePathTestBase->performUpgrade() (line 235 of /var/lib/drupaltestbot/sites/default/files/checkout/core/modules/system/lib/Drupal/system/Tests/Upgrade/UpgradePathTestBase.php). Drupal\system\Tests\Upgrade\UpgradePathTestBase->performUpgrade() Drupal\system\Tests\Upgrade\LanguageUpgradePathTest->testLanguageUpgrade() Drupal\simpletest\TestBase->run() simpletest_script_run_one_test('670', 'Drupal\system\Tests\Upgrade\LanguageUpgradePathTest') Uncaught exceptionUpgradePathTestBase.php235Drupal\system\Tests\Upgrade\UpgradePathTestBase->performUpgrade()
HTTP response expected 200, actual 500BrowserUpgradePathTestBase.php234Drupal\system\Tests\Upgrade\UpgradePathTestBase->performUpgrade()
Exception: Initial GET to update.php did not return HTTP 200 status. in Drupal\system\Tests\Upgrade\UpgradePathTestBase->performUpgrade() (line 235 of /var/lib/drupaltestbot/sites/default/files/checkout/core/modules/system/lib/Drupal/system/Tests/Upgrade/UpgradePathTestBase.php). Drupal\system\Tests\Upgrade\UpgradePathTestBase->performUpgrade() Drupal\system\Tests\Upgrade\LanguageUpgradePathTest->testLanguageUrlUpgrade() Drupal\simpletest\TestBase->run() simpletest_script_run_one_test('670', 'Drupal\system\Tests\Upgrade\LanguageUpgradePathTest') Uncaught exceptionUpgradePathTestBase.php235Drupal\system\Tests\Upgrade\UpgradePathTestBase->performUpgrade()
HTTP response expected 200, actual 500BrowserUpgradePathTestBase.php234Drupal\system\Tests\Upgrade\UpgradePathTestBase->performUpgrade()
Exception: Initial GET to update.php did not return HTTP 200 status. in Drupal\system\Tests\Upgrade\UpgradePathTestBase->performUpgrade() (line 235 of /var/lib/drupaltestbot/sites/default/files/checkout/core/modules/system/lib/Drupal/system/Tests/Upgrade/UpgradePathTestBase.php). Drupal\system\Tests\Upgrade\UpgradePathTestBase->performUpgrade() Drupal\system\Tests\Upgrade\LanguageUpgradePathTest->testLanguageNoPluralsUpgrade() Drupal\simpletest\TestBase->run() simpletest_script_run_one_test('670', 'Drupal\system\Tests\Upgrade\LanguageUpgradePathTest') Uncaught exceptionUpgradePathTestBase.php235Drupal\system\Tests\Upgrade\UpgradePathTestBase->performUpgrade()
HTTP response expected 200, actual 500BrowserUpgradePathTestBase.php234Drupal\system\Tests\Upgrade\UpgradePathTestBase->performUpgrade()
Exception: Initial GET to update.php did not return HTTP 200 status. in Drupal\system\Tests\Upgrade\UpgradePathTestBase->performUpgrade() (line 235 of /var/lib/drupaltestbot/sites/default/files/checkout/core/modules/system/lib/Drupal/system/Tests/Upgrade/UpgradePathTestBase.php). Drupal\system\Tests\Upgrade\UpgradePathTestBase->performUpgrade() Drupal\system\Tests\Upgrade\LanguageUpgradePathTest->testLanguagePermissionsUpgrade() Drupal\simpletest\TestBase->run() simpletest_script_run_one_test('670', 'Drupal\system\Tests\Upgrade\LanguageUpgradePathTest') Uncaught exceptionUpgradePathTestBase.php235Drupal\system\Tests\Upgrade\UpgradePathTestBase->performUpgrade()
ExpandDrupal\system\Tests\Upgrade\MailUpgradePathTest423
MessageGroupFilenameLineFunctionStatus
Invoking hooks entity_info is not supported during updatesLogicExceptionUpdateModuleHandler.php50Drupal\Core\Extension\UpdateModuleHandler->getImplementations()
simplexml_import_dom(): Invalid Nodetype to importsimplexml_import_dom(Object) Drupal\simpletest\WebTestBase->parse() Drupal\simpletest\WebTestBase->xpath('//input[@type="submit"]') Drupal\simpletest\WebTestBase->assertFieldByXPath('//input[@type="submit"]') Drupal\system\Tests\Upgrade\UpgradePathTestBase->performUpgrade(1) Drupal\system\Tests\Upgrade\MailUpgradePathTest->testMailSystemUpgrade() Drupal\simpletest\TestBase->run() simpletest_script_run_one_test('671', 'Drupal\system\Tests\Upgrade\MailUpgradePathTest') WarningWebTestBase.php1184Drupal\simpletest\WebTestBase->parse()
Parsed page successfully.BrowserUpgradePathTestBase.php239Drupal\system\Tests\Upgrade\UpgradePathTestBase->performUpgrade()
Value false is TRUE.OtherUpgradePathTestBase.php239Drupal\system\Tests\Upgrade\UpgradePathTestBase->performUpgrade()
Exception: An error was encountered during the first access to update.php. in Drupal\system\Tests\Upgrade\UpgradePathTestBase->performUpgrade() (line 240 of /var/lib/drupaltestbot/sites/default/files/checkout/core/modules/system/lib/Drupal/system/Tests/Upgrade/UpgradePathTestBase.php). Drupal\system\Tests\Upgrade\UpgradePathTestBase->performUpgrade(1) Drupal\system\Tests\Upgrade\MailUpgradePathTest->testMailSystemUpgrade() Drupal\simpletest\TestBase->run() simpletest_script_run_one_test('671', 'Drupal\system\Tests\Upgrade\MailUpgradePathTest') Uncaught exceptionUpgradePathTestBase.php240Drupal\system\Tests\Upgrade\UpgradePathTestBase->performUpgrade()
LeafDrupal\system\Tests\Upgrade\ModuleNameLengthUpgradePathTest2500
ExpandDrupal\system\Tests\Upgrade\ModulesDisabledUpgradePathTest423
MessageGroupFilenameLineFunctionStatus
Invoking hooks entity_info is not supported during updatesLogicExceptionUpdateModuleHandler.php50Drupal\Core\Extension\UpdateModuleHandler->getImplementations()
simplexml_import_dom(): Invalid Nodetype to importsimplexml_import_dom(Object) Drupal\simpletest\WebTestBase->parse() Drupal\simpletest\WebTestBase->xpath('//input[@type="submit"]') Drupal\simpletest\WebTestBase->assertFieldByXPath('//input[@type="submit"]') Drupal\system\Tests\Upgrade\UpgradePathTestBase->performUpgrade() Drupal\system\Tests\Upgrade\ModulesDisabledUpgradePathTest->testDisabledUpgrade() Drupal\simpletest\TestBase->run() simpletest_script_run_one_test('673', 'Drupal\system\Tests\Upgrade\ModulesDisabledUpgradePathTest') WarningWebTestBase.php1184Drupal\simpletest\WebTestBase->parse()
Parsed page successfully.BrowserUpgradePathTestBase.php239Drupal\system\Tests\Upgrade\UpgradePathTestBase->performUpgrade()
Value false is TRUE.OtherUpgradePathTestBase.php239Drupal\system\Tests\Upgrade\UpgradePathTestBase->performUpgrade()
Exception: An error was encountered during the first access to update.php. in Drupal\system\Tests\Upgrade\UpgradePathTestBase->performUpgrade() (line 240 of /var/lib/drupaltestbot/sites/default/files/checkout/core/modules/system/lib/Drupal/system/Tests/Upgrade/UpgradePathTestBase.php). Drupal\system\Tests\Upgrade\UpgradePathTestBase->performUpgrade() Drupal\system\Tests\Upgrade\ModulesDisabledUpgradePathTest->testDisabledUpgrade() Drupal\simpletest\TestBase->run() simpletest_script_run_one_test('673', 'Drupal\system\Tests\Upgrade\ModulesDisabledUpgradePathTest') Uncaught exceptionUpgradePathTestBase.php240Drupal\system\Tests\Upgrade\UpgradePathTestBase->performUpgrade()
ExpandDrupal\system\Tests\Upgrade\ShortcutUpgradePathTest523
MessageGroupFilenameLineFunctionStatus
Invoking hooks entity_info is not supported during updatesLogicExceptionUpdateModuleHandler.php50Drupal\Core\Extension\UpdateModuleHandler->getImplementations()
simplexml_import_dom(): Invalid Nodetype to importsimplexml_import_dom(Object) Drupal\simpletest\WebTestBase->parse() Drupal\simpletest\WebTestBase->xpath('//input[@type="submit"]') Drupal\simpletest\WebTestBase->assertFieldByXPath('//input[@type="submit"]') Drupal\system\Tests\Upgrade\UpgradePathTestBase->performUpgrade() Drupal\system\Tests\Upgrade\ShortcutUpgradePathTest->testContactUpgrade() Drupal\simpletest\TestBase->run() simpletest_script_run_one_test('674', 'Drupal\system\Tests\Upgrade\ShortcutUpgradePathTest') WarningWebTestBase.php1184Drupal\simpletest\WebTestBase->parse()
Parsed page successfully.BrowserUpgradePathTestBase.php239Drupal\system\Tests\Upgrade\UpgradePathTestBase->performUpgrade()
Value false is TRUE.OtherUpgradePathTestBase.php239Drupal\system\Tests\Upgrade\UpgradePathTestBase->performUpgrade()
Exception: An error was encountered during the first access to update.php. in Drupal\system\Tests\Upgrade\UpgradePathTestBase->performUpgrade() (line 240 of /var/lib/drupaltestbot/sites/default/files/checkout/core/modules/system/lib/Drupal/system/Tests/Upgrade/UpgradePathTestBase.php). Drupal\system\Tests\Upgrade\UpgradePathTestBase->performUpgrade() Drupal\system\Tests\Upgrade\ShortcutUpgradePathTest->testContactUpgrade() Drupal\simpletest\TestBase->run() simpletest_script_run_one_test('674', 'Drupal\system\Tests\Upgrade\ShortcutUpgradePathTest') Uncaught exceptionUpgradePathTestBase.php240Drupal\system\Tests\Upgrade\UpgradePathTestBase->performUpgrade()
ExpandDrupal\system\Tests\Upgrade\StateSystemUpgradePathTest423
MessageGroupFilenameLineFunctionStatus
Invoking hooks entity_info is not supported during updatesLogicExceptionUpdateModuleHandler.php50Drupal\Core\Extension\UpdateModuleHandler->getImplementations()
simplexml_import_dom(): Invalid Nodetype to importsimplexml_import_dom(Object) Drupal\simpletest\WebTestBase->parse() Drupal\simpletest\WebTestBase->xpath('//input[@type="submit"]') Drupal\simpletest\WebTestBase->assertFieldByXPath('//input[@type="submit"]') Drupal\system\Tests\Upgrade\UpgradePathTestBase->performUpgrade() Drupal\system\Tests\Upgrade\StateSystemUpgradePathTest->testSystemVariableUpgrade() Drupal\simpletest\TestBase->run() simpletest_script_run_one_test('675', 'Drupal\system\Tests\Upgrade\StateSystemUpgradePathTest') WarningWebTestBase.php1184Drupal\simpletest\WebTestBase->parse()
Parsed page successfully.BrowserUpgradePathTestBase.php239Drupal\system\Tests\Upgrade\UpgradePathTestBase->performUpgrade()
Value false is TRUE.OtherUpgradePathTestBase.php239Drupal\system\Tests\Upgrade\UpgradePathTestBase->performUpgrade()
Exception: An error was encountered during the first access to update.php. in Drupal\system\Tests\Upgrade\UpgradePathTestBase->performUpgrade() (line 240 of /var/lib/drupaltestbot/sites/default/files/checkout/core/modules/system/lib/Drupal/system/Tests/Upgrade/UpgradePathTestBase.php). Drupal\system\Tests\Upgrade\UpgradePathTestBase->performUpgrade() Drupal\system\Tests\Upgrade\StateSystemUpgradePathTest->testSystemVariableUpgrade() Drupal\simpletest\TestBase->run() simpletest_script_run_one_test('675', 'Drupal\system\Tests\Upgrade\StateSystemUpgradePathTest') Uncaught exceptionUpgradePathTestBase.php240Drupal\system\Tests\Upgrade\UpgradePathTestBase->performUpgrade()
ExpandDrupal\system\Tests\Upgrade\SystemUpgradePathTest846
MessageGroupFilenameLineFunctionStatus
Invoking hooks entity_info is not supported during updatesLogicExceptionUpdateModuleHandler.php50Drupal\Core\Extension\UpdateModuleHandler->getImplementations()
simplexml_import_dom(): Invalid Nodetype to importsimplexml_import_dom(Object) Drupal\simpletest\WebTestBase->parse() Drupal\simpletest\WebTestBase->xpath('//input[@type="submit"]') Drupal\simpletest\WebTestBase->assertFieldByXPath('//input[@type="submit"]') Drupal\system\Tests\Upgrade\UpgradePathTestBase->performUpgrade() Drupal\system\Tests\Upgrade\SystemUpgradePathTest->testVariableUpgrade() Drupal\simpletest\TestBase->run() simpletest_script_run_one_test('676', 'Drupal\system\Tests\Upgrade\SystemUpgradePathTest') WarningWebTestBase.php1184Drupal\simpletest\WebTestBase->parse()
Parsed page successfully.BrowserUpgradePathTestBase.php239Drupal\system\Tests\Upgrade\UpgradePathTestBase->performUpgrade()
Value false is TRUE.OtherUpgradePathTestBase.php239Drupal\system\Tests\Upgrade\UpgradePathTestBase->performUpgrade()
Exception: An error was encountered during the first access to update.php. in Drupal\system\Tests\Upgrade\UpgradePathTestBase->performUpgrade() (line 240 of /var/lib/drupaltestbot/sites/default/files/checkout/core/modules/system/lib/Drupal/system/Tests/Upgrade/UpgradePathTestBase.php). Drupal\system\Tests\Upgrade\UpgradePathTestBase->performUpgrade() Drupal\system\Tests\Upgrade\SystemUpgradePathTest->testVariableUpgrade() Drupal\simpletest\TestBase->run() simpletest_script_run_one_test('676', 'Drupal\system\Tests\Upgrade\SystemUpgradePathTest') Uncaught exceptionUpgradePathTestBase.php240Drupal\system\Tests\Upgrade\UpgradePathTestBase->performUpgrade()
Invoking hooks entity_info is not supported during updatesLogicExceptionUpdateModuleHandler.php50Drupal\Core\Extension\UpdateModuleHandler->getImplementations()
simplexml_import_dom(): Invalid Nodetype to importsimplexml_import_dom(Object) Drupal\simpletest\WebTestBase->parse() Drupal\simpletest\WebTestBase->xpath('//input[@type="submit"]') Drupal\simpletest\WebTestBase->assertFieldByXPath('//input[@type="submit"]') Drupal\system\Tests\Upgrade\UpgradePathTestBase->performUpgrade() Drupal\system\Tests\Upgrade\SystemUpgradePathTest->testFrontpageUpgrade() Drupal\simpletest\TestBase->run() simpletest_script_run_one_test('676', 'Drupal\system\Tests\Upgrade\SystemUpgradePathTest') WarningWebTestBase.php1184Drupal\simpletest\WebTestBase->parse()
Parsed page successfully.BrowserUpgradePathTestBase.php239Drupal\system\Tests\Upgrade\UpgradePathTestBase->performUpgrade()
Value false is TRUE.OtherUpgradePathTestBase.php239Drupal\system\Tests\Upgrade\UpgradePathTestBase->performUpgrade()
Exception: An error was encountered during the first access to update.php. in Drupal\system\Tests\Upgrade\UpgradePathTestBase->performUpgrade() (line 240 of /var/lib/drupaltestbot/sites/default/files/checkout/core/modules/system/lib/Drupal/system/Tests/Upgrade/UpgradePathTestBase.php). Drupal\system\Tests\Upgrade\UpgradePathTestBase->performUpgrade() Drupal\system\Tests\Upgrade\SystemUpgradePathTest->testFrontpageUpgrade() Drupal\simpletest\TestBase->run() simpletest_script_run_one_test('676', 'Drupal\system\Tests\Upgrade\SystemUpgradePathTest') Uncaught exceptionUpgradePathTestBase.php240Drupal\system\Tests\Upgrade\UpgradePathTestBase->performUpgrade()
ExpandDrupal\system\Tests\Upgrade\UserPictureUpgradePathTest423
MessageGroupFilenameLineFunctionStatus
Invoking hooks entity_info is not supported during updatesLogicExceptionUpdateModuleHandler.php50Drupal\Core\Extension\UpdateModuleHandler->getImplementations()
simplexml_import_dom(): Invalid Nodetype to importsimplexml_import_dom(Object) Drupal\simpletest\WebTestBase->parse() Drupal\simpletest\WebTestBase->xpath('//input[@type="submit"]') Drupal\simpletest\WebTestBase->assertFieldByXPath('//input[@type="submit"]') Drupal\system\Tests\Upgrade\UpgradePathTestBase->performUpgrade() Drupal\system\Tests\Upgrade\UserPictureUpgradePathTest->testUserPictureUpgrade() Drupal\simpletest\TestBase->run() simpletest_script_run_one_test('677', 'Drupal\system\Tests\Upgrade\UserPictureUpgradePathTest') WarningWebTestBase.php1184Drupal\simpletest\WebTestBase->parse()
Parsed page successfully.BrowserUpgradePathTestBase.php239Drupal\system\Tests\Upgrade\UpgradePathTestBase->performUpgrade()
Value false is TRUE.OtherUpgradePathTestBase.php239Drupal\system\Tests\Upgrade\UpgradePathTestBase->performUpgrade()
Exception: An error was encountered during the first access to update.php. in Drupal\system\Tests\Upgrade\UpgradePathTestBase->performUpgrade() (line 240 of /var/lib/drupaltestbot/sites/default/files/checkout/core/modules/system/lib/Drupal/system/Tests/Upgrade/UpgradePathTestBase.php). Drupal\system\Tests\Upgrade\UpgradePathTestBase->performUpgrade() Drupal\system\Tests\Upgrade\UserPictureUpgradePathTest->testUserPictureUpgrade() Drupal\simpletest\TestBase->run() simpletest_script_run_one_test('677', 'Drupal\system\Tests\Upgrade\UserPictureUpgradePathTest') Uncaught exceptionUpgradePathTestBase.php240Drupal\system\Tests\Upgrade\UpgradePathTestBase->performUpgrade()
ExpandDrupal\system\Tests\Upgrade\UserRoleUpgradePathTest846
MessageGroupFilenameLineFunctionStatus
Invoking hooks entity_info is not supported during updatesLogicExceptionUpdateModuleHandler.php50Drupal\Core\Extension\UpdateModuleHandler->getImplementations()
simplexml_import_dom(): Invalid Nodetype to importsimplexml_import_dom(Object) Drupal\simpletest\WebTestBase->parse() Drupal\simpletest\WebTestBase->xpath('//input[@type="submit"]') Drupal\simpletest\WebTestBase->assertFieldByXPath('//input[@type="submit"]') Drupal\system\Tests\Upgrade\UpgradePathTestBase->performUpgrade() Drupal\system\Tests\Upgrade\UserRoleUpgradePathTest->testRoleUpgrade() Drupal\simpletest\TestBase->run() simpletest_script_run_one_test('678', 'Drupal\system\Tests\Upgrade\UserRoleUpgradePathTest') WarningWebTestBase.php1184Drupal\simpletest\WebTestBase->parse()
Parsed page successfully.BrowserUpgradePathTestBase.php239Drupal\system\Tests\Upgrade\UpgradePathTestBase->performUpgrade()
Value false is TRUE.OtherUpgradePathTestBase.php239Drupal\system\Tests\Upgrade\UpgradePathTestBase->performUpgrade()
Exception: An error was encountered during the first access to update.php. in Drupal\system\Tests\Upgrade\UpgradePathTestBase->performUpgrade() (line 240 of /var/lib/drupaltestbot/sites/default/files/checkout/core/modules/system/lib/Drupal/system/Tests/Upgrade/UpgradePathTestBase.php). Drupal\system\Tests\Upgrade\UpgradePathTestBase->performUpgrade() Drupal\system\Tests\Upgrade\UserRoleUpgradePathTest->testRoleUpgrade() Drupal\simpletest\TestBase->run() simpletest_script_run_one_test('678', 'Drupal\system\Tests\Upgrade\UserRoleUpgradePathTest') Uncaught exceptionUpgradePathTestBase.php240Drupal\system\Tests\Upgrade\UpgradePathTestBase->performUpgrade()
Invoking hooks entity_info is not supported during updatesLogicExceptionUpdateModuleHandler.php50Drupal\Core\Extension\UpdateModuleHandler->getImplementations()
simplexml_import_dom(): Invalid Nodetype to importsimplexml_import_dom(Object) Drupal\simpletest\WebTestBase->parse() Drupal\simpletest\WebTestBase->xpath('//input[@type="submit"]') Drupal\simpletest\WebTestBase->assertFieldByXPath('//input[@type="submit"]') Drupal\system\Tests\Upgrade\UpgradePathTestBase->performUpgrade() Drupal\system\Tests\Upgrade\UserRoleUpgradePathTest->testRoleUpgradeToConfig() Drupal\simpletest\TestBase->run() simpletest_script_run_one_test('678', 'Drupal\system\Tests\Upgrade\UserRoleUpgradePathTest') WarningWebTestBase.php1184Drupal\simpletest\WebTestBase->parse()
Parsed page successfully.BrowserUpgradePathTestBase.php239Drupal\system\Tests\Upgrade\UpgradePathTestBase->performUpgrade()
Value false is TRUE.OtherUpgradePathTestBase.php239Drupal\system\Tests\Upgrade\UpgradePathTestBase->performUpgrade()
Exception: An error was encountered during the first access to update.php. in Drupal\system\Tests\Upgrade\UpgradePathTestBase->performUpgrade() (line 240 of /var/lib/drupaltestbot/sites/default/files/checkout/core/modules/system/lib/Drupal/system/Tests/Upgrade/UpgradePathTestBase.php). Drupal\system\Tests\Upgrade\UpgradePathTestBase->performUpgrade() Drupal\system\Tests\Upgrade\UserRoleUpgradePathTest->testRoleUpgradeToConfig() Drupal\simpletest\TestBase->run() simpletest_script_run_one_test('678', 'Drupal\system\Tests\Upgrade\UserRoleUpgradePathTest') Uncaught exceptionUpgradePathTestBase.php240Drupal\system\Tests\Upgrade\UpgradePathTestBase->performUpgrade()
ExpandDrupal\system\Tests\Upgrade\UuidUpgradePathTest211
MessageGroupFilenameLineFunctionStatus
HTTP response expected 200, actual 500BrowserUpgradePathTestBase.php234Drupal\system\Tests\Upgrade\UpgradePathTestBase->performUpgrade()
Exception: Initial GET to update.php did not return HTTP 200 status. in Drupal\system\Tests\Upgrade\UpgradePathTestBase->performUpgrade() (line 235 of /var/lib/drupaltestbot/sites/default/files/checkout/core/modules/system/lib/Drupal/system/Tests/Upgrade/UpgradePathTestBase.php). Drupal\system\Tests\Upgrade\UpgradePathTestBase->performUpgrade() Drupal\system\Tests\Upgrade\UuidUpgradePathTest->testUuidUpgrade() Drupal\simpletest\TestBase->run() simpletest_script_run_one_test('679', 'Drupal\system\Tests\Upgrade\UuidUpgradePathTest') Uncaught exceptionUpgradePathTestBase.php235Drupal\system\Tests\Upgrade\UpgradePathTestBase->performUpgrade()
LeafDrupal\system\Tests\Uuid\UuidUnitTest700
LeafDrupal\taxonomy\Tests\EfqTest1400
LeafDrupal\taxonomy\Tests\LegacyTest1400
LeafDrupal\taxonomy\Tests\LoadMultipleTest1800
LeafDrupal\taxonomy\Tests\RssTest2600
LeafDrupal\taxonomy\Tests\TaxonomyTermReferenceItemTest1500
LeafDrupal\taxonomy\Tests\TermFieldMultipleVocabularyTest2600
LeafDrupal\taxonomy\Tests\TermFieldTest4500
LeafDrupal\taxonomy\Tests\TermIndexTest4600
LeafDrupal\taxonomy\Tests\TermLanguageTest6400
LeafDrupal\taxonomy\Tests\TermTest26800
LeafDrupal\taxonomy\Tests\TermTranslationUITest15300
LeafDrupal\taxonomy\Tests\TermUnitTest1100
LeafDrupal\taxonomy\Tests\ThemeTest1900
LeafDrupal\taxonomy\Tests\TokenReplaceTest5500
LeafDrupal\taxonomy\Tests\Views\RelationshipNodeTermDataTest300
LeafDrupal\taxonomy\Tests\Views\RelationshipRepresentativeNode300
LeafDrupal\taxonomy\Tests\VocabularyLanguageTest6000
LeafDrupal\taxonomy\Tests\VocabularyPermissionsTest10100
LeafDrupal\taxonomy\Tests\VocabularyTest11000
LeafDrupal\taxonomy\Tests\VocabularyUnitTest7000
LeafDrupal\telephone\Tests\TelephoneFieldTest2200
LeafDrupal\telephone\Tests\TelephoneItemTest1000
LeafDrupal\Tests\Component\Graph\GraphTest100
LeafDrupal\Tests\Component\PhpStorage\FileStorageTest200
LeafDrupal\Tests\Component\PhpStorage\MTimeProtectedFastFileStorageTest200
LeafDrupal\Tests\Component\Utility\CryptTest100
LeafDrupal\Tests\Component\Utility\JsonTest500
LeafDrupal\Tests\Component\Utility\StringTest100
LeafDrupal\Tests\Component\Utility\TimerUnitTest100
LeafDrupal\Tests\Component\Utility\XssTest200
LeafDrupal\Tests\Core\Access\AccessManagerTest200
LeafDrupal\Tests\Core\Access\DefaultAccessCheckTest200
LeafDrupal\Tests\Core\Cache\BackendChainImplementationUnitTest900
LeafDrupal\Tests\Core\Cache\CacheCollectorTest1400
LeafDrupal\Tests\Core\Cache\NullBackendTest100
LeafDrupal\Tests\Core\Common\AttributesTest100
LeafDrupal\Tests\Core\Common\DiffArrayTest100
LeafDrupal\Tests\Core\Common\TagsTest100
LeafDrupal\Tests\Core\Database\EmptyStatementTest300
LeafDrupal\Tests\Core\Entity\Enhancer\EntityRouteEnhancerTest100
LeafDrupal\Tests\Core\Entity\EntityAccessCheckTest200
LeafDrupal\Tests\Core\EventSubscriber\ReverseProxySubscriberUnitTest200
LeafDrupal\Tests\Core\Extension\ModuleHandlerUnitTest100
LeafDrupal\Tests\Core\HttpKernelTest100
LeafDrupal\Tests\Core\NestedArrayUnitTest500
LeafDrupal\Tests\Core\PathProcessor\PathProcessorTest100
ExpandDrupal\Tests\Core\Plugin\DefaultPluginManagerTest220
MessageGroupFilenameLineFunctionStatus
Parameter 0 for invocation Drupal\Core\Cache\MemoryBackend::get('x2xgVbxM:', false) does not match expected value.OtherDefaultPluginManagerTest.php100Drupal\Tests\Core\Plugin\DefaultPluginManagerTest->testDefaultPluginManagerWithEmptyCache()
Parameter 0 for invocation Drupal\Core\Cache\MemoryBackend::get('lNZtTn2f:', false) does not match expected value.OtherDefaultPluginManagerTest.php132Drupal\Tests\Core\Plugin\DefaultPluginManagerTest->testDefaultPluginManagerWithFilledCache()
LeafDrupal\Tests\Core\Routing\UrlGeneratorTest400
LeafDrupal\text\Tests\Formatter\TextPlainUnitTest600
LeafDrupal\text\Tests\TextFieldTest18600
LeafDrupal\text\Tests\TextSummaryTest12500
LeafDrupal\toolbar\Tests\ToolbarHookToolbarTest1700
LeafDrupal\toolbar\Tests\ToolbarMenuTranslationTest10400
LeafDrupal\tour\Tests\TourPluginTest200
LeafDrupal\tour\Tests\TourTest3300
LeafDrupal\tracker\Tests\TrackerNodeAccessTest3800
LeafDrupal\tracker\Tests\TrackerTest22800
LeafDrupal\tracker\Tests\Views\TrackerUserUidTest1400
LeafDrupal\translation\Tests\TranslationTest57300
LeafDrupal\update\Tests\UpdateContribTest19700
LeafDrupal\update\Tests\UpdateCoreTest22600
LeafDrupal\update\Tests\UpdateCoreUnitTest400
LeafDrupal\update\Tests\UpdateUploadTest6400
LeafDrupal\user\Tests\Plugin\Action\AddRoleUserTest200
LeafDrupal\user\Tests\Plugin\Action\RemoveRoleUserTest200
LeafDrupal\user\Tests\TempStoreDatabaseTest1900
LeafDrupal\user\Tests\UserAccountLinksTests5800
LeafDrupal\user\Tests\UserAdminListingTest3300
LeafDrupal\user\Tests\UserAdminSettingsFormTest400
LeafDrupal\user\Tests\UserAdminTest9300
LeafDrupal\user\Tests\UserAutocompleteTest2900
LeafDrupal\user\Tests\UserBlocksTests6600
LeafDrupal\user\Tests\UserCancelTest28200
LeafDrupal\user\Tests\UserCreateFailMailTest1500
LeafDrupal\user\Tests\UserCreateTest3900
LeafDrupal\user\Tests\UserDeleteTest1500
LeafDrupal\user\Tests\UserEditedOwnAccountTest2200
LeafDrupal\user\Tests\UserEditTest8800
LeafDrupal\user\Tests\UserEntityCallbacksTest700
LeafDrupal\user\Tests\UserEntityTest1600
LeafDrupal\user\Tests\UserLanguageCreationTest6800
LeafDrupal\user\Tests\UserLanguageTest3900
LeafDrupal\user\Tests\UserLoginTest23500
LeafDrupal\user\Tests\UserPasswordResetTest7400
LeafDrupal\user\Tests\UserPermissionsTest7300
LeafDrupal\user\Tests\UserPictureTest7500
LeafDrupal\user\Tests\UserRegistrationTest18200
LeafDrupal\user\Tests\UserRoleAdminTest12000
LeafDrupal\user\Tests\UserRolesAssignmentTest10200
LeafDrupal\user\Tests\UserSaveTest400
LeafDrupal\user\Tests\UserSearchTest6400
LeafDrupal\user\Tests\UserSignatureTest4500
LeafDrupal\user\Tests\UserTimeZoneTest2900
LeafDrupal\user\Tests\UserTokenReplaceTest4700
LeafDrupal\user\Tests\UserTranslationUITest14300
LeafDrupal\user\Tests\UserValidateCurrentPassCustomFormTest1700
LeafDrupal\user\Tests\UserValidationTest1600
LeafDrupal\user\Tests\Views\AccessPermissionTest1400
LeafDrupal\user\Tests\Views\AccessRoleTest1400
LeafDrupal\user\Tests\Views\ArgumentDefaultTest900
LeafDrupal\user\Tests\Views\ArgumentValidateTest1900
LeafDrupal\user\Tests\Views\Argument\RolesRidTest100
LeafDrupal\user\Tests\Views\BulkFormTest3600
LeafDrupal\user\Tests\Views\HandlerArgumentUserUidTest500
LeafDrupal\user\Tests\Views\HandlerFieldPermissionTest1000
LeafDrupal\user\Tests\Views\HandlerFieldRoleTest1000
LeafDrupal\user\Tests\Views\HandlerFieldUserNameTest700
LeafDrupal\user\Tests\Views\HandlerFilterPermissionTest1400
LeafDrupal\user\Tests\Views\HandlerFilterUserNameTest5000
LeafDrupal\user\Tests\Views\RelationshipRepresentativeNode300
LeafDrupal\user\Tests\Views\UserDataTest400
LeafDrupal\views\Tests\BasicTest2000
LeafDrupal\views\Tests\DefaultViewsTest9900
LeafDrupal\views\Tests\Entity\FieldEntityTest400
LeafDrupal\views\Tests\Entity\FilterEntityBundleTest800
LeafDrupal\views\Tests\GlossaryTest2300
LeafDrupal\views\Tests\Handler\AreaEntityTest3900
LeafDrupal\views\Tests\Handler\AreaTest9000
LeafDrupal\views\Tests\Handler\AreaTextTest900
LeafDrupal\views\Tests\Handler\AreaTitleTest800
LeafDrupal\views\Tests\Handler\ArgumentDateTest4400
LeafDrupal\views\Tests\Handler\ArgumentNullTest800
LeafDrupal\views\Tests\Handler\ArgumentStringTest400
LeafDrupal\views\Tests\Handler\FieldBooleanTest1400
LeafDrupal\views\Tests\Handler\FieldCounterTest1400
LeafDrupal\views\Tests\Handler\FieldCustomTest500
LeafDrupal\views\Tests\Handler\FieldDateTest1800
LeafDrupal\views\Tests\Handler\FieldDropButtonTest1300
LeafDrupal\views\Tests\Handler\FieldFileSizeTest1200
LeafDrupal\views\Tests\Handler\FieldUnitTest14500
LeafDrupal\views\Tests\Handler\FieldUrlTest700
LeafDrupal\views\Tests\Handler\FieldWebTest10900
LeafDrupal\views\Tests\Handler\FieldXssTest700
LeafDrupal\views\Tests\Handler\FilterBooleanOperatorTest900
LeafDrupal\views\Tests\Handler\FilterCombineTest500
LeafDrupal\views\Tests\Handler\FilterDateTest2200
LeafDrupal\views\Tests\Handler\FilterEqualityTest2400
LeafDrupal\views\Tests\Handler\FilterInOperatorTest2300
LeafDrupal\views\Tests\Handler\FilterNumericTest5900
LeafDrupal\views\Tests\Handler\FilterStringTest14600
LeafDrupal\views\Tests\Handler\HandlerAliasTest1300
LeafDrupal\views\Tests\Handler\HandlerAllTest27400
LeafDrupal\views\Tests\Handler\HandlerTest11600
LeafDrupal\views\Tests\Handler\RelationshipTest1100
LeafDrupal\views\Tests\Handler\SortDateTest2800
LeafDrupal\views\Tests\Handler\SortRandomTest1000
LeafDrupal\views\Tests\Handler\SortTest1600
LeafDrupal\views\Tests\ModuleTest5200
LeafDrupal\views\Tests\PluginInstanceTest15300
LeafDrupal\views\Tests\PluginTypeListTest100
LeafDrupal\views\Tests\Plugin\AccessTest2900
LeafDrupal\views\Tests\Plugin\ArgumentDefaultTest2400
LeafDrupal\views\Tests\Plugin\ArgumentValidatorTest1200
LeafDrupal\views\Tests\Plugin\CacheTest1200
LeafDrupal\views\Tests\Plugin\DisplayAttachmentTest600
LeafDrupal\views\Tests\Plugin\DisplayExtenderTest600
LeafDrupal\views\Tests\Plugin\DisplayFeedTest4300
LeafDrupal\views\Tests\Plugin\DisplayPageTest3200
LeafDrupal\views\Tests\Plugin\DisplayPageWebTest4100
LeafDrupal\views\Tests\Plugin\DisplayTest10100
LeafDrupal\views\Tests\Plugin\DisplayUnitTest2700
LeafDrupal\views\Tests\Plugin\ExposedFormTest2400
LeafDrupal\views\Tests\Plugin\FilterTest1300
LeafDrupal\views\Tests\Plugin\JoinTest2800
LeafDrupal\views\Tests\Plugin\MiniPagerTest4900
LeafDrupal\views\Tests\Plugin\PagerTest9900
LeafDrupal\views\Tests\Plugin\QueryTest800
LeafDrupal\views\Tests\Plugin\RowEntityTest700
LeafDrupal\views\Tests\Plugin\StyleMappingTest4600
LeafDrupal\views\Tests\Plugin\StyleTableTest1800
LeafDrupal\views\Tests\Plugin\StyleTableUnitTest2300
LeafDrupal\views\Tests\Plugin\StyleTest2100
LeafDrupal\views\Tests\Plugin\StyleUnformattedTest2100
LeafDrupal\views\Tests\Plugin\ViewsBlockTest700
LeafDrupal\views\Tests\QueryGroupByTest5500
LeafDrupal\views\Tests\TokenReplaceTest1600
LeafDrupal\views\Tests\ViewElementTest1500
ExpandDrupal\views\Tests\ViewExecutableTest20800
MessageGroupFilenameLineFunctionStatus
'setDisplay() called with invalid display ID "invalid".'DebugViewExecutable.php664Drupal\views\ViewExecutable->setDisplay()
LeafDrupal\views\Tests\ViewPageControllerTest1000
LeafDrupal\views\Tests\ViewRenderTest200
LeafDrupal\views\Tests\ViewsDataHelperTest100
LeafDrupal\views\Tests\ViewsDataTest6500
LeafDrupal\views\Tests\ViewsHooksTest3200
LeafDrupal\views\Tests\ViewsTaxonomyAutocompleteTest1500
LeafDrupal\views\Tests\ViewStorageTest10600
LeafDrupal\views\Tests\Wizard\BasicTest11000
LeafDrupal\views\Tests\Wizard\ItemsPerPageTest3800
LeafDrupal\views\Tests\Wizard\MenuTest1900
LeafDrupal\views\Tests\Wizard\SortingTest3500
LeafDrupal\views\Tests\Wizard\TaggedWithTest7800
LeafDrupal\views\Tests\Wizard\WizardPluginBaseUnitTest1300
LeafDrupal\views_ui\Tests\AnalyzeTest2100
LeafDrupal\views_ui\Tests\CachedDataUITest5200
LeafDrupal\views_ui\Tests\CustomBooleanTest4200
LeafDrupal\views_ui\Tests\DefaultViewsTest11400
LeafDrupal\views_ui\Tests\DisplayAttachmentTest3500
LeafDrupal\views_ui\Tests\DisplayExtenderUITest2300
LeafDrupal\views_ui\Tests\DisplayPath8100
LeafDrupal\views_ui\Tests\DisplayTest29900
LeafDrupal\views_ui\Tests\ExposedFormUITest7900
LeafDrupal\views_ui\Tests\FieldUITest2100
LeafDrupal\views_ui\Tests\FilterBooleanWebTest2700
LeafDrupal\views_ui\Tests\Form\Ajax\RearrangeFilterTest100
LeafDrupal\views_ui\Tests\GroupByTest2900
LeafDrupal\views_ui\Tests\HandlerTest19500
LeafDrupal\views_ui\Tests\OverrideDisplaysTest14700
LeafDrupal\views_ui\Tests\PreviewTest6600
LeafDrupal\views_ui\Tests\QueryTest1900
LeafDrupal\views_ui\Tests\RearrangeFieldsTest3500
LeafDrupal\views_ui\Tests\RedirectTest2600
LeafDrupal\views_ui\Tests\RowUITest3000
LeafDrupal\views_ui\Tests\SettingsTest8800
LeafDrupal\views_ui\Tests\StorageTest2200
LeafDrupal\views_ui\Tests\StyleUITest3900
LeafDrupal\views_ui\Tests\TagTest1500
LeafDrupal\views_ui\Tests\ViewListControllerTest100
LeafDrupal\views_ui\Tests\ViewUIObjectTest100
LeafDrupal\xmlrpc\Tests\XmlRpcBasicTest900
LeafDrupal\xmlrpc\Tests\XmlRpcMessagesTest700
LeafDrupal\xmlrpc\Tests\XmlRpcValidatorTest1000