1862202-language-oo-114.patch

Test status
StatusResult
Last receivedWed, 06/26/2013 - 23:15:56
Last requestedWed, 06/26/2013 - 23:16:01
Last testedThu, 06/27/2013 - 00:23:26
Test count1
Environment status
MySQLfail
File information
File1862202-language-oo-114.patch
BranchDrupal core - 8.x
LinkIssue Link
SummaryFAILED: [[SimpleTest]]: [MySQL] 57,865 pass(es), 82 fail(s), and 28 exception(s).
Details

MySQL

  1. Setup environment
  2. Detect an invalid patch URL
  3. Detect invalid repository information
  4. Detect invalid patch format
  5. Detect a non-applicable patch
  6. Detect invalid PHP syntax
  7. Detect a Drupal installation failure
  8. Detect a test run failure
  9. Detect a failing test
    Review the test failures below then if necessary run them locally until the problem has been fixed.
  10. Complete test suite with all tests passing
57,865 pass(es), 82 fail(s), and 28 exception(s)

Non-pass

Test namePassFailException
ExpandDrupal\block\Tests\BlockLanguageTest5011
MessageGroupFilenameLineFunctionStatus
The body of the custom block appears on the page.OtherBlockLanguageTest.php81Drupal\block\Tests\BlockLanguageTest->testLanguageBlockVisibility()
Trying to get property of non-objectDrupal\Core\PathProcessor\PathProcessorAlias->processOutbound('', Array, Object) Drupal\Core\PathProcessor\PathProcessorManager->processOutbound('', Array, Object) Drupal\Core\Routing\UrlGenerator->processPath('', Array) Drupal\Core\Routing\UrlGenerator->generateFromPath('', Array) Drupal\simpletest\WebTestBase->drupalGet('', Array) Drupal\block\Tests\BlockLanguageTest->testLanguageBlockVisibility() Drupal\simpletest\TestBase->run() simpletest_script_run_one_test('36', 'Drupal\block\Tests\BlockLanguageTest') NoticePathProcessorAlias.php47Drupal\Core\PathProcessor\PathProcessorAlias->processOutbound()
ExpandDrupal\config\Tests\ConfigLocaleOverrideWebTest8710
MessageGroupFilenameLineFunctionStatus
"XX site name" foundOtherConfigLocaleOverrideWebTest.php66Drupal\config\Tests\ConfigLocaleOverrideWebTest->testSiteNameTranslation()
ExpandDrupal\language\Tests\LanguageBrowserDetectionUnitTest10160
MessageGroupFilenameLineFunctionStatus
Language selection 'zh-cn, en-us;q=0.90, en;q=0.80, zh;q=0.70' selects 'zh-hans', result = 'en-US'OtherLanguageBrowserDetectionUnitTest.php162Drupal\language\Tests\LanguageBrowserDetectionUnitTest->testLanguageFromBrowser()
Language selection 'zh-tw, en-us;q=0.90, en;q=0.80, zh;q=0.70' selects 'zh-hant', result = 'en-US'OtherLanguageBrowserDetectionUnitTest.php162Drupal\language\Tests\LanguageBrowserDetectionUnitTest->testLanguageFromBrowser()
Language selection 'zh-tw' selects 'zh-hant', result = 'zh-hans'OtherLanguageBrowserDetectionUnitTest.php162Drupal\language\Tests\LanguageBrowserDetectionUnitTest->testLanguageFromBrowser()
Language selection 'zh-hk' selects 'zh-hant', result = 'zh-hans'OtherLanguageBrowserDetectionUnitTest.php162Drupal\language\Tests\LanguageBrowserDetectionUnitTest->testLanguageFromBrowser()
Language selection 'zh-mo' selects 'zh-hant', result = 'zh-hans'OtherLanguageBrowserDetectionUnitTest.php162Drupal\language\Tests\LanguageBrowserDetectionUnitTest->testLanguageFromBrowser()
Language selection 'zh-cht' selects 'zh-hant', result = 'zh-hans'OtherLanguageBrowserDetectionUnitTest.php162Drupal\language\Tests\LanguageBrowserDetectionUnitTest->testLanguageFromBrowser()
ExpandDrupal\language\Tests\LanguageConfigurationTest7320
MessageGroupFilenameLineFunctionStatus
System language Not specified has higher weight than configurable languages after re-orderingOtherLanguageConfigurationTest.php151Drupal\language\Tests\LanguageConfigurationTest->checkConfigurableLanguageWeight()
System language Not specified has higher weight than configurable languages after deleting a languageOtherLanguageConfigurationTest.php151Drupal\language\Tests\LanguageConfigurationTest->checkConfigurableLanguageWeight()
ExpandDrupal\language\Tests\LanguageListTest9930
MessageGroupFilenameLineFunctionStatus
Correct page redirection.OtherLanguageListTest.php79Drupal\language\Tests\LanguageListTest->testLanguageList()
Correct page redirection.OtherLanguageListTest.php92Drupal\language\Tests\LanguageListTest->testLanguageList()
Language count is correct.OtherLanguageListTest.php122Drupal\language\Tests\LanguageListTest->testLanguageList()
ExpandDrupal\language\Tests\LanguageNegotiationInfoTest41110
MessageGroupFilenameLineFunctionStatus
Failed to set field language_content[enabled][language-interface] to 1OtherLanguageNegotiationInfoTest.php73Drupal\language\Tests\LanguageNegotiationInfoTest->testInfoAlterations()
Failed to set field language_content[enabled][test_language_negotiation_method] to 1OtherLanguageNegotiationInfoTest.php73Drupal\language\Tests\LanguageNegotiationInfoTest->testInfoAlterations()
Failed to set field test_language_type[enabled][test_language_negotiation_method] to 1OtherLanguageNegotiationInfoTest.php73Drupal\language\Tests\LanguageNegotiationInfoTest->testInfoAlterations()
Found the Save settings buttonOtherLanguageNegotiationInfoTest.php73Drupal\language\Tests\LanguageNegotiationInfoTest->testInfoAlterations()
Found the requested form fields at admin/config/regional/language/detectionOtherLanguageNegotiationInfoTest.php73Drupal\language\Tests\LanguageNegotiationInfoTest->testInfoAlterations()
Type-specific test language negotiation method available for test_language_type.OtherLanguageNegotiationInfoTest.php88Drupal\language\Tests\LanguageNegotiationInfoTest->testInfoAlterations()
The negotiated language for language_interface is OtherLanguageNegotiationInfoTest.php101Drupal\language\Tests\LanguageNegotiationInfoTest->testInfoAlterations()
The negotiated language for language_content is OtherLanguageNegotiationInfoTest.php101Drupal\language\Tests\LanguageNegotiationInfoTest->testInfoAlterations()
The negotiated language for language_url is OtherLanguageNegotiationInfoTest.php101Drupal\language\Tests\LanguageNegotiationInfoTest->testInfoAlterations()
The negotiated language for test_language_type is OtherLanguageNegotiationInfoTest.php101Drupal\language\Tests\LanguageNegotiationInfoTest->testInfoAlterations()
The negotiated language for fixed_test_language_type is OtherLanguageNegotiationInfoTest.php101Drupal\language\Tests\LanguageNegotiationInfoTest->testInfoAlterations()
ExpandDrupal\language\Tests\LanguageSwitchingTest4720
MessageGroupFilenameLineFunctionStatus
A link generated by #type link to the current French page with langcode en is NOT marked active.OtherLanguageSwitchingTest.php140Drupal\language\Tests\LanguageSwitchingTest->testLanguageLinkActiveClass()
A link generated by #type link to the current French page with langcode fr is marked active.OtherLanguageSwitchingTest.php145Drupal\language\Tests\LanguageSwitchingTest->testLanguageLinkActiveClass()
ExpandDrupal\language\Tests\LanguageUILanguageNegotiationTest126192
MessageGroupFilenameLineFunctionStatus
SELECTED: UI language is switched based on selected language.OtherLanguageUILanguageNegotiationTest.php379Drupal\language\Tests\LanguageUILanguageNegotiationTest->runTest()
"Language negotiation method: language-selected" foundOtherLanguageUILanguageNegotiationTest.php380Drupal\language\Tests\LanguageUILanguageNegotiationTest->runTest()
"Language negotiation method: language-selected" foundOtherLanguageUILanguageNegotiationTest.php380Drupal\language\Tests\LanguageUILanguageNegotiationTest->runTest()
"Language negotiation method: language-selected" foundOtherLanguageUILanguageNegotiationTest.php380Drupal\language\Tests\LanguageUILanguageNegotiationTest->runTest()
"Language negotiation method: language-selected" foundOtherLanguageUILanguageNegotiationTest.php380Drupal\language\Tests\LanguageUILanguageNegotiationTest->runTest()
URL (PATH) > DEFAULT: with language prefix, UI language is switched based on path prefixOtherLanguageUILanguageNegotiationTest.php379Drupal\language\Tests\LanguageUILanguageNegotiationTest->runTest()
"Language negotiation method: language-url" foundOtherLanguageUILanguageNegotiationTest.php380Drupal\language\Tests\LanguageUILanguageNegotiationTest->runTest()
URL (PATH) > BROWSER: with langage prefix, UI language is based on path prefixOtherLanguageUILanguageNegotiationTest.php379Drupal\language\Tests\LanguageUILanguageNegotiationTest->runTest()
"Language negotiation method: language-url" foundOtherLanguageUILanguageNegotiationTest.php380Drupal\language\Tests\LanguageUILanguageNegotiationTest->runTest()
"Language negotiation method: language-selected" foundOtherLanguageUILanguageNegotiationTest.php380Drupal\language\Tests\LanguageUILanguageNegotiationTest->runTest()
"Language negotiation method: language-selected" foundOtherLanguageUILanguageNegotiationTest.php380Drupal\language\Tests\LanguageUILanguageNegotiationTest->runTest()
"Language negotiation method: language-selected" foundOtherLanguageUILanguageNegotiationTest.php380Drupal\language\Tests\LanguageUILanguageNegotiationTest->runTest()
"Language negotiation method: language-selected" foundOtherLanguageUILanguageNegotiationTest.php380Drupal\language\Tests\LanguageUILanguageNegotiationTest->runTest()
"Language negotiation method: language-selected" foundOtherLanguageUILanguageNegotiationTest.php380Drupal\language\Tests\LanguageUILanguageNegotiationTest->runTest()
"Language negotiation method: language-selected" foundOtherLanguageUILanguageNegotiationTest.php380Drupal\language\Tests\LanguageUILanguageNegotiationTest->runTest()
URL (DOMAIN) > DEFAULT: domain example.cn should switch to ChineseOtherLanguageUILanguageNegotiationTest.php379Drupal\language\Tests\LanguageUILanguageNegotiationTest->runTest()
"Language negotiation method: language-url" foundOtherLanguageUILanguageNegotiationTest.php380Drupal\language\Tests\LanguageUILanguageNegotiationTest->runTest()
Undefined offset: 0Drupal\language\Tests\LanguageUILanguageNegotiationTest->testUrlLanguageFallback() Drupal\simpletest\TestBase->run() simpletest_script_run_one_test('392', 'Drupal\language\Tests\LanguageUILanguageNegotiationTest') NoticeLanguageUILanguageNegotiationTest.php423Drupal\language\Tests\LanguageUILanguageNegotiationTest->testUrlLanguageFallback()
The browser language is the URL active languageOtherLanguageUILanguageNegotiationTest.php423Drupal\language\Tests\LanguageUILanguageNegotiationTest->testUrlLanguageFallback()
Undefined offset: 0Drupal\language\Tests\LanguageUILanguageNegotiationTest->testUrlLanguageFallback() Drupal\simpletest\TestBase->run() simpletest_script_run_one_test('392', 'Drupal\language\Tests\LanguageUILanguageNegotiationTest') NoticeLanguageUILanguageNegotiationTest.php427Drupal\language\Tests\LanguageUILanguageNegotiationTest->testUrlLanguageFallback()
URLs are rewritten using the browser language.OtherLanguageUILanguageNegotiationTest.php427Drupal\language\Tests\LanguageUILanguageNegotiationTest->testUrlLanguageFallback()
ExpandDrupal\locale\Tests\LocaleConfigTranslationTest13310
MessageGroupFilenameLineFunctionStatus
The translated site name is displayed after translations refreshed.OtherLocaleConfigTranslationTest.php91Drupal\locale\Tests\LocaleConfigTranslationTest->testConfigTranslation()
ExpandDrupal\locale\Tests\LocaleContentTest47703
MessageGroupFilenameLineFunctionStatus
Drupal\Core\Entity\EntityStorageException: There are no fields available to insert with. in Drupal\Core\Entity\DatabaseStorageControllerNG->save() (line 400 of /var/lib/drupaltestbot/sites/default/files/checkout/core/lib/Drupal/Core/Entity/DatabaseStorageControllerNG.php). Drupal\Core\Entity\DatabaseStorageControllerNG->save(Object) Drupal\Core\Entity\Entity->save() Drupal\Core\Entity\EntityBCDecorator->save() Drupal\simpletest\WebTestBase->drupalCreateNode(Array) Drupal\locale\Tests\LocaleContentTest->testContentTypeLanguageConfiguration() Drupal\simpletest\TestBase->run() simpletest_script_run_one_test('396', 'Drupal\locale\Tests\LocaleContentTest') Uncaught exceptionDatabaseStorageControllerNG.php400Drupal\Core\Entity\DatabaseStorageControllerNG->save()
Drupal\Core\Entity\EntityStorageException: There are no fields available to insert with. in Drupal\Core\Entity\DatabaseStorageControllerNG->save() (line 400 of /var/lib/drupaltestbot/sites/default/files/checkout/core/lib/Drupal/Core/Entity/DatabaseStorageControllerNG.php). Drupal\Core\Entity\DatabaseStorageControllerNG->save(Object) Drupal\Core\Entity\Entity->save() Drupal\Core\Entity\EntityBCDecorator->save() Drupal\simpletest\WebTestBase->drupalCreateNode(Array) Drupal\locale\Tests\LocaleContentTest->testContentTypeDirLang() Drupal\simpletest\TestBase->run() simpletest_script_run_one_test('396', 'Drupal\locale\Tests\LocaleContentTest') Uncaught exceptionDatabaseStorageControllerNG.php400Drupal\Core\Entity\DatabaseStorageControllerNG->save()
Drupal\Core\Entity\EntityStorageException: There are no fields available to insert with. in Drupal\Core\Entity\DatabaseStorageControllerNG->save() (line 400 of /var/lib/drupaltestbot/sites/default/files/checkout/core/lib/Drupal/Core/Entity/DatabaseStorageControllerNG.php). Drupal\Core\Entity\DatabaseStorageControllerNG->save(Object) Drupal\Core\Entity\Entity->save() Drupal\Core\Entity\EntityBCDecorator->save() Drupal\simpletest\WebTestBase->drupalCreateNode(Array) Drupal\locale\Tests\LocaleContentTest->testNodeAdminLanguageFilter() Drupal\simpletest\TestBase->run() simpletest_script_run_one_test('396', 'Drupal\locale\Tests\LocaleContentTest') Uncaught exceptionDatabaseStorageControllerNG.php400Drupal\Core\Entity\DatabaseStorageControllerNG->save()
ExpandDrupal\locale\Tests\LocalePathTest11920
MessageGroupFilenameLineFunctionStatus
Custom language alias works.OtherLocalePathTest.php102Drupal\locale\Tests\LocalePathTest->testPathLanguageConfiguration()
Custom alias with prefix returns second node.OtherLocalePathTest.php155Drupal\locale\Tests\LocalePathTest->testPathLanguageConfiguration()
ExpandDrupal\locale\Tests\LocaleTranslationUiTest682422
MessageGroupFilenameLineFunctionStatus
Undefined index: xx_locale_rebuild_js('xx') Drupal\locale\Tests\LocaleTranslationUiTest->testJavaScriptTranslation() Drupal\simpletest\TestBase->run() simpletest_script_run_one_test('404', 'Drupal\locale\Tests\LocaleTranslationUiTest') Noticelocale.module1177_locale_rebuild_js()
Trying to get property of non-object_locale_rebuild_js('xx') Drupal\locale\Tests\LocaleTranslationUiTest->testJavaScriptTranslation() Drupal\simpletest\TestBase->run() simpletest_script_run_one_test('404', 'Drupal\locale\Tests\LocaleTranslationUiTest') Noticelocale.module1184_locale_rebuild_js()
Trying to get property of non-object_locale_rebuild_js('xx') Drupal\locale\Tests\LocaleTranslationUiTest->testJavaScriptTranslation() Drupal\simpletest\TestBase->run() simpletest_script_run_one_test('404', 'Drupal\locale\Tests\LocaleTranslationUiTest') Noticelocale.module1213_locale_rebuild_js()
Trying to get property of non-object_locale_rebuild_js('xx') Drupal\locale\Tests\LocaleTranslationUiTest->testJavaScriptTranslation() Drupal\simpletest\TestBase->run() simpletest_script_run_one_test('404', 'Drupal\locale\Tests\LocaleTranslationUiTest') Noticelocale.module1214_locale_rebuild_js()
Trying to get property of non-object_locale_rebuild_js('xx') Drupal\locale\Tests\LocaleTranslationUiTest->testJavaScriptTranslation() Drupal\simpletest\TestBase->run() simpletest_script_run_one_test('404', 'Drupal\locale\Tests\LocaleTranslationUiTest') Noticelocale.module1222_locale_rebuild_js()
Undefined index: xxDrupal\locale\Tests\LocaleTranslationUiTest->testJavaScriptTranslation() Drupal\simpletest\TestBase->run() simpletest_script_run_one_test('404', 'Drupal\locale\Tests\LocaleTranslationUiTest') NoticeLocaleTranslationUiTest.php263Drupal\locale\Tests\LocaleTranslationUiTest->testJavaScriptTranslation()
JavaScript file created: not foundOtherLocaleTranslationUiTest.php264Drupal\locale\Tests\LocaleTranslationUiTest->testJavaScriptTranslation()
Undefined index: xx_locale_rebuild_js('xx') Drupal\locale\Tests\LocaleTranslationUiTest->testJavaScriptTranslation() Drupal\simpletest\TestBase->run() simpletest_script_run_one_test('404', 'Drupal\locale\Tests\LocaleTranslationUiTest') Noticelocale.module1177_locale_rebuild_js()
Trying to get property of non-object_locale_rebuild_js('xx') Drupal\locale\Tests\LocaleTranslationUiTest->testJavaScriptTranslation() Drupal\simpletest\TestBase->run() simpletest_script_run_one_test('404', 'Drupal\locale\Tests\LocaleTranslationUiTest') Noticelocale.module1184_locale_rebuild_js()
Trying to get property of non-object_locale_rebuild_js('xx') Drupal\locale\Tests\LocaleTranslationUiTest->testJavaScriptTranslation() Drupal\simpletest\TestBase->run() simpletest_script_run_one_test('404', 'Drupal\locale\Tests\LocaleTranslationUiTest') Noticelocale.module1213_locale_rebuild_js()
Trying to get property of non-object_locale_rebuild_js('xx') Drupal\locale\Tests\LocaleTranslationUiTest->testJavaScriptTranslation() Drupal\simpletest\TestBase->run() simpletest_script_run_one_test('404', 'Drupal\locale\Tests\LocaleTranslationUiTest') Noticelocale.module1214_locale_rebuild_js()
Trying to get property of non-object_locale_rebuild_js('xx') Drupal\locale\Tests\LocaleTranslationUiTest->testJavaScriptTranslation() Drupal\simpletest\TestBase->run() simpletest_script_run_one_test('404', 'Drupal\locale\Tests\LocaleTranslationUiTest') Noticelocale.module1222_locale_rebuild_js()
JavaScript file rebuilt: not foundOtherLocaleTranslationUiTest.php271Drupal\locale\Tests\LocaleTranslationUiTest->testJavaScriptTranslation()
Undefined index: xx_locale_rebuild_js('xx') Drupal\locale\Tests\LocaleTranslationUiTest->testJavaScriptTranslation() Drupal\simpletest\TestBase->run() simpletest_script_run_one_test('404', 'Drupal\locale\Tests\LocaleTranslationUiTest') Noticelocale.module1177_locale_rebuild_js()
Trying to get property of non-object_locale_rebuild_js('xx') Drupal\locale\Tests\LocaleTranslationUiTest->testJavaScriptTranslation() Drupal\simpletest\TestBase->run() simpletest_script_run_one_test('404', 'Drupal\locale\Tests\LocaleTranslationUiTest') Noticelocale.module1184_locale_rebuild_js()
Trying to get property of non-object_locale_rebuild_js('xx') Drupal\locale\Tests\LocaleTranslationUiTest->testJavaScriptTranslation() Drupal\simpletest\TestBase->run() simpletest_script_run_one_test('404', 'Drupal\locale\Tests\LocaleTranslationUiTest') Noticelocale.module1213_locale_rebuild_js()
Trying to get property of non-object_locale_rebuild_js('xx') Drupal\locale\Tests\LocaleTranslationUiTest->testJavaScriptTranslation() Drupal\simpletest\TestBase->run() simpletest_script_run_one_test('404', 'Drupal\locale\Tests\LocaleTranslationUiTest') Noticelocale.module1214_locale_rebuild_js()
Trying to get property of non-object_locale_rebuild_js('xx') Drupal\locale\Tests\LocaleTranslationUiTest->testJavaScriptTranslation() Drupal\simpletest\TestBase->run() simpletest_script_run_one_test('404', 'Drupal\locale\Tests\LocaleTranslationUiTest') Noticelocale.module1222_locale_rebuild_js()
Undefined index: xxDrupal\locale\Tests\LocaleTranslationUiTest->testJavaScriptTranslation() Drupal\simpletest\TestBase->run() simpletest_script_run_one_test('404', 'Drupal\locale\Tests\LocaleTranslationUiTest') NoticeLocaleTranslationUiTest.php263Drupal\locale\Tests\LocaleTranslationUiTest->testJavaScriptTranslation()
JavaScript file created: not foundOtherLocaleTranslationUiTest.php264Drupal\locale\Tests\LocaleTranslationUiTest->testJavaScriptTranslation()
Undefined index: xx_locale_rebuild_js('xx') Drupal\locale\Tests\LocaleTranslationUiTest->testJavaScriptTranslation() Drupal\simpletest\TestBase->run() simpletest_script_run_one_test('404', 'Drupal\locale\Tests\LocaleTranslationUiTest') Noticelocale.module1177_locale_rebuild_js()
Trying to get property of non-object_locale_rebuild_js('xx') Drupal\locale\Tests\LocaleTranslationUiTest->testJavaScriptTranslation() Drupal\simpletest\TestBase->run() simpletest_script_run_one_test('404', 'Drupal\locale\Tests\LocaleTranslationUiTest') Noticelocale.module1184_locale_rebuild_js()
Trying to get property of non-object_locale_rebuild_js('xx') Drupal\locale\Tests\LocaleTranslationUiTest->testJavaScriptTranslation() Drupal\simpletest\TestBase->run() simpletest_script_run_one_test('404', 'Drupal\locale\Tests\LocaleTranslationUiTest') Noticelocale.module1213_locale_rebuild_js()
Trying to get property of non-object_locale_rebuild_js('xx') Drupal\locale\Tests\LocaleTranslationUiTest->testJavaScriptTranslation() Drupal\simpletest\TestBase->run() simpletest_script_run_one_test('404', 'Drupal\locale\Tests\LocaleTranslationUiTest') Noticelocale.module1214_locale_rebuild_js()
Trying to get property of non-object_locale_rebuild_js('xx') Drupal\locale\Tests\LocaleTranslationUiTest->testJavaScriptTranslation() Drupal\simpletest\TestBase->run() simpletest_script_run_one_test('404', 'Drupal\locale\Tests\LocaleTranslationUiTest') Noticelocale.module1222_locale_rebuild_js()
JavaScript file rebuilt: not foundOtherLocaleTranslationUiTest.php271Drupal\locale\Tests\LocaleTranslationUiTest->testJavaScriptTranslation()
ExpandDrupal\path\Tests\PathLanguageTest13520
MessageGroupFilenameLineFunctionStatus
Alias for French translation works.OtherPathLanguageTest.php95Drupal\path\Tests\PathLanguageTest->testAliasTranslation()
Alias for French translation works.OtherPathLanguageTest.php133Drupal\path\Tests\PathLanguageTest->testAliasTranslation()
ExpandDrupal\path\Tests\PathLanguageUiTest28320
MessageGroupFilenameLineFunctionStatus
Foreign URL alias worksOtherPathLanguageUiTest.php89Drupal\path\Tests\PathLanguageUiTest->testNonDefaultUrl()
Foreign URL alias worksOtherPathLanguageUiTest.php89Drupal\path\Tests\PathLanguageUiTest->testNonDefaultUrl()
ExpandDrupal\system\Tests\System\DateFormatsLanguageTest11510
MessageGroupFilenameLineFunctionStatus
French date format appearsOtherDateFormatsLanguageTest.php107Drupal\system\Tests\System\DateFormatsLanguageTest->testLocalizeDateFormats()
ExpandDrupal\taxonomy\Tests\TermLanguageTest6220
MessageGroupFilenameLineFunctionStatus
Option aa for field edit-langcode is selected.BrowserTermLanguageTest.php99Drupal\taxonomy\Tests\TermLanguageTest->testDefaultTermLanguage()
Option bb for field edit-langcode is selected.BrowserTermLanguageTest.php101Drupal\taxonomy\Tests\TermLanguageTest->testDefaultTermLanguage()
ExpandDrupal\Tests\Core\PathProcessor\PathProcessorTest010
MessageGroupFilenameLineFunctionStatus
Drupal\Tests\Core\PathProcessor\PathProcessorTest::testProcessInbound Argument 1 passed to Drupal\Core\Language\LanguageManager::__construct() must be an array, none given, called in /var/lib/drupaltestbot/sites/default/files/checkout/core/vendor/phpunit/phpunit-mock-objects/PHPUnit/Framework/MockObject/Generator.php on line 237 and defined /var/lib/drupaltestbot/sites/default/files/checkout/core/lib/Drupal/Core/Language/LanguageManager.php:80 /var/lib/drupaltestbot/sites/default/files/checkout/core/tests/Drupal/Tests/Core/PathProcessor/PathProcessorTest.php:49 OtherPathProcessorTest.php60Drupal\Tests\Core\PathProcessor\PathProcessorTest->testProcessInbound()
ExpandDrupal\Tests\Core\Plugin\DefaultPluginManagerTest220
MessageGroupFilenameLineFunctionStatus
Drupal\Tests\Core\Plugin\DefaultPluginManagerTest::testDefaultPluginManagerWithEmptyCache Argument 1 passed to Drupal\Core\Language\LanguageManager::__construct() must be an array, none given, called in /var/lib/drupaltestbot/sites/default/files/checkout/core/vendor/phpunit/phpunit-mock-objects/PHPUnit/Framework/MockObject/Generator.php on line 237 and defined /var/lib/drupaltestbot/sites/default/files/checkout/core/lib/Drupal/Core/Language/LanguageManager.php:80 /var/lib/drupaltestbot/sites/default/files/checkout/core/tests/Drupal/Tests/Core/Plugin/DefaultPluginManagerTest.php:116 OtherDefaultPluginManagerTest.php100Drupal\Tests\Core\Plugin\DefaultPluginManagerTest->testDefaultPluginManagerWithEmptyCache()
Drupal\Tests\Core\Plugin\DefaultPluginManagerTest::testDefaultPluginManagerWithFilledCache Argument 1 passed to Drupal\Core\Language\LanguageManager::__construct() must be an array, none given, called in /var/lib/drupaltestbot/sites/default/files/checkout/core/vendor/phpunit/phpunit-mock-objects/PHPUnit/Framework/MockObject/Generator.php on line 237 and defined /var/lib/drupaltestbot/sites/default/files/checkout/core/lib/Drupal/Core/Language/LanguageManager.php:80 /var/lib/drupaltestbot/sites/default/files/checkout/core/tests/Drupal/Tests/Core/Plugin/DefaultPluginManagerTest.php:147 OtherDefaultPluginManagerTest.php132Drupal\Tests\Core\Plugin\DefaultPluginManagerTest->testDefaultPluginManagerWithFilledCache()
ExpandDrupal\toolbar\Tests\ToolbarMenuTranslationTest9960
MessageGroupFilenameLineFunctionStatus
Search found the menu item as untranslated.OtherToolbarMenuTranslationTest.php64Drupal\toolbar\Tests\ToolbarMenuTranslationTest->testToolbarClasses()
Failed to set field to yXUgayQKOtherToolbarMenuTranslationTest.php77Drupal\toolbar\Tests\ToolbarMenuTranslationTest->testToolbarClasses()
Found the Save translations buttonOtherToolbarMenuTranslationTest.php77Drupal\toolbar\Tests\ToolbarMenuTranslationTest->testToolbarClasses()
Found the requested form fields at admin/config/regional/translate/translateOtherToolbarMenuTranslationTest.php77Drupal\toolbar\Tests\ToolbarMenuTranslationTest->testToolbarClasses()
Search found the menu item as translated: yXUgayQK.OtherToolbarMenuTranslationTest.php87Drupal\toolbar\Tests\ToolbarMenuTranslationTest->testToolbarClasses()
Found the menu translated.OtherToolbarMenuTranslationTest.php92Drupal\toolbar\Tests\ToolbarMenuTranslationTest->testToolbarClasses()
ExpandDrupal\tour\Tests\TourTest3120
MessageGroupFilenameLineFunctionStatus
Found Italian variant of tip 1.OtherTourTest.php98Drupal\tour\Tests\TourTest->testTourFunctionality()
Did not find English variant of tip 1.OtherTourTest.php104Drupal\tour\Tests\TourTest->testTourFunctionality()
ExpandDrupal\translation\Tests\TranslationTest56350
MessageGroupFilenameLineFunctionStatus
Language was installed successfully.OtherTranslationTest.php319Drupal\translation\Tests\TranslationTest->addLanguage()
Language was installed successfully.OtherTranslationTest.php319Drupal\translation\Tests\TranslationTest->addLanguage()
Language was installed successfully.OtherTranslationTest.php319Drupal\translation\Tests\TranslationTest->addLanguage()
Language was installed successfully.OtherTranslationTest.php319Drupal\translation\Tests\TranslationTest->addLanguage()
Language was installed successfully.OtherTranslationTest.php319Drupal\translation\Tests\TranslationTest->addLanguage()
ExpandDrupal\user\Tests\UserLanguageCreationTest6170
MessageGroupFilenameLineFunctionStatus
Global language set in the language selector.BrowserUserLanguageCreationTest.php59Drupal\user\Tests\UserLanguageCreationTest->testLocalUserCreation()
New user has correct preferred language set.OtherUserLanguageCreationTest.php74Drupal\user\Tests\UserLanguageCreationTest->testLocalUserCreation()
New user has correct profile language set.OtherUserLanguageCreationTest.php75Drupal\user\Tests\UserLanguageCreationTest->testLocalUserCreation()
New user has correct preferred language set.OtherUserLanguageCreationTest.php92Drupal\user\Tests\UserLanguageCreationTest->testLocalUserCreation()
New user has correct profile language set.OtherUserLanguageCreationTest.php93Drupal\user\Tests\UserLanguageCreationTest->testLocalUserCreation()
Language selector is accessible and correct language is selected.BrowserUserLanguageCreationTest.php101Drupal\user\Tests\UserLanguageCreationTest->testLocalUserCreation()
Language selector is accessible and correct language is selected.BrowserUserLanguageCreationTest.php114Drupal\user\Tests\UserLanguageCreationTest->testLocalUserCreation()

All

Test namePassFailException
Leaf40000
LeafDrupal\action\Tests\BulkFormTest4200
LeafDrupal\action\Tests\ConfigurationTest5100
LeafDrupal\aggregator\Tests\AddFeedTest7300
LeafDrupal\aggregator\Tests\AggregatorConfigurationTest3800
LeafDrupal\aggregator\Tests\AggregatorCronTest5500
LeafDrupal\aggregator\Tests\AggregatorRenderingTest22700
LeafDrupal\aggregator\Tests\CategorizeFeedItemTest6100
LeafDrupal\aggregator\Tests\CategorizeFeedTest2500
LeafDrupal\aggregator\Tests\FeedFetcherPluginTest6300
LeafDrupal\aggregator\Tests\FeedLanguageTest5700
LeafDrupal\aggregator\Tests\FeedParserTest9900
LeafDrupal\aggregator\Tests\FeedProcessorPluginTest15200
LeafDrupal\aggregator\Tests\ImportOpmlTest6800
LeafDrupal\aggregator\Tests\RemoveFeedItemTest27000
LeafDrupal\aggregator\Tests\RemoveFeedTest2500
LeafDrupal\aggregator\Tests\UpdateFeedItemTest7600
LeafDrupal\aggregator\Tests\UpdateFeedTest7600
LeafDrupal\aggregator\Tests\Views\IntegrationTest3600
LeafDrupal\ban\Tests\IpAddressBlockingTest4300
LeafDrupal\block\Tests\BlockAdminThemeTest1900
LeafDrupal\block\Tests\BlockCacheTest18500
LeafDrupal\block\Tests\BlockHiddenRegionTest1800
LeafDrupal\block\Tests\BlockHtmlIdTest1000
LeafDrupal\block\Tests\BlockInterfaceTest500
LeafDrupal\block\Tests\BlockInvalidRegionTest2400
LeafDrupal\block\Tests\BlockLanguageCacheTest8200
ExpandDrupal\block\Tests\BlockLanguageTest5011
MessageGroupFilenameLineFunctionStatus
The body of the custom block appears on the page.OtherBlockLanguageTest.php81Drupal\block\Tests\BlockLanguageTest->testLanguageBlockVisibility()
Trying to get property of non-objectDrupal\Core\PathProcessor\PathProcessorAlias->processOutbound('', Array, Object) Drupal\Core\PathProcessor\PathProcessorManager->processOutbound('', Array, Object) Drupal\Core\Routing\UrlGenerator->processPath('', Array) Drupal\Core\Routing\UrlGenerator->generateFromPath('', Array) Drupal\simpletest\WebTestBase->drupalGet('', Array) Drupal\block\Tests\BlockLanguageTest->testLanguageBlockVisibility() Drupal\simpletest\TestBase->run() simpletest_script_run_one_test('36', 'Drupal\block\Tests\BlockLanguageTest') NoticePathProcessorAlias.php47Drupal\Core\PathProcessor\PathProcessorAlias->processOutbound()
LeafDrupal\block\Tests\BlockLibrarySearchTest1900
LeafDrupal\block\Tests\BlockStorageUnitTest2000
LeafDrupal\block\Tests\BlockTemplateSuggestionsUnitTest300
LeafDrupal\block\Tests\BlockTest22100
LeafDrupal\block\Tests\BlockTitleXSSTest1500
LeafDrupal\block\Tests\BlockUiTest3700
LeafDrupal\block\Tests\NewDefaultThemeBlocksTest1700
LeafDrupal\block\Tests\NonDefaultBlockAdminTest1200
LeafDrupal\block\Tests\Views\DisplayBlockTest6400
LeafDrupal\book\Tests\BookTest63600
LeafDrupal\breakpoint\Tests\BreakpointAPITest600
LeafDrupal\breakpoint\Tests\BreakpointCRUDTest2100
LeafDrupal\breakpoint\Tests\BreakpointGroupAPITest400
LeafDrupal\breakpoint\Tests\BreakpointGroupCRUDTest1200
LeafDrupal\breakpoint\Tests\BreakpointMediaQueryTest200
LeafDrupal\breakpoint\Tests\BreakpointThemeTest2300
LeafDrupal\ckeditor\Tests\CKEditorAdminTest5800
LeafDrupal\ckeditor\Tests\CKEditorLoadingTest5100
LeafDrupal\ckeditor\Tests\CKEditorPluginManagerTest1600
LeafDrupal\ckeditor\Tests\CKEditorTest3700
LeafDrupal\color\Tests\ColorTest8700
LeafDrupal\comment\Tests\CommentActionsTest4800
LeafDrupal\comment\Tests\CommentAnonymousTest16300
LeafDrupal\comment\Tests\CommentApprovalTest15200
LeafDrupal\comment\Tests\CommentBlockTest9300
LeafDrupal\comment\Tests\CommentContentRebuildTest3300
LeafDrupal\comment\Tests\CommentCSSTest50100
LeafDrupal\comment\Tests\CommentFieldsTest9800
LeafDrupal\comment\Tests\CommentInterfaceTest24800
LeafDrupal\comment\Tests\CommentLanguageTest4200
ExpandDrupal\comment\Tests\CommentLinksTest109300
MessageGroupFilenameLineFunctionStatus
Changed environment:array ( 'authenticated' => false, 'comment count' => false, 'form' => 'below', 'user_register' => 'visitors', 'contact' => 'optional', 'comments' => 'open', 'access comments' => 0, 'post comments' => 0, 'skip comment approval' => 1, 'edit own comments' => 0, )DebugCommentLinksTest.php208Drupal\comment\Tests\CommentLinksTest->setEnvironment()
Changed environment:array ( 'authenticated' => true, 'comment count' => false, 'form' => 'below', 'user_register' => 'visitors', 'contact' => 'optional', 'comments' => 'open', 'access comments' => 0, 'post comments' => 0, 'skip comment approval' => 1, 'edit own comments' => 0, )DebugCommentLinksTest.php208Drupal\comment\Tests\CommentLinksTest->setEnvironment()
Changed environment:array ( 'authenticated' => false, 'comment count' => true, 'form' => 'below', 'user_register' => 'visitors', 'contact' => 'optional', 'comments' => 'open', 'access comments' => 0, 'post comments' => 0, 'skip comment approval' => 1, 'edit own comments' => 0, )DebugCommentLinksTest.php208Drupal\comment\Tests\CommentLinksTest->setEnvironment()
Changed environment:array ( 'authenticated' => true, 'comment count' => true, 'form' => 'below', 'user_register' => 'visitors', 'contact' => 'optional', 'comments' => 'open', 'access comments' => 0, 'post comments' => 0, 'skip comment approval' => 1, 'edit own comments' => 0, )DebugCommentLinksTest.php208Drupal\comment\Tests\CommentLinksTest->setEnvironment()
Changed environment:array ( 'authenticated' => false, 'comment count' => false, 'form' => 'below', 'user_register' => 'visitors', 'contact' => 'optional', 'comments' => 'open', 'access comments' => 1, 'post comments' => 0, 'skip comment approval' => 1, 'edit own comments' => 0, )DebugCommentLinksTest.php208Drupal\comment\Tests\CommentLinksTest->setEnvironment()
Changed environment:array ( 'authenticated' => true, 'comment count' => false, 'form' => 'below', 'user_register' => 'visitors', 'contact' => 'optional', 'comments' => 'open', 'access comments' => 1, 'post comments' => 0, 'skip comment approval' => 1, 'edit own comments' => 0, )DebugCommentLinksTest.php208Drupal\comment\Tests\CommentLinksTest->setEnvironment()
Changed environment:array ( 'authenticated' => false, 'comment count' => true, 'form' => 'below', 'user_register' => 'visitors', 'contact' => 'optional', 'comments' => 'open', 'access comments' => 1, 'post comments' => 0, 'skip comment approval' => 1, 'edit own comments' => 0, )DebugCommentLinksTest.php208Drupal\comment\Tests\CommentLinksTest->setEnvironment()
Changed environment:array ( 'authenticated' => true, 'comment count' => true, 'form' => 'below', 'user_register' => 'visitors', 'contact' => 'optional', 'comments' => 'open', 'access comments' => 1, 'post comments' => 0, 'skip comment approval' => 1, 'edit own comments' => 0, )DebugCommentLinksTest.php208Drupal\comment\Tests\CommentLinksTest->setEnvironment()
Changed environment:array ( 'authenticated' => false, 'comment count' => false, 'form' => 'below', 'user_register' => 'visitors', 'contact' => 'optional', 'comments' => 'open', 'access comments' => 0, 'post comments' => 1, 'skip comment approval' => 1, 'edit own comments' => 0, )DebugCommentLinksTest.php208Drupal\comment\Tests\CommentLinksTest->setEnvironment()
Changed environment:array ( 'authenticated' => true, 'comment count' => false, 'form' => 'below', 'user_register' => 'visitors', 'contact' => 'optional', 'comments' => 'open', 'access comments' => 0, 'post comments' => 1, 'skip comment approval' => 1, 'edit own comments' => 0, )DebugCommentLinksTest.php208Drupal\comment\Tests\CommentLinksTest->setEnvironment()
Changed environment:array ( 'authenticated' => false, 'comment count' => true, 'form' => 'below', 'user_register' => 'visitors', 'contact' => 'optional', 'comments' => 'open', 'access comments' => 0, 'post comments' => 1, 'skip comment approval' => 1, 'edit own comments' => 0, )DebugCommentLinksTest.php208Drupal\comment\Tests\CommentLinksTest->setEnvironment()
Changed environment:array ( 'authenticated' => true, 'comment count' => true, 'form' => 'below', 'user_register' => 'visitors', 'contact' => 'optional', 'comments' => 'open', 'access comments' => 0, 'post comments' => 1, 'skip comment approval' => 1, 'edit own comments' => 0, )DebugCommentLinksTest.php208Drupal\comment\Tests\CommentLinksTest->setEnvironment()
Changed environment:array ( 'authenticated' => false, 'comment count' => false, 'form' => 'below', 'user_register' => 'visitors', 'contact' => 'optional', 'comments' => 'open', 'access comments' => 1, 'post comments' => 1, 'skip comment approval' => 1, 'edit own comments' => 0, )DebugCommentLinksTest.php208Drupal\comment\Tests\CommentLinksTest->setEnvironment()
Changed environment:array ( 'authenticated' => true, 'comment count' => false, 'form' => 'below', 'user_register' => 'visitors', 'contact' => 'optional', 'comments' => 'open', 'access comments' => 1, 'post comments' => 1, 'skip comment approval' => 1, 'edit own comments' => 0, )DebugCommentLinksTest.php208Drupal\comment\Tests\CommentLinksTest->setEnvironment()
Changed environment:array ( 'authenticated' => false, 'comment count' => true, 'form' => 'below', 'user_register' => 'visitors', 'contact' => 'optional', 'comments' => 'open', 'access comments' => 1, 'post comments' => 1, 'skip comment approval' => 1, 'edit own comments' => 0, )DebugCommentLinksTest.php208Drupal\comment\Tests\CommentLinksTest->setEnvironment()
Changed environment:array ( 'authenticated' => true, 'comment count' => true, 'form' => 'below', 'user_register' => 'visitors', 'contact' => 'optional', 'comments' => 'open', 'access comments' => 1, 'post comments' => 1, 'skip comment approval' => 1, 'edit own comments' => 0, )DebugCommentLinksTest.php208Drupal\comment\Tests\CommentLinksTest->setEnvironment()
Changed environment:array ( 'authenticated' => false, 'comment count' => false, 'form' => 'separate page', 'user_register' => 'visitors', 'contact' => 'optional', 'comments' => 'open', 'access comments' => 0, 'post comments' => 0, 'skip comment approval' => 1, 'edit own comments' => 0, )DebugCommentLinksTest.php208Drupal\comment\Tests\CommentLinksTest->setEnvironment()
Changed environment:array ( 'authenticated' => true, 'comment count' => false, 'form' => 'separate page', 'user_register' => 'visitors', 'contact' => 'optional', 'comments' => 'open', 'access comments' => 0, 'post comments' => 0, 'skip comment approval' => 1, 'edit own comments' => 0, )DebugCommentLinksTest.php208Drupal\comment\Tests\CommentLinksTest->setEnvironment()
Changed environment:array ( 'authenticated' => false, 'comment count' => true, 'form' => 'separate page', 'user_register' => 'visitors', 'contact' => 'optional', 'comments' => 'open', 'access comments' => 0, 'post comments' => 0, 'skip comment approval' => 1, 'edit own comments' => 0, )DebugCommentLinksTest.php208Drupal\comment\Tests\CommentLinksTest->setEnvironment()
Changed environment:array ( 'authenticated' => true, 'comment count' => true, 'form' => 'separate page', 'user_register' => 'visitors', 'contact' => 'optional', 'comments' => 'open', 'access comments' => 0, 'post comments' => 0, 'skip comment approval' => 1, 'edit own comments' => 0, )DebugCommentLinksTest.php208Drupal\comment\Tests\CommentLinksTest->setEnvironment()
Changed environment:array ( 'authenticated' => false, 'comment count' => false, 'form' => 'separate page', 'user_register' => 'visitors', 'contact' => 'optional', 'comments' => 'open', 'access comments' => 1, 'post comments' => 0, 'skip comment approval' => 1, 'edit own comments' => 0, )DebugCommentLinksTest.php208Drupal\comment\Tests\CommentLinksTest->setEnvironment()
Changed environment:array ( 'authenticated' => true, 'comment count' => false, 'form' => 'separate page', 'user_register' => 'visitors', 'contact' => 'optional', 'comments' => 'open', 'access comments' => 1, 'post comments' => 0, 'skip comment approval' => 1, 'edit own comments' => 0, )DebugCommentLinksTest.php208Drupal\comment\Tests\CommentLinksTest->setEnvironment()
Changed environment:array ( 'authenticated' => false, 'comment count' => true, 'form' => 'separate page', 'user_register' => 'visitors', 'contact' => 'optional', 'comments' => 'open', 'access comments' => 1, 'post comments' => 0, 'skip comment approval' => 1, 'edit own comments' => 0, )DebugCommentLinksTest.php208Drupal\comment\Tests\CommentLinksTest->setEnvironment()
Changed environment:array ( 'authenticated' => true, 'comment count' => true, 'form' => 'separate page', 'user_register' => 'visitors', 'contact' => 'optional', 'comments' => 'open', 'access comments' => 1, 'post comments' => 0, 'skip comment approval' => 1, 'edit own comments' => 0, )DebugCommentLinksTest.php208Drupal\comment\Tests\CommentLinksTest->setEnvironment()
Changed environment:array ( 'authenticated' => false, 'comment count' => false, 'form' => 'separate page', 'user_register' => 'visitors', 'contact' => 'optional', 'comments' => 'open', 'access comments' => 0, 'post comments' => 1, 'skip comment approval' => 1, 'edit own comments' => 0, )DebugCommentLinksTest.php208Drupal\comment\Tests\CommentLinksTest->setEnvironment()
Changed environment:array ( 'authenticated' => true, 'comment count' => false, 'form' => 'separate page', 'user_register' => 'visitors', 'contact' => 'optional', 'comments' => 'open', 'access comments' => 0, 'post comments' => 1, 'skip comment approval' => 1, 'edit own comments' => 0, )DebugCommentLinksTest.php208Drupal\comment\Tests\CommentLinksTest->setEnvironment()
Changed environment:array ( 'authenticated' => false, 'comment count' => true, 'form' => 'separate page', 'user_register' => 'visitors', 'contact' => 'optional', 'comments' => 'open', 'access comments' => 0, 'post comments' => 1, 'skip comment approval' => 1, 'edit own comments' => 0, )DebugCommentLinksTest.php208Drupal\comment\Tests\CommentLinksTest->setEnvironment()
Changed environment:array ( 'authenticated' => true, 'comment count' => true, 'form' => 'separate page', 'user_register' => 'visitors', 'contact' => 'optional', 'comments' => 'open', 'access comments' => 0, 'post comments' => 1, 'skip comment approval' => 1, 'edit own comments' => 0, )DebugCommentLinksTest.php208Drupal\comment\Tests\CommentLinksTest->setEnvironment()
Changed environment:array ( 'authenticated' => false, 'comment count' => false, 'form' => 'separate page', 'user_register' => 'visitors', 'contact' => 'optional', 'comments' => 'open', 'access comments' => 1, 'post comments' => 1, 'skip comment approval' => 1, 'edit own comments' => 0, )DebugCommentLinksTest.php208Drupal\comment\Tests\CommentLinksTest->setEnvironment()
Changed environment:array ( 'authenticated' => true, 'comment count' => false, 'form' => 'separate page', 'user_register' => 'visitors', 'contact' => 'optional', 'comments' => 'open', 'access comments' => 1, 'post comments' => 1, 'skip comment approval' => 1, 'edit own comments' => 0, )DebugCommentLinksTest.php208Drupal\comment\Tests\CommentLinksTest->setEnvironment()
Changed environment:array ( 'authenticated' => false, 'comment count' => true, 'form' => 'separate page', 'user_register' => 'visitors', 'contact' => 'optional', 'comments' => 'open', 'access comments' => 1, 'post comments' => 1, 'skip comment approval' => 1, 'edit own comments' => 0, )DebugCommentLinksTest.php208Drupal\comment\Tests\CommentLinksTest->setEnvironment()
Changed environment:array ( 'authenticated' => true, 'comment count' => true, 'form' => 'separate page', 'user_register' => 'visitors', 'contact' => 'optional', 'comments' => 'open', 'access comments' => 1, 'post comments' => 1, 'skip comment approval' => 1, 'edit own comments' => 0, )DebugCommentLinksTest.php208Drupal\comment\Tests\CommentLinksTest->setEnvironment()
Changed environment:array ( 'authenticated' => false, 'comment count' => false, 'form' => 'below', 'user_register' => 'admin_only', 'contact' => 'optional', 'comments' => 'open', 'access comments' => 0, 'post comments' => 0, 'skip comment approval' => 1, 'edit own comments' => 0, )DebugCommentLinksTest.php208Drupal\comment\Tests\CommentLinksTest->setEnvironment()
Changed environment:array ( 'authenticated' => true, 'comment count' => false, 'form' => 'below', 'user_register' => 'admin_only', 'contact' => 'optional', 'comments' => 'open', 'access comments' => 0, 'post comments' => 0, 'skip comment approval' => 1, 'edit own comments' => 0, )DebugCommentLinksTest.php208Drupal\comment\Tests\CommentLinksTest->setEnvironment()
Changed environment:array ( 'authenticated' => false, 'comment count' => true, 'form' => 'below', 'user_register' => 'admin_only', 'contact' => 'optional', 'comments' => 'open', 'access comments' => 0, 'post comments' => 0, 'skip comment approval' => 1, 'edit own comments' => 0, )DebugCommentLinksTest.php208Drupal\comment\Tests\CommentLinksTest->setEnvironment()
Changed environment:array ( 'authenticated' => true, 'comment count' => true, 'form' => 'below', 'user_register' => 'admin_only', 'contact' => 'optional', 'comments' => 'open', 'access comments' => 0, 'post comments' => 0, 'skip comment approval' => 1, 'edit own comments' => 0, )DebugCommentLinksTest.php208Drupal\comment\Tests\CommentLinksTest->setEnvironment()
Changed environment:array ( 'authenticated' => false, 'comment count' => false, 'form' => 'below', 'user_register' => 'admin_only', 'contact' => 'optional', 'comments' => 'open', 'access comments' => 1, 'post comments' => 0, 'skip comment approval' => 1, 'edit own comments' => 0, )DebugCommentLinksTest.php208Drupal\comment\Tests\CommentLinksTest->setEnvironment()
Changed environment:array ( 'authenticated' => true, 'comment count' => false, 'form' => 'below', 'user_register' => 'admin_only', 'contact' => 'optional', 'comments' => 'open', 'access comments' => 1, 'post comments' => 0, 'skip comment approval' => 1, 'edit own comments' => 0, )DebugCommentLinksTest.php208Drupal\comment\Tests\CommentLinksTest->setEnvironment()
Changed environment:array ( 'authenticated' => false, 'comment count' => true, 'form' => 'below', 'user_register' => 'admin_only', 'contact' => 'optional', 'comments' => 'open', 'access comments' => 1, 'post comments' => 0, 'skip comment approval' => 1, 'edit own comments' => 0, )DebugCommentLinksTest.php208Drupal\comment\Tests\CommentLinksTest->setEnvironment()
Changed environment:array ( 'authenticated' => true, 'comment count' => true, 'form' => 'below', 'user_register' => 'admin_only', 'contact' => 'optional', 'comments' => 'open', 'access comments' => 1, 'post comments' => 0, 'skip comment approval' => 1, 'edit own comments' => 0, )DebugCommentLinksTest.php208Drupal\comment\Tests\CommentLinksTest->setEnvironment()
Changed environment:array ( 'authenticated' => false, 'comment count' => false, 'form' => 'below', 'user_register' => 'admin_only', 'contact' => 'optional', 'comments' => 'open', 'access comments' => 0, 'post comments' => 1, 'skip comment approval' => 1, 'edit own comments' => 0, )DebugCommentLinksTest.php208Drupal\comment\Tests\CommentLinksTest->setEnvironment()
Changed environment:array ( 'authenticated' => true, 'comment count' => false, 'form' => 'below', 'user_register' => 'admin_only', 'contact' => 'optional', 'comments' => 'open', 'access comments' => 0, 'post comments' => 1, 'skip comment approval' => 1, 'edit own comments' => 0, )DebugCommentLinksTest.php208Drupal\comment\Tests\CommentLinksTest->setEnvironment()
Changed environment:array ( 'authenticated' => false, 'comment count' => true, 'form' => 'below', 'user_register' => 'admin_only', 'contact' => 'optional', 'comments' => 'open', 'access comments' => 0, 'post comments' => 1, 'skip comment approval' => 1, 'edit own comments' => 0, )DebugCommentLinksTest.php208Drupal\comment\Tests\CommentLinksTest->setEnvironment()
Changed environment:array ( 'authenticated' => true, 'comment count' => true, 'form' => 'below', 'user_register' => 'admin_only', 'contact' => 'optional', 'comments' => 'open', 'access comments' => 0, 'post comments' => 1, 'skip comment approval' => 1, 'edit own comments' => 0, )DebugCommentLinksTest.php208Drupal\comment\Tests\CommentLinksTest->setEnvironment()
Changed environment:array ( 'authenticated' => false, 'comment count' => false, 'form' => 'below', 'user_register' => 'admin_only', 'contact' => 'optional', 'comments' => 'open', 'access comments' => 1, 'post comments' => 1, 'skip comment approval' => 1, 'edit own comments' => 0, )DebugCommentLinksTest.php208Drupal\comment\Tests\CommentLinksTest->setEnvironment()
Changed environment:array ( 'authenticated' => true, 'comment count' => false, 'form' => 'below', 'user_register' => 'admin_only', 'contact' => 'optional', 'comments' => 'open', 'access comments' => 1, 'post comments' => 1, 'skip comment approval' => 1, 'edit own comments' => 0, )DebugCommentLinksTest.php208Drupal\comment\Tests\CommentLinksTest->setEnvironment()
Changed environment:array ( 'authenticated' => false, 'comment count' => true, 'form' => 'below', 'user_register' => 'admin_only', 'contact' => 'optional', 'comments' => 'open', 'access comments' => 1, 'post comments' => 1, 'skip comment approval' => 1, 'edit own comments' => 0, )DebugCommentLinksTest.php208Drupal\comment\Tests\CommentLinksTest->setEnvironment()
Changed environment:array ( 'authenticated' => true, 'comment count' => true, 'form' => 'below', 'user_register' => 'admin_only', 'contact' => 'optional', 'comments' => 'open', 'access comments' => 1, 'post comments' => 1, 'skip comment approval' => 1, 'edit own comments' => 0, )DebugCommentLinksTest.php208Drupal\comment\Tests\CommentLinksTest->setEnvironment()
Changed environment:array ( 'authenticated' => false, 'comment count' => false, 'form' => 'separate page', 'user_register' => 'admin_only', 'contact' => 'optional', 'comments' => 'open', 'access comments' => 0, 'post comments' => 0, 'skip comment approval' => 1, 'edit own comments' => 0, )DebugCommentLinksTest.php208Drupal\comment\Tests\CommentLinksTest->setEnvironment()
Changed environment:array ( 'authenticated' => true, 'comment count' => false, 'form' => 'separate page', 'user_register' => 'admin_only', 'contact' => 'optional', 'comments' => 'open', 'access comments' => 0, 'post comments' => 0, 'skip comment approval' => 1, 'edit own comments' => 0, )DebugCommentLinksTest.php208Drupal\comment\Tests\CommentLinksTest->setEnvironment()
Changed environment:array ( 'authenticated' => false, 'comment count' => true, 'form' => 'separate page', 'user_register' => 'admin_only', 'contact' => 'optional', 'comments' => 'open', 'access comments' => 0, 'post comments' => 0, 'skip comment approval' => 1, 'edit own comments' => 0, )DebugCommentLinksTest.php208Drupal\comment\Tests\CommentLinksTest->setEnvironment()
Changed environment:array ( 'authenticated' => true, 'comment count' => true, 'form' => 'separate page', 'user_register' => 'admin_only', 'contact' => 'optional', 'comments' => 'open', 'access comments' => 0, 'post comments' => 0, 'skip comment approval' => 1, 'edit own comments' => 0, )DebugCommentLinksTest.php208Drupal\comment\Tests\CommentLinksTest->setEnvironment()
Changed environment:array ( 'authenticated' => false, 'comment count' => false, 'form' => 'separate page', 'user_register' => 'admin_only', 'contact' => 'optional', 'comments' => 'open', 'access comments' => 1, 'post comments' => 0, 'skip comment approval' => 1, 'edit own comments' => 0, )DebugCommentLinksTest.php208Drupal\comment\Tests\CommentLinksTest->setEnvironment()
Changed environment:array ( 'authenticated' => true, 'comment count' => false, 'form' => 'separate page', 'user_register' => 'admin_only', 'contact' => 'optional', 'comments' => 'open', 'access comments' => 1, 'post comments' => 0, 'skip comment approval' => 1, 'edit own comments' => 0, )DebugCommentLinksTest.php208Drupal\comment\Tests\CommentLinksTest->setEnvironment()
Changed environment:array ( 'authenticated' => false, 'comment count' => true, 'form' => 'separate page', 'user_register' => 'admin_only', 'contact' => 'optional', 'comments' => 'open', 'access comments' => 1, 'post comments' => 0, 'skip comment approval' => 1, 'edit own comments' => 0, )DebugCommentLinksTest.php208Drupal\comment\Tests\CommentLinksTest->setEnvironment()
Changed environment:array ( 'authenticated' => true, 'comment count' => true, 'form' => 'separate page', 'user_register' => 'admin_only', 'contact' => 'optional', 'comments' => 'open', 'access comments' => 1, 'post comments' => 0, 'skip comment approval' => 1, 'edit own comments' => 0, )DebugCommentLinksTest.php208Drupal\comment\Tests\CommentLinksTest->setEnvironment()
Changed environment:array ( 'authenticated' => false, 'comment count' => false, 'form' => 'separate page', 'user_register' => 'admin_only', 'contact' => 'optional', 'comments' => 'open', 'access comments' => 0, 'post comments' => 1, 'skip comment approval' => 1, 'edit own comments' => 0, )DebugCommentLinksTest.php208Drupal\comment\Tests\CommentLinksTest->setEnvironment()
Changed environment:array ( 'authenticated' => true, 'comment count' => false, 'form' => 'separate page', 'user_register' => 'admin_only', 'contact' => 'optional', 'comments' => 'open', 'access comments' => 0, 'post comments' => 1, 'skip comment approval' => 1, 'edit own comments' => 0, )DebugCommentLinksTest.php208Drupal\comment\Tests\CommentLinksTest->setEnvironment()
Changed environment:array ( 'authenticated' => false, 'comment count' => true, 'form' => 'separate page', 'user_register' => 'admin_only', 'contact' => 'optional', 'comments' => 'open', 'access comments' => 0, 'post comments' => 1, 'skip comment approval' => 1, 'edit own comments' => 0, )DebugCommentLinksTest.php208Drupal\comment\Tests\CommentLinksTest->setEnvironment()
Changed environment:array ( 'authenticated' => true, 'comment count' => true, 'form' => 'separate page', 'user_register' => 'admin_only', 'contact' => 'optional', 'comments' => 'open', 'access comments' => 0, 'post comments' => 1, 'skip comment approval' => 1, 'edit own comments' => 0, )DebugCommentLinksTest.php208Drupal\comment\Tests\CommentLinksTest->setEnvironment()
Changed environment:array ( 'authenticated' => false, 'comment count' => false, 'form' => 'separate page', 'user_register' => 'admin_only', 'contact' => 'optional', 'comments' => 'open', 'access comments' => 1, 'post comments' => 1, 'skip comment approval' => 1, 'edit own comments' => 0, )DebugCommentLinksTest.php208Drupal\comment\Tests\CommentLinksTest->setEnvironment()
Changed environment:array ( 'authenticated' => true, 'comment count' => false, 'form' => 'separate page', 'user_register' => 'admin_only', 'contact' => 'optional', 'comments' => 'open', 'access comments' => 1, 'post comments' => 1, 'skip comment approval' => 1, 'edit own comments' => 0, )DebugCommentLinksTest.php208Drupal\comment\Tests\CommentLinksTest->setEnvironment()
Changed environment:array ( 'authenticated' => false, 'comment count' => true, 'form' => 'separate page', 'user_register' => 'admin_only', 'contact' => 'optional', 'comments' => 'open', 'access comments' => 1, 'post comments' => 1, 'skip comment approval' => 1, 'edit own comments' => 0, )DebugCommentLinksTest.php208Drupal\comment\Tests\CommentLinksTest->setEnvironment()
Changed environment:array ( 'authenticated' => true, 'comment count' => true, 'form' => 'separate page', 'user_register' => 'admin_only', 'contact' => 'optional', 'comments' => 'open', 'access comments' => 1, 'post comments' => 1, 'skip comment approval' => 1, 'edit own comments' => 0, )DebugCommentLinksTest.php208Drupal\comment\Tests\CommentLinksTest->setEnvironment()
LeafDrupal\comment\Tests\CommentNewIndicatorTest4200
LeafDrupal\comment\Tests\CommentNodeAccessTest5700
LeafDrupal\comment\Tests\CommentNodeChangesTest2400
LeafDrupal\comment\Tests\CommentPagerTest21300
LeafDrupal\comment\Tests\CommentPreviewTest10000
LeafDrupal\comment\Tests\CommentRssTest2600
LeafDrupal\comment\Tests\CommentStatisticsTest9800
LeafDrupal\comment\Tests\CommentThreadingTest15900
LeafDrupal\comment\Tests\CommentTokenReplaceTest6600
LeafDrupal\comment\Tests\CommentTranslationUITest18300
LeafDrupal\comment\Tests\CommentUninstallTest800
LeafDrupal\comment\Tests\Views\ArgumentUserUIDTest900
LeafDrupal\comment\Tests\Views\CommentRowTest1100
LeafDrupal\comment\Tests\Views\DefaultViewRecentComments800
LeafDrupal\comment\Tests\Views\FilterUserUIDTest900
LeafDrupal\comment\Tests\Views\RowRssTest1200
LeafDrupal\comment\Tests\Views\WizardTest3300
LeafDrupal\config\Tests\ConfigCRUDTest3200
LeafDrupal\config\Tests\ConfigDiffTest1200
LeafDrupal\config\Tests\ConfigEntityListTest7100
LeafDrupal\config\Tests\ConfigEntityStatusTest600
LeafDrupal\config\Tests\ConfigEntityStatusUITest1500
LeafDrupal\config\Tests\ConfigEntityStorageControllerTest300
LeafDrupal\config\Tests\ConfigEntityTest13600
LeafDrupal\config\Tests\ConfigEntityUnitTest600
LeafDrupal\config\Tests\ConfigExportUITest1800
LeafDrupal\config\Tests\ConfigFileContentTest3300
LeafDrupal\config\Tests\ConfigImporterTest4800
LeafDrupal\config\Tests\ConfigImportUITest6100
LeafDrupal\config\Tests\ConfigInstallTest1400
LeafDrupal\config\Tests\ConfigInstallWebTest1700
LeafDrupal\config\Tests\ConfigLocaleOverride4400
ExpandDrupal\config\Tests\ConfigLocaleOverrideWebTest8710
MessageGroupFilenameLineFunctionStatus
"XX site name" foundOtherConfigLocaleOverrideWebTest.php66Drupal\config\Tests\ConfigLocaleOverrideWebTest->testSiteNameTranslation()
LeafDrupal\config\Tests\ConfigOverrideTest2600
LeafDrupal\config\Tests\ConfigSchemaTest2900
LeafDrupal\config\Tests\ConfigSnapshotTest900
LeafDrupal\config\Tests\ConfigUpgradeTest1200
LeafDrupal\config\Tests\Storage\DatabaseStorageTest2200
LeafDrupal\config\Tests\Storage\FileStorageTest2400
LeafDrupal\contact\Tests\ContactAuthenticatedUserTest1300
LeafDrupal\contact\Tests\ContactPersonalTest21400
LeafDrupal\contact\Tests\ContactSitewideTest33800
LeafDrupal\contact\Tests\ContactUpgradePathTest6400
LeafDrupal\contact\Tests\MessageEntityTest1200
LeafDrupal\contact\Tests\Views\ContactFieldsTest600
LeafDrupal\contact\Tests\Views\ContactLinkTest5300
LeafDrupal\content_translation\Tests\ConfigTestTranslationUITest1700
LeafDrupal\content_translation\Tests\ContentTestTranslationUITest14300
LeafDrupal\content_translation\Tests\ContentTranslationSettingsTest9400
LeafDrupal\content_translation\Tests\ContentTranslationSyncImageTest4100
LeafDrupal\content_translation\Tests\ContentTranslationSyncUnitTest1100
LeafDrupal\content_translation\Tests\ContentTranslationWorkflowsTest28200
LeafDrupal\content_translation\Tests\Views\ContentTranslationViewsUITest1500
LeafDrupal\content_translation\Tests\Views\TranslationLinkTest1700
LeafDrupal\contextual\Tests\ContextualDynamicContextTest7800
LeafDrupal\contextual\Tests\ContextualUnitTest2000
LeafDrupal\custom_block\Tests\CustomBlockBuildContentTest1000
LeafDrupal\custom_block\Tests\CustomBlockCreationTest6300
LeafDrupal\custom_block\Tests\CustomBlockFieldTest2000
LeafDrupal\custom_block\Tests\CustomBlockLoadHooksTest800
LeafDrupal\custom_block\Tests\CustomBlockPageViewTest1200
LeafDrupal\custom_block\Tests\CustomBlockRevisionsTest1300
LeafDrupal\custom_block\Tests\CustomBlockSaveTest3300
LeafDrupal\custom_block\Tests\CustomBlockTranslationUITest12800
LeafDrupal\custom_block\Tests\CustomBlockTypeTest7200
LeafDrupal\custom_block\Tests\PageEditTest3000
LeafDrupal\datetime\Tests\DatetimeFieldTest13100
LeafDrupal\dblog\Tests\DbLogTest37700
LeafDrupal\editor\Tests\EditIntegrationTest2600
LeafDrupal\editor\Tests\EditorAdminTest8500
LeafDrupal\editor\Tests\EditorLoadingTest6600
LeafDrupal\editor\Tests\EditorManagerTest1100
LeafDrupal\edit\Tests\EditLoadingTest5600
LeafDrupal\edit\Tests\EditorSelectionTest2300
LeafDrupal\edit\Tests\MetadataGeneratorTest1400
LeafDrupal\email\Tests\EmailFieldTest1900
LeafDrupal\email\Tests\EmailItemTest1000
LeafDrupal\entity\Tests\EntityDisplayTest5100
LeafDrupal\entity\Tests\EntityFormDisplayTest1700
LeafDrupal\entity_reference\Tests\EntityReferenceAdminTest2900
LeafDrupal\entity_reference\Tests\EntityReferenceAutocompleteTest1000
LeafDrupal\entity_reference\Tests\EntityReferenceAutoCreateTest1800
LeafDrupal\entity_reference\Tests\EntityReferenceItemTest2500
LeafDrupal\entity_reference\Tests\EntityReferenceSelectionAccessTest6900
LeafDrupal\entity_reference\Tests\EntityReferenceSelectionSortTest700
LeafDrupal\entity_reference\Tests\Views\SelectionTest300
LeafDrupal\field\Tests\ActiveTest1400
LeafDrupal\field\Tests\BulkDeleteTest10700
LeafDrupal\field\Tests\CrudTest8500
LeafDrupal\field\Tests\DisplayApiTest5900
LeafDrupal\field\Tests\FieldAccessTest2100
LeafDrupal\field\Tests\FieldAttachOtherTest7800
LeafDrupal\field\Tests\FieldAttachStorageTest12700
LeafDrupal\field\Tests\FieldImportChangeTest600
LeafDrupal\field\Tests\FieldImportCreateTest3300
LeafDrupal\field\Tests\FieldImportDeleteTest1800
LeafDrupal\field\Tests\FieldInfoTest9800
LeafDrupal\field\Tests\FieldInstanceCrudTest3600
LeafDrupal\field\Tests\FieldValidationTest1300
LeafDrupal\field\Tests\FormTest23700
LeafDrupal\field\Tests\NestedFormTest7200
LeafDrupal\field\Tests\ShapeItemTest1400
LeafDrupal\field\Tests\TestItemTest1000
LeafDrupal\field\Tests\TranslationTest4000
LeafDrupal\field\Tests\TranslationWebTest2300
LeafDrupal\field\Tests\Views\ApiDataTest1500
LeafDrupal\field\Tests\Views\FieldUITest2800
LeafDrupal\field\Tests\Views\HandlerFieldFieldTest2400
LeafDrupal\field_sql_storage\Tests\FieldSqlStorageTest13300
LeafDrupal\field_ui\Tests\FieldUIRouteTest1300
LeafDrupal\field_ui\Tests\ManageDisplayTest14900
LeafDrupal\field_ui\Tests\ManageFieldsTest41900
LeafDrupal\file\Tests\CopyTest11000
LeafDrupal\file\Tests\DeleteTest2400
LeafDrupal\file\Tests\DownloadTest4500
LeafDrupal\file\Tests\FileFieldDisplayTest5400
LeafDrupal\file\Tests\FileFieldPathTest2800
LeafDrupal\file\Tests\FileFieldRevisionTest6800
LeafDrupal\file\Tests\FileFieldRSSContentTest2400
LeafDrupal\file\Tests\FileFieldValidateTest12100
LeafDrupal\file\Tests\FileFieldWidgetTest34600
LeafDrupal\file\Tests\FileItemTest1600
LeafDrupal\file\Tests\FileManagedFileElementTest54200
LeafDrupal\file\Tests\FilePrivateTest3800
LeafDrupal\file\Tests\FileTokenReplaceTest3600
LeafDrupal\file\Tests\LoadTest3500
LeafDrupal\file\Tests\MoveTest13600
LeafDrupal\file\Tests\RemoteFileSaveUploadTest27000
LeafDrupal\file\Tests\SaveDataTest12600
LeafDrupal\file\Tests\SaveTest1600
LeafDrupal\file\Tests\SaveUploadTest39500
LeafDrupal\file\Tests\SpaceUsedTest1200
LeafDrupal\file\Tests\UsageTest5900
LeafDrupal\file\Tests\ValidateTest1200
LeafDrupal\file\Tests\ValidatorTest5800
LeafDrupal\file\Tests\Views\ExtensionViewsFieldTest1200
LeafDrupal\filter\Tests\FilterAdminTest19800
LeafDrupal\filter\Tests\FilterAPITest1500
LeafDrupal\filter\Tests\FilterCrudTest13800
LeafDrupal\filter\Tests\FilterDefaultConfigTest3000
LeafDrupal\filter\Tests\FilterDefaultFormatTest3300
LeafDrupal\filter\Tests\FilterFormatAccessTest28400
LeafDrupal\filter\Tests\FilterHooksTest3300
LeafDrupal\filter\Tests\FilterHtmlImageSecureTest4600
LeafDrupal\filter\Tests\FilterNoFormatTest100
LeafDrupal\filter\Tests\FilterSecurityTest4000
LeafDrupal\filter\Tests\FilterSettingsTest1300
LeafDrupal\filter\Tests\FilterUnitTest17800
LeafDrupal\forum\Tests\ForumBlockTest12200
LeafDrupal\forum\Tests\ForumIndexTest2700
LeafDrupal\forum\Tests\ForumNodeAccessTest5100
LeafDrupal\forum\Tests\ForumTest65000
LeafDrupal\forum\Tests\ForumUninstallTest600
LeafDrupal\forum\Tests\Views\ForumIntegrationTest200
LeafDrupal\hal\Tests\DenormalizeTest2700
LeafDrupal\hal\Tests\NormalizeTest1300
LeafDrupal\help\Tests\HelpTest30500
LeafDrupal\help\Tests\NoHelpTest1200
LeafDrupal\history\Tests\Views\HistoryTimestampTest1200
LeafDrupal\image\Tests\FileMoveTest400
LeafDrupal\image\Tests\ImageAdminStylesTest22500
LeafDrupal\image\Tests\ImageDimensionsTest5600
LeafDrupal\image\Tests\ImageEffectsTest4300
LeafDrupal\image\Tests\ImageFieldDefaultImagesTest4000
LeafDrupal\image\Tests\ImageFieldDisplayTest15900
LeafDrupal\image\Tests\ImageFieldValidateTest3800
LeafDrupal\image\Tests\ImageItemTest2000
LeafDrupal\image\Tests\ImageStyleFlushTest4100
LeafDrupal\image\Tests\ImageStylesPathAndUrlTest13900
LeafDrupal\image\Tests\ImageThemeFunctionTest500
LeafDrupal\language\Tests\Condition\LanguageConditionTest1500
ExpandDrupal\language\Tests\LanguageBrowserDetectionUnitTest10160
MessageGroupFilenameLineFunctionStatus
Language selection 'zh-cn, en-us;q=0.90, en;q=0.80, zh;q=0.70' selects 'zh-hans', result = 'en-US'OtherLanguageBrowserDetectionUnitTest.php162Drupal\language\Tests\LanguageBrowserDetectionUnitTest->testLanguageFromBrowser()
Language selection 'zh-tw, en-us;q=0.90, en;q=0.80, zh;q=0.70' selects 'zh-hant', result = 'en-US'OtherLanguageBrowserDetectionUnitTest.php162Drupal\language\Tests\LanguageBrowserDetectionUnitTest->testLanguageFromBrowser()
Language selection 'zh-tw' selects 'zh-hant', result = 'zh-hans'OtherLanguageBrowserDetectionUnitTest.php162Drupal\language\Tests\LanguageBrowserDetectionUnitTest->testLanguageFromBrowser()
Language selection 'zh-hk' selects 'zh-hant', result = 'zh-hans'OtherLanguageBrowserDetectionUnitTest.php162Drupal\language\Tests\LanguageBrowserDetectionUnitTest->testLanguageFromBrowser()
Language selection 'zh-mo' selects 'zh-hant', result = 'zh-hans'OtherLanguageBrowserDetectionUnitTest.php162Drupal\language\Tests\LanguageBrowserDetectionUnitTest->testLanguageFromBrowser()
Language selection 'zh-cht' selects 'zh-hant', result = 'zh-hans'OtherLanguageBrowserDetectionUnitTest.php162Drupal\language\Tests\LanguageBrowserDetectionUnitTest->testLanguageFromBrowser()
LeafDrupal\language\Tests\LanguageConfigurationElementTest5400
ExpandDrupal\language\Tests\LanguageConfigurationTest7320
MessageGroupFilenameLineFunctionStatus
System language Not specified has higher weight than configurable languages after re-orderingOtherLanguageConfigurationTest.php151Drupal\language\Tests\LanguageConfigurationTest->checkConfigurableLanguageWeight()
System language Not specified has higher weight than configurable languages after deleting a languageOtherLanguageConfigurationTest.php151Drupal\language\Tests\LanguageConfigurationTest->checkConfigurableLanguageWeight()
LeafDrupal\language\Tests\LanguageCustomLanguageConfigurationTest3600
LeafDrupal\language\Tests\LanguageDependencyInjectionTest1700
ExpandDrupal\language\Tests\LanguageListTest9930
MessageGroupFilenameLineFunctionStatus
Correct page redirection.OtherLanguageListTest.php79Drupal\language\Tests\LanguageListTest->testLanguageList()
Correct page redirection.OtherLanguageListTest.php92Drupal\language\Tests\LanguageListTest->testLanguageList()
Language count is correct.OtherLanguageListTest.php122Drupal\language\Tests\LanguageListTest->testLanguageList()
ExpandDrupal\language\Tests\LanguageNegotiationInfoTest41110
MessageGroupFilenameLineFunctionStatus
Failed to set field language_content[enabled][language-interface] to 1OtherLanguageNegotiationInfoTest.php73Drupal\language\Tests\LanguageNegotiationInfoTest->testInfoAlterations()
Failed to set field language_content[enabled][test_language_negotiation_method] to 1OtherLanguageNegotiationInfoTest.php73Drupal\language\Tests\LanguageNegotiationInfoTest->testInfoAlterations()
Failed to set field test_language_type[enabled][test_language_negotiation_method] to 1OtherLanguageNegotiationInfoTest.php73Drupal\language\Tests\LanguageNegotiationInfoTest->testInfoAlterations()
Found the Save settings buttonOtherLanguageNegotiationInfoTest.php73Drupal\language\Tests\LanguageNegotiationInfoTest->testInfoAlterations()
Found the requested form fields at admin/config/regional/language/detectionOtherLanguageNegotiationInfoTest.php73Drupal\language\Tests\LanguageNegotiationInfoTest->testInfoAlterations()
Type-specific test language negotiation method available for test_language_type.OtherLanguageNegotiationInfoTest.php88Drupal\language\Tests\LanguageNegotiationInfoTest->testInfoAlterations()
The negotiated language for language_interface is OtherLanguageNegotiationInfoTest.php101Drupal\language\Tests\LanguageNegotiationInfoTest->testInfoAlterations()
The negotiated language for language_content is OtherLanguageNegotiationInfoTest.php101Drupal\language\Tests\LanguageNegotiationInfoTest->testInfoAlterations()
The negotiated language for language_url is OtherLanguageNegotiationInfoTest.php101Drupal\language\Tests\LanguageNegotiationInfoTest->testInfoAlterations()
The negotiated language for test_language_type is OtherLanguageNegotiationInfoTest.php101Drupal\language\Tests\LanguageNegotiationInfoTest->testInfoAlterations()
The negotiated language for fixed_test_language_type is OtherLanguageNegotiationInfoTest.php101Drupal\language\Tests\LanguageNegotiationInfoTest->testInfoAlterations()
LeafDrupal\language\Tests\LanguagePathMonolingualTest3500
ExpandDrupal\language\Tests\LanguageSwitchingTest4720
MessageGroupFilenameLineFunctionStatus
A link generated by #type link to the current French page with langcode en is NOT marked active.OtherLanguageSwitchingTest.php140Drupal\language\Tests\LanguageSwitchingTest->testLanguageLinkActiveClass()
A link generated by #type link to the current French page with langcode fr is marked active.OtherLanguageSwitchingTest.php145Drupal\language\Tests\LanguageSwitchingTest->testLanguageLinkActiveClass()
ExpandDrupal\language\Tests\LanguageUILanguageNegotiationTest126192
MessageGroupFilenameLineFunctionStatus
SELECTED: UI language is switched based on selected language.OtherLanguageUILanguageNegotiationTest.php379Drupal\language\Tests\LanguageUILanguageNegotiationTest->runTest()
"Language negotiation method: language-selected" foundOtherLanguageUILanguageNegotiationTest.php380Drupal\language\Tests\LanguageUILanguageNegotiationTest->runTest()
"Language negotiation method: language-selected" foundOtherLanguageUILanguageNegotiationTest.php380Drupal\language\Tests\LanguageUILanguageNegotiationTest->runTest()
"Language negotiation method: language-selected" foundOtherLanguageUILanguageNegotiationTest.php380Drupal\language\Tests\LanguageUILanguageNegotiationTest->runTest()
"Language negotiation method: language-selected" foundOtherLanguageUILanguageNegotiationTest.php380Drupal\language\Tests\LanguageUILanguageNegotiationTest->runTest()
URL (PATH) > DEFAULT: with language prefix, UI language is switched based on path prefixOtherLanguageUILanguageNegotiationTest.php379Drupal\language\Tests\LanguageUILanguageNegotiationTest->runTest()
"Language negotiation method: language-url" foundOtherLanguageUILanguageNegotiationTest.php380Drupal\language\Tests\LanguageUILanguageNegotiationTest->runTest()
URL (PATH) > BROWSER: with langage prefix, UI language is based on path prefixOtherLanguageUILanguageNegotiationTest.php379Drupal\language\Tests\LanguageUILanguageNegotiationTest->runTest()
"Language negotiation method: language-url" foundOtherLanguageUILanguageNegotiationTest.php380Drupal\language\Tests\LanguageUILanguageNegotiationTest->runTest()
"Language negotiation method: language-selected" foundOtherLanguageUILanguageNegotiationTest.php380Drupal\language\Tests\LanguageUILanguageNegotiationTest->runTest()
"Language negotiation method: language-selected" foundOtherLanguageUILanguageNegotiationTest.php380Drupal\language\Tests\LanguageUILanguageNegotiationTest->runTest()
"Language negotiation method: language-selected" foundOtherLanguageUILanguageNegotiationTest.php380Drupal\language\Tests\LanguageUILanguageNegotiationTest->runTest()
"Language negotiation method: language-selected" foundOtherLanguageUILanguageNegotiationTest.php380Drupal\language\Tests\LanguageUILanguageNegotiationTest->runTest()
"Language negotiation method: language-selected" foundOtherLanguageUILanguageNegotiationTest.php380Drupal\language\Tests\LanguageUILanguageNegotiationTest->runTest()
"Language negotiation method: language-selected" foundOtherLanguageUILanguageNegotiationTest.php380Drupal\language\Tests\LanguageUILanguageNegotiationTest->runTest()
URL (DOMAIN) > DEFAULT: domain example.cn should switch to ChineseOtherLanguageUILanguageNegotiationTest.php379Drupal\language\Tests\LanguageUILanguageNegotiationTest->runTest()
"Language negotiation method: language-url" foundOtherLanguageUILanguageNegotiationTest.php380Drupal\language\Tests\LanguageUILanguageNegotiationTest->runTest()
Undefined offset: 0Drupal\language\Tests\LanguageUILanguageNegotiationTest->testUrlLanguageFallback() Drupal\simpletest\TestBase->run() simpletest_script_run_one_test('392', 'Drupal\language\Tests\LanguageUILanguageNegotiationTest') NoticeLanguageUILanguageNegotiationTest.php423Drupal\language\Tests\LanguageUILanguageNegotiationTest->testUrlLanguageFallback()
The browser language is the URL active languageOtherLanguageUILanguageNegotiationTest.php423Drupal\language\Tests\LanguageUILanguageNegotiationTest->testUrlLanguageFallback()
Undefined offset: 0Drupal\language\Tests\LanguageUILanguageNegotiationTest->testUrlLanguageFallback() Drupal\simpletest\TestBase->run() simpletest_script_run_one_test('392', 'Drupal\language\Tests\LanguageUILanguageNegotiationTest') NoticeLanguageUILanguageNegotiationTest.php427Drupal\language\Tests\LanguageUILanguageNegotiationTest->testUrlLanguageFallback()
URLs are rewritten using the browser language.OtherLanguageUILanguageNegotiationTest.php427Drupal\language\Tests\LanguageUILanguageNegotiationTest->testUrlLanguageFallback()
LeafDrupal\language\Tests\LanguageUrlRewritingTest4700
LeafDrupal\language\Tests\Views\ArgumentLanguageTest800
LeafDrupal\language\Tests\Views\FieldLanguageTest800
LeafDrupal\language\Tests\Views\FilterLanguageTest800
LeafDrupal\layout\Tests\DisplayInternalLogicTest1100
LeafDrupal\layout\Tests\LayoutDerivativesTest2400
LeafDrupal\link\Tests\LinkFieldTest14400
LeafDrupal\link\Tests\LinkFieldUITest2100
LeafDrupal\link\Tests\LinkItemTest1700
ExpandDrupal\locale\Tests\LocaleConfigTranslationTest13310
MessageGroupFilenameLineFunctionStatus
The translated site name is displayed after translations refreshed.OtherLocaleConfigTranslationTest.php91Drupal\locale\Tests\LocaleConfigTranslationTest->testConfigTranslation()
ExpandDrupal\locale\Tests\LocaleContentTest47703
MessageGroupFilenameLineFunctionStatus
Drupal\Core\Entity\EntityStorageException: There are no fields available to insert with. in Drupal\Core\Entity\DatabaseStorageControllerNG->save() (line 400 of /var/lib/drupaltestbot/sites/default/files/checkout/core/lib/Drupal/Core/Entity/DatabaseStorageControllerNG.php). Drupal\Core\Entity\DatabaseStorageControllerNG->save(Object) Drupal\Core\Entity\Entity->save() Drupal\Core\Entity\EntityBCDecorator->save() Drupal\simpletest\WebTestBase->drupalCreateNode(Array) Drupal\locale\Tests\LocaleContentTest->testContentTypeLanguageConfiguration() Drupal\simpletest\TestBase->run() simpletest_script_run_one_test('396', 'Drupal\locale\Tests\LocaleContentTest') Uncaught exceptionDatabaseStorageControllerNG.php400Drupal\Core\Entity\DatabaseStorageControllerNG->save()
Drupal\Core\Entity\EntityStorageException: There are no fields available to insert with. in Drupal\Core\Entity\DatabaseStorageControllerNG->save() (line 400 of /var/lib/drupaltestbot/sites/default/files/checkout/core/lib/Drupal/Core/Entity/DatabaseStorageControllerNG.php). Drupal\Core\Entity\DatabaseStorageControllerNG->save(Object) Drupal\Core\Entity\Entity->save() Drupal\Core\Entity\EntityBCDecorator->save() Drupal\simpletest\WebTestBase->drupalCreateNode(Array) Drupal\locale\Tests\LocaleContentTest->testContentTypeDirLang() Drupal\simpletest\TestBase->run() simpletest_script_run_one_test('396', 'Drupal\locale\Tests\LocaleContentTest') Uncaught exceptionDatabaseStorageControllerNG.php400Drupal\Core\Entity\DatabaseStorageControllerNG->save()
Drupal\Core\Entity\EntityStorageException: There are no fields available to insert with. in Drupal\Core\Entity\DatabaseStorageControllerNG->save() (line 400 of /var/lib/drupaltestbot/sites/default/files/checkout/core/lib/Drupal/Core/Entity/DatabaseStorageControllerNG.php). Drupal\Core\Entity\DatabaseStorageControllerNG->save(Object) Drupal\Core\Entity\Entity->save() Drupal\Core\Entity\EntityBCDecorator->save() Drupal\simpletest\WebTestBase->drupalCreateNode(Array) Drupal\locale\Tests\LocaleContentTest->testNodeAdminLanguageFilter() Drupal\simpletest\TestBase->run() simpletest_script_run_one_test('396', 'Drupal\locale\Tests\LocaleContentTest') Uncaught exceptionDatabaseStorageControllerNG.php400Drupal\Core\Entity\DatabaseStorageControllerNG->save()
LeafDrupal\locale\Tests\LocaleExportTest5700
LeafDrupal\locale\Tests\LocaleImportFunctionalTest26900
LeafDrupal\locale\Tests\LocaleJavascriptTranslation6600
LeafDrupal\locale\Tests\LocaleLibraryInfoAlterTest200
ExpandDrupal\locale\Tests\LocalePathTest11920
MessageGroupFilenameLineFunctionStatus
Custom language alias works.OtherLocalePathTest.php102Drupal\locale\Tests\LocalePathTest->testPathLanguageConfiguration()
Custom alias with prefix returns second node.OtherLocalePathTest.php155Drupal\locale\Tests\LocalePathTest->testPathLanguageConfiguration()
LeafDrupal\locale\Tests\LocalePluralFormatTest16000
LeafDrupal\locale\Tests\LocaleStringTest2600
LeafDrupal\locale\Tests\LocaleTranslationTest100
ExpandDrupal\locale\Tests\LocaleTranslationUiTest682422
MessageGroupFilenameLineFunctionStatus
Undefined index: xx_locale_rebuild_js('xx') Drupal\locale\Tests\LocaleTranslationUiTest->testJavaScriptTranslation() Drupal\simpletest\TestBase->run() simpletest_script_run_one_test('404', 'Drupal\locale\Tests\LocaleTranslationUiTest') Noticelocale.module1177_locale_rebuild_js()
Trying to get property of non-object_locale_rebuild_js('xx') Drupal\locale\Tests\LocaleTranslationUiTest->testJavaScriptTranslation() Drupal\simpletest\TestBase->run() simpletest_script_run_one_test('404', 'Drupal\locale\Tests\LocaleTranslationUiTest') Noticelocale.module1184_locale_rebuild_js()
Trying to get property of non-object_locale_rebuild_js('xx') Drupal\locale\Tests\LocaleTranslationUiTest->testJavaScriptTranslation() Drupal\simpletest\TestBase->run() simpletest_script_run_one_test('404', 'Drupal\locale\Tests\LocaleTranslationUiTest') Noticelocale.module1213_locale_rebuild_js()
Trying to get property of non-object_locale_rebuild_js('xx') Drupal\locale\Tests\LocaleTranslationUiTest->testJavaScriptTranslation() Drupal\simpletest\TestBase->run() simpletest_script_run_one_test('404', 'Drupal\locale\Tests\LocaleTranslationUiTest') Noticelocale.module1214_locale_rebuild_js()
Trying to get property of non-object_locale_rebuild_js('xx') Drupal\locale\Tests\LocaleTranslationUiTest->testJavaScriptTranslation() Drupal\simpletest\TestBase->run() simpletest_script_run_one_test('404', 'Drupal\locale\Tests\LocaleTranslationUiTest') Noticelocale.module1222_locale_rebuild_js()
Undefined index: xxDrupal\locale\Tests\LocaleTranslationUiTest->testJavaScriptTranslation() Drupal\simpletest\TestBase->run() simpletest_script_run_one_test('404', 'Drupal\locale\Tests\LocaleTranslationUiTest') NoticeLocaleTranslationUiTest.php263Drupal\locale\Tests\LocaleTranslationUiTest->testJavaScriptTranslation()
JavaScript file created: not foundOtherLocaleTranslationUiTest.php264Drupal\locale\Tests\LocaleTranslationUiTest->testJavaScriptTranslation()
Undefined index: xx_locale_rebuild_js('xx') Drupal\locale\Tests\LocaleTranslationUiTest->testJavaScriptTranslation() Drupal\simpletest\TestBase->run() simpletest_script_run_one_test('404', 'Drupal\locale\Tests\LocaleTranslationUiTest') Noticelocale.module1177_locale_rebuild_js()
Trying to get property of non-object_locale_rebuild_js('xx') Drupal\locale\Tests\LocaleTranslationUiTest->testJavaScriptTranslation() Drupal\simpletest\TestBase->run() simpletest_script_run_one_test('404', 'Drupal\locale\Tests\LocaleTranslationUiTest') Noticelocale.module1184_locale_rebuild_js()
Trying to get property of non-object_locale_rebuild_js('xx') Drupal\locale\Tests\LocaleTranslationUiTest->testJavaScriptTranslation() Drupal\simpletest\TestBase->run() simpletest_script_run_one_test('404', 'Drupal\locale\Tests\LocaleTranslationUiTest') Noticelocale.module1213_locale_rebuild_js()
Trying to get property of non-object_locale_rebuild_js('xx') Drupal\locale\Tests\LocaleTranslationUiTest->testJavaScriptTranslation() Drupal\simpletest\TestBase->run() simpletest_script_run_one_test('404', 'Drupal\locale\Tests\LocaleTranslationUiTest') Noticelocale.module1214_locale_rebuild_js()
Trying to get property of non-object_locale_rebuild_js('xx') Drupal\locale\Tests\LocaleTranslationUiTest->testJavaScriptTranslation() Drupal\simpletest\TestBase->run() simpletest_script_run_one_test('404', 'Drupal\locale\Tests\LocaleTranslationUiTest') Noticelocale.module1222_locale_rebuild_js()
JavaScript file rebuilt: not foundOtherLocaleTranslationUiTest.php271Drupal\locale\Tests\LocaleTranslationUiTest->testJavaScriptTranslation()
Undefined index: xx_locale_rebuild_js('xx') Drupal\locale\Tests\LocaleTranslationUiTest->testJavaScriptTranslation() Drupal\simpletest\TestBase->run() simpletest_script_run_one_test('404', 'Drupal\locale\Tests\LocaleTranslationUiTest') Noticelocale.module1177_locale_rebuild_js()
Trying to get property of non-object_locale_rebuild_js('xx') Drupal\locale\Tests\LocaleTranslationUiTest->testJavaScriptTranslation() Drupal\simpletest\TestBase->run() simpletest_script_run_one_test('404', 'Drupal\locale\Tests\LocaleTranslationUiTest') Noticelocale.module1184_locale_rebuild_js()
Trying to get property of non-object_locale_rebuild_js('xx') Drupal\locale\Tests\LocaleTranslationUiTest->testJavaScriptTranslation() Drupal\simpletest\TestBase->run() simpletest_script_run_one_test('404', 'Drupal\locale\Tests\LocaleTranslationUiTest') Noticelocale.module1213_locale_rebuild_js()
Trying to get property of non-object_locale_rebuild_js('xx') Drupal\locale\Tests\LocaleTranslationUiTest->testJavaScriptTranslation() Drupal\simpletest\TestBase->run() simpletest_script_run_one_test('404', 'Drupal\locale\Tests\LocaleTranslationUiTest') Noticelocale.module1214_locale_rebuild_js()
Trying to get property of non-object_locale_rebuild_js('xx') Drupal\locale\Tests\LocaleTranslationUiTest->testJavaScriptTranslation() Drupal\simpletest\TestBase->run() simpletest_script_run_one_test('404', 'Drupal\locale\Tests\LocaleTranslationUiTest') Noticelocale.module1222_locale_rebuild_js()
Undefined index: xxDrupal\locale\Tests\LocaleTranslationUiTest->testJavaScriptTranslation() Drupal\simpletest\TestBase->run() simpletest_script_run_one_test('404', 'Drupal\locale\Tests\LocaleTranslationUiTest') NoticeLocaleTranslationUiTest.php263Drupal\locale\Tests\LocaleTranslationUiTest->testJavaScriptTranslation()
JavaScript file created: not foundOtherLocaleTranslationUiTest.php264Drupal\locale\Tests\LocaleTranslationUiTest->testJavaScriptTranslation()
Undefined index: xx_locale_rebuild_js('xx') Drupal\locale\Tests\LocaleTranslationUiTest->testJavaScriptTranslation() Drupal\simpletest\TestBase->run() simpletest_script_run_one_test('404', 'Drupal\locale\Tests\LocaleTranslationUiTest') Noticelocale.module1177_locale_rebuild_js()
Trying to get property of non-object_locale_rebuild_js('xx') Drupal\locale\Tests\LocaleTranslationUiTest->testJavaScriptTranslation() Drupal\simpletest\TestBase->run() simpletest_script_run_one_test('404', 'Drupal\locale\Tests\LocaleTranslationUiTest') Noticelocale.module1184_locale_rebuild_js()
Trying to get property of non-object_locale_rebuild_js('xx') Drupal\locale\Tests\LocaleTranslationUiTest->testJavaScriptTranslation() Drupal\simpletest\TestBase->run() simpletest_script_run_one_test('404', 'Drupal\locale\Tests\LocaleTranslationUiTest') Noticelocale.module1213_locale_rebuild_js()
Trying to get property of non-object_locale_rebuild_js('xx') Drupal\locale\Tests\LocaleTranslationUiTest->testJavaScriptTranslation() Drupal\simpletest\TestBase->run() simpletest_script_run_one_test('404', 'Drupal\locale\Tests\LocaleTranslationUiTest') Noticelocale.module1214_locale_rebuild_js()
Trying to get property of non-object_locale_rebuild_js('xx') Drupal\locale\Tests\LocaleTranslationUiTest->testJavaScriptTranslation() Drupal\simpletest\TestBase->run() simpletest_script_run_one_test('404', 'Drupal\locale\Tests\LocaleTranslationUiTest') Noticelocale.module1222_locale_rebuild_js()
JavaScript file rebuilt: not foundOtherLocaleTranslationUiTest.php271Drupal\locale\Tests\LocaleTranslationUiTest->testJavaScriptTranslation()
LeafDrupal\locale\Tests\LocaleUninstallFrenchTest3400
LeafDrupal\locale\Tests\LocaleUninstallTest3400
LeafDrupal\locale\Tests\LocaleUpdateInterfaceTest10800
LeafDrupal\locale\Tests\LocaleUpdateTest133000
LeafDrupal\menu\Tests\MenuLanguageTest5800
LeafDrupal\menu\Tests\MenuNodeTest10700
LeafDrupal\menu\Tests\MenuTest190300
LeafDrupal\minimal\Tests\MinimalTest1600
LeafDrupal\node\Tests\Condition\NodeConditionTest1500
LeafDrupal\node\Tests\MultiStepNodeFormBasicOptionsTest1700
LeafDrupal\node\Tests\NodeAccessBaseTableTest15900
LeafDrupal\node\Tests\NodeAccessFieldTest5000
LeafDrupal\node\Tests\NodeAccessLanguageAwareCombinationTest14200
LeafDrupal\node\Tests\NodeAccessLanguageAwareTest9100
LeafDrupal\node\Tests\NodeAccessLanguageTest9800
LeafDrupal\node\Tests\NodeAccessPagerTest3000
LeafDrupal\node\Tests\NodeAccessRebuildTest1900
LeafDrupal\node\Tests\NodeAccessRecordsTest2600
LeafDrupal\node\Tests\NodeAccessTest3400
LeafDrupal\node\Tests\NodeAdminTest15200
LeafDrupal\node\Tests\NodeBlockFunctionalTest6300
LeafDrupal\node\Tests\NodeBuildContentTest400
LeafDrupal\node\Tests\NodeCreationTest4900
LeafDrupal\node\Tests\NodeEntityFieldQueryAlterTest3200
LeafDrupal\node\Tests\NodeEntityViewModeAlterTest2000
LeafDrupal\node\Tests\NodeFieldMultilingualTestCase6400
LeafDrupal\node\Tests\NodeFormButtonsTest12500
LeafDrupal\node\Tests\NodeLoadHooksTest700
LeafDrupal\node\Tests\NodeLoadMultipleTest2700
LeafDrupal\node\Tests\NodePostSettingsTest4000
LeafDrupal\node\Tests\NodeQueryAlterTest9900
LeafDrupal\node\Tests\NodeRevisionPermissionsTest4600
LeafDrupal\node\Tests\NodeRevisionsAllTestCase4900
LeafDrupal\node\Tests\NodeRevisionsTest6400
LeafDrupal\node\Tests\NodeRSSContentTest1900
LeafDrupal\node\Tests\NodeSaveTest6000
LeafDrupal\node\Tests\NodeSyndicateBlockTest1400
LeafDrupal\node\Tests\NodeTitleTest2300
LeafDrupal\node\Tests\NodeTitleXSSTest2300
LeafDrupal\node\Tests\NodeTokenReplaceTest4000
LeafDrupal\node\Tests\NodeTranslationUITest20700
LeafDrupal\node\Tests\NodeTypeInitialLanguageTest8000
LeafDrupal\node\Tests\NodeTypePersistenceTest6500
LeafDrupal\node\Tests\NodeTypeTest13000
LeafDrupal\node\Tests\PageEditTest9700
LeafDrupal\node\Tests\PagePreviewTest8300
LeafDrupal\node\Tests\PageViewTest3400
LeafDrupal\node\Tests\SummaryLengthTest1200
LeafDrupal\node\Tests\Views\BulkFormTest1600
LeafDrupal\node\Tests\Views\FieldTypeTest200
LeafDrupal\node\Tests\Views\FilterUidRevisionTest400
LeafDrupal\node\Tests\Views\FrontPageTest600
LeafDrupal\node\Tests\Views\NodeIntegrationTest1600
LeafDrupal\node\Tests\Views\RevisionRelationships300
LeafDrupal\node\Tests\Views\RowPluginTest3600
LeafDrupal\node\Tests\Views\StatusExtraTest6800
LeafDrupal\number\Tests\NumberFieldTest8800
LeafDrupal\number\Tests\NumberItemTest2200
LeafDrupal\options\Tests\OptionsDynamicValuesValidationTest900
LeafDrupal\options\Tests\OptionsFieldTest2000
LeafDrupal\options\Tests\OptionsFieldUITest25500
LeafDrupal\options\Tests\OptionsFormattersTest900
LeafDrupal\options\Tests\OptionsSelectDynamicValuesTest1600
LeafDrupal\options\Tests\OptionsWidgetsTest26100
LeafDrupal\overlay\Tests\OverlayCloseTest1800
LeafDrupal\path\Tests\PathAliasTest14000
ExpandDrupal\path\Tests\PathLanguageTest13520
MessageGroupFilenameLineFunctionStatus
Alias for French translation works.OtherPathLanguageTest.php95Drupal\path\Tests\PathLanguageTest->testAliasTranslation()
Alias for French translation works.OtherPathLanguageTest.php133Drupal\path\Tests\PathLanguageTest->testAliasTranslation()
ExpandDrupal\path\Tests\PathLanguageUiTest28320
MessageGroupFilenameLineFunctionStatus
Foreign URL alias worksOtherPathLanguageUiTest.php89Drupal\path\Tests\PathLanguageUiTest->testNonDefaultUrl()
Foreign URL alias worksOtherPathLanguageUiTest.php89Drupal\path\Tests\PathLanguageUiTest->testNonDefaultUrl()
LeafDrupal\path\Tests\PathTaxonomyTermTest3700
LeafDrupal\php\Tests\Condition\PhpConditionTest600
LeafDrupal\php\Tests\PhpAccessTest3800
LeafDrupal\php\Tests\PhpFilterTest4200
LeafDrupal\picture\Tests\PictureAdminUITest5400
LeafDrupal\picture\Tests\PictureFieldDisplayTest11500
LeafDrupal\rdf\Tests\CommentAttributesTest11800
LeafDrupal\rdf\Tests\CrudTest800
LeafDrupal\rdf\Tests\FileFieldAttributesTest1800
LeafDrupal\rdf\Tests\GetNamespacesTest700
LeafDrupal\rdf\Tests\GetRdfNamespacesTest500
LeafDrupal\rdf\Tests\ImageFieldAttributesTest1700
LeafDrupal\rdf\Tests\NodeAttributesTest1000
LeafDrupal\rdf\Tests\RdfaAttributesTest800
LeafDrupal\rdf\Tests\RdfMappingUpgradePathTest3900
LeafDrupal\rdf\Tests\TaxonomyAttributesTest700
LeafDrupal\rdf\Tests\TaxonomyTermFieldAttributesTest1600
LeafDrupal\rdf\Tests\TrackerAttributesTest3000
LeafDrupal\rdf\Tests\UserAttributesTest4000
LeafDrupal\rest\Tests\CreateTest4400
LeafDrupal\rest\Tests\DBLogTest1800
LeafDrupal\rest\Tests\DeleteTest3700
LeafDrupal\rest\Tests\ReadTest3900
LeafDrupal\rest\Tests\UpdateTest4500
LeafDrupal\rest\Tests\Views\StyleSerializerTest11400
LeafDrupal\search\Tests\SearchAdvancedSearchFormTest6800
LeafDrupal\search\Tests\SearchBlockTest7600
LeafDrupal\search\Tests\SearchCommentCountToggleTest3100
LeafDrupal\search\Tests\SearchCommentTest19300
LeafDrupal\search\Tests\SearchConfigSettingsFormTest16700
LeafDrupal\search\Tests\SearchEmbedFormTest3500
LeafDrupal\search\Tests\SearchExactTest2500
LeafDrupal\search\Tests\SearchExcerptTest1800
LeafDrupal\search\Tests\SearchKeywordsConditionsTest2800
LeafDrupal\search\Tests\SearchLanguageTest4300
LeafDrupal\search\Tests\SearchMatchTest14700
LeafDrupal\search\Tests\SearchMultilingualEntityTest1000
LeafDrupal\search\Tests\SearchNodeAccessTest1600
LeafDrupal\search\Tests\SearchNumberMatchingTest29500
LeafDrupal\search\Tests\SearchNumbersTest17500
LeafDrupal\search\Tests\SearchPageOverrideTest1500
LeafDrupal\search\Tests\SearchPageTextTest3700
LeafDrupal\search\Tests\SearchPreprocessLangcodeTest3900
LeafDrupal\search\Tests\SearchRankingTest5900
LeafDrupal\search\Tests\SearchSimplifyTest65700
LeafDrupal\search\Tests\SearchTokenizerTest800
LeafDrupal\serialization\Tests\EntityResolverTest500
LeafDrupal\serialization\Tests\EntitySerializationTest2600
LeafDrupal\serialization\Tests\SerializationTest200
LeafDrupal\shortcut\Tests\ShortcutLinksTest15000
LeafDrupal\shortcut\Tests\ShortcutSetsTest21900
LeafDrupal\simpletest\Tests\BrokenSetUpTest2100
LeafDrupal\simpletest\Tests\BrowserTest1600
LeafDrupal\simpletest\Tests\DrupalUnitTestBaseTest6800
LeafDrupal\simpletest\Tests\FolderTest200
LeafDrupal\simpletest\Tests\InstallationProfileModuleTestsTest1900
LeafDrupal\simpletest\Tests\MailCaptureTest1200
LeafDrupal\simpletest\Tests\MissingCheckedRequirementsTest1900
LeafDrupal\simpletest\Tests\OtherInstallationProfileModuleTestsTest1200
LeafDrupal\simpletest\Tests\PhpUnitAutoloaderTest100
LeafDrupal\simpletest\Tests\PhpUnitErrorTest100
LeafDrupal\simpletest\Tests\SimpleTestTest11500
LeafDrupal\simpletest\Tests\UserHelpersTest4600
LeafDrupal\standard\Tests\StandardTest3400
LeafDrupal\statistics\Tests\StatisticsAdminTest5800
LeafDrupal\statistics\Tests\StatisticsLoggingTest2100
LeafDrupal\statistics\Tests\StatisticsReportsTest1900
LeafDrupal\statistics\Tests\StatisticsTokenReplaceTest3000
LeafDrupal\statistics\Tests\Views\IntegrationTest1600
LeafDrupal\syslog\Tests\SyslogTest1700
LeafDrupal\system\Tests\Action\ActionUnitTest1100
LeafDrupal\system\Tests\Ajax\AjaxCommandsUnitTest4600
LeafDrupal\system\Tests\Ajax\CommandsTest7700
LeafDrupal\system\Tests\Ajax\DialogTest5400
LeafDrupal\system\Tests\Ajax\ElementValidationTest1400
LeafDrupal\system\Tests\Ajax\FormValuesTest2900
LeafDrupal\system\Tests\Ajax\FrameworkTest3800
LeafDrupal\system\Tests\Ajax\MultiFormTest3700
LeafDrupal\system\Tests\Batch\PageTest1600
LeafDrupal\system\Tests\Batch\ProcessingTest16100
LeafDrupal\system\Tests\Bootstrap\GetFilenameUnitTest700
LeafDrupal\system\Tests\Bootstrap\MiscUnitTest400
LeafDrupal\system\Tests\Bootstrap\OverrideServerVariablesUnitTest600
LeafDrupal\system\Tests\Bootstrap\PageCacheTest8700
LeafDrupal\system\Tests\Bootstrap\ResettableStaticUnitTest500
LeafDrupal\system\Tests\Bootstrap\VariableTest900
LeafDrupal\system\Tests\Bundle\BundleTest900
LeafDrupal\system\Tests\Cache\BackendChainUnitTest13700
LeafDrupal\system\Tests\Cache\ClearTest1000
LeafDrupal\system\Tests\Cache\DatabaseBackendUnitTest13700
LeafDrupal\system\Tests\Cache\MemoryBackendUnitTest13700
LeafDrupal\system\Tests\Common\AddFeedTest700
LeafDrupal\system\Tests\Common\AlterTest700
LeafDrupal\system\Tests\Common\CascadingStylesheetsTest2900
LeafDrupal\system\Tests\Common\CascadingStylesheetsUnitTest1200
LeafDrupal\system\Tests\Common\FormatDateTest7300
LeafDrupal\system\Tests\Common\HtmlIdentifierUnitTest1100
LeafDrupal\system\Tests\Common\HtmlTagTest200
LeafDrupal\system\Tests\Common\JavaScriptTest9300
LeafDrupal\system\Tests\Common\JsonUnitTest2100
LeafDrupal\system\Tests\Common\ParseInfoFileUnitTest300
LeafDrupal\system\Tests\Common\RegionContentTest1800
LeafDrupal\system\Tests\Common\RenderTest6200
LeafDrupal\system\Tests\Common\SimpleTestErrorCollectorTest1600
LeafDrupal\system\Tests\Common\SizeUnitTest3500
LeafDrupal\system\Tests\Common\SystemListingTest600
LeafDrupal\system\Tests\Common\TableSortExtenderUnitTest600
LeafDrupal\system\Tests\Common\UrlTest5200
LeafDrupal\system\Tests\Common\ValidNumberStepUnitTest2400
LeafDrupal\system\Tests\Common\WriteRecordTest3400
LeafDrupal\system\Tests\Common\XssUnitTest800
LeafDrupal\system\Tests\Condition\ConditionFormTest900
LeafDrupal\system\Tests\Database\AlterTest3400
LeafDrupal\system\Tests\Database\BasicSyntaxTest1400
LeafDrupal\system\Tests\Database\CaseSensitivityTest400
LeafDrupal\system\Tests\Database\ConnectionTest2200
LeafDrupal\system\Tests\Database\ConnectionUnitTest3300
LeafDrupal\system\Tests\Database\DatabaseExceptionWrapperTest100
LeafDrupal\system\Tests\Database\DeleteTruncateTest1100
LeafDrupal\system\Tests\Database\FetchTest3800
LeafDrupal\system\Tests\Database\InsertDefaultsTest1000
LeafDrupal\system\Tests\Database\InsertLobTest700
LeafDrupal\system\Tests\Database\InsertTest2700
LeafDrupal\system\Tests\Database\InvalidDataTest400
LeafDrupal\system\Tests\Database\LoggingTest2400
LeafDrupal\system\Tests\Database\MergeTest5200
LeafDrupal\system\Tests\Database\NextIdTest400
LeafDrupal\system\Tests\Database\QueryTest300
LeafDrupal\system\Tests\Database\RangeQueryTest400
LeafDrupal\system\Tests\Database\RegressionTest1500
LeafDrupal\system\Tests\Database\SchemaTest58800
LeafDrupal\system\Tests\Database\SelectCloneTest400
LeafDrupal\system\Tests\Database\SelectComplexTest9300
LeafDrupal\system\Tests\Database\SelectOrderedTest1700
LeafDrupal\system\Tests\Database\SelectPagerDefaultTest2200
LeafDrupal\system\Tests\Database\SelectSubqueryTest1900
LeafDrupal\system\Tests\Database\SelectTableSortDefaultTest3000
LeafDrupal\system\Tests\Database\SelectTest9000
LeafDrupal\system\Tests\Database\SerializeQueryTest300
LeafDrupal\system\Tests\Database\TaggingTest1600
LeafDrupal\system\Tests\Database\TemporaryQueryTest600
LeafDrupal\system\Tests\Database\TransactionTest5400
LeafDrupal\system\Tests\Database\UpdateComplexTest3500
LeafDrupal\system\Tests\Database\UpdateLobTest700
LeafDrupal\system\Tests\Database\UpdateTest3500
LeafDrupal\system\Tests\Datetime\DateTimePlusIntlTest1400
LeafDrupal\system\Tests\Datetime\DateTimePlusTest5400
LeafDrupal\system\Tests\Datetime\DrupalDateTimeTest1400
LeafDrupal\system\Tests\DrupalKernel\ContentNegotiationTest4000
LeafDrupal\system\Tests\DrupalKernel\DrupalKernelTest900
LeafDrupal\system\Tests\DrupalKernel\ServiceDestructionTest800
LeafDrupal\system\Tests\Entity\ConfigEntityQueryTest12600
LeafDrupal\system\Tests\Entity\EntityAccessTest3800
LeafDrupal\system\Tests\Entity\EntityApiInfoTest600
LeafDrupal\system\Tests\Entity\EntityApiTest4000
LeafDrupal\system\Tests\Entity\EntityBCDecoratorTest1700
LeafDrupal\system\Tests\Entity\EntityCrudHookTest21600
LeafDrupal\system\Tests\Entity\EntityFieldDefaultValueTest1700
LeafDrupal\system\Tests\Entity\EntityFieldTest72300
LeafDrupal\system\Tests\Entity\EntityFormTest8900
LeafDrupal\system\Tests\Entity\EntityLabelTest800
LeafDrupal\system\Tests\Entity\EntityManagerTest1000
LeafDrupal\system\Tests\Entity\EntityOperationsTest1700
LeafDrupal\system\Tests\Entity\EntityQueryAggregateTest4900
LeafDrupal\system\Tests\Entity\EntityQueryRelationshipTest2300
LeafDrupal\system\Tests\Entity\EntityQueryTest9700
LeafDrupal\system\Tests\Entity\EntityRevisionsTest5300
LeafDrupal\system\Tests\Entity\EntityTranslationFormTest3600
LeafDrupal\system\Tests\Entity\EntityTranslationTest15200
LeafDrupal\system\Tests\Entity\EntityUriTest700
LeafDrupal\system\Tests\Entity\EntityUUIDTest8800
LeafDrupal\system\Tests\Entity\EntityValidationTest5600
LeafDrupal\system\Tests\Entity\FieldAccessTest600
LeafDrupal\system\Tests\FileTransfer\FileTransferTest200
LeafDrupal\system\Tests\File\ConfigTest4200
LeafDrupal\system\Tests\File\DirectoryTest5200
LeafDrupal\system\Tests\File\MimeTypeTest8400
LeafDrupal\system\Tests\File\NameMungingTest1100
LeafDrupal\system\Tests\File\ReadOnlyStreamWrapperTest3200
LeafDrupal\system\Tests\File\RemoteFileDirectoryTest3200
LeafDrupal\system\Tests\File\RemoteFileScanDirectoryTest2900
LeafDrupal\system\Tests\File\RemoteFileUnmanagedCopyTest3200
LeafDrupal\system\Tests\File\RemoteFileUnmanagedDeleteRecursiveTest2100
LeafDrupal\system\Tests\File\RemoteFileUnmanagedDeleteTest1000
LeafDrupal\system\Tests\File\RemoteFileUnmanagedMoveTest2300
LeafDrupal\system\Tests\File\RemoteFileUnmanagedSaveDataTest800
LeafDrupal\system\Tests\File\ScanDirectoryTest4700
LeafDrupal\system\Tests\File\StreamWrapperTest2500
LeafDrupal\system\Tests\File\UnmanagedCopyTest4300
LeafDrupal\system\Tests\File\UnmanagedDeleteRecursiveTest1700
LeafDrupal\system\Tests\File\UnmanagedDeleteTest700
LeafDrupal\system\Tests\File\UnmanagedMoveTest2000
LeafDrupal\system\Tests\File\UnmanagedSaveDataTest700
LeafDrupal\system\Tests\File\UrlRewritingTest1400
LeafDrupal\system\Tests\Form\AlterTest400
LeafDrupal\system\Tests\Form\ArbitraryRebuildTest1600
LeafDrupal\system\Tests\Form\CheckboxTest9700
LeafDrupal\system\Tests\Form\ConfirmFormTest2700
LeafDrupal\system\Tests\Form\ElementsLabelsTest2000
LeafDrupal\system\Tests\Form\ElementsTableSelectTest6900
LeafDrupal\system\Tests\Form\ElementsVerticalTabsTest3900
LeafDrupal\system\Tests\Form\ElementTest5700
LeafDrupal\system\Tests\Form\EmailTest1700
LeafDrupal\system\Tests\Form\FileInclusionTest1100
LeafDrupal\system\Tests\Form\FormCacheTest1400
LeafDrupal\system\Tests\Form\FormObjectTest4300
LeafDrupal\system\Tests\Form\FormTest65600
LeafDrupal\system\Tests\Form\HTMLIdTest700
LeafDrupal\system\Tests\Form\LanguageSelectElementTest4400
LeafDrupal\system\Tests\Form\ProgrammaticTest2400
LeafDrupal\system\Tests\Form\RebuildTest5300
LeafDrupal\system\Tests\Form\RedirectTest3100
LeafDrupal\system\Tests\Form\StateValuesCleanAdvancedTest700
LeafDrupal\system\Tests\Form\StateValuesCleanTest1400
LeafDrupal\system\Tests\Form\StorageTest12000
LeafDrupal\system\Tests\Form\SystemConfigFormTest700
LeafDrupal\system\Tests\Form\TriggeringElementTest5000
LeafDrupal\system\Tests\Form\UrlTest1700
LeafDrupal\system\Tests\Form\ValidationTest11200
LeafDrupal\system\Tests\Form\WrapperTest500
LeafDrupal\system\Tests\Image\ToolkitGdTest20500
LeafDrupal\system\Tests\Image\ToolkitTest5300
LeafDrupal\system\Tests\InstallerTest1500
LeafDrupal\system\Tests\Installer\InstallerLanguageTest800
LeafDrupal\system\Tests\Installer\SiteNameTest300
LeafDrupal\system\Tests\KeyValueStore\DatabaseStorageExpirableTest6800
LeafDrupal\system\Tests\KeyValueStore\DatabaseStorageTest3600
LeafDrupal\system\Tests\KeyValueStore\GarbageCollectionTest200
LeafDrupal\system\Tests\KeyValueStore\MemoryStorageTest3600
LeafDrupal\system\Tests\Lock\LockFunctionalTest1800
LeafDrupal\system\Tests\Lock\LockUnitTest1300
LeafDrupal\system\Tests\Mail\HtmlToTextTest8600
LeafDrupal\system\Tests\Mail\MailTest700
LeafDrupal\system\Tests\Mail\WrapMailUnitTest200
LeafDrupal\system\Tests\Menu\BreadcrumbTest41500
LeafDrupal\system\Tests\Menu\LinksTest5000
LeafDrupal\system\Tests\Menu\LocalActionTest900
LeafDrupal\system\Tests\Menu\LocalTasksTest5700
LeafDrupal\system\Tests\Menu\MenuRouterTest24400
LeafDrupal\system\Tests\Menu\MenuTranslateTest2600
LeafDrupal\system\Tests\Menu\RebuildTest1000
LeafDrupal\system\Tests\Menu\TrailTest6800
LeafDrupal\system\Tests\Menu\TreeAccessTest600
LeafDrupal\system\Tests\Menu\TreeDataUnitTest400
LeafDrupal\system\Tests\Menu\TreeOutputTest900
LeafDrupal\system\Tests\Module\ClassLoaderTest1200
LeafDrupal\system\Tests\Module\DependencyTest16200
LeafDrupal\system\Tests\Module\EnableDisableTest228300
LeafDrupal\system\Tests\Module\HookRequirementsTest1600
LeafDrupal\system\Tests\Module\InstallTest300
LeafDrupal\system\Tests\Module\ModuleApiTest6600
LeafDrupal\system\Tests\Module\ModuleEnable500
LeafDrupal\system\Tests\Module\RequiredTest2000
LeafDrupal\system\Tests\Module\UninstallTest200
LeafDrupal\system\Tests\Module\VersionTest5100
LeafDrupal\system\Tests\Pager\PagerTest12300
LeafDrupal\system\Tests\ParamConverter\UpcastingTest1700
LeafDrupal\system\Tests\Path\AliasTest4200
LeafDrupal\system\Tests\Path\MatchPathTest4100
LeafDrupal\system\Tests\Path\UrlAlterFunctionalTest3700
LeafDrupal\system\Tests\Plugin\AlterDecoratorTest300
LeafDrupal\system\Tests\Plugin\CacheDecoratorLanguageTest3800
LeafDrupal\system\Tests\Plugin\CacheDecoratorTest1400
LeafDrupal\system\Tests\Plugin\ContextPluginTest2500
LeafDrupal\system\Tests\Plugin\DerivativeTest1200
LeafDrupal\system\Tests\Plugin\Discovery\AnnotatedClassDiscoveryTest700
LeafDrupal\system\Tests\Plugin\Discovery\CustomAnnotationClassDiscoveryTest500
LeafDrupal\system\Tests\Plugin\Discovery\StaticDiscoveryTest600
LeafDrupal\system\Tests\Plugin\FactoryTest900
LeafDrupal\system\Tests\Plugin\InspectionTest1500
LeafDrupal\system\Tests\Plugin\PluginBagTest2800
LeafDrupal\system\Tests\Queue\QueueTest1700
LeafDrupal\system\Tests\Routing\ControllerResolverTest100
LeafDrupal\system\Tests\Routing\MatcherDumperTest800
LeafDrupal\system\Tests\Routing\MimeTypeMatcherTest1000
LeafDrupal\system\Tests\Routing\RouteProviderTest4600
LeafDrupal\system\Tests\Routing\RouterPermissionTest2300
LeafDrupal\system\Tests\Routing\RouterTest6900
LeafDrupal\system\Tests\Routing\RouteTest600
LeafDrupal\system\Tests\Session\SessionHttpsTest3500
LeafDrupal\system\Tests\Session\SessionTest18700
LeafDrupal\system\Tests\System\AccessDeniedTest6400
LeafDrupal\system\Tests\System\AdminMetaTagTest300
LeafDrupal\system\Tests\System\AdminTest18100
LeafDrupal\system\Tests\System\CronRunTest5200
ExpandDrupal\system\Tests\System\DateFormatsLanguageTest11510
MessageGroupFilenameLineFunctionStatus
French date format appearsOtherDateFormatsLanguageTest.php107Drupal\system\Tests\System\DateFormatsLanguageTest->testLocalizeDateFormats()
LeafDrupal\system\Tests\System\DateTimeTest8800
LeafDrupal\system\Tests\System\DefaultMobileMetaTagsTest1200
LeafDrupal\system\Tests\System\ErrorHandlerTest4000
LeafDrupal\system\Tests\System\ExceptionControllerTest200
LeafDrupal\system\Tests\System\FloodTest1000
LeafDrupal\system\Tests\System\FrontPageTest3700
LeafDrupal\system\Tests\System\IgnoreSlaveSubscriberTest100
LeafDrupal\system\Tests\System\IndexPhpTest600
LeafDrupal\system\Tests\System\InfoAlterTest1000
LeafDrupal\system\Tests\System\MainContentFallbackTest6000
LeafDrupal\system\Tests\System\PageNotFoundTest1800
LeafDrupal\system\Tests\System\PageTitleFilteringTest4400
LeafDrupal\system\Tests\System\PasswordHashingTest1000
LeafDrupal\system\Tests\System\RetrieveFileTest700
LeafDrupal\system\Tests\System\SettingsRewriteTest500
LeafDrupal\system\Tests\System\ShutdownFunctionsTest500
LeafDrupal\system\Tests\System\SiteMaintenanceTest7700
LeafDrupal\system\Tests\System\SystemAuthorizeTest1600
LeafDrupal\system\Tests\System\ThemeTest20500
LeafDrupal\system\Tests\System\TokenReplaceTest3600
LeafDrupal\system\Tests\System\TokenScanTest400
LeafDrupal\system\Tests\Theme\EntityFilteringThemeTest5600
LeafDrupal\system\Tests\Theme\FastTest1200
LeafDrupal\system\Tests\Theme\FunctionsTest2600
LeafDrupal\system\Tests\Theme\HtmlTplPhpAttributesTest500
LeafDrupal\system\Tests\Theme\RegistryTest600
LeafDrupal\system\Tests\Theme\TableTest800
LeafDrupal\system\Tests\Theme\ThemeEarlyInitializationTest500
LeafDrupal\system\Tests\Theme\ThemeInfoStylesTest1300
LeafDrupal\system\Tests\Theme\ThemeTest5300
LeafDrupal\system\Tests\Theme\ThemeTestPhpTemplate400
LeafDrupal\system\Tests\Theme\ThemeTestTwig1000
LeafDrupal\system\Tests\Theme\TwigDebugMarkupTest900
LeafDrupal\system\Tests\Theme\TwigReferenceUnitTest1500
LeafDrupal\system\Tests\Theme\TwigSettingsTest1300
LeafDrupal\system\Tests\Transliteration\TransliterationTest3100
LeafDrupal\system\Tests\TypedData\TypedDataTest22000
LeafDrupal\system\Tests\Update\DependencyHookInvocationTest400
LeafDrupal\system\Tests\Update\DependencyMissingTest400
LeafDrupal\system\Tests\Update\DependencyOrderingTest500
LeafDrupal\system\Tests\Update\UpdateScriptTest20100
LeafDrupal\system\Tests\Upgrade\ActionUpgradePathTest2700
LeafDrupal\system\Tests\Upgrade\BareMinimalAnonymousUpgradePathTest5600
LeafDrupal\system\Tests\Upgrade\BareMinimalNoConfigUpgradePathTest6900
LeafDrupal\system\Tests\Upgrade\BareMinimalUpgradePathTest6900
LeafDrupal\system\Tests\Upgrade\BareStandardUpgradePathTest7200
LeafDrupal\system\Tests\Upgrade\BlockUpgradePathTest3600
LeafDrupal\system\Tests\Upgrade\DateUpgradePathTest4900
LeafDrupal\system\Tests\Upgrade\ExistingModuleNameLengthUpgradePathTest600
LeafDrupal\system\Tests\Upgrade\FieldUIUpgradePathTest6600
LeafDrupal\system\Tests\Upgrade\FieldUpgradePathTest13600
LeafDrupal\system\Tests\Upgrade\FilledMinimalUpgradePathTest6600
LeafDrupal\system\Tests\Upgrade\FilledStandardUpgradePathTest10400
LeafDrupal\system\Tests\Upgrade\FilterFormatUpgradePathTest4500
LeafDrupal\system\Tests\Upgrade\ImageUpgradePathTest3600
LeafDrupal\system\Tests\Upgrade\LanguageUpgradePathTest23500
LeafDrupal\system\Tests\Upgrade\MailUpgradePathTest3600
LeafDrupal\system\Tests\Upgrade\ModuleNameLengthUpgradePathTest2700
LeafDrupal\system\Tests\Upgrade\ModulesDisabledUpgradePathTest4400
LeafDrupal\system\Tests\Upgrade\ShortcutUpgradePathTest3800
LeafDrupal\system\Tests\Upgrade\StateSystemUpgradePathTest5400
LeafDrupal\system\Tests\Upgrade\SystemUpgradePathTest13000
LeafDrupal\system\Tests\Upgrade\UserPictureUpgradePathTest4900
LeafDrupal\system\Tests\Upgrade\UserRoleUpgradePathTest12100
LeafDrupal\system\Tests\Upgrade\UuidUpgradePathTest6900
LeafDrupal\system\Tests\Uuid\UuidUnitTest700
LeafDrupal\taxonomy\Tests\EfqTest1400
LeafDrupal\taxonomy\Tests\LegacyTest1400
LeafDrupal\taxonomy\Tests\LoadMultipleTest1800
LeafDrupal\taxonomy\Tests\RssTest2600
LeafDrupal\taxonomy\Tests\TaxonomyTermReferenceItemTest1500
LeafDrupal\taxonomy\Tests\TermFieldMultipleVocabularyTest2600
LeafDrupal\taxonomy\Tests\TermFieldTest4500
LeafDrupal\taxonomy\Tests\TermIndexTest4600
ExpandDrupal\taxonomy\Tests\TermLanguageTest6220
MessageGroupFilenameLineFunctionStatus
Option aa for field edit-langcode is selected.BrowserTermLanguageTest.php99Drupal\taxonomy\Tests\TermLanguageTest->testDefaultTermLanguage()
Option bb for field edit-langcode is selected.BrowserTermLanguageTest.php101Drupal\taxonomy\Tests\TermLanguageTest->testDefaultTermLanguage()
LeafDrupal\taxonomy\Tests\TermTest26800
LeafDrupal\taxonomy\Tests\TermTranslationUITest15300
LeafDrupal\taxonomy\Tests\TermUnitTest1100
LeafDrupal\taxonomy\Tests\ThemeTest1900
LeafDrupal\taxonomy\Tests\TokenReplaceTest5500
LeafDrupal\taxonomy\Tests\Views\RelationshipNodeTermDataTest200
LeafDrupal\taxonomy\Tests\Views\RelationshipRepresentativeNode200
LeafDrupal\taxonomy\Tests\VocabularyLanguageTest6000
LeafDrupal\taxonomy\Tests\VocabularyPermissionsTest10100
LeafDrupal\taxonomy\Tests\VocabularyTest11000
LeafDrupal\taxonomy\Tests\VocabularyUnitTest7000
LeafDrupal\telephone\Tests\TelephoneFieldTest2200
LeafDrupal\telephone\Tests\TelephoneItemTest1000
LeafDrupal\Tests\Component\Graph\GraphTest100
LeafDrupal\Tests\Component\PhpStorage\FileStorageTest200
LeafDrupal\Tests\Component\PhpStorage\MTimeProtectedFastFileStorageTest200
LeafDrupal\Tests\Component\Utility\CryptTest100
LeafDrupal\Tests\Component\Utility\StringTest100
LeafDrupal\Tests\Component\Utility\TimerUnitTest100
LeafDrupal\Tests\Component\Utility\XssTest200
LeafDrupal\Tests\Core\Access\AccessManagerTest200
LeafDrupal\Tests\Core\Access\DefaultAccessCheckTest200
LeafDrupal\Tests\Core\Cache\BackendChainImplementationUnitTest900
LeafDrupal\Tests\Core\Cache\CacheCollectorTest1400
LeafDrupal\Tests\Core\Cache\NullBackendTest100
LeafDrupal\Tests\Core\Common\AttributesTest100
LeafDrupal\Tests\Core\Common\DiffArrayTest100
LeafDrupal\Tests\Core\Common\TagsTest100
LeafDrupal\Tests\Core\Database\EmptyStatementTest300
LeafDrupal\Tests\Core\Entity\Enhancer\EntityRouteEnhancerTest100
LeafDrupal\Tests\Core\Entity\EntityAccessCheckTest200
LeafDrupal\Tests\Core\EventSubscriber\ReverseProxySubscriberUnitTest200
LeafDrupal\Tests\Core\Extension\ModuleHandlerUnitTest100
LeafDrupal\Tests\Core\HttpKernelTest100
LeafDrupal\Tests\Core\NestedArrayUnitTest500
ExpandDrupal\Tests\Core\PathProcessor\PathProcessorTest010
MessageGroupFilenameLineFunctionStatus
Drupal\Tests\Core\PathProcessor\PathProcessorTest::testProcessInbound Argument 1 passed to Drupal\Core\Language\LanguageManager::__construct() must be an array, none given, called in /var/lib/drupaltestbot/sites/default/files/checkout/core/vendor/phpunit/phpunit-mock-objects/PHPUnit/Framework/MockObject/Generator.php on line 237 and defined /var/lib/drupaltestbot/sites/default/files/checkout/core/lib/Drupal/Core/Language/LanguageManager.php:80 /var/lib/drupaltestbot/sites/default/files/checkout/core/tests/Drupal/Tests/Core/PathProcessor/PathProcessorTest.php:49 OtherPathProcessorTest.php60Drupal\Tests\Core\PathProcessor\PathProcessorTest->testProcessInbound()
ExpandDrupal\Tests\Core\Plugin\DefaultPluginManagerTest220
MessageGroupFilenameLineFunctionStatus
Drupal\Tests\Core\Plugin\DefaultPluginManagerTest::testDefaultPluginManagerWithEmptyCache Argument 1 passed to Drupal\Core\Language\LanguageManager::__construct() must be an array, none given, called in /var/lib/drupaltestbot/sites/default/files/checkout/core/vendor/phpunit/phpunit-mock-objects/PHPUnit/Framework/MockObject/Generator.php on line 237 and defined /var/lib/drupaltestbot/sites/default/files/checkout/core/lib/Drupal/Core/Language/LanguageManager.php:80 /var/lib/drupaltestbot/sites/default/files/checkout/core/tests/Drupal/Tests/Core/Plugin/DefaultPluginManagerTest.php:116 OtherDefaultPluginManagerTest.php100Drupal\Tests\Core\Plugin\DefaultPluginManagerTest->testDefaultPluginManagerWithEmptyCache()
Drupal\Tests\Core\Plugin\DefaultPluginManagerTest::testDefaultPluginManagerWithFilledCache Argument 1 passed to Drupal\Core\Language\LanguageManager::__construct() must be an array, none given, called in /var/lib/drupaltestbot/sites/default/files/checkout/core/vendor/phpunit/phpunit-mock-objects/PHPUnit/Framework/MockObject/Generator.php on line 237 and defined /var/lib/drupaltestbot/sites/default/files/checkout/core/lib/Drupal/Core/Language/LanguageManager.php:80 /var/lib/drupaltestbot/sites/default/files/checkout/core/tests/Drupal/Tests/Core/Plugin/DefaultPluginManagerTest.php:147 OtherDefaultPluginManagerTest.php132Drupal\Tests\Core\Plugin\DefaultPluginManagerTest->testDefaultPluginManagerWithFilledCache()
LeafDrupal\Tests\Core\Routing\UrlGeneratorTest400
LeafDrupal\text\Tests\Formatter\TextPlainUnitTest600
LeafDrupal\text\Tests\TextFieldTest18600
LeafDrupal\text\Tests\TextSummaryTest12500
LeafDrupal\toolbar\Tests\ToolbarHookToolbarTest1500
ExpandDrupal\toolbar\Tests\ToolbarMenuTranslationTest9960
MessageGroupFilenameLineFunctionStatus
Search found the menu item as untranslated.OtherToolbarMenuTranslationTest.php64Drupal\toolbar\Tests\ToolbarMenuTranslationTest->testToolbarClasses()
Failed to set field to yXUgayQKOtherToolbarMenuTranslationTest.php77Drupal\toolbar\Tests\ToolbarMenuTranslationTest->testToolbarClasses()
Found the Save translations buttonOtherToolbarMenuTranslationTest.php77Drupal\toolbar\Tests\ToolbarMenuTranslationTest->testToolbarClasses()
Found the requested form fields at admin/config/regional/translate/translateOtherToolbarMenuTranslationTest.php77Drupal\toolbar\Tests\ToolbarMenuTranslationTest->testToolbarClasses()
Search found the menu item as translated: yXUgayQK.OtherToolbarMenuTranslationTest.php87Drupal\toolbar\Tests\ToolbarMenuTranslationTest->testToolbarClasses()
Found the menu translated.OtherToolbarMenuTranslationTest.php92Drupal\toolbar\Tests\ToolbarMenuTranslationTest->testToolbarClasses()
LeafDrupal\tour\Tests\TourPluginTest200
ExpandDrupal\tour\Tests\TourTest3120
MessageGroupFilenameLineFunctionStatus
Found Italian variant of tip 1.OtherTourTest.php98Drupal\tour\Tests\TourTest->testTourFunctionality()
Did not find English variant of tip 1.OtherTourTest.php104Drupal\tour\Tests\TourTest->testTourFunctionality()
LeafDrupal\tracker\Tests\TrackerNodeAccessTest3800
LeafDrupal\tracker\Tests\TrackerTest22800
LeafDrupal\tracker\Tests\Views\TrackerUserUidTest1400
ExpandDrupal\translation\Tests\TranslationTest56350
MessageGroupFilenameLineFunctionStatus
Language was installed successfully.OtherTranslationTest.php319Drupal\translation\Tests\TranslationTest->addLanguage()
Language was installed successfully.OtherTranslationTest.php319Drupal\translation\Tests\TranslationTest->addLanguage()
Language was installed successfully.OtherTranslationTest.php319Drupal\translation\Tests\TranslationTest->addLanguage()
Language was installed successfully.OtherTranslationTest.php319Drupal\translation\Tests\TranslationTest->addLanguage()
Language was installed successfully.OtherTranslationTest.php319Drupal\translation\Tests\TranslationTest->addLanguage()
LeafDrupal\update\Tests\UpdateContribTest19700
LeafDrupal\update\Tests\UpdateCoreTest22600
LeafDrupal\update\Tests\UpdateCoreUnitTest400
LeafDrupal\update\Tests\UpdateUploadTest6400
LeafDrupal\user\Tests\Plugin\Action\AddRoleUserTest200
LeafDrupal\user\Tests\Plugin\Action\RemoveRoleUserTest200
LeafDrupal\user\Tests\TempStoreDatabaseTest1900
LeafDrupal\user\Tests\UserAccountLinksTests9700
LeafDrupal\user\Tests\UserAdminListingTest5300
LeafDrupal\user\Tests\UserAdminSettingsFormTest800
LeafDrupal\user\Tests\UserAdminTest15000
LeafDrupal\user\Tests\UserAutocompleteTest5800
LeafDrupal\user\Tests\UserBlocksTests11000
LeafDrupal\user\Tests\UserCancelTest26900
LeafDrupal\user\Tests\UserCreateFailMailTest1500
LeafDrupal\user\Tests\UserCreateTest3900
LeafDrupal\user\Tests\UserDeleteTest1500
LeafDrupal\user\Tests\UserEditedOwnAccountTest2200
LeafDrupal\user\Tests\UserEditTest8800
LeafDrupal\user\Tests\UserEntityCallbacksTest700
LeafDrupal\user\Tests\UserEntityTest1600
ExpandDrupal\user\Tests\UserLanguageCreationTest6170
MessageGroupFilenameLineFunctionStatus
Global language set in the language selector.BrowserUserLanguageCreationTest.php59Drupal\user\Tests\UserLanguageCreationTest->testLocalUserCreation()
New user has correct preferred language set.OtherUserLanguageCreationTest.php74Drupal\user\Tests\UserLanguageCreationTest->testLocalUserCreation()
New user has correct profile language set.OtherUserLanguageCreationTest.php75Drupal\user\Tests\UserLanguageCreationTest->testLocalUserCreation()
New user has correct preferred language set.OtherUserLanguageCreationTest.php92Drupal\user\Tests\UserLanguageCreationTest->testLocalUserCreation()
New user has correct profile language set.OtherUserLanguageCreationTest.php93Drupal\user\Tests\UserLanguageCreationTest->testLocalUserCreation()
Language selector is accessible and correct language is selected.BrowserUserLanguageCreationTest.php101Drupal\user\Tests\UserLanguageCreationTest->testLocalUserCreation()
Language selector is accessible and correct language is selected.BrowserUserLanguageCreationTest.php114Drupal\user\Tests\UserLanguageCreationTest->testLocalUserCreation()
LeafDrupal\user\Tests\UserLanguageTest3900
LeafDrupal\user\Tests\UserLoginTest15900
LeafDrupal\user\Tests\UserPasswordResetTest6600
LeafDrupal\user\Tests\UserPermissionsTest5000
LeafDrupal\user\Tests\UserPictureTest5000
LeafDrupal\user\Tests\UserRegistrationTest12900
LeafDrupal\user\Tests\UserRoleAdminTest6000
LeafDrupal\user\Tests\UserRolesAssignmentTest5100
LeafDrupal\user\Tests\UserSaveTest200
LeafDrupal\user\Tests\UserSearchTest5800
LeafDrupal\user\Tests\UserSignatureTest4500
LeafDrupal\user\Tests\UserTimeZoneTest2900
LeafDrupal\user\Tests\UserTokenReplaceTest4700
LeafDrupal\user\Tests\UserTranslationUITest14300
LeafDrupal\user\Tests\UserValidateCurrentPassCustomFormTest1700
LeafDrupal\user\Tests\UserValidationTest1600
LeafDrupal\user\Tests\Views\AccessPermissionTest1400
LeafDrupal\user\Tests\Views\AccessRoleTest1400
LeafDrupal\user\Tests\Views\ArgumentDefaultTest900
LeafDrupal\user\Tests\Views\ArgumentValidateTest1900
LeafDrupal\user\Tests\Views\Argument\RolesRidTest100
LeafDrupal\user\Tests\Views\BulkFormTest3600
LeafDrupal\user\Tests\Views\HandlerArgumentUserUidTest500
LeafDrupal\user\Tests\Views\HandlerFieldPermissionTest1000
LeafDrupal\user\Tests\Views\HandlerFieldRoleTest1000
LeafDrupal\user\Tests\Views\HandlerFieldUserNameTest700
LeafDrupal\user\Tests\Views\HandlerFilterPermissionTest1400
LeafDrupal\user\Tests\Views\HandlerFilterUserNameTest5000
LeafDrupal\user\Tests\Views\RelationshipRepresentativeNode300
LeafDrupal\user\Tests\Views\UserDataTest400
LeafDrupal\views\Tests\BasicTest2000
LeafDrupal\views\Tests\DefaultViewsTest9900
LeafDrupal\views\Tests\Entity\FieldEntityTest400
LeafDrupal\views\Tests\Entity\FilterEntityBundleTest800
LeafDrupal\views\Tests\GlossaryTest2300
LeafDrupal\views\Tests\Handler\AreaEntityTest3700
LeafDrupal\views\Tests\Handler\AreaTest9000
LeafDrupal\views\Tests\Handler\AreaTextTest900
LeafDrupal\views\Tests\Handler\AreaTitleTest800
LeafDrupal\views\Tests\Handler\ArgumentDateTest4400
LeafDrupal\views\Tests\Handler\ArgumentNullTest800
LeafDrupal\views\Tests\Handler\ArgumentStringTest400
LeafDrupal\views\Tests\Handler\FieldBooleanTest1400
LeafDrupal\views\Tests\Handler\FieldCounterTest1400
LeafDrupal\views\Tests\Handler\FieldCustomTest500
LeafDrupal\views\Tests\Handler\FieldDateTest1800
LeafDrupal\views\Tests\Handler\FieldDropButtonTest1300
LeafDrupal\views\Tests\Handler\FieldFileSizeTest1200
LeafDrupal\views\Tests\Handler\FieldUnitTest14500
LeafDrupal\views\Tests\Handler\FieldUrlTest700
LeafDrupal\views\Tests\Handler\FieldWebTest10900
LeafDrupal\views\Tests\Handler\FieldXssTest700
LeafDrupal\views\Tests\Handler\FilterBooleanOperatorTest900
LeafDrupal\views\Tests\Handler\FilterCombineTest500
LeafDrupal\views\Tests\Handler\FilterDateTest2200
LeafDrupal\views\Tests\Handler\FilterEqualityTest2400
LeafDrupal\views\Tests\Handler\FilterInOperatorTest2300
LeafDrupal\views\Tests\Handler\FilterNumericTest5900
LeafDrupal\views\Tests\Handler\FilterStringTest14600
LeafDrupal\views\Tests\Handler\HandlerAliasTest1300
LeafDrupal\views\Tests\Handler\HandlerAllTest29400
LeafDrupal\views\Tests\Handler\HandlerTest11600
LeafDrupal\views\Tests\Handler\RelationshipTest1100
LeafDrupal\views\Tests\Handler\SortDateTest2800
LeafDrupal\views\Tests\Handler\SortRandomTest1000
LeafDrupal\views\Tests\Handler\SortTest1600
LeafDrupal\views\Tests\ModuleTest5200
LeafDrupal\views\Tests\PluginInstanceTest15300
LeafDrupal\views\Tests\PluginTypeListTest100
LeafDrupal\views\Tests\Plugin\AccessTest2900
LeafDrupal\views\Tests\Plugin\ArgumentDefaultTest2400
LeafDrupal\views\Tests\Plugin\ArgumentValidatorTest1200
LeafDrupal\views\Tests\Plugin\CacheTest1200
LeafDrupal\views\Tests\Plugin\DisplayAttachmentTest600
LeafDrupal\views\Tests\Plugin\DisplayExtenderTest600
LeafDrupal\views\Tests\Plugin\DisplayFeedTest4300
LeafDrupal\views\Tests\Plugin\DisplayPageTest3200
LeafDrupal\views\Tests\Plugin\DisplayPageWebTest4100
LeafDrupal\views\Tests\Plugin\DisplayTest10100
LeafDrupal\views\Tests\Plugin\DisplayUnitTest2700
LeafDrupal\views\Tests\Plugin\ExposedFormTest2400
LeafDrupal\views\Tests\Plugin\FilterTest1300
LeafDrupal\views\Tests\Plugin\JoinTest2800
LeafDrupal\views\Tests\Plugin\MiniPagerTest4900
LeafDrupal\views\Tests\Plugin\PagerTest9900
LeafDrupal\views\Tests\Plugin\QueryTest800
LeafDrupal\views\Tests\Plugin\RowEntityTest700
LeafDrupal\views\Tests\Plugin\StyleMappingTest4600
LeafDrupal\views\Tests\Plugin\StyleTableTest1800
LeafDrupal\views\Tests\Plugin\StyleTableUnitTest2300
LeafDrupal\views\Tests\Plugin\StyleTest2100
LeafDrupal\views\Tests\Plugin\StyleUnformattedTest2100
LeafDrupal\views\Tests\Plugin\ViewsBlockTest700
LeafDrupal\views\Tests\QueryGroupByTest5500
LeafDrupal\views\Tests\TokenReplaceTest1600
LeafDrupal\views\Tests\ViewElementTest1500
ExpandDrupal\views\Tests\ViewExecutableTest20800
MessageGroupFilenameLineFunctionStatus
'setDisplay() called with invalid display ID "invalid".'DebugViewExecutable.php664Drupal\views\ViewExecutable->setDisplay()
LeafDrupal\views\Tests\ViewPageControllerTest1000
LeafDrupal\views\Tests\ViewRenderTest200
LeafDrupal\views\Tests\ViewsDataHelperTest100
LeafDrupal\views\Tests\ViewsDataTest6500
LeafDrupal\views\Tests\ViewsHooksTest3200
LeafDrupal\views\Tests\ViewsTaxonomyAutocompleteTest1500
LeafDrupal\views\Tests\ViewStorageTest10600
LeafDrupal\views\Tests\Wizard\BasicTest11000
LeafDrupal\views\Tests\Wizard\ItemsPerPageTest3800
LeafDrupal\views\Tests\Wizard\MenuTest1900
LeafDrupal\views\Tests\Wizard\SortingTest3500
LeafDrupal\views\Tests\Wizard\TaggedWithTest7800
LeafDrupal\views\Tests\Wizard\WizardPluginBaseUnitTest1300
LeafDrupal\views_ui\Tests\AnalyzeTest2100
LeafDrupal\views_ui\Tests\CachedDataUITest5200
LeafDrupal\views_ui\Tests\CustomBooleanTest4200
LeafDrupal\views_ui\Tests\DefaultViewsTest11400
LeafDrupal\views_ui\Tests\DisplayAttachmentTest3500
LeafDrupal\views_ui\Tests\DisplayExtenderUITest2300
LeafDrupal\views_ui\Tests\DisplayPath8100
LeafDrupal\views_ui\Tests\DisplayTest29900
LeafDrupal\views_ui\Tests\ExposedFormUITest7900
LeafDrupal\views_ui\Tests\FieldUITest2100
LeafDrupal\views_ui\Tests\FilterBooleanWebTest2700
LeafDrupal\views_ui\Tests\Form\Ajax\RearrangeFilterTest100
LeafDrupal\views_ui\Tests\GroupByTest2900
LeafDrupal\views_ui\Tests\HandlerTest19500
LeafDrupal\views_ui\Tests\OverrideDisplaysTest14700
LeafDrupal\views_ui\Tests\PreviewTest6600
LeafDrupal\views_ui\Tests\QueryTest1900
LeafDrupal\views_ui\Tests\RearrangeFieldsTest3500
LeafDrupal\views_ui\Tests\RedirectTest2600
LeafDrupal\views_ui\Tests\RowUITest3000
LeafDrupal\views_ui\Tests\SettingsTest8800
LeafDrupal\views_ui\Tests\StorageTest2200
LeafDrupal\views_ui\Tests\StyleUITest3900
LeafDrupal\views_ui\Tests\TagTest1500
LeafDrupal\views_ui\Tests\ViewListControllerTest100
LeafDrupal\views_ui\Tests\ViewUIObjectTest100
LeafDrupal\xmlrpc\Tests\XmlRpcBasicTest900
LeafDrupal\xmlrpc\Tests\XmlRpcMessagesTest700
LeafDrupal\xmlrpc\Tests\XmlRpcValidatorTest1000