1938062-75.patch

Test status
StatusResult
Last receivedTue, 06/25/2013 - 11:24:26
Last requestedTue, 06/25/2013 - 11:28:22
Last testedTue, 06/25/2013 - 12:58:48
Test count1
Environment status
MySQLfail
File information
File1938062-75.patch
BranchDrupal core - 8.x
LinkIssue Link
SummaryFAILED: [[SimpleTest]]: [MySQL] 56,432 pass(es), 124 fail(s), and 20 exception(s).
Details

MySQL

  1. Setup environment
  2. Detect an invalid patch URL
  3. Detect invalid repository information
  4. Detect invalid patch format
  5. Detect a non-applicable patch
  6. Detect invalid PHP syntax
  7. Detect a Drupal installation failure
  8. Detect a test run failure
  9. Detect a failing test
    Review the test failures below then if necessary run them locally until the problem has been fixed.
  10. Complete test suite with all tests passing
56,432 pass(es), 124 fail(s), and 20 exception(s)

Non-pass

Test namePassFailException
ExpandDrupal\block\Tests\Views\DisplayBlockTest4201
MessageGroupFilenameLineFunctionStatus
Drupal\Core\Config\StorageException: Failed to write configuration file: sites/default/files/simpletest/796764/config_active/block.block.stark.kjry4cil.yml in Drupal\Core\Config\FileStorage->write() (line 102 of /var/lib/drupaltestbot/sites/default/files/checkout/core/lib/Drupal/Core/Config/FileStorage.php). Drupal\Core\Config\FileStorage->write('block.block.stark.kjry4cil', Array) Drupal\Core\Config\CachedStorage->write('block.block.stark.kjry4cil', Array) Drupal\Core\Config\Config->save() Drupal\Core\Config\Entity\ConfigStorageController->save(Object) Drupal\Core\Entity\Entity->save() Drupal\simpletest\WebTestBase->drupalPlaceBlock('views_block:test_view_block-block_1', Array) Drupal\block\Tests\Views\DisplayBlockTest->testDeleteBlockDisplay() Drupal\simpletest\TestBase->run() simpletest_script_run_one_test('762', 'Drupal\block\Tests\Views\DisplayBlockTest') Uncaught exceptionFileStorage.php102Drupal\Core\Config\FileStorage->write()
ExpandDrupal\comment\Tests\Views\WizardTest12274
MessageGroupFilenameLineFunctionStatus
The test did not complete due to a fatal error.Completion checkWizardTest.php38Drupal\comment\Tests\Views\WizardTest->testCommentWizard()
mkdir(): No space left on deviceWarningMTimeProtectedFastFileStorage.php150Drupal\Component\PhpStorage\MTimeProtectedFastFileStorage->ensureDirectory()
chmod(): No such file or directoryWarningMTimeProtectedFastFileStorage.php152Drupal\Component\PhpStorage\MTimeProtectedFastFileStorage->ensureDirectory()
file_put_contents(/var/lib/drupaltestbot/sites/default/files/checkout/sites/default/files/simpletest/785436/php/twig/.htaccess): failed to open stream: No such file or directoryWarningMTimeProtectedFastFileStorage.php154Drupal\Component\PhpStorage\MTimeProtectedFastFileStorage->ensureDirectory()
simplexml_import_dom(): Invalid Nodetype to importsimplexml_import_dom(Object) Drupal\simpletest\WebTestBase->parse() Drupal\simpletest\WebTestBase->drupalPost('user', Array, 'Log in') Drupal\simpletest\WebTestBase->drupalLogin(Object) Drupal\views\Tests\Wizard\WizardTestBase->setUp() Drupal\simpletest\TestBase->run() simpletest_script_run_one_test('850', 'Drupal\comment\Tests\Views\WizardTest') WarningWebTestBase.php1200Drupal\simpletest\WebTestBase->parse()
Parsed page successfully.BrowserWizardTestBase.php29Drupal\views\Tests\Wizard\WizardTestBase->setUp()
User u8x47C0h successfully logged in.User loginWizardTestBase.php29Drupal\views\Tests\Wizard\WizardTestBase->setUp()
Failed to set field label to ucjbMIazDmVWUIKjOtherWizardTest.php48Drupal\comment\Tests\Views\WizardTest->testCommentWizard()
Failed to set field id to yhxrq8qoqwojqcmhOtherWizardTest.php48Drupal\comment\Tests\Views\WizardTest->testCommentWizard()
Failed to set field show[wizard_key] to commentOtherWizardTest.php48Drupal\comment\Tests\Views\WizardTest->testCommentWizard()
Failed to set field page[create] to 1OtherWizardTest.php48Drupal\comment\Tests\Views\WizardTest->testCommentWizard()
Failed to set field page[path] to hDXCoWggI6a9XVTHOtherWizardTest.php48Drupal\comment\Tests\Views\WizardTest->testCommentWizard()
Found the Save and edit buttonOtherWizardTest.php48Drupal\comment\Tests\Views\WizardTest->testCommentWizard()
Found the requested form fields at admin/structure/views/addOtherWizardTest.php48Drupal\comment\Tests\Views\WizardTest->testCommentWizard()
Make sure the view saving was successful and the browser got redirected to the edit page.OtherWizardTest.php49Drupal\comment\Tests\Views\WizardTest->testCommentWizard()
Failed to set field label to ucjbMIazDmVWUIKjOtherWizardTest.php55Drupal\comment\Tests\Views\WizardTest->testCommentWizard()
Failed to set field id to yhxrq8qoqwojqcmhOtherWizardTest.php55Drupal\comment\Tests\Views\WizardTest->testCommentWizard()
Failed to set field show[wizard_key] to commentOtherWizardTest.php55Drupal\comment\Tests\Views\WizardTest->testCommentWizard()
Failed to set field page[create] to 1OtherWizardTest.php55Drupal\comment\Tests\Views\WizardTest->testCommentWizard()
Failed to set field page[path] to hDXCoWggI6a9XVTHOtherWizardTest.php55Drupal\comment\Tests\Views\WizardTest->testCommentWizard()
Found the Update "of type" choice buttonOtherWizardTest.php55Drupal\comment\Tests\Views\WizardTest->testCommentWizard()
Found the requested form fields at admin/structure/views/addOtherWizardTest.php55Drupal\comment\Tests\Views\WizardTest->testCommentWizard()
Value array ( ) is equal to value array ( 0 => 'comment', 1 => 'fields', ).OtherWizardTest.php68Drupal\comment\Tests\Views\WizardTest->testCommentWizard()
Failed to set field label to ucjbMIazDmVWUIKjOtherWizardTest.php71Drupal\comment\Tests\Views\WizardTest->testCommentWizard()
Failed to set field id to vglfwxsry2eyxoqsOtherWizardTest.php71Drupal\comment\Tests\Views\WizardTest->testCommentWizard()
Failed to set field show[wizard_key] to commentOtherWizardTest.php71Drupal\comment\Tests\Views\WizardTest->testCommentWizard()
Failed to set field page[create] to 1OtherWizardTest.php71Drupal\comment\Tests\Views\WizardTest->testCommentWizard()
Failed to set field page[path] to hDXCoWggI6a9XVTHOtherWizardTest.php71Drupal\comment\Tests\Views\WizardTest->testCommentWizard()
Found the Save and edit buttonOtherWizardTest.php71Drupal\comment\Tests\Views\WizardTest->testCommentWizard()
Found the requested form fields at OtherWizardTest.php71Drupal\comment\Tests\Views\WizardTest->testCommentWizard()
Make sure the view saving was successful and the browser got redirected to the edit page.OtherWizardTest.php72Drupal\comment\Tests\Views\WizardTest->testCommentWizard()
ExpandDrupal\rest\Tests\Views\StyleSerializerTest5310
MessageGroupFilenameLineFunctionStatus
The test did not complete due to a fatal error.Completion checkStyleSerializerTest.php176Drupal\rest\Tests\Views\StyleSerializerTest->testUIFieldAlias()
ExpandDrupal\system\Tests\Upgrade\FieldUpgradePathTest16911
MessageGroupFilenameLineFunctionStatus
Failed: Drupal\Core\Database\DatabaseExceptionWrapper: SQLSTATE[HY000]: General error: 1114 The table 'simpletest880294field_data_field_tags' is full: ALTER TABLE {field_data_field_tags} ADD PRIMARY KEY (`entity_type`, `entity_id`, `deleted`, `delta`, `langcode`); Array ( ) in Drupal\Core\Database\Connection->query() (line 571 of /var/lib/drupaltestbot/sites/default/files/checkout/core/lib/Drupal/Core/Database/Connection.php).OtherUpgradePathTestBase.php278Drupal\system\Tests\Upgrade\UpgradePathTestBase->performUpgrade()
Exception: Errors during update process. in Drupal\system\Tests\Upgrade\UpgradePathTestBase->performUpgrade() (line 284 of /var/lib/drupaltestbot/sites/default/files/checkout/core/modules/system/lib/Drupal/system/Tests/Upgrade/UpgradePathTestBase.php). Drupal\system\Tests\Upgrade\UpgradePathTestBase->performUpgrade() Drupal\system\Tests\Upgrade\FieldUpgradePathTest->testFieldUpgradeToConfig() Drupal\simpletest\TestBase->run() simpletest_script_run_one_test('662', 'Drupal\system\Tests\Upgrade\FieldUpgradePathTest') Uncaught exceptionUpgradePathTestBase.php284Drupal\system\Tests\Upgrade\UpgradePathTestBase->performUpgrade()
ExpandDrupal\system\Tests\Upgrade\LanguageUpgradePathTest32011
MessageGroupFilenameLineFunctionStatus
Failed: Drupal\Core\Database\DatabaseExceptionWrapper: SQLSTATE[HY000]: General error: 1114 The table 'simpletest710050field_revision_taxonomy_vocabulary_6_5' is full: ALTER TABLE {field_revision_taxonomy_vocabulary_6_5} ADD PRIMARY KEY (`entity_type`, `entity_id`, `revision_id`, `deleted`, `delta`, `langcode`); Array ( ) in Drupal\Core\Database\Connection->query() (line 571 of /var/lib/drupaltestbot/sites/default/files/checkout/core/lib/Drupal/Core/Database/Connection.php).OtherUpgradePathTestBase.php278Drupal\system\Tests\Upgrade\UpgradePathTestBase->performUpgrade()
Exception: Errors during update process. in Drupal\system\Tests\Upgrade\UpgradePathTestBase->performUpgrade() (line 284 of /var/lib/drupaltestbot/sites/default/files/checkout/core/modules/system/lib/Drupal/system/Tests/Upgrade/UpgradePathTestBase.php). Drupal\system\Tests\Upgrade\UpgradePathTestBase->performUpgrade() Drupal\system\Tests\Upgrade\LanguageUpgradePathTest->testLanguageNoPluralsUpgrade() Drupal\simpletest\TestBase->run() simpletest_script_run_one_test('667', 'Drupal\system\Tests\Upgrade\LanguageUpgradePathTest') Uncaught exceptionUpgradePathTestBase.php284Drupal\system\Tests\Upgrade\UpgradePathTestBase->performUpgrade()
ExpandDrupal\system\Tests\Upgrade\UuidUpgradePathTest4611
MessageGroupFilenameLineFunctionStatus
Failed: Drupal\Core\Database\DatabaseExceptionWrapper: SQLSTATE[HY000]: General error: 1114 The table 'simpletest977700field_data_body' is full: ALTER TABLE {field_data_body} ADD PRIMARY KEY (`entity_type`, `entity_id`, `deleted`, `delta`, `langcode`); Array ( ) in Drupal\Core\Database\Connection->query() (line 571 of /var/lib/drupaltestbot/sites/default/files/checkout/core/lib/Drupal/Core/Database/Connection.php).OtherUpgradePathTestBase.php278Drupal\system\Tests\Upgrade\UpgradePathTestBase->performUpgrade()
Exception: Errors during update process. in Drupal\system\Tests\Upgrade\UpgradePathTestBase->performUpgrade() (line 284 of /var/lib/drupaltestbot/sites/default/files/checkout/core/modules/system/lib/Drupal/system/Tests/Upgrade/UpgradePathTestBase.php). Drupal\system\Tests\Upgrade\UpgradePathTestBase->performUpgrade() Drupal\system\Tests\Upgrade\UuidUpgradePathTest->testUuidUpgrade() Drupal\simpletest\TestBase->run() simpletest_script_run_one_test('676', 'Drupal\system\Tests\Upgrade\UuidUpgradePathTest') Uncaught exceptionUpgradePathTestBase.php284Drupal\system\Tests\Upgrade\UpgradePathTestBase->performUpgrade()
ExpandDrupal\user\Tests\UserCancelTest8110
MessageGroupFilenameLineFunctionStatus
The test did not complete due to a fatal error.Completion checkUserCancelTest.php182Drupal\user\Tests\UserCancelTest->testUserBlockUnpublish()
ExpandDrupal\user\Tests\UserLoginTest14110
MessageGroupFilenameLineFunctionStatus
The test did not complete due to a fatal error.Completion checkUserLoginTest.php105Drupal\user\Tests\UserLoginTest->testPasswordRehashOnLogin()
ExpandDrupal\user\Tests\UserPictureTest2510
MessageGroupFilenameLineFunctionStatus
The test did not complete due to a fatal error.Completion checkUserPictureTest.php91Drupal\user\Tests\UserPictureTest->testPictureOnNodeComment()
ExpandDrupal\user\Tests\UserRegistrationTest1510
MessageGroupFilenameLineFunctionStatus
The test did not complete due to a fatal error.Completion checkUserRegistrationTest.php63Drupal\user\Tests\UserRegistrationTest->testRegistrationWithoutEmailVerification()
ExpandDrupal\user\Tests\Views\HandlerFilterUserNameTest2501
MessageGroupFilenameLineFunctionStatus
Drupal\Core\Config\StorageException: Failed to write configuration file: sites/default/files/simpletest/395002/config_active/user.role.ztxdxgn6.yml in Drupal\Core\Config\FileStorage->write() (line 102 of /var/lib/drupaltestbot/sites/default/files/checkout/core/lib/Drupal/Core/Config/FileStorage.php). Drupal\Core\Config\FileStorage->write('user.role.ztxdxgn6', Array) Drupal\Core\Config\CachedStorage->write('user.role.ztxdxgn6', Array) Drupal\Core\Config\Config->save() Drupal\Core\Config\Entity\ConfigStorageController->save(Object) Drupal\Core\Entity\Entity->save() Drupal\simpletest\WebTestBase->drupalCreateRole(Array) Drupal\simpletest\WebTestBase->drupalCreateUser(Array) Drupal\user\Tests\Views\HandlerFilterUserNameTest->testAdminUserInterface() Drupal\simpletest\TestBase->run() simpletest_script_run_one_test('797', 'Drupal\user\Tests\Views\HandlerFilterUserNameTest') Uncaught exceptionFileStorage.php102Drupal\Core\Config\FileStorage->write()
ExpandDrupal\views\Tests\Handler\AreaTest8610
MessageGroupFilenameLineFunctionStatus
The test did not complete due to a fatal error.Completion checkAreaTest.php161Drupal\views\Tests\Handler\AreaTest->testTitleArea()
ExpandDrupal\views\Tests\Handler\FilterStringTest11110
MessageGroupFilenameLineFunctionStatus
The test did not complete due to a fatal error.Completion checkFilterStringTest.php602Drupal\views\Tests\Handler\FilterStringTest->testFilterStringShorter()
ExpandDrupal\views\Tests\Handler\HandlerTest9910
MessageGroupFilenameLineFunctionStatus
The test did not complete due to a fatal error.Completion checkHandlerTest.php352Drupal\views\Tests\Handler\HandlerTest->testAccess()
ExpandDrupal\views\Tests\Plugin\ArgumentDefaultTest710
MessageGroupFilenameLineFunctionStatus
The test did not complete due to a fatal error.Completion checkArgumentDefaultTest.php88Drupal\views\Tests\Plugin\ArgumentDefaultTest->testArgumentDefaultNoOptions()
ExpandDrupal\views\Tests\Plugin\CacheTest010
MessageGroupFilenameLineFunctionStatus
The test did not complete due to a fatal error.Completion checkCacheTest.php45Drupal\views\Tests\Plugin\CacheTest->testTimeCaching()
ExpandDrupal\views\Tests\Plugin\DisplayAttachmentTest010
MessageGroupFilenameLineFunctionStatus
The test did not complete due to a fatal error.Completion checkDisplayAttachmentTest.php42Drupal\views\Tests\Plugin\DisplayAttachmentTest->testAttachment()
ExpandDrupal\views\Tests\Plugin\DisplayExtenderTest010
MessageGroupFilenameLineFunctionStatus
The test did not complete due to a fatal error.Completion checkDisplayExtenderTest.php43Drupal\views\Tests\Plugin\DisplayExtenderTest->testDisplayExtenders()
ExpandDrupal\views\Tests\Plugin\DisplayPageWebTest2710
MessageGroupFilenameLineFunctionStatus
The test did not complete due to a fatal error.Completion checkDisplayPageWebTest.php75Drupal\views\Tests\Plugin\DisplayPageWebTest->testPageDisplayMenu()
ExpandDrupal\views\Tests\Plugin\DisplayTest1211
MessageGroupFilenameLineFunctionStatus
Drupal\Core\Config\StorageException: Failed to write configuration file: sites/default/files/simpletest/952183/config_active/views.view.test_view.yml in Drupal\Core\Config\FileStorage->write() (line 102 of /var/lib/drupaltestbot/sites/default/files/checkout/core/lib/Drupal/Core/Config/FileStorage.php). Drupal\Core\Config\FileStorage->write('views.view.test_view', Array) Drupal\Core\Config\CachedStorage->write('views.view.test_view', Array) Drupal\Core\Config\Config->save() Drupal\Core\Config\Entity\ConfigStorageController->save(Object) Drupal\Core\Entity\Entity->save() Drupal\views\ViewExecutable->save() Drupal\views\Tests\Plugin\DisplayTest->testDisplayPlugin() Drupal\simpletest\TestBase->run() simpletest_script_run_one_test('812', 'Drupal\views\Tests\Plugin\DisplayTest') Uncaught exceptionFileStorage.php102Drupal\Core\Config\FileStorage->write()
The test did not complete due to a fatal error.Completion checkDisplayTest.php145Drupal\views\Tests\Plugin\DisplayTest->testFilterGroupsOverriding()
ExpandDrupal\views\Tests\Plugin\ExposedFormTest110
MessageGroupFilenameLineFunctionStatus
The test did not complete due to a fatal error.Completion checkExposedFormTest.php53Drupal\views\Tests\Plugin\ExposedFormTest->testResetButton()
ExpandDrupal\views\Tests\Plugin\FilterTest010
MessageGroupFilenameLineFunctionStatus
The test did not complete due to a fatal error.Completion checkFilterTest.php61Drupal\views\Tests\Plugin\FilterTest->testFilterQuery()
ExpandDrupal\views\Tests\Plugin\PagerTest37364
MessageGroupFilenameLineFunctionStatus
mkdir(): No space left on deviceWarningMTimeProtectedFastFileStorage.php150Drupal\Component\PhpStorage\MTimeProtectedFastFileStorage->ensureDirectory()
chmod(): No such file or directoryWarningMTimeProtectedFastFileStorage.php152Drupal\Component\PhpStorage\MTimeProtectedFastFileStorage->ensureDirectory()
file_put_contents(/var/lib/drupaltestbot/sites/default/files/checkout/sites/default/files/simpletest/728799/php/twig/.htaccess): failed to open stream: No such file or directoryWarningMTimeProtectedFastFileStorage.php154Drupal\Component\PhpStorage\MTimeProtectedFastFileStorage->ensureDirectory()
simplexml_import_dom(): Invalid Nodetype to importsimplexml_import_dom(Object) Drupal\simpletest\WebTestBase->parse() Drupal\simpletest\WebTestBase->drupalPost('user', Array, 'Log in') Drupal\simpletest\WebTestBase->drupalLogin(Object) Drupal\views\Tests\Plugin\PagerTest->testStorePagerSettings() Drupal\simpletest\TestBase->run() simpletest_script_run_one_test('818', 'Drupal\views\Tests\Plugin\PagerTest') WarningWebTestBase.php1200Drupal\simpletest\WebTestBase->parse()
Parsed page successfully.BrowserPagerTest.php44Drupal\views\Tests\Plugin\PagerTest->testStorePagerSettings()
User hYgVOhYd successfully logged in.User loginPagerTest.php44Drupal\views\Tests\Plugin\PagerTest->testStorePagerSettings()
Failed to set field pager[type] to fullOtherPagerTest.php52Drupal\views\Tests\Plugin\PagerTest->testStorePagerSettings()
Found the Apply buttonOtherPagerTest.php52Drupal\views\Tests\Plugin\PagerTest->testStorePagerSettings()
Found the requested form fields at admin/structure/views/nojs/display/test_view/default/pagerOtherPagerTest.php52Drupal\views\Tests\Plugin\PagerTest->testStorePagerSettings()
Failed to set field pager_options[items_per_page] to 20OtherPagerTest.php56Drupal\views\Tests\Plugin\PagerTest->testStorePagerSettings()
Found the Apply buttonOtherPagerTest.php56Drupal\views\Tests\Plugin\PagerTest->testStorePagerSettings()
Found the requested form fields at admin/structure/views/nojs/display/test_view/default/pager_optionsOtherPagerTest.php56Drupal\views\Tests\Plugin\PagerTest->testStorePagerSettings()
"20 items" foundOtherPagerTest.php57Drupal\views\Tests\Plugin\PagerTest->testStorePagerSettings()
Failed to set field pager[type] to miniOtherPagerTest.php64Drupal\views\Tests\Plugin\PagerTest->testStorePagerSettings()
Found the Apply buttonOtherPagerTest.php64Drupal\views\Tests\Plugin\PagerTest->testStorePagerSettings()
Found the requested form fields at admin/structure/views/nojs/display/test_view/default/pagerOtherPagerTest.php64Drupal\views\Tests\Plugin\PagerTest->testStorePagerSettings()
Changed pager plugin, should change some textOtherPagerTest.php66Drupal\views\Tests\Plugin\PagerTest->testStorePagerSettings()
Failed to set field pager[type] to fullOtherPagerTest.php79Drupal\views\Tests\Plugin\PagerTest->testStorePagerSettings()
Found the Apply buttonOtherPagerTest.php79Drupal\views\Tests\Plugin\PagerTest->testStorePagerSettings()
Found the requested form fields at admin/structure/views/nojs/display/test_store_pager_settings/default/pagerOtherPagerTest.php79Drupal\views\Tests\Plugin\PagerTest->testStorePagerSettings()
"Full" foundOtherPagerTest.php81Drupal\views\Tests\Plugin\PagerTest->testStorePagerSettings()
Failed to set field pager_options[items_per_page] to 20OtherPagerTest.php86Drupal\views\Tests\Plugin\PagerTest->testStorePagerSettings()
Found the Apply buttonOtherPagerTest.php86Drupal\views\Tests\Plugin\PagerTest->testStorePagerSettings()
Found the requested form fields at admin/structure/views/nojs/display/test_store_pager_settings/default/pager_optionsOtherPagerTest.php86Drupal\views\Tests\Plugin\PagerTest->testStorePagerSettings()
"20 items" foundOtherPagerTest.php87Drupal\views\Tests\Plugin\PagerTest->testStorePagerSettings()
Found the Add Page buttonOtherPagerTest.php92Drupal\views\Tests\Plugin\PagerTest->testStorePagerSettings()
Found the requested form fields at admin/structure/views/view/test_store_pager_settings/editOtherPagerTest.php92Drupal\views\Tests\Plugin\PagerTest->testStorePagerSettings()
Failed to set field override[dropdown] to page_1OtherPagerTest.php96Drupal\views\Tests\Plugin\PagerTest->testStorePagerSettings()
Found the Apply buttonOtherPagerTest.php96Drupal\views\Tests\Plugin\PagerTest->testStorePagerSettings()
Found the requested form fields at admin/structure/views/nojs/display/test_store_pager_settings/page_1/pagerOtherPagerTest.php96Drupal\views\Tests\Plugin\PagerTest->testStorePagerSettings()
Failed to set field pager[type] to miniOtherPagerTest.php101Drupal\views\Tests\Plugin\PagerTest->testStorePagerSettings()
Found the Apply buttonOtherPagerTest.php101Drupal\views\Tests\Plugin\PagerTest->testStorePagerSettings()
Found the requested form fields at admin/structure/views/nojs/display/test_store_pager_settings/page_1/pagerOtherPagerTest.php101Drupal\views\Tests\Plugin\PagerTest->testStorePagerSettings()
Changed pager plugin, should change some textOtherPagerTest.php103Drupal\views\Tests\Plugin\PagerTest->testStorePagerSettings()
Failed to set field pager_options[items_per_page] to 10OtherPagerTest.php108Drupal\views\Tests\Plugin\PagerTest->testStorePagerSettings()
Found the Apply buttonOtherPagerTest.php108Drupal\views\Tests\Plugin\PagerTest->testStorePagerSettings()
Found the requested form fields at admin/structure/views/nojs/display/test_store_pager_settings/default/pager_optionsOtherPagerTest.php108Drupal\views\Tests\Plugin\PagerTest->testStorePagerSettings()
The default value has been changed.OtherPagerTest.php109Drupal\views\Tests\Plugin\PagerTest->testStorePagerSettings()
The original value remains unchanged.OtherPagerTest.php111Drupal\views\Tests\Plugin\PagerTest->testStorePagerSettings()
The test did not complete due to a fatal error.Completion checkPagerTest.php118Drupal\views\Tests\Plugin\PagerTest->testNoLimit()
ExpandDrupal\views\Tests\Plugin\StyleTableTest110
MessageGroupFilenameLineFunctionStatus
The test did not complete due to a fatal error.Completion checkStyleTableTest.php39Drupal\views\Tests\Plugin\StyleTableTest->testAccessibilitySettings()
ExpandDrupal\views\Tests\Plugin\StyleTest1010
MessageGroupFilenameLineFunctionStatus
The test did not complete due to a fatal error.Completion checkStyleTest.php224Drupal\views\Tests\Plugin\StyleTest->testCustomRowClasses()
ExpandDrupal\views\Tests\Wizard\BasicTest911
MessageGroupFilenameLineFunctionStatus
Drupal\Core\Config\StorageException: Failed to write configuration file: sites/default/files/simpletest/175141/config_active/field.field.body.yml in Drupal\Core\Config\FileStorage->write() (line 102 of /var/lib/drupaltestbot/sites/default/files/checkout/core/lib/Drupal/Core/Config/FileStorage.php). Drupal\Core\Config\FileStorage->write('field.field.body', Array) Drupal\Core\Config\CachedStorage->write('field.field.body', Array) Drupal\Core\Config\Config->save() Drupal\Core\Config\Entity\ConfigStorageController->save(Object) Drupal\Core\Entity\Entity->save() Drupal\field\Plugin\Core\Entity\Field->saveNew() Drupal\field\Plugin\Core\Entity\Field->save() node_add_body_field(Object) Drupal\simpletest\WebTestBase->drupalCreateContentType(Array) Drupal\views\Tests\Wizard\BasicTest->testViewsWizardAndListing() Drupal\simpletest\TestBase->run() simpletest_script_run_one_test('851', 'Drupal\views\Tests\Wizard\BasicTest') Uncaught exceptionFileStorage.php102Drupal\Core\Config\FileStorage->write()
The test did not complete due to a fatal error.Completion checkBasicTest.php146Drupal\views\Tests\Wizard\BasicTest->testWizardForm()
ExpandDrupal\views\Tests\Wizard\ItemsPerPageTest010
MessageGroupFilenameLineFunctionStatus
The test did not complete due to a fatal error.Completion checkItemsPerPageTest.php26Drupal\views\Tests\Wizard\ItemsPerPageTest->testItemsPerPage()
ExpandDrupal\views\Tests\Wizard\MenuTest010
MessageGroupFilenameLineFunctionStatus
The test did not complete due to a fatal error.Completion checkMenuTest.php26Drupal\views\Tests\Wizard\MenuTest->testMenus()
ExpandDrupal\views\Tests\Wizard\SortingTest010
MessageGroupFilenameLineFunctionStatus
The test did not complete due to a fatal error.Completion checkSortingTest.php26Drupal\views\Tests\Wizard\SortingTest->testSorting()
ExpandDrupal\views_ui\Tests\CachedDataUITest110
MessageGroupFilenameLineFunctionStatus
The test did not complete due to a fatal error.Completion checkCachedDataUITest.php33Drupal\views_ui\Tests\CachedDataUITest->testCacheData()
ExpandDrupal\views_ui\Tests\DefaultViewsTest9020
MessageGroupFilenameLineFunctionStatus
The custom view name got saved.OtherDefaultViewsTest.php98Drupal\views_ui\Tests\DefaultViewsTest->testDefaultViews()
The test did not complete due to a fatal error.Completion checkDefaultViewsTest.php132Drupal\views_ui\Tests\DefaultViewsTest->testSplitListing()
ExpandDrupal\views_ui\Tests\DisplayAttachmentTest010
MessageGroupFilenameLineFunctionStatus
The test did not complete due to a fatal error.Completion checkDisplayAttachmentTest.php35Drupal\views_ui\Tests\DisplayAttachmentTest->testAttachmentUI()
ExpandDrupal\views_ui\Tests\DisplayExtenderUITest010
MessageGroupFilenameLineFunctionStatus
The test did not complete due to a fatal error.Completion checkDisplayExtenderUITest.php33Drupal\views_ui\Tests\DisplayExtenderUITest->testDisplayExtenderUI()
ExpandDrupal\views_ui\Tests\DisplayPath010
MessageGroupFilenameLineFunctionStatus
The test did not complete due to a fatal error.Completion checkDisplayPath.php32Drupal\views_ui\Tests\DisplayPath->testPathUI()
ExpandDrupal\views_ui\Tests\DisplayTest010
MessageGroupFilenameLineFunctionStatus
The test did not complete due to a fatal error.Completion checkDisplayTest.php61Drupal\views_ui\Tests\DisplayTest->testRemoveDisplay()
ExpandDrupal\views_ui\Tests\ExposedFormUITest010
MessageGroupFilenameLineFunctionStatus
The test did not complete due to a fatal error.Completion checkExposedFormUITest.php45Drupal\views_ui\Tests\ExposedFormUITest->testExposedAdminUi()
ExpandDrupal\views_ui\Tests\HandlerTest110
MessageGroupFilenameLineFunctionStatus
The test did not complete due to a fatal error.Completion checkHandlerTest.php76Drupal\views_ui\Tests\HandlerTest->testUICRUD()
ExpandDrupal\views_ui\Tests\OverrideDisplaysTest110
MessageGroupFilenameLineFunctionStatus
The test did not complete due to a fatal error.Completion checkOverrideDisplaysTest.php26Drupal\views_ui\Tests\OverrideDisplaysTest->testOverrideDisplays()
ExpandDrupal\views_ui\Tests\PreviewTest010
MessageGroupFilenameLineFunctionStatus
The test did not complete due to a fatal error.Completion checkPreviewTest.php33Drupal\views_ui\Tests\PreviewTest->testPreviewContextual()
ExpandDrupal\views_ui\Tests\QueryTest010
MessageGroupFilenameLineFunctionStatus
The test did not complete due to a fatal error.Completion checkQueryTest.php46Drupal\views_ui\Tests\QueryTest->testQueryUI()
ExpandDrupal\views_ui\Tests\RearrangeFieldsTest010
MessageGroupFilenameLineFunctionStatus
The test did not complete due to a fatal error.Completion checkRearrangeFieldsTest.php64Drupal\views_ui\Tests\RearrangeFieldsTest->testRearrangeFields()
ExpandDrupal\views_ui\Tests\RedirectTest2410
MessageGroupFilenameLineFunctionStatus
Make sure the user got redirected to the expected page after changing the url of a page display.OtherRedirectTest.php56Drupal\views_ui\Tests\RedirectTest->testRedirect()
ExpandDrupal\views_ui\Tests\SettingsTest8510
MessageGroupFilenameLineFunctionStatus
Link with label Master not found.OtherSettingsTest.php71Drupal\views_ui\Tests\SettingsTest->testEditUI()
ExpandDrupal\views_ui\Tests\StyleUITest20215
MessageGroupFilenameLineFunctionStatus
mkdir(): No space left on deviceWarningMTimeProtectedFastFileStorage.php150Drupal\Component\PhpStorage\MTimeProtectedFastFileStorage->ensureDirectory()
chmod(): No such file or directoryWarningMTimeProtectedFastFileStorage.php152Drupal\Component\PhpStorage\MTimeProtectedFastFileStorage->ensureDirectory()
file_put_contents(/var/lib/drupaltestbot/sites/default/files/checkout/sites/default/files/simpletest/215082/php/twig/.htaccess): failed to open stream: No such file or directoryWarningMTimeProtectedFastFileStorage.php154Drupal\Component\PhpStorage\MTimeProtectedFastFileStorage->ensureDirectory()
simplexml_import_dom(): Invalid Nodetype to importsimplexml_import_dom(Object) Drupal\simpletest\WebTestBase->parse() Drupal\simpletest\WebTestBase->drupalPost('user', Array, 'Log in') Drupal\simpletest\WebTestBase->drupalLogin(Object) Drupal\views_ui\Tests\UITestBase->setUp() Drupal\simpletest\TestBase->run() simpletest_script_run_one_test('848', 'Drupal\views_ui\Tests\StyleUITest') WarningWebTestBase.php1200Drupal\simpletest\WebTestBase->parse()
Parsed page successfully.BrowserUITestBase.php46Drupal\views_ui\Tests\UITestBase->setUp()
User za888ym3 successfully logged in.User loginUITestBase.php46Drupal\views_ui\Tests\UITestBase->setUp()
The default style plugin selected in the UI should be unformatted list.BrowserStyleUITest.php44Drupal\views_ui\Tests\StyleUITest->testStyleUI()
Failed to set field style to test_styleOtherStyleUITest.php49Drupal\views_ui\Tests\StyleUITest->testStyleUI()
Found the Apply buttonOtherStyleUITest.php49Drupal\views_ui\Tests\StyleUITest->testStyleUI()
Found the requested form fields at OtherStyleUITest.php49Drupal\views_ui\Tests\StyleUITest->testStyleUI()
Make sure the custom settings form from the test plugin appears.BrowserStyleUITest.php50Drupal\views_ui\Tests\StyleUITest->testStyleUI()
Failed to set field style_options[test_option] to jKkDI47jOtherStyleUITest.php55Drupal\views_ui\Tests\StyleUITest->testStyleUI()
Found the Apply buttonOtherStyleUITest.php55Drupal\views_ui\Tests\StyleUITest->testStyleUI()
Found the requested form fields at OtherStyleUITest.php55Drupal\views_ui\Tests\StyleUITest->testStyleUI()
Make sure the custom settings form field has the expected value stored.BrowserStyleUITest.php57Drupal\views_ui\Tests\StyleUITest->testStyleUI()
Found the Save buttonOtherStyleUITest.php59Drupal\views_ui\Tests\StyleUITest->testStyleUI()
Found the requested form fields at admin/structure/views/view/test_view/editOtherStyleUITest.php59Drupal\views_ui\Tests\StyleUITest->testStyleUI()
Make sure the test style plugin is shown in the UIOtherStyleUITest.php60Drupal\views_ui\Tests\StyleUITest->testStyleUI()
Make sure that the test_style got saved as used style plugin.OtherStyleUITest.php65Drupal\views_ui\Tests\StyleUITest->testStyleUI()
Undefined index: test_optionDrupal\views_ui\Tests\StyleUITest->testStyleUI() Drupal\simpletest\TestBase->run() simpletest_script_run_one_test('848', 'Drupal\views_ui\Tests\StyleUITest') NoticeStyleUITest.php66Drupal\views_ui\Tests\StyleUITest->testStyleUI()
Make sure that the custom settings field got saved as expected.OtherStyleUITest.php66Drupal\views_ui\Tests\StyleUITest->testStyleUI()
Found the Add Page buttonOtherStyleUITest.php70Drupal\views_ui\Tests\StyleUITest->testStyleUI()
Found the requested form fields at admin/structure/views/view/test_view/editOtherStyleUITest.php70Drupal\views_ui\Tests\StyleUITest->testStyleUI()
Failed to set field row to fieldsOtherStyleUITest.php71Drupal\views_ui\Tests\StyleUITest->testStyleUI()
Found the Apply buttonOtherStyleUITest.php71Drupal\views_ui\Tests\StyleUITest->testStyleUI()
Found the requested form fields at admin/structure/views/nojs/display/test_view/page_1/rowOtherStyleUITest.php71Drupal\views_ui\Tests\StyleUITest->testStyleUI()

All

Test namePassFailException
Leaf40000
LeafDrupal\action\Tests\BulkFormTest4200
LeafDrupal\action\Tests\ConfigurationTest5100
LeafDrupal\aggregator\Tests\AddFeedTest7300
LeafDrupal\aggregator\Tests\AggregatorConfigurationTest3800
LeafDrupal\aggregator\Tests\AggregatorCronTest5500
LeafDrupal\aggregator\Tests\AggregatorRenderingTest22700
LeafDrupal\aggregator\Tests\CategorizeFeedItemTest6100
LeafDrupal\aggregator\Tests\CategorizeFeedTest2500
LeafDrupal\aggregator\Tests\FeedFetcherPluginTest6300
LeafDrupal\aggregator\Tests\FeedLanguageTest5700
LeafDrupal\aggregator\Tests\FeedParserTest9900
LeafDrupal\aggregator\Tests\FeedProcessorPluginTest15200
LeafDrupal\aggregator\Tests\ImportOpmlTest6800
LeafDrupal\aggregator\Tests\RemoveFeedItemTest27000
LeafDrupal\aggregator\Tests\RemoveFeedTest2500
LeafDrupal\aggregator\Tests\UpdateFeedItemTest7600
LeafDrupal\aggregator\Tests\UpdateFeedTest7600
LeafDrupal\aggregator\Tests\Views\IntegrationTest3600
LeafDrupal\ban\Tests\IpAddressBlockingTest4300
LeafDrupal\block\Tests\BlockAdminThemeTest1900
LeafDrupal\block\Tests\BlockCacheTest18500
LeafDrupal\block\Tests\BlockHiddenRegionTest1800
LeafDrupal\block\Tests\BlockHtmlIdTest1000
LeafDrupal\block\Tests\BlockInterfaceTest500
LeafDrupal\block\Tests\BlockInvalidRegionTest2400
LeafDrupal\block\Tests\BlockLanguageCacheTest8200
LeafDrupal\block\Tests\BlockLanguageTest5100
LeafDrupal\block\Tests\BlockLibrarySearchTest1900
LeafDrupal\block\Tests\BlockStorageUnitTest2000
LeafDrupal\block\Tests\BlockTemplateSuggestionsUnitTest300
LeafDrupal\block\Tests\BlockTest22100
LeafDrupal\block\Tests\BlockTitleXSSTest1500
LeafDrupal\block\Tests\BlockUiTest3700
LeafDrupal\block\Tests\NewDefaultThemeBlocksTest1700
LeafDrupal\block\Tests\NonDefaultBlockAdminTest1200
ExpandDrupal\block\Tests\Views\DisplayBlockTest4201
MessageGroupFilenameLineFunctionStatus
Drupal\Core\Config\StorageException: Failed to write configuration file: sites/default/files/simpletest/796764/config_active/block.block.stark.kjry4cil.yml in Drupal\Core\Config\FileStorage->write() (line 102 of /var/lib/drupaltestbot/sites/default/files/checkout/core/lib/Drupal/Core/Config/FileStorage.php). Drupal\Core\Config\FileStorage->write('block.block.stark.kjry4cil', Array) Drupal\Core\Config\CachedStorage->write('block.block.stark.kjry4cil', Array) Drupal\Core\Config\Config->save() Drupal\Core\Config\Entity\ConfigStorageController->save(Object) Drupal\Core\Entity\Entity->save() Drupal\simpletest\WebTestBase->drupalPlaceBlock('views_block:test_view_block-block_1', Array) Drupal\block\Tests\Views\DisplayBlockTest->testDeleteBlockDisplay() Drupal\simpletest\TestBase->run() simpletest_script_run_one_test('762', 'Drupal\block\Tests\Views\DisplayBlockTest') Uncaught exceptionFileStorage.php102Drupal\Core\Config\FileStorage->write()
LeafDrupal\book\Tests\BookTest63600
LeafDrupal\breakpoint\Tests\BreakpointAPITest600
LeafDrupal\breakpoint\Tests\BreakpointCRUDTest2100
LeafDrupal\breakpoint\Tests\BreakpointGroupAPITest400
LeafDrupal\breakpoint\Tests\BreakpointGroupCRUDTest1200
LeafDrupal\breakpoint\Tests\BreakpointMediaQueryTest200
LeafDrupal\breakpoint\Tests\BreakpointThemeTest2300
LeafDrupal\ckeditor\Tests\CKEditorAdminTest5800
LeafDrupal\ckeditor\Tests\CKEditorLoadingTest5100
LeafDrupal\ckeditor\Tests\CKEditorPluginManagerTest1600
LeafDrupal\ckeditor\Tests\CKEditorTest3700
LeafDrupal\color\Tests\ColorTest8700
LeafDrupal\comment\Tests\CommentActionsTest4800
LeafDrupal\comment\Tests\CommentAnonymousTest16300
LeafDrupal\comment\Tests\CommentApprovalTest15200
LeafDrupal\comment\Tests\CommentBlockTest19600
LeafDrupal\comment\Tests\CommentContentRebuildTest3300
LeafDrupal\comment\Tests\CommentCSSTest50100
LeafDrupal\comment\Tests\CommentFieldsTest9800
LeafDrupal\comment\Tests\CommentInterfaceTest24800
LeafDrupal\comment\Tests\CommentLanguageTest7300
ExpandDrupal\comment\Tests\CommentLinksTest109300
MessageGroupFilenameLineFunctionStatus
Changed environment:array ( 'authenticated' => false, 'comment count' => false, 'form' => 'below', 'user_register' => 'visitors', 'contact' => 'optional', 'comments' => 'open', 'access comments' => 0, 'post comments' => 0, 'skip comment approval' => 1, 'edit own comments' => 0, )DebugCommentLinksTest.php208Drupal\comment\Tests\CommentLinksTest->setEnvironment()
Changed environment:array ( 'authenticated' => true, 'comment count' => false, 'form' => 'below', 'user_register' => 'visitors', 'contact' => 'optional', 'comments' => 'open', 'access comments' => 0, 'post comments' => 0, 'skip comment approval' => 1, 'edit own comments' => 0, )DebugCommentLinksTest.php208Drupal\comment\Tests\CommentLinksTest->setEnvironment()
Changed environment:array ( 'authenticated' => false, 'comment count' => true, 'form' => 'below', 'user_register' => 'visitors', 'contact' => 'optional', 'comments' => 'open', 'access comments' => 0, 'post comments' => 0, 'skip comment approval' => 1, 'edit own comments' => 0, )DebugCommentLinksTest.php208Drupal\comment\Tests\CommentLinksTest->setEnvironment()
Changed environment:array ( 'authenticated' => true, 'comment count' => true, 'form' => 'below', 'user_register' => 'visitors', 'contact' => 'optional', 'comments' => 'open', 'access comments' => 0, 'post comments' => 0, 'skip comment approval' => 1, 'edit own comments' => 0, )DebugCommentLinksTest.php208Drupal\comment\Tests\CommentLinksTest->setEnvironment()
Changed environment:array ( 'authenticated' => false, 'comment count' => false, 'form' => 'below', 'user_register' => 'visitors', 'contact' => 'optional', 'comments' => 'open', 'access comments' => 1, 'post comments' => 0, 'skip comment approval' => 1, 'edit own comments' => 0, )DebugCommentLinksTest.php208Drupal\comment\Tests\CommentLinksTest->setEnvironment()
Changed environment:array ( 'authenticated' => true, 'comment count' => false, 'form' => 'below', 'user_register' => 'visitors', 'contact' => 'optional', 'comments' => 'open', 'access comments' => 1, 'post comments' => 0, 'skip comment approval' => 1, 'edit own comments' => 0, )DebugCommentLinksTest.php208Drupal\comment\Tests\CommentLinksTest->setEnvironment()
Changed environment:array ( 'authenticated' => false, 'comment count' => true, 'form' => 'below', 'user_register' => 'visitors', 'contact' => 'optional', 'comments' => 'open', 'access comments' => 1, 'post comments' => 0, 'skip comment approval' => 1, 'edit own comments' => 0, )DebugCommentLinksTest.php208Drupal\comment\Tests\CommentLinksTest->setEnvironment()
Changed environment:array ( 'authenticated' => true, 'comment count' => true, 'form' => 'below', 'user_register' => 'visitors', 'contact' => 'optional', 'comments' => 'open', 'access comments' => 1, 'post comments' => 0, 'skip comment approval' => 1, 'edit own comments' => 0, )DebugCommentLinksTest.php208Drupal\comment\Tests\CommentLinksTest->setEnvironment()
Changed environment:array ( 'authenticated' => false, 'comment count' => false, 'form' => 'below', 'user_register' => 'visitors', 'contact' => 'optional', 'comments' => 'open', 'access comments' => 0, 'post comments' => 1, 'skip comment approval' => 1, 'edit own comments' => 0, )DebugCommentLinksTest.php208Drupal\comment\Tests\CommentLinksTest->setEnvironment()
Changed environment:array ( 'authenticated' => true, 'comment count' => false, 'form' => 'below', 'user_register' => 'visitors', 'contact' => 'optional', 'comments' => 'open', 'access comments' => 0, 'post comments' => 1, 'skip comment approval' => 1, 'edit own comments' => 0, )DebugCommentLinksTest.php208Drupal\comment\Tests\CommentLinksTest->setEnvironment()
Changed environment:array ( 'authenticated' => false, 'comment count' => true, 'form' => 'below', 'user_register' => 'visitors', 'contact' => 'optional', 'comments' => 'open', 'access comments' => 0, 'post comments' => 1, 'skip comment approval' => 1, 'edit own comments' => 0, )DebugCommentLinksTest.php208Drupal\comment\Tests\CommentLinksTest->setEnvironment()
Changed environment:array ( 'authenticated' => true, 'comment count' => true, 'form' => 'below', 'user_register' => 'visitors', 'contact' => 'optional', 'comments' => 'open', 'access comments' => 0, 'post comments' => 1, 'skip comment approval' => 1, 'edit own comments' => 0, )DebugCommentLinksTest.php208Drupal\comment\Tests\CommentLinksTest->setEnvironment()
Changed environment:array ( 'authenticated' => false, 'comment count' => false, 'form' => 'below', 'user_register' => 'visitors', 'contact' => 'optional', 'comments' => 'open', 'access comments' => 1, 'post comments' => 1, 'skip comment approval' => 1, 'edit own comments' => 0, )DebugCommentLinksTest.php208Drupal\comment\Tests\CommentLinksTest->setEnvironment()
Changed environment:array ( 'authenticated' => true, 'comment count' => false, 'form' => 'below', 'user_register' => 'visitors', 'contact' => 'optional', 'comments' => 'open', 'access comments' => 1, 'post comments' => 1, 'skip comment approval' => 1, 'edit own comments' => 0, )DebugCommentLinksTest.php208Drupal\comment\Tests\CommentLinksTest->setEnvironment()
Changed environment:array ( 'authenticated' => false, 'comment count' => true, 'form' => 'below', 'user_register' => 'visitors', 'contact' => 'optional', 'comments' => 'open', 'access comments' => 1, 'post comments' => 1, 'skip comment approval' => 1, 'edit own comments' => 0, )DebugCommentLinksTest.php208Drupal\comment\Tests\CommentLinksTest->setEnvironment()
Changed environment:array ( 'authenticated' => true, 'comment count' => true, 'form' => 'below', 'user_register' => 'visitors', 'contact' => 'optional', 'comments' => 'open', 'access comments' => 1, 'post comments' => 1, 'skip comment approval' => 1, 'edit own comments' => 0, )DebugCommentLinksTest.php208Drupal\comment\Tests\CommentLinksTest->setEnvironment()
Changed environment:array ( 'authenticated' => false, 'comment count' => false, 'form' => 'separate page', 'user_register' => 'visitors', 'contact' => 'optional', 'comments' => 'open', 'access comments' => 0, 'post comments' => 0, 'skip comment approval' => 1, 'edit own comments' => 0, )DebugCommentLinksTest.php208Drupal\comment\Tests\CommentLinksTest->setEnvironment()
Changed environment:array ( 'authenticated' => true, 'comment count' => false, 'form' => 'separate page', 'user_register' => 'visitors', 'contact' => 'optional', 'comments' => 'open', 'access comments' => 0, 'post comments' => 0, 'skip comment approval' => 1, 'edit own comments' => 0, )DebugCommentLinksTest.php208Drupal\comment\Tests\CommentLinksTest->setEnvironment()
Changed environment:array ( 'authenticated' => false, 'comment count' => true, 'form' => 'separate page', 'user_register' => 'visitors', 'contact' => 'optional', 'comments' => 'open', 'access comments' => 0, 'post comments' => 0, 'skip comment approval' => 1, 'edit own comments' => 0, )DebugCommentLinksTest.php208Drupal\comment\Tests\CommentLinksTest->setEnvironment()
Changed environment:array ( 'authenticated' => true, 'comment count' => true, 'form' => 'separate page', 'user_register' => 'visitors', 'contact' => 'optional', 'comments' => 'open', 'access comments' => 0, 'post comments' => 0, 'skip comment approval' => 1, 'edit own comments' => 0, )DebugCommentLinksTest.php208Drupal\comment\Tests\CommentLinksTest->setEnvironment()
Changed environment:array ( 'authenticated' => false, 'comment count' => false, 'form' => 'separate page', 'user_register' => 'visitors', 'contact' => 'optional', 'comments' => 'open', 'access comments' => 1, 'post comments' => 0, 'skip comment approval' => 1, 'edit own comments' => 0, )DebugCommentLinksTest.php208Drupal\comment\Tests\CommentLinksTest->setEnvironment()
Changed environment:array ( 'authenticated' => true, 'comment count' => false, 'form' => 'separate page', 'user_register' => 'visitors', 'contact' => 'optional', 'comments' => 'open', 'access comments' => 1, 'post comments' => 0, 'skip comment approval' => 1, 'edit own comments' => 0, )DebugCommentLinksTest.php208Drupal\comment\Tests\CommentLinksTest->setEnvironment()
Changed environment:array ( 'authenticated' => false, 'comment count' => true, 'form' => 'separate page', 'user_register' => 'visitors', 'contact' => 'optional', 'comments' => 'open', 'access comments' => 1, 'post comments' => 0, 'skip comment approval' => 1, 'edit own comments' => 0, )DebugCommentLinksTest.php208Drupal\comment\Tests\CommentLinksTest->setEnvironment()
Changed environment:array ( 'authenticated' => true, 'comment count' => true, 'form' => 'separate page', 'user_register' => 'visitors', 'contact' => 'optional', 'comments' => 'open', 'access comments' => 1, 'post comments' => 0, 'skip comment approval' => 1, 'edit own comments' => 0, )DebugCommentLinksTest.php208Drupal\comment\Tests\CommentLinksTest->setEnvironment()
Changed environment:array ( 'authenticated' => false, 'comment count' => false, 'form' => 'separate page', 'user_register' => 'visitors', 'contact' => 'optional', 'comments' => 'open', 'access comments' => 0, 'post comments' => 1, 'skip comment approval' => 1, 'edit own comments' => 0, )DebugCommentLinksTest.php208Drupal\comment\Tests\CommentLinksTest->setEnvironment()
Changed environment:array ( 'authenticated' => true, 'comment count' => false, 'form' => 'separate page', 'user_register' => 'visitors', 'contact' => 'optional', 'comments' => 'open', 'access comments' => 0, 'post comments' => 1, 'skip comment approval' => 1, 'edit own comments' => 0, )DebugCommentLinksTest.php208Drupal\comment\Tests\CommentLinksTest->setEnvironment()
Changed environment:array ( 'authenticated' => false, 'comment count' => true, 'form' => 'separate page', 'user_register' => 'visitors', 'contact' => 'optional', 'comments' => 'open', 'access comments' => 0, 'post comments' => 1, 'skip comment approval' => 1, 'edit own comments' => 0, )DebugCommentLinksTest.php208Drupal\comment\Tests\CommentLinksTest->setEnvironment()
Changed environment:array ( 'authenticated' => true, 'comment count' => true, 'form' => 'separate page', 'user_register' => 'visitors', 'contact' => 'optional', 'comments' => 'open', 'access comments' => 0, 'post comments' => 1, 'skip comment approval' => 1, 'edit own comments' => 0, )DebugCommentLinksTest.php208Drupal\comment\Tests\CommentLinksTest->setEnvironment()
Changed environment:array ( 'authenticated' => false, 'comment count' => false, 'form' => 'separate page', 'user_register' => 'visitors', 'contact' => 'optional', 'comments' => 'open', 'access comments' => 1, 'post comments' => 1, 'skip comment approval' => 1, 'edit own comments' => 0, )DebugCommentLinksTest.php208Drupal\comment\Tests\CommentLinksTest->setEnvironment()
Changed environment:array ( 'authenticated' => true, 'comment count' => false, 'form' => 'separate page', 'user_register' => 'visitors', 'contact' => 'optional', 'comments' => 'open', 'access comments' => 1, 'post comments' => 1, 'skip comment approval' => 1, 'edit own comments' => 0, )DebugCommentLinksTest.php208Drupal\comment\Tests\CommentLinksTest->setEnvironment()
Changed environment:array ( 'authenticated' => false, 'comment count' => true, 'form' => 'separate page', 'user_register' => 'visitors', 'contact' => 'optional', 'comments' => 'open', 'access comments' => 1, 'post comments' => 1, 'skip comment approval' => 1, 'edit own comments' => 0, )DebugCommentLinksTest.php208Drupal\comment\Tests\CommentLinksTest->setEnvironment()
Changed environment:array ( 'authenticated' => true, 'comment count' => true, 'form' => 'separate page', 'user_register' => 'visitors', 'contact' => 'optional', 'comments' => 'open', 'access comments' => 1, 'post comments' => 1, 'skip comment approval' => 1, 'edit own comments' => 0, )DebugCommentLinksTest.php208Drupal\comment\Tests\CommentLinksTest->setEnvironment()
Changed environment:array ( 'authenticated' => false, 'comment count' => false, 'form' => 'below', 'user_register' => 'admin_only', 'contact' => 'optional', 'comments' => 'open', 'access comments' => 0, 'post comments' => 0, 'skip comment approval' => 1, 'edit own comments' => 0, )DebugCommentLinksTest.php208Drupal\comment\Tests\CommentLinksTest->setEnvironment()
Changed environment:array ( 'authenticated' => true, 'comment count' => false, 'form' => 'below', 'user_register' => 'admin_only', 'contact' => 'optional', 'comments' => 'open', 'access comments' => 0, 'post comments' => 0, 'skip comment approval' => 1, 'edit own comments' => 0, )DebugCommentLinksTest.php208Drupal\comment\Tests\CommentLinksTest->setEnvironment()
Changed environment:array ( 'authenticated' => false, 'comment count' => true, 'form' => 'below', 'user_register' => 'admin_only', 'contact' => 'optional', 'comments' => 'open', 'access comments' => 0, 'post comments' => 0, 'skip comment approval' => 1, 'edit own comments' => 0, )DebugCommentLinksTest.php208Drupal\comment\Tests\CommentLinksTest->setEnvironment()
Changed environment:array ( 'authenticated' => true, 'comment count' => true, 'form' => 'below', 'user_register' => 'admin_only', 'contact' => 'optional', 'comments' => 'open', 'access comments' => 0, 'post comments' => 0, 'skip comment approval' => 1, 'edit own comments' => 0, )DebugCommentLinksTest.php208Drupal\comment\Tests\CommentLinksTest->setEnvironment()
Changed environment:array ( 'authenticated' => false, 'comment count' => false, 'form' => 'below', 'user_register' => 'admin_only', 'contact' => 'optional', 'comments' => 'open', 'access comments' => 1, 'post comments' => 0, 'skip comment approval' => 1, 'edit own comments' => 0, )DebugCommentLinksTest.php208Drupal\comment\Tests\CommentLinksTest->setEnvironment()
Changed environment:array ( 'authenticated' => true, 'comment count' => false, 'form' => 'below', 'user_register' => 'admin_only', 'contact' => 'optional', 'comments' => 'open', 'access comments' => 1, 'post comments' => 0, 'skip comment approval' => 1, 'edit own comments' => 0, )DebugCommentLinksTest.php208Drupal\comment\Tests\CommentLinksTest->setEnvironment()
Changed environment:array ( 'authenticated' => false, 'comment count' => true, 'form' => 'below', 'user_register' => 'admin_only', 'contact' => 'optional', 'comments' => 'open', 'access comments' => 1, 'post comments' => 0, 'skip comment approval' => 1, 'edit own comments' => 0, )DebugCommentLinksTest.php208Drupal\comment\Tests\CommentLinksTest->setEnvironment()
Changed environment:array ( 'authenticated' => true, 'comment count' => true, 'form' => 'below', 'user_register' => 'admin_only', 'contact' => 'optional', 'comments' => 'open', 'access comments' => 1, 'post comments' => 0, 'skip comment approval' => 1, 'edit own comments' => 0, )DebugCommentLinksTest.php208Drupal\comment\Tests\CommentLinksTest->setEnvironment()
Changed environment:array ( 'authenticated' => false, 'comment count' => false, 'form' => 'below', 'user_register' => 'admin_only', 'contact' => 'optional', 'comments' => 'open', 'access comments' => 0, 'post comments' => 1, 'skip comment approval' => 1, 'edit own comments' => 0, )DebugCommentLinksTest.php208Drupal\comment\Tests\CommentLinksTest->setEnvironment()
Changed environment:array ( 'authenticated' => true, 'comment count' => false, 'form' => 'below', 'user_register' => 'admin_only', 'contact' => 'optional', 'comments' => 'open', 'access comments' => 0, 'post comments' => 1, 'skip comment approval' => 1, 'edit own comments' => 0, )DebugCommentLinksTest.php208Drupal\comment\Tests\CommentLinksTest->setEnvironment()
Changed environment:array ( 'authenticated' => false, 'comment count' => true, 'form' => 'below', 'user_register' => 'admin_only', 'contact' => 'optional', 'comments' => 'open', 'access comments' => 0, 'post comments' => 1, 'skip comment approval' => 1, 'edit own comments' => 0, )DebugCommentLinksTest.php208Drupal\comment\Tests\CommentLinksTest->setEnvironment()
Changed environment:array ( 'authenticated' => true, 'comment count' => true, 'form' => 'below', 'user_register' => 'admin_only', 'contact' => 'optional', 'comments' => 'open', 'access comments' => 0, 'post comments' => 1, 'skip comment approval' => 1, 'edit own comments' => 0, )DebugCommentLinksTest.php208Drupal\comment\Tests\CommentLinksTest->setEnvironment()
Changed environment:array ( 'authenticated' => false, 'comment count' => false, 'form' => 'below', 'user_register' => 'admin_only', 'contact' => 'optional', 'comments' => 'open', 'access comments' => 1, 'post comments' => 1, 'skip comment approval' => 1, 'edit own comments' => 0, )DebugCommentLinksTest.php208Drupal\comment\Tests\CommentLinksTest->setEnvironment()
Changed environment:array ( 'authenticated' => true, 'comment count' => false, 'form' => 'below', 'user_register' => 'admin_only', 'contact' => 'optional', 'comments' => 'open', 'access comments' => 1, 'post comments' => 1, 'skip comment approval' => 1, 'edit own comments' => 0, )DebugCommentLinksTest.php208Drupal\comment\Tests\CommentLinksTest->setEnvironment()
Changed environment:array ( 'authenticated' => false, 'comment count' => true, 'form' => 'below', 'user_register' => 'admin_only', 'contact' => 'optional', 'comments' => 'open', 'access comments' => 1, 'post comments' => 1, 'skip comment approval' => 1, 'edit own comments' => 0, )DebugCommentLinksTest.php208Drupal\comment\Tests\CommentLinksTest->setEnvironment()
Changed environment:array ( 'authenticated' => true, 'comment count' => true, 'form' => 'below', 'user_register' => 'admin_only', 'contact' => 'optional', 'comments' => 'open', 'access comments' => 1, 'post comments' => 1, 'skip comment approval' => 1, 'edit own comments' => 0, )DebugCommentLinksTest.php208Drupal\comment\Tests\CommentLinksTest->setEnvironment()
Changed environment:array ( 'authenticated' => false, 'comment count' => false, 'form' => 'separate page', 'user_register' => 'admin_only', 'contact' => 'optional', 'comments' => 'open', 'access comments' => 0, 'post comments' => 0, 'skip comment approval' => 1, 'edit own comments' => 0, )DebugCommentLinksTest.php208Drupal\comment\Tests\CommentLinksTest->setEnvironment()
Changed environment:array ( 'authenticated' => true, 'comment count' => false, 'form' => 'separate page', 'user_register' => 'admin_only', 'contact' => 'optional', 'comments' => 'open', 'access comments' => 0, 'post comments' => 0, 'skip comment approval' => 1, 'edit own comments' => 0, )DebugCommentLinksTest.php208Drupal\comment\Tests\CommentLinksTest->setEnvironment()
Changed environment:array ( 'authenticated' => false, 'comment count' => true, 'form' => 'separate page', 'user_register' => 'admin_only', 'contact' => 'optional', 'comments' => 'open', 'access comments' => 0, 'post comments' => 0, 'skip comment approval' => 1, 'edit own comments' => 0, )DebugCommentLinksTest.php208Drupal\comment\Tests\CommentLinksTest->setEnvironment()
Changed environment:array ( 'authenticated' => true, 'comment count' => true, 'form' => 'separate page', 'user_register' => 'admin_only', 'contact' => 'optional', 'comments' => 'open', 'access comments' => 0, 'post comments' => 0, 'skip comment approval' => 1, 'edit own comments' => 0, )DebugCommentLinksTest.php208Drupal\comment\Tests\CommentLinksTest->setEnvironment()
Changed environment:array ( 'authenticated' => false, 'comment count' => false, 'form' => 'separate page', 'user_register' => 'admin_only', 'contact' => 'optional', 'comments' => 'open', 'access comments' => 1, 'post comments' => 0, 'skip comment approval' => 1, 'edit own comments' => 0, )DebugCommentLinksTest.php208Drupal\comment\Tests\CommentLinksTest->setEnvironment()
Changed environment:array ( 'authenticated' => true, 'comment count' => false, 'form' => 'separate page', 'user_register' => 'admin_only', 'contact' => 'optional', 'comments' => 'open', 'access comments' => 1, 'post comments' => 0, 'skip comment approval' => 1, 'edit own comments' => 0, )DebugCommentLinksTest.php208Drupal\comment\Tests\CommentLinksTest->setEnvironment()
Changed environment:array ( 'authenticated' => false, 'comment count' => true, 'form' => 'separate page', 'user_register' => 'admin_only', 'contact' => 'optional', 'comments' => 'open', 'access comments' => 1, 'post comments' => 0, 'skip comment approval' => 1, 'edit own comments' => 0, )DebugCommentLinksTest.php208Drupal\comment\Tests\CommentLinksTest->setEnvironment()
Changed environment:array ( 'authenticated' => true, 'comment count' => true, 'form' => 'separate page', 'user_register' => 'admin_only', 'contact' => 'optional', 'comments' => 'open', 'access comments' => 1, 'post comments' => 0, 'skip comment approval' => 1, 'edit own comments' => 0, )DebugCommentLinksTest.php208Drupal\comment\Tests\CommentLinksTest->setEnvironment()
Changed environment:array ( 'authenticated' => false, 'comment count' => false, 'form' => 'separate page', 'user_register' => 'admin_only', 'contact' => 'optional', 'comments' => 'open', 'access comments' => 0, 'post comments' => 1, 'skip comment approval' => 1, 'edit own comments' => 0, )DebugCommentLinksTest.php208Drupal\comment\Tests\CommentLinksTest->setEnvironment()
Changed environment:array ( 'authenticated' => true, 'comment count' => false, 'form' => 'separate page', 'user_register' => 'admin_only', 'contact' => 'optional', 'comments' => 'open', 'access comments' => 0, 'post comments' => 1, 'skip comment approval' => 1, 'edit own comments' => 0, )DebugCommentLinksTest.php208Drupal\comment\Tests\CommentLinksTest->setEnvironment()
Changed environment:array ( 'authenticated' => false, 'comment count' => true, 'form' => 'separate page', 'user_register' => 'admin_only', 'contact' => 'optional', 'comments' => 'open', 'access comments' => 0, 'post comments' => 1, 'skip comment approval' => 1, 'edit own comments' => 0, )DebugCommentLinksTest.php208Drupal\comment\Tests\CommentLinksTest->setEnvironment()
Changed environment:array ( 'authenticated' => true, 'comment count' => true, 'form' => 'separate page', 'user_register' => 'admin_only', 'contact' => 'optional', 'comments' => 'open', 'access comments' => 0, 'post comments' => 1, 'skip comment approval' => 1, 'edit own comments' => 0, )DebugCommentLinksTest.php208Drupal\comment\Tests\CommentLinksTest->setEnvironment()
Changed environment:array ( 'authenticated' => false, 'comment count' => false, 'form' => 'separate page', 'user_register' => 'admin_only', 'contact' => 'optional', 'comments' => 'open', 'access comments' => 1, 'post comments' => 1, 'skip comment approval' => 1, 'edit own comments' => 0, )DebugCommentLinksTest.php208Drupal\comment\Tests\CommentLinksTest->setEnvironment()
Changed environment:array ( 'authenticated' => true, 'comment count' => false, 'form' => 'separate page', 'user_register' => 'admin_only', 'contact' => 'optional', 'comments' => 'open', 'access comments' => 1, 'post comments' => 1, 'skip comment approval' => 1, 'edit own comments' => 0, )DebugCommentLinksTest.php208Drupal\comment\Tests\CommentLinksTest->setEnvironment()
Changed environment:array ( 'authenticated' => false, 'comment count' => true, 'form' => 'separate page', 'user_register' => 'admin_only', 'contact' => 'optional', 'comments' => 'open', 'access comments' => 1, 'post comments' => 1, 'skip comment approval' => 1, 'edit own comments' => 0, )DebugCommentLinksTest.php208Drupal\comment\Tests\CommentLinksTest->setEnvironment()
Changed environment:array ( 'authenticated' => true, 'comment count' => true, 'form' => 'separate page', 'user_register' => 'admin_only', 'contact' => 'optional', 'comments' => 'open', 'access comments' => 1, 'post comments' => 1, 'skip comment approval' => 1, 'edit own comments' => 0, )DebugCommentLinksTest.php208Drupal\comment\Tests\CommentLinksTest->setEnvironment()
LeafDrupal\comment\Tests\CommentNewIndicatorTest4200
LeafDrupal\comment\Tests\CommentNodeAccessTest5700
LeafDrupal\comment\Tests\CommentNodeChangesTest2400
LeafDrupal\comment\Tests\CommentPagerTest21300
LeafDrupal\comment\Tests\CommentPreviewTest10000
LeafDrupal\comment\Tests\CommentRssTest2600
LeafDrupal\comment\Tests\CommentStatisticsTest9800
LeafDrupal\comment\Tests\CommentThreadingTest15900
LeafDrupal\comment\Tests\CommentTokenReplaceTest6600
LeafDrupal\comment\Tests\CommentTranslationUITest18300
LeafDrupal\comment\Tests\CommentUninstallTest800
LeafDrupal\comment\Tests\Views\ArgumentUserUIDTest900
LeafDrupal\comment\Tests\Views\CommentRowTest1100
LeafDrupal\comment\Tests\Views\FilterUserUIDTest900
LeafDrupal\comment\Tests\Views\RowRssTest1200
ExpandDrupal\comment\Tests\Views\WizardTest12274
MessageGroupFilenameLineFunctionStatus
The test did not complete due to a fatal error.Completion checkWizardTest.php38Drupal\comment\Tests\Views\WizardTest->testCommentWizard()
mkdir(): No space left on deviceWarningMTimeProtectedFastFileStorage.php150Drupal\Component\PhpStorage\MTimeProtectedFastFileStorage->ensureDirectory()
chmod(): No such file or directoryWarningMTimeProtectedFastFileStorage.php152Drupal\Component\PhpStorage\MTimeProtectedFastFileStorage->ensureDirectory()
file_put_contents(/var/lib/drupaltestbot/sites/default/files/checkout/sites/default/files/simpletest/785436/php/twig/.htaccess): failed to open stream: No such file or directoryWarningMTimeProtectedFastFileStorage.php154Drupal\Component\PhpStorage\MTimeProtectedFastFileStorage->ensureDirectory()
simplexml_import_dom(): Invalid Nodetype to importsimplexml_import_dom(Object) Drupal\simpletest\WebTestBase->parse() Drupal\simpletest\WebTestBase->drupalPost('user', Array, 'Log in') Drupal\simpletest\WebTestBase->drupalLogin(Object) Drupal\views\Tests\Wizard\WizardTestBase->setUp() Drupal\simpletest\TestBase->run() simpletest_script_run_one_test('850', 'Drupal\comment\Tests\Views\WizardTest') WarningWebTestBase.php1200Drupal\simpletest\WebTestBase->parse()
Parsed page successfully.BrowserWizardTestBase.php29Drupal\views\Tests\Wizard\WizardTestBase->setUp()
User u8x47C0h successfully logged in.User loginWizardTestBase.php29Drupal\views\Tests\Wizard\WizardTestBase->setUp()
Failed to set field label to ucjbMIazDmVWUIKjOtherWizardTest.php48Drupal\comment\Tests\Views\WizardTest->testCommentWizard()
Failed to set field id to yhxrq8qoqwojqcmhOtherWizardTest.php48Drupal\comment\Tests\Views\WizardTest->testCommentWizard()
Failed to set field show[wizard_key] to commentOtherWizardTest.php48Drupal\comment\Tests\Views\WizardTest->testCommentWizard()
Failed to set field page[create] to 1OtherWizardTest.php48Drupal\comment\Tests\Views\WizardTest->testCommentWizard()
Failed to set field page[path] to hDXCoWggI6a9XVTHOtherWizardTest.php48Drupal\comment\Tests\Views\WizardTest->testCommentWizard()
Found the Save and edit buttonOtherWizardTest.php48Drupal\comment\Tests\Views\WizardTest->testCommentWizard()
Found the requested form fields at admin/structure/views/addOtherWizardTest.php48Drupal\comment\Tests\Views\WizardTest->testCommentWizard()
Make sure the view saving was successful and the browser got redirected to the edit page.OtherWizardTest.php49Drupal\comment\Tests\Views\WizardTest->testCommentWizard()
Failed to set field label to ucjbMIazDmVWUIKjOtherWizardTest.php55Drupal\comment\Tests\Views\WizardTest->testCommentWizard()
Failed to set field id to yhxrq8qoqwojqcmhOtherWizardTest.php55Drupal\comment\Tests\Views\WizardTest->testCommentWizard()
Failed to set field show[wizard_key] to commentOtherWizardTest.php55Drupal\comment\Tests\Views\WizardTest->testCommentWizard()
Failed to set field page[create] to 1OtherWizardTest.php55Drupal\comment\Tests\Views\WizardTest->testCommentWizard()
Failed to set field page[path] to hDXCoWggI6a9XVTHOtherWizardTest.php55Drupal\comment\Tests\Views\WizardTest->testCommentWizard()
Found the Update "of type" choice buttonOtherWizardTest.php55Drupal\comment\Tests\Views\WizardTest->testCommentWizard()
Found the requested form fields at admin/structure/views/addOtherWizardTest.php55Drupal\comment\Tests\Views\WizardTest->testCommentWizard()
Value array ( ) is equal to value array ( 0 => 'comment', 1 => 'fields', ).OtherWizardTest.php68Drupal\comment\Tests\Views\WizardTest->testCommentWizard()
Failed to set field label to ucjbMIazDmVWUIKjOtherWizardTest.php71Drupal\comment\Tests\Views\WizardTest->testCommentWizard()
Failed to set field id to vglfwxsry2eyxoqsOtherWizardTest.php71Drupal\comment\Tests\Views\WizardTest->testCommentWizard()
Failed to set field show[wizard_key] to commentOtherWizardTest.php71Drupal\comment\Tests\Views\WizardTest->testCommentWizard()
Failed to set field page[create] to 1OtherWizardTest.php71Drupal\comment\Tests\Views\WizardTest->testCommentWizard()
Failed to set field page[path] to hDXCoWggI6a9XVTHOtherWizardTest.php71Drupal\comment\Tests\Views\WizardTest->testCommentWizard()
Found the Save and edit buttonOtherWizardTest.php71Drupal\comment\Tests\Views\WizardTest->testCommentWizard()
Found the requested form fields at OtherWizardTest.php71Drupal\comment\Tests\Views\WizardTest->testCommentWizard()
Make sure the view saving was successful and the browser got redirected to the edit page.OtherWizardTest.php72Drupal\comment\Tests\Views\WizardTest->testCommentWizard()
LeafDrupal\config\Tests\ConfigCRUDTest3200
LeafDrupal\config\Tests\ConfigDiffTest1200
LeafDrupal\config\Tests\ConfigEntityListTest7100
LeafDrupal\config\Tests\ConfigEntityStatusTest600
LeafDrupal\config\Tests\ConfigEntityStatusUITest1500
LeafDrupal\config\Tests\ConfigEntityTest13600
LeafDrupal\config\Tests\ConfigEntityUnitTest600
LeafDrupal\config\Tests\ConfigExportUITest1800
LeafDrupal\config\Tests\ConfigFileContentTest3300
LeafDrupal\config\Tests\ConfigImporterTest4800
LeafDrupal\config\Tests\ConfigImportUITest6100
LeafDrupal\config\Tests\ConfigInstallTest1400
LeafDrupal\config\Tests\ConfigInstallWebTest1700
LeafDrupal\config\Tests\ConfigLocaleOverride4400
LeafDrupal\config\Tests\ConfigLocaleOverrideWebTest9200
LeafDrupal\config\Tests\ConfigOverrideTest2600
LeafDrupal\config\Tests\ConfigSchemaTest2900
LeafDrupal\config\Tests\ConfigSnapshotTest900
LeafDrupal\config\Tests\ConfigUpgradeTest1200
LeafDrupal\config\Tests\Storage\DatabaseStorageTest2200
LeafDrupal\config\Tests\Storage\FileStorageTest2400
LeafDrupal\contact\Tests\ContactAuthenticatedUserTest1300
LeafDrupal\contact\Tests\ContactPersonalTest23000
LeafDrupal\contact\Tests\ContactSitewideTest36500
LeafDrupal\contact\Tests\ContactUpgradePathTest7100
LeafDrupal\contact\Tests\MessageEntityTest1200
LeafDrupal\contact\Tests\Views\ContactFieldsTest600
LeafDrupal\contact\Tests\Views\ContactLinkTest5300
LeafDrupal\contextual\Tests\ContextualDynamicContextTest12300
LeafDrupal\contextual\Tests\ContextualUnitTest1000
LeafDrupal\custom_block\Tests\CustomBlockBuildContentTest500
LeafDrupal\custom_block\Tests\CustomBlockCreationTest8800
LeafDrupal\custom_block\Tests\CustomBlockFieldTest3800
LeafDrupal\custom_block\Tests\CustomBlockLoadHooksTest1600
LeafDrupal\custom_block\Tests\CustomBlockPageViewTest2400
LeafDrupal\custom_block\Tests\CustomBlockRevisionsTest2600
LeafDrupal\custom_block\Tests\CustomBlockSaveTest3300
LeafDrupal\custom_block\Tests\CustomBlockTranslationUITest12800
LeafDrupal\custom_block\Tests\CustomBlockTypeTest7200
LeafDrupal\custom_block\Tests\PageEditTest3000
LeafDrupal\datetime\Tests\DatetimeFieldTest13100
LeafDrupal\dblog\Tests\DbLogTest37700
LeafDrupal\editor\Tests\EditIntegrationTest2600
LeafDrupal\editor\Tests\EditorAdminTest8500
LeafDrupal\editor\Tests\EditorLoadingTest6600
LeafDrupal\editor\Tests\EditorManagerTest1100
LeafDrupal\edit\Tests\EditLoadingTest5600
LeafDrupal\edit\Tests\EditorSelectionTest2300
LeafDrupal\edit\Tests\MetadataGeneratorTest1400
LeafDrupal\email\Tests\EmailFieldTest1900
LeafDrupal\email\Tests\EmailItemTest1100
LeafDrupal\entity\Tests\EntityDisplayTest5100
LeafDrupal\entity\Tests\EntityFormDisplayTest1700
LeafDrupal\entity_reference\Tests\EntityReferenceAdminTest2900
LeafDrupal\entity_reference\Tests\EntityReferenceAutocompleteTest1000
LeafDrupal\entity_reference\Tests\EntityReferenceAutoCreateTest1800
LeafDrupal\entity_reference\Tests\EntityReferenceItemTest2700
LeafDrupal\entity_reference\Tests\EntityReferenceSelectionAccessTest6900
LeafDrupal\entity_reference\Tests\EntityReferenceSelectionSortTest700
LeafDrupal\entity_reference\Tests\Views\SelectionTest300
LeafDrupal\field\Tests\ActiveTest1400
LeafDrupal\field\Tests\BulkDeleteTest11000
LeafDrupal\field\Tests\CrudTest9400
LeafDrupal\field\Tests\DisplayApiTest6200
LeafDrupal\field\Tests\FieldAccessTest2100
LeafDrupal\field\Tests\FieldAttachOtherTest8300
LeafDrupal\field\Tests\FieldAttachStorageTest13000
LeafDrupal\field\Tests\FieldImportChangeTest700
LeafDrupal\field\Tests\FieldImportCreateTest3500
LeafDrupal\field\Tests\FieldImportDeleteTest1900
LeafDrupal\field\Tests\FieldInfoTest10600
LeafDrupal\field\Tests\FieldInstanceCrudTest4000
LeafDrupal\field\Tests\FieldValidationTest1500
LeafDrupal\field\Tests\FormTest23700
LeafDrupal\field\Tests\NestedFormTest7200
LeafDrupal\field\Tests\ShapeItemTest1500
LeafDrupal\field\Tests\TestItemTest1100
LeafDrupal\field\Tests\TranslationTest4400
LeafDrupal\field\Tests\TranslationWebTest2300
LeafDrupal\field\Tests\Views\ApiDataTest1500
LeafDrupal\field\Tests\Views\FieldUITest2800
LeafDrupal\field\Tests\Views\HandlerFieldFieldTest2400
LeafDrupal\field_sql_storage\Tests\FieldSqlStorageTest13400
LeafDrupal\field_ui\Tests\FieldUIRouteTest1300
LeafDrupal\field_ui\Tests\ManageDisplayTest14900
LeafDrupal\field_ui\Tests\ManageFieldsTest39800
LeafDrupal\file\Tests\CopyTest11000
LeafDrupal\file\Tests\DeleteTest2400
LeafDrupal\file\Tests\DownloadTest4500
LeafDrupal\file\Tests\FileFieldDisplayTest5400
LeafDrupal\file\Tests\FileFieldPathTest2800
LeafDrupal\file\Tests\FileFieldRevisionTest6800
LeafDrupal\file\Tests\FileFieldRSSContentTest2400
LeafDrupal\file\Tests\FileFieldValidateTest12100
LeafDrupal\file\Tests\FileFieldWidgetTest39900
LeafDrupal\file\Tests\FileItemTest1700
LeafDrupal\file\Tests\FileManagedFileElementTest54200
LeafDrupal\file\Tests\FilePrivateTest3800
LeafDrupal\file\Tests\FileTokenReplaceTest3600
LeafDrupal\file\Tests\LoadTest5800
LeafDrupal\file\Tests\MoveTest15000
LeafDrupal\file\Tests\RemoteFileSaveUploadTest27000
LeafDrupal\file\Tests\SaveDataTest15400
LeafDrupal\file\Tests\SaveTest1600
LeafDrupal\file\Tests\SaveUploadTest36000
LeafDrupal\file\Tests\SpaceUsedTest1300
LeafDrupal\file\Tests\UsageTest5800
LeafDrupal\file\Tests\ValidateTest2400
LeafDrupal\file\Tests\ValidatorTest3700
LeafDrupal\file\Tests\Views\ExtensionViewsFieldTest1200
LeafDrupal\filter\Tests\FilterAdminTest19800
LeafDrupal\filter\Tests\FilterAPITest1500
LeafDrupal\filter\Tests\FilterCrudTest13800
LeafDrupal\filter\Tests\FilterDefaultConfigTest3000
LeafDrupal\filter\Tests\FilterDefaultFormatTest3300
LeafDrupal\filter\Tests\FilterFormatAccessTest28400
LeafDrupal\filter\Tests\FilterHooksTest3300
LeafDrupal\filter\Tests\FilterHtmlImageSecureTest4600
LeafDrupal\filter\Tests\FilterNoFormatTest100
LeafDrupal\filter\Tests\FilterSecurityTest4000
LeafDrupal\filter\Tests\FilterSettingsTest1300
LeafDrupal\filter\Tests\FilterUnitTest17800
LeafDrupal\forum\Tests\ForumBlockTest12200
LeafDrupal\forum\Tests\ForumIndexTest2700
LeafDrupal\forum\Tests\ForumNodeAccessTest5100
LeafDrupal\forum\Tests\ForumTest65000
LeafDrupal\forum\Tests\ForumUninstallTest600
LeafDrupal\forum\Tests\Views\ForumIntegrationTest200
LeafDrupal\hal\Tests\DenormalizeTest2700
LeafDrupal\hal\Tests\NormalizeTest1300
LeafDrupal\help\Tests\HelpTest30500
LeafDrupal\help\Tests\NoHelpTest1200
LeafDrupal\history\Tests\Views\HistoryTimestampTest1200
LeafDrupal\image\Tests\FileMoveTest400
LeafDrupal\image\Tests\ImageAdminStylesTest22500
LeafDrupal\image\Tests\ImageDimensionsTest5600
LeafDrupal\image\Tests\ImageEffectsTest4300
LeafDrupal\image\Tests\ImageFieldDefaultImagesTest4000
LeafDrupal\image\Tests\ImageFieldDisplayTest15900
LeafDrupal\image\Tests\ImageFieldValidateTest3800
LeafDrupal\image\Tests\ImageItemTest2100
LeafDrupal\image\Tests\ImageStyleFlushTest4100
LeafDrupal\image\Tests\ImageStylesPathAndUrlTest13900
LeafDrupal\image\Tests\ImageThemeFunctionTest500
LeafDrupal\language\Tests\Condition\LanguageConditionTest1500
LeafDrupal\language\Tests\LanguageBrowserDetectionUnitTest10700
LeafDrupal\language\Tests\LanguageConfigurationElementTest5400
LeafDrupal\language\Tests\LanguageConfigurationTest7500
LeafDrupal\language\Tests\LanguageCustomLanguageConfigurationTest3600
LeafDrupal\language\Tests\LanguageDependencyInjectionTest1700
LeafDrupal\language\Tests\LanguageListTest10200
LeafDrupal\language\Tests\LanguageNegotiationInfoTest4900
LeafDrupal\language\Tests\LanguagePathMonolingualTest3500
LeafDrupal\language\Tests\LanguageSwitchingTest4900
LeafDrupal\language\Tests\LanguageUILanguageNegotiationTest14500
LeafDrupal\language\Tests\LanguageUrlRewritingTest4700
LeafDrupal\language\Tests\Views\ArgumentLanguageTest800
LeafDrupal\language\Tests\Views\FieldLanguageTest800
LeafDrupal\language\Tests\Views\FilterLanguageTest800
LeafDrupal\layout\Tests\DisplayInternalLogicTest1100
LeafDrupal\layout\Tests\LayoutDerivativesTest2400
LeafDrupal\link\Tests\LinkFieldTest14400
LeafDrupal\link\Tests\LinkFieldUITest2100
LeafDrupal\link\Tests\LinkItemTest1800
LeafDrupal\locale\Tests\LocaleConfigTranslationTest13600
LeafDrupal\locale\Tests\LocaleContentTest52500
LeafDrupal\locale\Tests\LocaleExportTest5700
LeafDrupal\locale\Tests\LocaleImportFunctionalTest26900
LeafDrupal\locale\Tests\LocaleJavascriptTranslation6600
LeafDrupal\locale\Tests\LocaleLibraryInfoAlterTest200
LeafDrupal\locale\Tests\LocalePathTest11900
LeafDrupal\locale\Tests\LocalePluralFormatTest16000
LeafDrupal\locale\Tests\LocaleStringTest2600
LeafDrupal\locale\Tests\LocaleTranslationTest100
LeafDrupal\locale\Tests\LocaleTranslationUiTest70100
LeafDrupal\locale\Tests\LocaleUninstallFrenchTest3400
LeafDrupal\locale\Tests\LocaleUninstallTest3400
LeafDrupal\locale\Tests\LocaleUpdateInterfaceTest10800
LeafDrupal\locale\Tests\LocaleUpdateTest131100
LeafDrupal\menu\Tests\MenuLanguageTest5800
LeafDrupal\menu\Tests\MenuNodeTest7500
LeafDrupal\menu\Tests\MenuTest193500
LeafDrupal\minimal\Tests\MinimalTest1600
LeafDrupal\node\Tests\Condition\NodeConditionTest1500
LeafDrupal\node\Tests\MultiStepNodeFormBasicOptionsTest1700
LeafDrupal\node\Tests\NodeAccessBaseTableTest15900
LeafDrupal\node\Tests\NodeAccessFieldTest5000
LeafDrupal\node\Tests\NodeAccessLanguageAwareCombinationTest14200
LeafDrupal\node\Tests\NodeAccessLanguageAwareTest9100
LeafDrupal\node\Tests\NodeAccessLanguageTest9800
LeafDrupal\node\Tests\NodeAccessPagerTest3000
LeafDrupal\node\Tests\NodeAccessRebuildTest1900
LeafDrupal\node\Tests\NodeAccessRecordsTest2600
LeafDrupal\node\Tests\NodeAccessTest3400
LeafDrupal\node\Tests\NodeAdminTest15200
LeafDrupal\node\Tests\NodeBlockFunctionalTest6300
LeafDrupal\node\Tests\NodeBuildContentTest400
LeafDrupal\node\Tests\NodeCreationTest4900
LeafDrupal\node\Tests\NodeEntityFieldQueryAlterTest3200
LeafDrupal\node\Tests\NodeEntityViewModeAlterTest2000
LeafDrupal\node\Tests\NodeFieldMultilingualTestCase6400
LeafDrupal\node\Tests\NodeFormButtonsTest12500
LeafDrupal\node\Tests\NodeLoadHooksTest700
LeafDrupal\node\Tests\NodeLoadMultipleTest2700
LeafDrupal\node\Tests\NodePostSettingsTest4000
LeafDrupal\node\Tests\NodeQueryAlterTest9900
LeafDrupal\node\Tests\NodeRevisionPermissionsTest4600
LeafDrupal\node\Tests\NodeRevisionsAllTestCase4900
LeafDrupal\node\Tests\NodeRevisionsTest6400
LeafDrupal\node\Tests\NodeRSSContentTest1900
LeafDrupal\node\Tests\NodeSaveTest6000
LeafDrupal\node\Tests\NodeSyndicateBlockTest1400
LeafDrupal\node\Tests\NodeTitleTest2300
LeafDrupal\node\Tests\NodeTitleXSSTest2300
LeafDrupal\node\Tests\NodeTokenReplaceTest4000
LeafDrupal\node\Tests\NodeTranslationUITest20700
LeafDrupal\node\Tests\NodeTypeInitialLanguageTest8000
LeafDrupal\node\Tests\NodeTypePersistenceTest6500
LeafDrupal\node\Tests\NodeTypeTest13000
LeafDrupal\node\Tests\PageEditTest9700
LeafDrupal\node\Tests\PagePreviewTest8300
LeafDrupal\node\Tests\PageViewTest3400
LeafDrupal\node\Tests\SummaryLengthTest1200
LeafDrupal\node\Tests\Views\BulkFormTest1600
LeafDrupal\node\Tests\Views\FieldTypeTest200
LeafDrupal\node\Tests\Views\FilterUidRevisionTest400
LeafDrupal\node\Tests\Views\FrontPageTest600
LeafDrupal\node\Tests\Views\NodeIntegrationTest1600
LeafDrupal\node\Tests\Views\RevisionRelationships300
LeafDrupal\node\Tests\Views\RowPluginTest3600
LeafDrupal\node\Tests\Views\StatusExtraTest6800
LeafDrupal\number\Tests\NumberFieldTest8800
LeafDrupal\number\Tests\NumberItemTest2300
LeafDrupal\options\Tests\OptionsDynamicValuesValidationTest900
LeafDrupal\options\Tests\OptionsFieldTest2100
LeafDrupal\options\Tests\OptionsFieldUITest25500
LeafDrupal\options\Tests\OptionsFormattersTest1000
LeafDrupal\options\Tests\OptionsSelectDynamicValuesTest1600
LeafDrupal\options\Tests\OptionsWidgetsTest26100
LeafDrupal\overlay\Tests\OverlayCloseTest1800
LeafDrupal\path\Tests\PathAliasTest14000
LeafDrupal\path\Tests\PathLanguageTest13700
LeafDrupal\path\Tests\PathLanguageUiTest29600
LeafDrupal\path\Tests\PathTaxonomyTermTest3700
LeafDrupal\php\Tests\Condition\PhpConditionTest600
LeafDrupal\php\Tests\PhpAccessTest3800
LeafDrupal\php\Tests\PhpFilterTest4200
LeafDrupal\picture\Tests\PictureAdminUITest5400
LeafDrupal\picture\Tests\PictureFieldDisplayTest11500
LeafDrupal\rdf\Tests\CommentAttributesTest13300
LeafDrupal\rdf\Tests\CrudTest800
LeafDrupal\rdf\Tests\FileFieldAttributesTest1800
LeafDrupal\rdf\Tests\GetNamespacesTest700
LeafDrupal\rdf\Tests\GetRdfNamespacesTest500
LeafDrupal\rdf\Tests\ImageFieldAttributesTest1700
LeafDrupal\rdf\Tests\NodeAttributesTest1000
LeafDrupal\rdf\Tests\RdfaAttributesTest800
LeafDrupal\rdf\Tests\RdfMappingUpgradePathTest4600
LeafDrupal\rdf\Tests\TaxonomyAttributesTest700
LeafDrupal\rdf\Tests\TaxonomyTermFieldAttributesTest1600
LeafDrupal\rdf\Tests\TrackerAttributesTest3000
LeafDrupal\rdf\Tests\UserAttributesTest4000
LeafDrupal\rest\Tests\CreateTest4400
LeafDrupal\rest\Tests\DBLogTest1800
LeafDrupal\rest\Tests\DeleteTest6400
LeafDrupal\rest\Tests\ReadTest7800
LeafDrupal\rest\Tests\UpdateTest5600
ExpandDrupal\rest\Tests\Views\StyleSerializerTest5310
MessageGroupFilenameLineFunctionStatus
The test did not complete due to a fatal error.Completion checkStyleSerializerTest.php176Drupal\rest\Tests\Views\StyleSerializerTest->testUIFieldAlias()
LeafDrupal\search\Tests\SearchAdvancedSearchFormTest3400
LeafDrupal\search\Tests\SearchBlockTest3800
LeafDrupal\search\Tests\SearchCommentCountToggleTest3100
LeafDrupal\search\Tests\SearchCommentTest19300
LeafDrupal\search\Tests\SearchConfigSettingsFormTest15900
LeafDrupal\search\Tests\SearchEmbedFormTest3200
LeafDrupal\search\Tests\SearchExactTest2500
LeafDrupal\search\Tests\SearchExcerptTest1800
LeafDrupal\search\Tests\SearchKeywordsConditionsTest2800
LeafDrupal\search\Tests\SearchLanguageTest4300
LeafDrupal\search\Tests\SearchMatchTest14700
LeafDrupal\search\Tests\SearchMultilingualEntityTest1000
LeafDrupal\search\Tests\SearchNodeAccessTest1600
LeafDrupal\search\Tests\SearchNumberMatchingTest29500
LeafDrupal\search\Tests\SearchNumbersTest17500
LeafDrupal\search\Tests\SearchPageOverrideTest1500
LeafDrupal\search\Tests\SearchPageTextTest3700
LeafDrupal\search\Tests\SearchPreprocessLangcodeTest3900
LeafDrupal\search\Tests\SearchRankingTest5900
LeafDrupal\search\Tests\SearchSimplifyTest65700
LeafDrupal\search\Tests\SearchTokenizerTest800
LeafDrupal\serialization\Tests\EntityResolverTest500
LeafDrupal\serialization\Tests\EntitySerializationTest2600
LeafDrupal\serialization\Tests\SerializationTest200
LeafDrupal\shortcut\Tests\ShortcutLinksTest15000
LeafDrupal\shortcut\Tests\ShortcutSetsTest21900
LeafDrupal\simpletest\Tests\BrokenSetUpTest2100
LeafDrupal\simpletest\Tests\BrowserTest1600
LeafDrupal\simpletest\Tests\DrupalUnitTestBaseTest6800
LeafDrupal\simpletest\Tests\FolderTest200
LeafDrupal\simpletest\Tests\InstallationProfileModuleTestsTest1900
LeafDrupal\simpletest\Tests\MailCaptureTest1200
LeafDrupal\simpletest\Tests\MissingCheckedRequirementsTest1900
LeafDrupal\simpletest\Tests\OtherInstallationProfileModuleTestsTest1200
LeafDrupal\simpletest\Tests\PhpUnitAutoloaderTest100
LeafDrupal\simpletest\Tests\PhpUnitErrorTest100
LeafDrupal\simpletest\Tests\SimpleTestTest11500
LeafDrupal\simpletest\Tests\UserHelpersTest4600
LeafDrupal\standard\Tests\StandardTest3400
LeafDrupal\statistics\Tests\StatisticsAdminTest5800
LeafDrupal\statistics\Tests\StatisticsLoggingTest2100
LeafDrupal\statistics\Tests\StatisticsReportsTest1900
LeafDrupal\statistics\Tests\StatisticsTokenReplaceTest3000
LeafDrupal\statistics\Tests\Views\IntegrationTest1600
LeafDrupal\syslog\Tests\SyslogTest1700
LeafDrupal\system\Tests\Action\ActionUnitTest1100
LeafDrupal\system\Tests\Ajax\AjaxCommandsUnitTest4600
LeafDrupal\system\Tests\Ajax\CommandsTest7700
LeafDrupal\system\Tests\Ajax\DialogTest5400
LeafDrupal\system\Tests\Ajax\ElementValidationTest1400
LeafDrupal\system\Tests\Ajax\FormValuesTest2900
LeafDrupal\system\Tests\Ajax\FrameworkTest3800
LeafDrupal\system\Tests\Ajax\MultiFormTest3700
LeafDrupal\system\Tests\Batch\PageTest1600
LeafDrupal\system\Tests\Batch\ProcessingTest16100
LeafDrupal\system\Tests\Bootstrap\GetFilenameUnitTest700
LeafDrupal\system\Tests\Bootstrap\MiscUnitTest400
LeafDrupal\system\Tests\Bootstrap\OverrideServerVariablesUnitTest600
LeafDrupal\system\Tests\Bootstrap\PageCacheTest8700
LeafDrupal\system\Tests\Bootstrap\ResettableStaticUnitTest500
LeafDrupal\system\Tests\Bootstrap\VariableTest900
LeafDrupal\system\Tests\Bundle\BundleTest900
LeafDrupal\system\Tests\Cache\BackendChainUnitTest13700
LeafDrupal\system\Tests\Cache\ClearTest1000
LeafDrupal\system\Tests\Cache\DatabaseBackendUnitTest13700
LeafDrupal\system\Tests\Cache\MemoryBackendUnitTest13700
LeafDrupal\system\Tests\Common\AddFeedTest700
LeafDrupal\system\Tests\Common\AlterTest700
LeafDrupal\system\Tests\Common\CascadingStylesheetsTest4300
LeafDrupal\system\Tests\Common\CascadingStylesheetsUnitTest1200
LeafDrupal\system\Tests\Common\FormatDateTest7300
LeafDrupal\system\Tests\Common\HtmlIdentifierUnitTest1100
LeafDrupal\system\Tests\Common\HtmlTagTest200
LeafDrupal\system\Tests\Common\JavaScriptTest9300
LeafDrupal\system\Tests\Common\JsonUnitTest2100
LeafDrupal\system\Tests\Common\ParseInfoFileUnitTest300
LeafDrupal\system\Tests\Common\RegionContentTest1800
LeafDrupal\system\Tests\Common\RenderTest6200
LeafDrupal\system\Tests\Common\SimpleTestErrorCollectorTest1600
LeafDrupal\system\Tests\Common\SizeUnitTest3500
LeafDrupal\system\Tests\Common\SystemListingTest600
LeafDrupal\system\Tests\Common\TableSortExtenderUnitTest600
LeafDrupal\system\Tests\Common\UrlTest5200
LeafDrupal\system\Tests\Common\ValidNumberStepUnitTest2400
LeafDrupal\system\Tests\Common\WriteRecordTest3400
LeafDrupal\system\Tests\Common\XssUnitTest800
LeafDrupal\system\Tests\Condition\ConditionFormTest900
LeafDrupal\system\Tests\Database\AlterTest6400
LeafDrupal\system\Tests\Database\BasicSyntaxTest2800
LeafDrupal\system\Tests\Database\CaseSensitivityTest400
LeafDrupal\system\Tests\Database\ConnectionTest2200
LeafDrupal\system\Tests\Database\ConnectionUnitTest3300
LeafDrupal\system\Tests\Database\DatabaseExceptionWrapperTest100
LeafDrupal\system\Tests\Database\DeleteTruncateTest1100
LeafDrupal\system\Tests\Database\FetchTest3800
LeafDrupal\system\Tests\Database\InsertDefaultsTest1000
LeafDrupal\system\Tests\Database\InsertLobTest700
LeafDrupal\system\Tests\Database\InsertTest2700
LeafDrupal\system\Tests\Database\InvalidDataTest400
LeafDrupal\system\Tests\Database\LoggingTest2400
LeafDrupal\system\Tests\Database\MergeTest5200
LeafDrupal\system\Tests\Database\NextIdTest400
LeafDrupal\system\Tests\Database\QueryTest300
LeafDrupal\system\Tests\Database\RangeQueryTest400
LeafDrupal\system\Tests\Database\RegressionTest1500
LeafDrupal\system\Tests\Database\SchemaTest58800
LeafDrupal\system\Tests\Database\SelectCloneTest400
LeafDrupal\system\Tests\Database\SelectComplexTest9300
LeafDrupal\system\Tests\Database\SelectOrderedTest1700
LeafDrupal\system\Tests\Database\SelectPagerDefaultTest2200
LeafDrupal\system\Tests\Database\SelectSubqueryTest1900
LeafDrupal\system\Tests\Database\SelectTableSortDefaultTest3000
LeafDrupal\system\Tests\Database\SelectTest9000
LeafDrupal\system\Tests\Database\SerializeQueryTest300
LeafDrupal\system\Tests\Database\TaggingTest1600
LeafDrupal\system\Tests\Database\TemporaryQueryTest600
LeafDrupal\system\Tests\Database\TransactionTest5400
LeafDrupal\system\Tests\Database\UpdateComplexTest3500
LeafDrupal\system\Tests\Database\UpdateLobTest700
LeafDrupal\system\Tests\Database\UpdateTest3500
LeafDrupal\system\Tests\Datetime\DateTimePlusIntlTest1400
LeafDrupal\system\Tests\Datetime\DateTimePlusTest5400
LeafDrupal\system\Tests\Datetime\DrupalDateTimeTest1400
LeafDrupal\system\Tests\DrupalKernel\ContentNegotiationTest4000
LeafDrupal\system\Tests\DrupalKernel\DrupalKernelTest900
LeafDrupal\system\Tests\DrupalKernel\ServiceDestructionTest800
LeafDrupal\system\Tests\Entity\ConfigEntityQueryTest12100
LeafDrupal\system\Tests\Entity\EntityAccessTest3800
LeafDrupal\system\Tests\Entity\EntityApiInfoTest600
LeafDrupal\system\Tests\Entity\EntityApiTest4000
LeafDrupal\system\Tests\Entity\EntityBCDecoratorTest1700
LeafDrupal\system\Tests\Entity\EntityCrudHookTest21600
LeafDrupal\system\Tests\Entity\EntityFieldDefaultValueTest1700
LeafDrupal\system\Tests\Entity\EntityFieldTest72300
LeafDrupal\system\Tests\Entity\EntityFormTest8900
LeafDrupal\system\Tests\Entity\EntityLabelTest800
LeafDrupal\system\Tests\Entity\EntityManagerTest1000
LeafDrupal\system\Tests\Entity\EntityOperationsTest1700
LeafDrupal\system\Tests\Entity\EntityQueryAggregateTest4900
LeafDrupal\system\Tests\Entity\EntityQueryRelationshipTest2300
LeafDrupal\system\Tests\Entity\EntityQueryTest9700
LeafDrupal\system\Tests\Entity\EntityRevisionsTest5300
LeafDrupal\system\Tests\Entity\EntityTranslationFormTest3600
LeafDrupal\system\Tests\Entity\EntityTranslationTest15200
LeafDrupal\system\Tests\Entity\EntityUriTest700
LeafDrupal\system\Tests\Entity\EntityUUIDTest8800
LeafDrupal\system\Tests\Entity\EntityValidationTest5600
LeafDrupal\system\Tests\Entity\FieldAccessTest600
LeafDrupal\system\Tests\FileTransfer\FileTransferTest200
LeafDrupal\system\Tests\File\ConfigTest4200
LeafDrupal\system\Tests\File\DirectoryTest4400
LeafDrupal\system\Tests\File\MimeTypeTest8400
LeafDrupal\system\Tests\File\NameMungingTest800
LeafDrupal\system\Tests\File\ReadOnlyStreamWrapperTest1700
LeafDrupal\system\Tests\File\RemoteFileDirectoryTest3200
LeafDrupal\system\Tests\File\RemoteFileScanDirectoryTest2900
LeafDrupal\system\Tests\File\RemoteFileUnmanagedCopyTest3200
LeafDrupal\system\Tests\File\RemoteFileUnmanagedDeleteRecursiveTest2100
LeafDrupal\system\Tests\File\RemoteFileUnmanagedDeleteTest1000
LeafDrupal\system\Tests\File\RemoteFileUnmanagedMoveTest2300
LeafDrupal\system\Tests\File\RemoteFileUnmanagedSaveDataTest800
LeafDrupal\system\Tests\File\ScanDirectoryTest2900
LeafDrupal\system\Tests\File\StreamWrapperTest1900
LeafDrupal\system\Tests\File\UnmanagedCopyTest2900
LeafDrupal\system\Tests\File\UnmanagedDeleteRecursiveTest1700
LeafDrupal\system\Tests\File\UnmanagedDeleteTest700
LeafDrupal\system\Tests\File\UnmanagedMoveTest2000
LeafDrupal\system\Tests\File\UnmanagedSaveDataTest700
LeafDrupal\system\Tests\File\UrlRewritingTest1400
LeafDrupal\system\Tests\Form\AlterTest400
LeafDrupal\system\Tests\Form\ArbitraryRebuildTest1600
LeafDrupal\system\Tests\Form\CheckboxTest9700
LeafDrupal\system\Tests\Form\ConfirmFormTest2700
LeafDrupal\system\Tests\Form\ElementsLabelsTest2000
LeafDrupal\system\Tests\Form\ElementsTableSelectTest6900
LeafDrupal\system\Tests\Form\ElementsVerticalTabsTest3900
LeafDrupal\system\Tests\Form\ElementTest5700
LeafDrupal\system\Tests\Form\EmailTest1700
LeafDrupal\system\Tests\Form\FileInclusionTest1100
LeafDrupal\system\Tests\Form\FormCacheTest1400
LeafDrupal\system\Tests\Form\FormObjectTest4300
LeafDrupal\system\Tests\Form\FormTest65600
LeafDrupal\system\Tests\Form\HTMLIdTest700
LeafDrupal\system\Tests\Form\LanguageSelectElementTest4400
LeafDrupal\system\Tests\Form\ProgrammaticTest2400
LeafDrupal\system\Tests\Form\RebuildTest5300
LeafDrupal\system\Tests\Form\RedirectTest3100
LeafDrupal\system\Tests\Form\StateValuesCleanAdvancedTest700
LeafDrupal\system\Tests\Form\StateValuesCleanTest1400
LeafDrupal\system\Tests\Form\StorageTest12000
LeafDrupal\system\Tests\Form\SystemConfigFormTest700
LeafDrupal\system\Tests\Form\TriggeringElementTest5000
LeafDrupal\system\Tests\Form\UrlTest1700
LeafDrupal\system\Tests\Form\ValidationTest11200
LeafDrupal\system\Tests\Form\WrapperTest500
LeafDrupal\system\Tests\Image\ToolkitGdTest20500
LeafDrupal\system\Tests\Image\ToolkitTest5300
LeafDrupal\system\Tests\InstallerTest1500
LeafDrupal\system\Tests\Installer\InstallerLanguageTest800
LeafDrupal\system\Tests\Installer\SiteNameTest300
LeafDrupal\system\Tests\KeyValueStore\DatabaseStorageExpirableTest6800
LeafDrupal\system\Tests\KeyValueStore\DatabaseStorageTest3600
LeafDrupal\system\Tests\KeyValueStore\GarbageCollectionTest200
LeafDrupal\system\Tests\KeyValueStore\MemoryStorageTest3600
LeafDrupal\system\Tests\Lock\LockFunctionalTest1800
LeafDrupal\system\Tests\Lock\LockUnitTest1300
LeafDrupal\system\Tests\Mail\HtmlToTextTest8900
LeafDrupal\system\Tests\Mail\MailTest700
LeafDrupal\system\Tests\Mail\WrapMailUnitTest200
LeafDrupal\system\Tests\Menu\BreadcrumbTest41000
LeafDrupal\system\Tests\Menu\LinksTest5000
LeafDrupal\system\Tests\Menu\LocalActionTest700
LeafDrupal\system\Tests\Menu\LocalTasksTest11300
LeafDrupal\system\Tests\Menu\MenuRouterTest23300
LeafDrupal\system\Tests\Menu\MenuTranslateTest1300
LeafDrupal\system\Tests\Menu\RebuildTest500
LeafDrupal\system\Tests\Menu\TrailTest6800
LeafDrupal\system\Tests\Menu\TreeAccessTest300
LeafDrupal\system\Tests\Menu\TreeDataUnitTest400
LeafDrupal\system\Tests\Menu\TreeOutputTest900
LeafDrupal\system\Tests\Module\ClassLoaderTest1200
LeafDrupal\system\Tests\Module\DependencyTest16200
LeafDrupal\system\Tests\Module\EnableDisableTest227900
LeafDrupal\system\Tests\Module\HookRequirementsTest1600
LeafDrupal\system\Tests\Module\InstallTest300
LeafDrupal\system\Tests\Module\ModuleApiTest6600
LeafDrupal\system\Tests\Module\ModuleEnable500
LeafDrupal\system\Tests\Module\RequiredTest2000
LeafDrupal\system\Tests\Module\UninstallTest200
LeafDrupal\system\Tests\Module\VersionTest5100
LeafDrupal\system\Tests\Pager\PagerTest12300
LeafDrupal\system\Tests\ParamConverter\UpcastingTest1700
LeafDrupal\system\Tests\Path\AliasTest4200
LeafDrupal\system\Tests\Path\MatchPathTest4100
LeafDrupal\system\Tests\Path\UrlAlterFunctionalTest3700
LeafDrupal\system\Tests\Plugin\AlterDecoratorTest300
LeafDrupal\system\Tests\Plugin\CacheDecoratorLanguageTest3800
LeafDrupal\system\Tests\Plugin\CacheDecoratorTest1400
LeafDrupal\system\Tests\Plugin\ContextPluginTest2500
LeafDrupal\system\Tests\Plugin\DerivativeTest1200
LeafDrupal\system\Tests\Plugin\Discovery\AnnotatedClassDiscoveryTest700
LeafDrupal\system\Tests\Plugin\Discovery\CustomAnnotationClassDiscoveryTest500
LeafDrupal\system\Tests\Plugin\Discovery\StaticDiscoveryTest600
LeafDrupal\system\Tests\Plugin\FactoryTest900
LeafDrupal\system\Tests\Plugin\InspectionTest1500
LeafDrupal\system\Tests\Plugin\PluginBagTest2800
LeafDrupal\system\Tests\Queue\QueueTest1700
LeafDrupal\system\Tests\Routing\ControllerResolverTest200
LeafDrupal\system\Tests\Routing\MatcherDumperTest1600
LeafDrupal\system\Tests\Routing\MimeTypeMatcherTest2000
LeafDrupal\system\Tests\Routing\RouteProviderTest9200
LeafDrupal\system\Tests\Routing\RouterPermissionTest2300
LeafDrupal\system\Tests\Routing\RouterTest4900
LeafDrupal\system\Tests\Routing\RouteTest1200
LeafDrupal\system\Tests\Session\SessionHttpsTest3500
LeafDrupal\system\Tests\Session\SessionTest18700
LeafDrupal\system\Tests\System\AccessDeniedTest6400
LeafDrupal\system\Tests\System\AdminMetaTagTest300
LeafDrupal\system\Tests\System\AdminTest18100
LeafDrupal\system\Tests\System\CronRunTest5200
LeafDrupal\system\Tests\System\DateFormatsLanguageTest11800
LeafDrupal\system\Tests\System\DateTimeTest8800
LeafDrupal\system\Tests\System\DefaultMobileMetaTagsTest1200
LeafDrupal\system\Tests\System\ErrorHandlerTest4000
LeafDrupal\system\Tests\System\ExceptionControllerTest200
LeafDrupal\system\Tests\System\FloodTest1000
LeafDrupal\system\Tests\System\FrontPageTest3700
LeafDrupal\system\Tests\System\IgnoreSlaveSubscriberTest100
LeafDrupal\system\Tests\System\IndexPhpTest600
LeafDrupal\system\Tests\System\InfoAlterTest1000
LeafDrupal\system\Tests\System\MainContentFallbackTest6000
LeafDrupal\system\Tests\System\PageNotFoundTest1800
LeafDrupal\system\Tests\System\PageTitleFilteringTest4400
LeafDrupal\system\Tests\System\PasswordHashingTest1000
LeafDrupal\system\Tests\System\RetrieveFileTest700
LeafDrupal\system\Tests\System\SettingsRewriteTest500
LeafDrupal\system\Tests\System\ShutdownFunctionsTest500
LeafDrupal\system\Tests\System\SiteMaintenanceTest7700
LeafDrupal\system\Tests\System\SystemAuthorizeTest1600
LeafDrupal\system\Tests\System\ThemeTest20500
LeafDrupal\system\Tests\System\TokenReplaceTest3600
LeafDrupal\system\Tests\System\TokenScanTest400
LeafDrupal\system\Tests\Theme\EntityFilteringThemeTest5600
LeafDrupal\system\Tests\Theme\FastTest1200
LeafDrupal\system\Tests\Theme\FunctionsTest2600
LeafDrupal\system\Tests\Theme\HtmlTplPhpAttributesTest500
LeafDrupal\system\Tests\Theme\RegistryTest600
LeafDrupal\system\Tests\Theme\TableTest800
LeafDrupal\system\Tests\Theme\ThemeEarlyInitializationTest500
LeafDrupal\system\Tests\Theme\ThemeInfoStylesTest1300
LeafDrupal\system\Tests\Theme\ThemeTest5300
LeafDrupal\system\Tests\Theme\ThemeTestPhpTemplate400
LeafDrupal\system\Tests\Theme\ThemeTestTwig1000
LeafDrupal\system\Tests\Theme\TwigDebugMarkupTest900
LeafDrupal\system\Tests\Theme\TwigReferenceUnitTest1500
LeafDrupal\system\Tests\Theme\TwigSettingsTest1300
LeafDrupal\system\Tests\Transliteration\TransliterationTest3100
LeafDrupal\system\Tests\TypedData\TypedDataTest22000
LeafDrupal\system\Tests\Update\DependencyHookInvocationTest400
LeafDrupal\system\Tests\Update\DependencyMissingTest400
LeafDrupal\system\Tests\Update\DependencyOrderingTest500
LeafDrupal\system\Tests\Update\UpdateScriptTest20100
LeafDrupal\system\Tests\Upgrade\ActionUpgradePathTest3100
LeafDrupal\system\Tests\Upgrade\BareMinimalAnonymousUpgradePathTest5800
LeafDrupal\system\Tests\Upgrade\BareMinimalNoConfigUpgradePathTest7300
LeafDrupal\system\Tests\Upgrade\BareMinimalUpgradePathTest7300
LeafDrupal\system\Tests\Upgrade\BareStandardUpgradePathTest7800
LeafDrupal\system\Tests\Upgrade\BlockUpgradePathTest3800
LeafDrupal\system\Tests\Upgrade\DateUpgradePathTest5700
LeafDrupal\system\Tests\Upgrade\ExistingModuleNameLengthUpgradePathTest600
LeafDrupal\system\Tests\Upgrade\FieldUIUpgradePathTest8000
ExpandDrupal\system\Tests\Upgrade\FieldUpgradePathTest16911
MessageGroupFilenameLineFunctionStatus
Failed: Drupal\Core\Database\DatabaseExceptionWrapper: SQLSTATE[HY000]: General error: 1114 The table 'simpletest880294field_data_field_tags' is full: ALTER TABLE {field_data_field_tags} ADD PRIMARY KEY (`entity_type`, `entity_id`, `deleted`, `delta`, `langcode`); Array ( ) in Drupal\Core\Database\Connection->query() (line 571 of /var/lib/drupaltestbot/sites/default/files/checkout/core/lib/Drupal/Core/Database/Connection.php).OtherUpgradePathTestBase.php278Drupal\system\Tests\Upgrade\UpgradePathTestBase->performUpgrade()
Exception: Errors during update process. in Drupal\system\Tests\Upgrade\UpgradePathTestBase->performUpgrade() (line 284 of /var/lib/drupaltestbot/sites/default/files/checkout/core/modules/system/lib/Drupal/system/Tests/Upgrade/UpgradePathTestBase.php). Drupal\system\Tests\Upgrade\UpgradePathTestBase->performUpgrade() Drupal\system\Tests\Upgrade\FieldUpgradePathTest->testFieldUpgradeToConfig() Drupal\simpletest\TestBase->run() simpletest_script_run_one_test('662', 'Drupal\system\Tests\Upgrade\FieldUpgradePathTest') Uncaught exceptionUpgradePathTestBase.php284Drupal\system\Tests\Upgrade\UpgradePathTestBase->performUpgrade()
LeafDrupal\system\Tests\Upgrade\FilledMinimalUpgradePathTest7200
LeafDrupal\system\Tests\Upgrade\FilledStandardUpgradePathTest15000
LeafDrupal\system\Tests\Upgrade\FilterFormatUpgradePathTest5300
LeafDrupal\system\Tests\Upgrade\ImageUpgradePathTest4200
ExpandDrupal\system\Tests\Upgrade\LanguageUpgradePathTest32011
MessageGroupFilenameLineFunctionStatus
Failed: Drupal\Core\Database\DatabaseExceptionWrapper: SQLSTATE[HY000]: General error: 1114 The table 'simpletest710050field_revision_taxonomy_vocabulary_6_5' is full: ALTER TABLE {field_revision_taxonomy_vocabulary_6_5} ADD PRIMARY KEY (`entity_type`, `entity_id`, `revision_id`, `deleted`, `delta`, `langcode`); Array ( ) in Drupal\Core\Database\Connection->query() (line 571 of /var/lib/drupaltestbot/sites/default/files/checkout/core/lib/Drupal/Core/Database/Connection.php).OtherUpgradePathTestBase.php278Drupal\system\Tests\Upgrade\UpgradePathTestBase->performUpgrade()
Exception: Errors during update process. in Drupal\system\Tests\Upgrade\UpgradePathTestBase->performUpgrade() (line 284 of /var/lib/drupaltestbot/sites/default/files/checkout/core/modules/system/lib/Drupal/system/Tests/Upgrade/UpgradePathTestBase.php). Drupal\system\Tests\Upgrade\UpgradePathTestBase->performUpgrade() Drupal\system\Tests\Upgrade\LanguageUpgradePathTest->testLanguageNoPluralsUpgrade() Drupal\simpletest\TestBase->run() simpletest_script_run_one_test('667', 'Drupal\system\Tests\Upgrade\LanguageUpgradePathTest') Uncaught exceptionUpgradePathTestBase.php284Drupal\system\Tests\Upgrade\UpgradePathTestBase->performUpgrade()
LeafDrupal\system\Tests\Upgrade\MailUpgradePathTest5100
LeafDrupal\system\Tests\Upgrade\ModuleNameLengthUpgradePathTest3300
LeafDrupal\system\Tests\Upgrade\ModulesDisabledUpgradePathTest7800
LeafDrupal\system\Tests\Upgrade\ShortcutUpgradePathTest6700
LeafDrupal\system\Tests\Upgrade\StateSystemUpgradePathTest9900
LeafDrupal\system\Tests\Upgrade\SystemUpgradePathTest16800
LeafDrupal\system\Tests\Upgrade\UserPictureUpgradePathTest9300
LeafDrupal\system\Tests\Upgrade\UserRoleUpgradePathTest13400
ExpandDrupal\system\Tests\Upgrade\UuidUpgradePathTest4611
MessageGroupFilenameLineFunctionStatus
Failed: Drupal\Core\Database\DatabaseExceptionWrapper: SQLSTATE[HY000]: General error: 1114 The table 'simpletest977700field_data_body' is full: ALTER TABLE {field_data_body} ADD PRIMARY KEY (`entity_type`, `entity_id`, `deleted`, `delta`, `langcode`); Array ( ) in Drupal\Core\Database\Connection->query() (line 571 of /var/lib/drupaltestbot/sites/default/files/checkout/core/lib/Drupal/Core/Database/Connection.php).OtherUpgradePathTestBase.php278Drupal\system\Tests\Upgrade\UpgradePathTestBase->performUpgrade()
Exception: Errors during update process. in Drupal\system\Tests\Upgrade\UpgradePathTestBase->performUpgrade() (line 284 of /var/lib/drupaltestbot/sites/default/files/checkout/core/modules/system/lib/Drupal/system/Tests/Upgrade/UpgradePathTestBase.php). Drupal\system\Tests\Upgrade\UpgradePathTestBase->performUpgrade() Drupal\system\Tests\Upgrade\UuidUpgradePathTest->testUuidUpgrade() Drupal\simpletest\TestBase->run() simpletest_script_run_one_test('676', 'Drupal\system\Tests\Upgrade\UuidUpgradePathTest') Uncaught exceptionUpgradePathTestBase.php284Drupal\system\Tests\Upgrade\UpgradePathTestBase->performUpgrade()
LeafDrupal\system\Tests\Uuid\UuidUnitTest700
LeafDrupal\taxonomy\Tests\EfqTest1400
LeafDrupal\taxonomy\Tests\LegacyTest1400
LeafDrupal\taxonomy\Tests\LoadMultipleTest1800
LeafDrupal\taxonomy\Tests\RssTest2600
LeafDrupal\taxonomy\Tests\TaxonomyTermReferenceItemTest1600
LeafDrupal\taxonomy\Tests\TermFieldMultipleVocabularyTest2600
LeafDrupal\taxonomy\Tests\TermFieldTest4500
LeafDrupal\taxonomy\Tests\TermIndexTest4600
LeafDrupal\taxonomy\Tests\TermLanguageTest6400
LeafDrupal\taxonomy\Tests\TermTest26800
LeafDrupal\taxonomy\Tests\TermTranslationUITest15300
LeafDrupal\taxonomy\Tests\TermUnitTest1100
LeafDrupal\taxonomy\Tests\ThemeTest1900
LeafDrupal\taxonomy\Tests\TokenReplaceTest5500
LeafDrupal\taxonomy\Tests\Views\RelationshipNodeTermDataTest200
LeafDrupal\taxonomy\Tests\Views\RelationshipRepresentativeNode200
LeafDrupal\taxonomy\Tests\VocabularyLanguageTest6000
LeafDrupal\taxonomy\Tests\VocabularyPermissionsTest10100
LeafDrupal\taxonomy\Tests\VocabularyTest11000
LeafDrupal\taxonomy\Tests\VocabularyUnitTest7000
LeafDrupal\telephone\Tests\TelephoneFieldTest2200
LeafDrupal\telephone\Tests\TelephoneItemTest1100
LeafDrupal\Tests\Component\Graph\GraphTest100
LeafDrupal\Tests\Component\PhpStorage\FileStorageTest200
LeafDrupal\Tests\Component\PhpStorage\MTimeProtectedFastFileStorageTest200
LeafDrupal\Tests\Component\Utility\CryptTest100
LeafDrupal\Tests\Component\Utility\StringTest100
LeafDrupal\Tests\Component\Utility\TimerUnitTest100
LeafDrupal\Tests\Component\Utility\XssTest200
LeafDrupal\Tests\Core\Access\AccessManagerTest200
LeafDrupal\Tests\Core\Access\DefaultAccessCheckTest200
LeafDrupal\Tests\Core\Cache\BackendChainImplementationUnitTest900
LeafDrupal\Tests\Core\Cache\CacheCollectorTest1400
LeafDrupal\Tests\Core\Cache\NullBackendTest100
LeafDrupal\Tests\Core\Common\AttributesTest100
LeafDrupal\Tests\Core\Common\DiffArrayTest100
LeafDrupal\Tests\Core\Common\TagsTest100
LeafDrupal\Tests\Core\Database\EmptyStatementTest300
LeafDrupal\Tests\Core\Entity\Enhancer\EntityRouteEnhancerTest100
LeafDrupal\Tests\Core\Entity\EntityAccessCheckTest200
LeafDrupal\Tests\Core\EventSubscriber\ReverseProxySubscriberUnitTest200
LeafDrupal\Tests\Core\Extension\ModuleHandlerUnitTest100
LeafDrupal\Tests\Core\HttpKernelTest100
LeafDrupal\Tests\Core\NestedArrayUnitTest500
LeafDrupal\Tests\Core\PathProcessor\PathProcessorTest100
LeafDrupal\Tests\Core\Plugin\DefaultPluginManagerTest400
LeafDrupal\Tests\Core\Routing\UrlGeneratorTest400
LeafDrupal\text\Tests\Formatter\TextPlainUnitTest600
LeafDrupal\text\Tests\TextFieldTest18600
LeafDrupal\text\Tests\TextSummaryTest12500
LeafDrupal\toolbar\Tests\ToolbarHookToolbarTest1500
LeafDrupal\toolbar\Tests\ToolbarMenuTranslationTest11000
LeafDrupal\tour\Tests\TourPluginTest200
LeafDrupal\tour\Tests\TourTest3300
LeafDrupal\tracker\Tests\TrackerNodeAccessTest3800
LeafDrupal\tracker\Tests\TrackerTest22800
LeafDrupal\tracker\Tests\Views\TrackerUserUidTest1400
LeafDrupal\translation\Tests\TranslationTest57300
LeafDrupal\translation_entity\Tests\ConfigTestTranslationUITest1700
LeafDrupal\translation_entity\Tests\EntityTestTranslationUITest11800
LeafDrupal\translation_entity\Tests\EntityTranslationSettingsTest4900
LeafDrupal\translation_entity\Tests\EntityTranslationSyncImageTest2100
LeafDrupal\translation_entity\Tests\EntityTranslationSyncUnitTest1100
LeafDrupal\translation_entity\Tests\EntityTranslationWorkflowsTest16300
LeafDrupal\translation_entity\Tests\Views\TranslationEntityViewsUITest1500
LeafDrupal\translation_entity\Tests\Views\TranslationLinkTest1700
LeafDrupal\update\Tests\UpdateContribTest19700
LeafDrupal\update\Tests\UpdateCoreTest22600
LeafDrupal\update\Tests\UpdateCoreUnitTest400
LeafDrupal\update\Tests\UpdateUploadTest6400
LeafDrupal\user\Tests\Plugin\Action\AddRoleUserTest200
LeafDrupal\user\Tests\Plugin\Action\RemoveRoleUserTest200
LeafDrupal\user\Tests\TempStoreDatabaseTest1900
LeafDrupal\user\Tests\UserAccountLinksTests5800
LeafDrupal\user\Tests\UserAdminListingTest3300
LeafDrupal\user\Tests\UserAdminSettingsFormTest400
LeafDrupal\user\Tests\UserAdminTest9300
LeafDrupal\user\Tests\UserAutocompleteTest2900
LeafDrupal\user\Tests\UserBlocksTests6600
ExpandDrupal\user\Tests\UserCancelTest8110
MessageGroupFilenameLineFunctionStatus
The test did not complete due to a fatal error.Completion checkUserCancelTest.php182Drupal\user\Tests\UserCancelTest->testUserBlockUnpublish()
LeafDrupal\user\Tests\UserCreateFailMailTest1500
LeafDrupal\user\Tests\UserCreateTest3900
LeafDrupal\user\Tests\UserDeleteTest1500
LeafDrupal\user\Tests\UserEditedOwnAccountTest2200
LeafDrupal\user\Tests\UserEditTest8800
LeafDrupal\user\Tests\UserEntityCallbacksTest700
LeafDrupal\user\Tests\UserEntityTest1600
LeafDrupal\user\Tests\UserLanguageCreationTest6800
LeafDrupal\user\Tests\UserLanguageTest3900
ExpandDrupal\user\Tests\UserLoginTest14110
MessageGroupFilenameLineFunctionStatus
The test did not complete due to a fatal error.Completion checkUserLoginTest.php105Drupal\user\Tests\UserLoginTest->testPasswordRehashOnLogin()
LeafDrupal\user\Tests\UserPasswordResetTest6600
LeafDrupal\user\Tests\UserPermissionsTest5000
ExpandDrupal\user\Tests\UserPictureTest2510
MessageGroupFilenameLineFunctionStatus
The test did not complete due to a fatal error.Completion checkUserPictureTest.php91Drupal\user\Tests\UserPictureTest->testPictureOnNodeComment()
ExpandDrupal\user\Tests\UserRegistrationTest1510
MessageGroupFilenameLineFunctionStatus
The test did not complete due to a fatal error.Completion checkUserRegistrationTest.php63Drupal\user\Tests\UserRegistrationTest->testRegistrationWithoutEmailVerification()
LeafDrupal\user\Tests\UserRoleAdminTest6000
LeafDrupal\user\Tests\UserRolesAssignmentTest5100
LeafDrupal\user\Tests\UserSaveTest200
LeafDrupal\user\Tests\UserSearchTest5800
LeafDrupal\user\Tests\UserSignatureTest4500
LeafDrupal\user\Tests\UserTimeZoneTest2900
LeafDrupal\user\Tests\UserTokenReplaceTest4700
LeafDrupal\user\Tests\UserTranslationUITest14300
LeafDrupal\user\Tests\UserValidateCurrentPassCustomFormTest1700
LeafDrupal\user\Tests\UserValidationTest1600
LeafDrupal\user\Tests\Views\AccessPermissionTest1400
LeafDrupal\user\Tests\Views\AccessRoleTest1400
LeafDrupal\user\Tests\Views\ArgumentDefaultTest900
LeafDrupal\user\Tests\Views\ArgumentValidateTest1900
LeafDrupal\user\Tests\Views\Argument\RolesRidTest100
LeafDrupal\user\Tests\Views\BulkFormTest3600
LeafDrupal\user\Tests\Views\HandlerArgumentUserUidTest500
LeafDrupal\user\Tests\Views\HandlerFieldPermissionTest1000
LeafDrupal\user\Tests\Views\HandlerFieldRoleTest1000
LeafDrupal\user\Tests\Views\HandlerFieldUserNameTest700
LeafDrupal\user\Tests\Views\HandlerFilterPermissionTest1400
ExpandDrupal\user\Tests\Views\HandlerFilterUserNameTest2501
MessageGroupFilenameLineFunctionStatus
Drupal\Core\Config\StorageException: Failed to write configuration file: sites/default/files/simpletest/395002/config_active/user.role.ztxdxgn6.yml in Drupal\Core\Config\FileStorage->write() (line 102 of /var/lib/drupaltestbot/sites/default/files/checkout/core/lib/Drupal/Core/Config/FileStorage.php). Drupal\Core\Config\FileStorage->write('user.role.ztxdxgn6', Array) Drupal\Core\Config\CachedStorage->write('user.role.ztxdxgn6', Array) Drupal\Core\Config\Config->save() Drupal\Core\Config\Entity\ConfigStorageController->save(Object) Drupal\Core\Entity\Entity->save() Drupal\simpletest\WebTestBase->drupalCreateRole(Array) Drupal\simpletest\WebTestBase->drupalCreateUser(Array) Drupal\user\Tests\Views\HandlerFilterUserNameTest->testAdminUserInterface() Drupal\simpletest\TestBase->run() simpletest_script_run_one_test('797', 'Drupal\user\Tests\Views\HandlerFilterUserNameTest') Uncaught exceptionFileStorage.php102Drupal\Core\Config\FileStorage->write()
LeafDrupal\user\Tests\Views\RelationshipRepresentativeNode300
LeafDrupal\user\Tests\Views\UserDataTest400
LeafDrupal\views\Tests\BasicTest2000
LeafDrupal\views\Tests\DefaultViewsTest9600
LeafDrupal\views\Tests\Entity\FieldEntityTest400
LeafDrupal\views\Tests\Entity\FilterEntityBundleTest800
LeafDrupal\views\Tests\GlossaryTest2300
LeafDrupal\views\Tests\Handler\AreaEntityTest3600
ExpandDrupal\views\Tests\Handler\AreaTest8610
MessageGroupFilenameLineFunctionStatus
The test did not complete due to a fatal error.Completion checkAreaTest.php161Drupal\views\Tests\Handler\AreaTest->testTitleArea()
LeafDrupal\views\Tests\Handler\AreaTextTest900
LeafDrupal\views\Tests\Handler\AreaTitleTest800
LeafDrupal\views\Tests\Handler\ArgumentDateTest4400
LeafDrupal\views\Tests\Handler\ArgumentNullTest800
LeafDrupal\views\Tests\Handler\ArgumentStringTest400
LeafDrupal\views\Tests\Handler\FieldBooleanTest1400
LeafDrupal\views\Tests\Handler\FieldCounterTest1400
LeafDrupal\views\Tests\Handler\FieldCustomTest500
LeafDrupal\views\Tests\Handler\FieldDateTest1800
LeafDrupal\views\Tests\Handler\FieldDropButtonTest1300
LeafDrupal\views\Tests\Handler\FieldFileSizeTest1200
LeafDrupal\views\Tests\Handler\FieldUnitTest14500
LeafDrupal\views\Tests\Handler\FieldUrlTest700
LeafDrupal\views\Tests\Handler\FieldWebTest10900
LeafDrupal\views\Tests\Handler\FieldXssTest700
LeafDrupal\views\Tests\Handler\FilterBooleanOperatorTest900
LeafDrupal\views\Tests\Handler\FilterCombineTest500
LeafDrupal\views\Tests\Handler\FilterDateTest2200
LeafDrupal\views\Tests\Handler\FilterEqualityTest2400
LeafDrupal\views\Tests\Handler\FilterInOperatorTest2300
LeafDrupal\views\Tests\Handler\FilterNumericTest5900
ExpandDrupal\views\Tests\Handler\FilterStringTest11110
MessageGroupFilenameLineFunctionStatus
The test did not complete due to a fatal error.Completion checkFilterStringTest.php602Drupal\views\Tests\Handler\FilterStringTest->testFilterStringShorter()
LeafDrupal\views\Tests\Handler\HandlerAliasTest1300
LeafDrupal\views\Tests\Handler\HandlerAllTest29400
ExpandDrupal\views\Tests\Handler\HandlerTest9910
MessageGroupFilenameLineFunctionStatus
The test did not complete due to a fatal error.Completion checkHandlerTest.php352Drupal\views\Tests\Handler\HandlerTest->testAccess()
LeafDrupal\views\Tests\Handler\RelationshipTest1100
LeafDrupal\views\Tests\Handler\SortDateTest2800
LeafDrupal\views\Tests\Handler\SortRandomTest1000
LeafDrupal\views\Tests\Handler\SortTest1600
LeafDrupal\views\Tests\ModuleTest5200
LeafDrupal\views\Tests\PluginInstanceTest15300
LeafDrupal\views\Tests\PluginTypeListTest100
LeafDrupal\views\Tests\Plugin\AccessTest2900
ExpandDrupal\views\Tests\Plugin\ArgumentDefaultTest710
MessageGroupFilenameLineFunctionStatus
The test did not complete due to a fatal error.Completion checkArgumentDefaultTest.php88Drupal\views\Tests\Plugin\ArgumentDefaultTest->testArgumentDefaultNoOptions()
LeafDrupal\views\Tests\Plugin\ArgumentValidatorTest1200
ExpandDrupal\views\Tests\Plugin\CacheTest010
MessageGroupFilenameLineFunctionStatus
The test did not complete due to a fatal error.Completion checkCacheTest.php45Drupal\views\Tests\Plugin\CacheTest->testTimeCaching()
ExpandDrupal\views\Tests\Plugin\DisplayAttachmentTest010
MessageGroupFilenameLineFunctionStatus
The test did not complete due to a fatal error.Completion checkDisplayAttachmentTest.php42Drupal\views\Tests\Plugin\DisplayAttachmentTest->testAttachment()
ExpandDrupal\views\Tests\Plugin\DisplayExtenderTest010
MessageGroupFilenameLineFunctionStatus
The test did not complete due to a fatal error.Completion checkDisplayExtenderTest.php43Drupal\views\Tests\Plugin\DisplayExtenderTest->testDisplayExtenders()
LeafDrupal\views\Tests\Plugin\DisplayFeedTest4300
LeafDrupal\views\Tests\Plugin\DisplayPageTest3200
ExpandDrupal\views\Tests\Plugin\DisplayPageWebTest2710
MessageGroupFilenameLineFunctionStatus
The test did not complete due to a fatal error.Completion checkDisplayPageWebTest.php75Drupal\views\Tests\Plugin\DisplayPageWebTest->testPageDisplayMenu()
ExpandDrupal\views\Tests\Plugin\DisplayTest1211
MessageGroupFilenameLineFunctionStatus
Drupal\Core\Config\StorageException: Failed to write configuration file: sites/default/files/simpletest/952183/config_active/views.view.test_view.yml in Drupal\Core\Config\FileStorage->write() (line 102 of /var/lib/drupaltestbot/sites/default/files/checkout/core/lib/Drupal/Core/Config/FileStorage.php). Drupal\Core\Config\FileStorage->write('views.view.test_view', Array) Drupal\Core\Config\CachedStorage->write('views.view.test_view', Array) Drupal\Core\Config\Config->save() Drupal\Core\Config\Entity\ConfigStorageController->save(Object) Drupal\Core\Entity\Entity->save() Drupal\views\ViewExecutable->save() Drupal\views\Tests\Plugin\DisplayTest->testDisplayPlugin() Drupal\simpletest\TestBase->run() simpletest_script_run_one_test('812', 'Drupal\views\Tests\Plugin\DisplayTest') Uncaught exceptionFileStorage.php102Drupal\Core\Config\FileStorage->write()
The test did not complete due to a fatal error.Completion checkDisplayTest.php145Drupal\views\Tests\Plugin\DisplayTest->testFilterGroupsOverriding()
LeafDrupal\views\Tests\Plugin\DisplayUnitTest2700
ExpandDrupal\views\Tests\Plugin\ExposedFormTest110
MessageGroupFilenameLineFunctionStatus
The test did not complete due to a fatal error.Completion checkExposedFormTest.php53Drupal\views\Tests\Plugin\ExposedFormTest->testResetButton()
ExpandDrupal\views\Tests\Plugin\FilterTest010
MessageGroupFilenameLineFunctionStatus
The test did not complete due to a fatal error.Completion checkFilterTest.php61Drupal\views\Tests\Plugin\FilterTest->testFilterQuery()
LeafDrupal\views\Tests\Plugin\JoinTest2800
LeafDrupal\views\Tests\Plugin\MiniPagerTest4900
ExpandDrupal\views\Tests\Plugin\PagerTest37364
MessageGroupFilenameLineFunctionStatus
mkdir(): No space left on deviceWarningMTimeProtectedFastFileStorage.php150Drupal\Component\PhpStorage\MTimeProtectedFastFileStorage->ensureDirectory()
chmod(): No such file or directoryWarningMTimeProtectedFastFileStorage.php152Drupal\Component\PhpStorage\MTimeProtectedFastFileStorage->ensureDirectory()
file_put_contents(/var/lib/drupaltestbot/sites/default/files/checkout/sites/default/files/simpletest/728799/php/twig/.htaccess): failed to open stream: No such file or directoryWarningMTimeProtectedFastFileStorage.php154Drupal\Component\PhpStorage\MTimeProtectedFastFileStorage->ensureDirectory()
simplexml_import_dom(): Invalid Nodetype to importsimplexml_import_dom(Object) Drupal\simpletest\WebTestBase->parse() Drupal\simpletest\WebTestBase->drupalPost('user', Array, 'Log in') Drupal\simpletest\WebTestBase->drupalLogin(Object) Drupal\views\Tests\Plugin\PagerTest->testStorePagerSettings() Drupal\simpletest\TestBase->run() simpletest_script_run_one_test('818', 'Drupal\views\Tests\Plugin\PagerTest') WarningWebTestBase.php1200Drupal\simpletest\WebTestBase->parse()
Parsed page successfully.BrowserPagerTest.php44Drupal\views\Tests\Plugin\PagerTest->testStorePagerSettings()
User hYgVOhYd successfully logged in.User loginPagerTest.php44Drupal\views\Tests\Plugin\PagerTest->testStorePagerSettings()
Failed to set field pager[type] to fullOtherPagerTest.php52Drupal\views\Tests\Plugin\PagerTest->testStorePagerSettings()
Found the Apply buttonOtherPagerTest.php52Drupal\views\Tests\Plugin\PagerTest->testStorePagerSettings()
Found the requested form fields at admin/structure/views/nojs/display/test_view/default/pagerOtherPagerTest.php52Drupal\views\Tests\Plugin\PagerTest->testStorePagerSettings()
Failed to set field pager_options[items_per_page] to 20OtherPagerTest.php56Drupal\views\Tests\Plugin\PagerTest->testStorePagerSettings()
Found the Apply buttonOtherPagerTest.php56Drupal\views\Tests\Plugin\PagerTest->testStorePagerSettings()
Found the requested form fields at admin/structure/views/nojs/display/test_view/default/pager_optionsOtherPagerTest.php56Drupal\views\Tests\Plugin\PagerTest->testStorePagerSettings()
"20 items" foundOtherPagerTest.php57Drupal\views\Tests\Plugin\PagerTest->testStorePagerSettings()
Failed to set field pager[type] to miniOtherPagerTest.php64Drupal\views\Tests\Plugin\PagerTest->testStorePagerSettings()
Found the Apply buttonOtherPagerTest.php64Drupal\views\Tests\Plugin\PagerTest->testStorePagerSettings()
Found the requested form fields at admin/structure/views/nojs/display/test_view/default/pagerOtherPagerTest.php64Drupal\views\Tests\Plugin\PagerTest->testStorePagerSettings()
Changed pager plugin, should change some textOtherPagerTest.php66Drupal\views\Tests\Plugin\PagerTest->testStorePagerSettings()
Failed to set field pager[type] to fullOtherPagerTest.php79Drupal\views\Tests\Plugin\PagerTest->testStorePagerSettings()
Found the Apply buttonOtherPagerTest.php79Drupal\views\Tests\Plugin\PagerTest->testStorePagerSettings()
Found the requested form fields at admin/structure/views/nojs/display/test_store_pager_settings/default/pagerOtherPagerTest.php79Drupal\views\Tests\Plugin\PagerTest->testStorePagerSettings()
"Full" foundOtherPagerTest.php81Drupal\views\Tests\Plugin\PagerTest->testStorePagerSettings()
Failed to set field pager_options[items_per_page] to 20OtherPagerTest.php86Drupal\views\Tests\Plugin\PagerTest->testStorePagerSettings()
Found the Apply buttonOtherPagerTest.php86Drupal\views\Tests\Plugin\PagerTest->testStorePagerSettings()
Found the requested form fields at admin/structure/views/nojs/display/test_store_pager_settings/default/pager_optionsOtherPagerTest.php86Drupal\views\Tests\Plugin\PagerTest->testStorePagerSettings()
"20 items" foundOtherPagerTest.php87Drupal\views\Tests\Plugin\PagerTest->testStorePagerSettings()
Found the Add Page buttonOtherPagerTest.php92Drupal\views\Tests\Plugin\PagerTest->testStorePagerSettings()
Found the requested form fields at admin/structure/views/view/test_store_pager_settings/editOtherPagerTest.php92Drupal\views\Tests\Plugin\PagerTest->testStorePagerSettings()
Failed to set field override[dropdown] to page_1OtherPagerTest.php96Drupal\views\Tests\Plugin\PagerTest->testStorePagerSettings()
Found the Apply buttonOtherPagerTest.php96Drupal\views\Tests\Plugin\PagerTest->testStorePagerSettings()
Found the requested form fields at admin/structure/views/nojs/display/test_store_pager_settings/page_1/pagerOtherPagerTest.php96Drupal\views\Tests\Plugin\PagerTest->testStorePagerSettings()
Failed to set field pager[type] to miniOtherPagerTest.php101Drupal\views\Tests\Plugin\PagerTest->testStorePagerSettings()
Found the Apply buttonOtherPagerTest.php101Drupal\views\Tests\Plugin\PagerTest->testStorePagerSettings()
Found the requested form fields at admin/structure/views/nojs/display/test_store_pager_settings/page_1/pagerOtherPagerTest.php101Drupal\views\Tests\Plugin\PagerTest->testStorePagerSettings()
Changed pager plugin, should change some textOtherPagerTest.php103Drupal\views\Tests\Plugin\PagerTest->testStorePagerSettings()
Failed to set field pager_options[items_per_page] to 10OtherPagerTest.php108Drupal\views\Tests\Plugin\PagerTest->testStorePagerSettings()
Found the Apply buttonOtherPagerTest.php108Drupal\views\Tests\Plugin\PagerTest->testStorePagerSettings()
Found the requested form fields at admin/structure/views/nojs/display/test_store_pager_settings/default/pager_optionsOtherPagerTest.php108Drupal\views\Tests\Plugin\PagerTest->testStorePagerSettings()
The default value has been changed.OtherPagerTest.php109Drupal\views\Tests\Plugin\PagerTest->testStorePagerSettings()
The original value remains unchanged.OtherPagerTest.php111Drupal\views\Tests\Plugin\PagerTest->testStorePagerSettings()
The test did not complete due to a fatal error.Completion checkPagerTest.php118Drupal\views\Tests\Plugin\PagerTest->testNoLimit()
LeafDrupal\views\Tests\Plugin\QueryTest800
LeafDrupal\views\Tests\Plugin\RowEntityTest700
LeafDrupal\views\Tests\Plugin\StyleMappingTest4600
ExpandDrupal\views\Tests\Plugin\StyleTableTest110
MessageGroupFilenameLineFunctionStatus
The test did not complete due to a fatal error.Completion checkStyleTableTest.php39Drupal\views\Tests\Plugin\StyleTableTest->testAccessibilitySettings()
LeafDrupal\views\Tests\Plugin\StyleTableUnitTest2300
ExpandDrupal\views\Tests\Plugin\StyleTest1010
MessageGroupFilenameLineFunctionStatus
The test did not complete due to a fatal error.Completion checkStyleTest.php224Drupal\views\Tests\Plugin\StyleTest->testCustomRowClasses()
LeafDrupal\views\Tests\Plugin\StyleUnformattedTest2100
LeafDrupal\views\Tests\Plugin\ViewsBlockTest700
LeafDrupal\views\Tests\QueryGroupByTest5500
LeafDrupal\views\Tests\TokenReplaceTest1600
LeafDrupal\views\Tests\ViewElementTest1500
ExpandDrupal\views\Tests\ViewExecutableTest20800
MessageGroupFilenameLineFunctionStatus
'setDisplay() called with invalid display ID "invalid".'DebugViewExecutable.php664Drupal\views\ViewExecutable->setDisplay()
LeafDrupal\views\Tests\ViewPageControllerTest1000
LeafDrupal\views\Tests\ViewRenderTest200
LeafDrupal\views\Tests\ViewsDataHelperTest100
LeafDrupal\views\Tests\ViewsDataTest6500
LeafDrupal\views\Tests\ViewsHooksTest3200
LeafDrupal\views\Tests\ViewsTaxonomyAutocompleteTest1500
LeafDrupal\views\Tests\ViewStorageTest10600
ExpandDrupal\views\Tests\Wizard\BasicTest911
MessageGroupFilenameLineFunctionStatus
Drupal\Core\Config\StorageException: Failed to write configuration file: sites/default/files/simpletest/175141/config_active/field.field.body.yml in Drupal\Core\Config\FileStorage->write() (line 102 of /var/lib/drupaltestbot/sites/default/files/checkout/core/lib/Drupal/Core/Config/FileStorage.php). Drupal\Core\Config\FileStorage->write('field.field.body', Array) Drupal\Core\Config\CachedStorage->write('field.field.body', Array) Drupal\Core\Config\Config->save() Drupal\Core\Config\Entity\ConfigStorageController->save(Object) Drupal\Core\Entity\Entity->save() Drupal\field\Plugin\Core\Entity\Field->saveNew() Drupal\field\Plugin\Core\Entity\Field->save() node_add_body_field(Object) Drupal\simpletest\WebTestBase->drupalCreateContentType(Array) Drupal\views\Tests\Wizard\BasicTest->testViewsWizardAndListing() Drupal\simpletest\TestBase->run() simpletest_script_run_one_test('851', 'Drupal\views\Tests\Wizard\BasicTest') Uncaught exceptionFileStorage.php102Drupal\Core\Config\FileStorage->write()
The test did not complete due to a fatal error.Completion checkBasicTest.php146Drupal\views\Tests\Wizard\BasicTest->testWizardForm()
ExpandDrupal\views\Tests\Wizard\ItemsPerPageTest010
MessageGroupFilenameLineFunctionStatus
The test did not complete due to a fatal error.Completion checkItemsPerPageTest.php26Drupal\views\Tests\Wizard\ItemsPerPageTest->testItemsPerPage()
ExpandDrupal\views\Tests\Wizard\MenuTest010
MessageGroupFilenameLineFunctionStatus
The test did not complete due to a fatal error.Completion checkMenuTest.php26Drupal\views\Tests\Wizard\MenuTest->testMenus()
ExpandDrupal\views\Tests\Wizard\SortingTest010
MessageGroupFilenameLineFunctionStatus
The test did not complete due to a fatal error.Completion checkSortingTest.php26Drupal\views\Tests\Wizard\SortingTest->testSorting()
LeafDrupal\views\Tests\Wizard\TaggedWithTest7800
LeafDrupal\views\Tests\Wizard\WizardPluginBaseUnitTest1300
LeafDrupal\views_ui\Tests\AnalyzeTest2100
ExpandDrupal\views_ui\Tests\CachedDataUITest110
MessageGroupFilenameLineFunctionStatus
The test did not complete due to a fatal error.Completion checkCachedDataUITest.php33Drupal\views_ui\Tests\CachedDataUITest->testCacheData()
LeafDrupal\views_ui\Tests\CustomBooleanTest4200
ExpandDrupal\views_ui\Tests\DefaultViewsTest9020
MessageGroupFilenameLineFunctionStatus
The custom view name got saved.OtherDefaultViewsTest.php98Drupal\views_ui\Tests\DefaultViewsTest->testDefaultViews()
The test did not complete due to a fatal error.Completion checkDefaultViewsTest.php132Drupal\views_ui\Tests\DefaultViewsTest->testSplitListing()
ExpandDrupal\views_ui\Tests\DisplayAttachmentTest010
MessageGroupFilenameLineFunctionStatus
The test did not complete due to a fatal error.Completion checkDisplayAttachmentTest.php35Drupal\views_ui\Tests\DisplayAttachmentTest->testAttachmentUI()
ExpandDrupal\views_ui\Tests\DisplayExtenderUITest010
MessageGroupFilenameLineFunctionStatus
The test did not complete due to a fatal error.Completion checkDisplayExtenderUITest.php33Drupal\views_ui\Tests\DisplayExtenderUITest->testDisplayExtenderUI()
ExpandDrupal\views_ui\Tests\DisplayPath010
MessageGroupFilenameLineFunctionStatus
The test did not complete due to a fatal error.Completion checkDisplayPath.php32Drupal\views_ui\Tests\DisplayPath->testPathUI()
ExpandDrupal\views_ui\Tests\DisplayTest010
MessageGroupFilenameLineFunctionStatus
The test did not complete due to a fatal error.Completion checkDisplayTest.php61Drupal\views_ui\Tests\DisplayTest->testRemoveDisplay()
ExpandDrupal\views_ui\Tests\ExposedFormUITest010
MessageGroupFilenameLineFunctionStatus
The test did not complete due to a fatal error.Completion checkExposedFormUITest.php45Drupal\views_ui\Tests\ExposedFormUITest->testExposedAdminUi()
LeafDrupal\views_ui\Tests\FieldUITest2100
LeafDrupal\views_ui\Tests\FilterBooleanWebTest2700
LeafDrupal\views_ui\Tests\Form\Ajax\RearrangeFilterTest100
LeafDrupal\views_ui\Tests\GroupByTest2900
ExpandDrupal\views_ui\Tests\HandlerTest110
MessageGroupFilenameLineFunctionStatus
The test did not complete due to a fatal error.Completion checkHandlerTest.php76Drupal\views_ui\Tests\HandlerTest->testUICRUD()
ExpandDrupal\views_ui\Tests\OverrideDisplaysTest110
MessageGroupFilenameLineFunctionStatus
The test did not complete due to a fatal error.Completion checkOverrideDisplaysTest.php26Drupal\views_ui\Tests\OverrideDisplaysTest->testOverrideDisplays()
ExpandDrupal\views_ui\Tests\PreviewTest010
MessageGroupFilenameLineFunctionStatus
The test did not complete due to a fatal error.Completion checkPreviewTest.php33Drupal\views_ui\Tests\PreviewTest->testPreviewContextual()
ExpandDrupal\views_ui\Tests\QueryTest010
MessageGroupFilenameLineFunctionStatus
The test did not complete due to a fatal error.Completion checkQueryTest.php46Drupal\views_ui\Tests\QueryTest->testQueryUI()
ExpandDrupal\views_ui\Tests\RearrangeFieldsTest010
MessageGroupFilenameLineFunctionStatus
The test did not complete due to a fatal error.Completion checkRearrangeFieldsTest.php64Drupal\views_ui\Tests\RearrangeFieldsTest->testRearrangeFields()
ExpandDrupal\views_ui\Tests\RedirectTest2410
MessageGroupFilenameLineFunctionStatus
Make sure the user got redirected to the expected page after changing the url of a page display.OtherRedirectTest.php56Drupal\views_ui\Tests\RedirectTest->testRedirect()
LeafDrupal\views_ui\Tests\RowUITest3000
ExpandDrupal\views_ui\Tests\SettingsTest8510
MessageGroupFilenameLineFunctionStatus
Link with label Master not found.OtherSettingsTest.php71Drupal\views_ui\Tests\SettingsTest->testEditUI()
LeafDrupal\views_ui\Tests\StorageTest2200
ExpandDrupal\views_ui\Tests\StyleUITest20215
MessageGroupFilenameLineFunctionStatus
mkdir(): No space left on deviceWarningMTimeProtectedFastFileStorage.php150Drupal\Component\PhpStorage\MTimeProtectedFastFileStorage->ensureDirectory()
chmod(): No such file or directoryWarningMTimeProtectedFastFileStorage.php152Drupal\Component\PhpStorage\MTimeProtectedFastFileStorage->ensureDirectory()
file_put_contents(/var/lib/drupaltestbot/sites/default/files/checkout/sites/default/files/simpletest/215082/php/twig/.htaccess): failed to open stream: No such file or directoryWarningMTimeProtectedFastFileStorage.php154Drupal\Component\PhpStorage\MTimeProtectedFastFileStorage->ensureDirectory()
simplexml_import_dom(): Invalid Nodetype to importsimplexml_import_dom(Object) Drupal\simpletest\WebTestBase->parse() Drupal\simpletest\WebTestBase->drupalPost('user', Array, 'Log in') Drupal\simpletest\WebTestBase->drupalLogin(Object) Drupal\views_ui\Tests\UITestBase->setUp() Drupal\simpletest\TestBase->run() simpletest_script_run_one_test('848', 'Drupal\views_ui\Tests\StyleUITest') WarningWebTestBase.php1200Drupal\simpletest\WebTestBase->parse()
Parsed page successfully.BrowserUITestBase.php46Drupal\views_ui\Tests\UITestBase->setUp()
User za888ym3 successfully logged in.User loginUITestBase.php46Drupal\views_ui\Tests\UITestBase->setUp()
The default style plugin selected in the UI should be unformatted list.BrowserStyleUITest.php44Drupal\views_ui\Tests\StyleUITest->testStyleUI()
Failed to set field style to test_styleOtherStyleUITest.php49Drupal\views_ui\Tests\StyleUITest->testStyleUI()
Found the Apply buttonOtherStyleUITest.php49Drupal\views_ui\Tests\StyleUITest->testStyleUI()
Found the requested form fields at OtherStyleUITest.php49Drupal\views_ui\Tests\StyleUITest->testStyleUI()
Make sure the custom settings form from the test plugin appears.BrowserStyleUITest.php50Drupal\views_ui\Tests\StyleUITest->testStyleUI()
Failed to set field style_options[test_option] to jKkDI47jOtherStyleUITest.php55Drupal\views_ui\Tests\StyleUITest->testStyleUI()
Found the Apply buttonOtherStyleUITest.php55Drupal\views_ui\Tests\StyleUITest->testStyleUI()
Found the requested form fields at OtherStyleUITest.php55Drupal\views_ui\Tests\StyleUITest->testStyleUI()
Make sure the custom settings form field has the expected value stored.BrowserStyleUITest.php57Drupal\views_ui\Tests\StyleUITest->testStyleUI()
Found the Save buttonOtherStyleUITest.php59Drupal\views_ui\Tests\StyleUITest->testStyleUI()
Found the requested form fields at admin/structure/views/view/test_view/editOtherStyleUITest.php59Drupal\views_ui\Tests\StyleUITest->testStyleUI()
Make sure the test style plugin is shown in the UIOtherStyleUITest.php60Drupal\views_ui\Tests\StyleUITest->testStyleUI()
Make sure that the test_style got saved as used style plugin.OtherStyleUITest.php65Drupal\views_ui\Tests\StyleUITest->testStyleUI()
Undefined index: test_optionDrupal\views_ui\Tests\StyleUITest->testStyleUI() Drupal\simpletest\TestBase->run() simpletest_script_run_one_test('848', 'Drupal\views_ui\Tests\StyleUITest') NoticeStyleUITest.php66Drupal\views_ui\Tests\StyleUITest->testStyleUI()
Make sure that the custom settings field got saved as expected.OtherStyleUITest.php66Drupal\views_ui\Tests\StyleUITest->testStyleUI()
Found the Add Page buttonOtherStyleUITest.php70Drupal\views_ui\Tests\StyleUITest->testStyleUI()
Found the requested form fields at admin/structure/views/view/test_view/editOtherStyleUITest.php70Drupal\views_ui\Tests\StyleUITest->testStyleUI()
Failed to set field row to fieldsOtherStyleUITest.php71Drupal\views_ui\Tests\StyleUITest->testStyleUI()
Found the Apply buttonOtherStyleUITest.php71Drupal\views_ui\Tests\StyleUITest->testStyleUI()
Found the requested form fields at admin/structure/views/nojs/display/test_view/page_1/rowOtherStyleUITest.php71Drupal\views_ui\Tests\StyleUITest->testStyleUI()
LeafDrupal\views_ui\Tests\TagTest1500
LeafDrupal\views_ui\Tests\ViewListControllerTest100
LeafDrupal\views_ui\Tests\ViewUIObjectTest100
LeafDrupal\xmlrpc\Tests\XmlRpcBasicTest900
LeafDrupal\xmlrpc\Tests\XmlRpcMessagesTest700
LeafDrupal\xmlrpc\Tests\XmlRpcValidatorTest1000