1905152-metadata-locale-integration-73.patch

Test status
StatusResult
Last receivedThu, 03/28/2013 - 11:33:12
Last requestedThu, 03/28/2013 - 11:34:01
Last testedThu, 03/28/2013 - 12:17:52
Test count1
Environment status
MySQLfail
File information
File1905152-metadata-locale-integration-73.patch
BranchDrupal core - 8.x
LinkIssue Link
SummaryFAILED: [[SimpleTest]]: [MySQL] 52,634 pass(es), 27 fail(s), and 23 exception(s).
Details

MySQL

  1. Setup environment
  2. Detect an invalid patch URL
  3. Detect invalid repository information
  4. Detect invalid patch format
  5. Detect a non-applicable patch
  6. Detect invalid PHP syntax
  7. Detect a Drupal installation failure
  8. Detect a test run failure
  9. Detect a failing test
    Review the test failures below then if necessary run them locally until the problem has been fixed.
  10. Complete test suite with all tests passing
52,634 pass(es), 27 fail(s), and 23 exception(s)

Non-pass

Test namePassFailException
ExpandDrupal\config\Tests\ConfigLocaleOverride110
MessageGroupFilenameLineFunctionStatus
The test did not complete due to a fatal error.Completion checkConfigLocaleOverride.php42Drupal\config\Tests\ConfigLocaleOverride->testConfigLocaleOverride()
ExpandDrupal\config\Tests\ConfigSchemaTest110
MessageGroupFilenameLineFunctionStatus
The test did not complete due to a fatal error.Completion checkConfigSchemaTest.php43Drupal\config\Tests\ConfigSchemaTest->testSchemaMapping()
ExpandDrupal\contact\Tests\ContactUpgradePathTest311
MessageGroupFilenameLineFunctionStatus
HTTP response expected 200, actual 500BrowserUpgradePathTestBase.php214Drupal\system\Tests\Upgrade\UpgradePathTestBase->performUpgrade()
Exception: Initial GET to update.php did not return HTTP 200 status. in Drupal\system\Tests\Upgrade\UpgradePathTestBase->performUpgrade() (line 215 of /var/lib/drupaltestbot/sites/default/files/checkout/core/modules/system/lib/Drupal/system/Tests/Upgrade/UpgradePathTestBase.php). Drupal\system\Tests\Upgrade\UpgradePathTestBase->performUpgrade() Drupal\contact\Tests\ContactUpgradePathTest->testContactUpgrade() Drupal\simpletest\TestBase->run() simpletest_script_run_one_test('138', 'Drupal\contact\Tests\ContactUpgradePathTest') Uncaught exceptionUpgradePathTestBase.php215Drupal\system\Tests\Upgrade\UpgradePathTestBase->performUpgrade()
ExpandDrupal\locale\Tests\LocaleConfigTranslationTest8420
MessageGroupFilenameLineFunctionStatus
Got the right number of properties with strict translationOtherLocaleConfigTranslationTest.php106Drupal\locale\Tests\LocaleConfigTranslationTest->testConfigTranslation()
The new site name is displayed on foreign language page.OtherLocaleConfigTranslationTest.php112Drupal\locale\Tests\LocaleConfigTranslationTest->testConfigTranslation()
ExpandDrupal\locale\Tests\LocaleUninstallFrenchTest2201
MessageGroupFilenameLineFunctionStatus
Drupal\Core\Database\DatabaseExceptionWrapper: SQLSTATE[42S02]: Base table or view not found: 1146 Table 'drupaltestbotmysql.simpletest826662locales_location' doesn't exist: SELECT l.* FROM {locales_location} l; Array ( ) in Drupal\Core\Database\Connection->query() (line 554 of /var/lib/drupaltestbot/sites/default/files/checkout/core/lib/Drupal/Core/Database/Connection.php). Drupal\Core\Database\Connection->query('SELECT l.* FROM {locales_location} l', Array, Array) Drupal\Core\Database\Query\Select->execute() Drupal\locale\StringDatabaseStorage->getLocations() Drupal\locale\LocaleConfigSubscriber->configSave(Object) call_user_func(Array, Object) Symfony\Component\EventDispatcher\EventDispatcher->doDispatch(Array, 'config.save', Object) Symfony\Component\EventDispatcher\EventDispatcher->dispatch('config.save', Object) Symfony\Component\EventDispatcher\ContainerAwareEventDispatcher->dispatch('config.save', Object) Drupal\Core\Config\Context\ConfigContext->notify('save', Object) Drupal\Core\Config\Config->notify('save') Drupal\Core\Config\Config->save() module_uninstall(Array) Drupal\locale\Tests\LocaleUninstallTest->testUninstallProcess() Drupal\simpletest\TestBase->run() simpletest_script_run_one_test('394', 'Drupal\locale\Tests\LocaleUninstallFrenchTest') Uncaught exceptionConnection.php554Drupal\Core\Database\Connection->query()
ExpandDrupal\locale\Tests\LocaleUninstallTest2201
MessageGroupFilenameLineFunctionStatus
Drupal\Core\Database\DatabaseExceptionWrapper: SQLSTATE[42S02]: Base table or view not found: 1146 Table 'drupaltestbotmysql.simpletest386297locales_location' doesn't exist: SELECT l.* FROM {locales_location} l; Array ( ) in Drupal\Core\Database\Connection->query() (line 554 of /var/lib/drupaltestbot/sites/default/files/checkout/core/lib/Drupal/Core/Database/Connection.php). Drupal\Core\Database\Connection->query('SELECT l.* FROM {locales_location} l', Array, Array) Drupal\Core\Database\Query\Select->execute() Drupal\locale\StringDatabaseStorage->getLocations() Drupal\locale\LocaleConfigSubscriber->configSave(Object) call_user_func(Array, Object) Symfony\Component\EventDispatcher\EventDispatcher->doDispatch(Array, 'config.save', Object) Symfony\Component\EventDispatcher\EventDispatcher->dispatch('config.save', Object) Symfony\Component\EventDispatcher\ContainerAwareEventDispatcher->dispatch('config.save', Object) Drupal\Core\Config\Context\ConfigContext->notify('save', Object) Drupal\Core\Config\Config->notify('save') Drupal\Core\Config\Config->save() module_uninstall(Array) Drupal\locale\Tests\LocaleUninstallTest->testUninstallProcess() Drupal\simpletest\TestBase->run() simpletest_script_run_one_test('395', 'Drupal\locale\Tests\LocaleUninstallTest') Uncaught exceptionConnection.php554Drupal\Core\Database\Connection->query()
ExpandDrupal\system\Tests\Entity\EntityAccessTest810
MessageGroupFilenameLineFunctionStatus
The test did not complete due to a fatal error.Completion checkEntityAccessTest.php62Drupal\system\Tests\Entity\EntityAccessTest->testEntityAccess()
ExpandDrupal\system\Tests\Entity\EntityTranslationTest810
MessageGroupFilenameLineFunctionStatus
The test did not complete due to a fatal error.Completion checkEntityTranslationTest.php95Drupal\system\Tests\Entity\EntityTranslationTest->testEntityLanguageMethods()
ExpandDrupal\system\Tests\Upgrade\BareStandardUpgradePathTest211
MessageGroupFilenameLineFunctionStatus
HTTP response expected 200, actual 500BrowserUpgradePathTestBase.php214Drupal\system\Tests\Upgrade\UpgradePathTestBase->performUpgrade()
Exception: Initial GET to update.php did not return HTTP 200 status. in Drupal\system\Tests\Upgrade\UpgradePathTestBase->performUpgrade() (line 215 of /var/lib/drupaltestbot/sites/default/files/checkout/core/modules/system/lib/Drupal/system/Tests/Upgrade/UpgradePathTestBase.php). Drupal\system\Tests\Upgrade\UpgradePathTestBase->performUpgrade() Drupal\system\Tests\Upgrade\BareStandardUpgradePathTest->testBasicStandardUpgrade() Drupal\simpletest\TestBase->run() simpletest_script_run_one_test('646', 'Drupal\system\Tests\Upgrade\BareStandardUpgradePathTest') Uncaught exceptionUpgradePathTestBase.php215Drupal\system\Tests\Upgrade\UpgradePathTestBase->performUpgrade()
ExpandDrupal\system\Tests\Upgrade\DateUpgradePathTest211
MessageGroupFilenameLineFunctionStatus
HTTP response expected 200, actual 500BrowserUpgradePathTestBase.php214Drupal\system\Tests\Upgrade\UpgradePathTestBase->performUpgrade()
Exception: Initial GET to update.php did not return HTTP 200 status. in Drupal\system\Tests\Upgrade\UpgradePathTestBase->performUpgrade() (line 215 of /var/lib/drupaltestbot/sites/default/files/checkout/core/modules/system/lib/Drupal/system/Tests/Upgrade/UpgradePathTestBase.php). Drupal\system\Tests\Upgrade\UpgradePathTestBase->performUpgrade() Drupal\system\Tests\Upgrade\DateUpgradePathTest->testDateUpgrade() Drupal\simpletest\TestBase->run() simpletest_script_run_one_test('648', 'Drupal\system\Tests\Upgrade\DateUpgradePathTest') Uncaught exceptionUpgradePathTestBase.php215Drupal\system\Tests\Upgrade\UpgradePathTestBase->performUpgrade()
ExpandDrupal\system\Tests\Upgrade\FieldUIUpgradePathTest211
MessageGroupFilenameLineFunctionStatus
HTTP response expected 200, actual 500BrowserUpgradePathTestBase.php214Drupal\system\Tests\Upgrade\UpgradePathTestBase->performUpgrade()
Exception: Initial GET to update.php did not return HTTP 200 status. in Drupal\system\Tests\Upgrade\UpgradePathTestBase->performUpgrade() (line 215 of /var/lib/drupaltestbot/sites/default/files/checkout/core/modules/system/lib/Drupal/system/Tests/Upgrade/UpgradePathTestBase.php). Drupal\system\Tests\Upgrade\UpgradePathTestBase->performUpgrade() Drupal\system\Tests\Upgrade\FieldUIUpgradePathTest->testFieldUIPermissions() Drupal\simpletest\TestBase->run() simpletest_script_run_one_test('649', 'Drupal\system\Tests\Upgrade\FieldUIUpgradePathTest') Uncaught exceptionUpgradePathTestBase.php215Drupal\system\Tests\Upgrade\UpgradePathTestBase->performUpgrade()
ExpandDrupal\system\Tests\Upgrade\FieldUpgradePathTest211
MessageGroupFilenameLineFunctionStatus
HTTP response expected 200, actual 500BrowserUpgradePathTestBase.php214Drupal\system\Tests\Upgrade\UpgradePathTestBase->performUpgrade()
Exception: Initial GET to update.php did not return HTTP 200 status. in Drupal\system\Tests\Upgrade\UpgradePathTestBase->performUpgrade() (line 215 of /var/lib/drupaltestbot/sites/default/files/checkout/core/modules/system/lib/Drupal/system/Tests/Upgrade/UpgradePathTestBase.php). Drupal\system\Tests\Upgrade\UpgradePathTestBase->performUpgrade() Drupal\system\Tests\Upgrade\FieldUpgradePathTest->testEntityDisplayUpgrade() Drupal\simpletest\TestBase->run() simpletest_script_run_one_test('650', 'Drupal\system\Tests\Upgrade\FieldUpgradePathTest') Uncaught exceptionUpgradePathTestBase.php215Drupal\system\Tests\Upgrade\UpgradePathTestBase->performUpgrade()
ExpandDrupal\system\Tests\Upgrade\FilledStandardUpgradePathTest211
MessageGroupFilenameLineFunctionStatus
HTTP response expected 200, actual 500BrowserUpgradePathTestBase.php214Drupal\system\Tests\Upgrade\UpgradePathTestBase->performUpgrade()
Exception: Initial GET to update.php did not return HTTP 200 status. in Drupal\system\Tests\Upgrade\UpgradePathTestBase->performUpgrade() (line 215 of /var/lib/drupaltestbot/sites/default/files/checkout/core/modules/system/lib/Drupal/system/Tests/Upgrade/UpgradePathTestBase.php). Drupal\system\Tests\Upgrade\UpgradePathTestBase->performUpgrade() Drupal\system\Tests\Upgrade\FilledStandardUpgradePathTest->testFilledStandardUpgrade() Drupal\simpletest\TestBase->run() simpletest_script_run_one_test('652', 'Drupal\system\Tests\Upgrade\FilledStandardUpgradePathTest') Uncaught exceptionUpgradePathTestBase.php215Drupal\system\Tests\Upgrade\UpgradePathTestBase->performUpgrade()
ExpandDrupal\system\Tests\Upgrade\FilterFormatUpgradePathTest211
MessageGroupFilenameLineFunctionStatus
HTTP response expected 200, actual 500BrowserUpgradePathTestBase.php214Drupal\system\Tests\Upgrade\UpgradePathTestBase->performUpgrade()
Exception: Initial GET to update.php did not return HTTP 200 status. in Drupal\system\Tests\Upgrade\UpgradePathTestBase->performUpgrade() (line 215 of /var/lib/drupaltestbot/sites/default/files/checkout/core/modules/system/lib/Drupal/system/Tests/Upgrade/UpgradePathTestBase.php). Drupal\system\Tests\Upgrade\UpgradePathTestBase->performUpgrade() Drupal\system\Tests\Upgrade\FilterFormatUpgradePathTest->testFilterFormatUpgrade() Drupal\simpletest\TestBase->run() simpletest_script_run_one_test('653', 'Drupal\system\Tests\Upgrade\FilterFormatUpgradePathTest') Uncaught exceptionUpgradePathTestBase.php215Drupal\system\Tests\Upgrade\UpgradePathTestBase->performUpgrade()
ExpandDrupal\system\Tests\Upgrade\ImageUpgradePathTest211
MessageGroupFilenameLineFunctionStatus
HTTP response expected 200, actual 500BrowserUpgradePathTestBase.php214Drupal\system\Tests\Upgrade\UpgradePathTestBase->performUpgrade()
Exception: Initial GET to update.php did not return HTTP 200 status. in Drupal\system\Tests\Upgrade\UpgradePathTestBase->performUpgrade() (line 215 of /var/lib/drupaltestbot/sites/default/files/checkout/core/modules/system/lib/Drupal/system/Tests/Upgrade/UpgradePathTestBase.php). Drupal\system\Tests\Upgrade\UpgradePathTestBase->performUpgrade() Drupal\system\Tests\Upgrade\ImageUpgradePathTest->testImageStyleUpgrade() Drupal\simpletest\TestBase->run() simpletest_script_run_one_test('654', 'Drupal\system\Tests\Upgrade\ImageUpgradePathTest') Uncaught exceptionUpgradePathTestBase.php215Drupal\system\Tests\Upgrade\UpgradePathTestBase->performUpgrade()
ExpandDrupal\system\Tests\Upgrade\LanguageUpgradePathTest844
MessageGroupFilenameLineFunctionStatus
HTTP response expected 200, actual 500BrowserUpgradePathTestBase.php214Drupal\system\Tests\Upgrade\UpgradePathTestBase->performUpgrade()
Exception: Initial GET to update.php did not return HTTP 200 status. in Drupal\system\Tests\Upgrade\UpgradePathTestBase->performUpgrade() (line 215 of /var/lib/drupaltestbot/sites/default/files/checkout/core/modules/system/lib/Drupal/system/Tests/Upgrade/UpgradePathTestBase.php). Drupal\system\Tests\Upgrade\UpgradePathTestBase->performUpgrade() Drupal\system\Tests\Upgrade\LanguageUpgradePathTest->testLanguageUpgrade() Drupal\simpletest\TestBase->run() simpletest_script_run_one_test('655', 'Drupal\system\Tests\Upgrade\LanguageUpgradePathTest') Uncaught exceptionUpgradePathTestBase.php215Drupal\system\Tests\Upgrade\UpgradePathTestBase->performUpgrade()
HTTP response expected 200, actual 500BrowserUpgradePathTestBase.php214Drupal\system\Tests\Upgrade\UpgradePathTestBase->performUpgrade()
Exception: Initial GET to update.php did not return HTTP 200 status. in Drupal\system\Tests\Upgrade\UpgradePathTestBase->performUpgrade() (line 215 of /var/lib/drupaltestbot/sites/default/files/checkout/core/modules/system/lib/Drupal/system/Tests/Upgrade/UpgradePathTestBase.php). Drupal\system\Tests\Upgrade\UpgradePathTestBase->performUpgrade() Drupal\system\Tests\Upgrade\LanguageUpgradePathTest->testLanguageUrlUpgrade() Drupal\simpletest\TestBase->run() simpletest_script_run_one_test('655', 'Drupal\system\Tests\Upgrade\LanguageUpgradePathTest') Uncaught exceptionUpgradePathTestBase.php215Drupal\system\Tests\Upgrade\UpgradePathTestBase->performUpgrade()
HTTP response expected 200, actual 500BrowserUpgradePathTestBase.php214Drupal\system\Tests\Upgrade\UpgradePathTestBase->performUpgrade()
Exception: Initial GET to update.php did not return HTTP 200 status. in Drupal\system\Tests\Upgrade\UpgradePathTestBase->performUpgrade() (line 215 of /var/lib/drupaltestbot/sites/default/files/checkout/core/modules/system/lib/Drupal/system/Tests/Upgrade/UpgradePathTestBase.php). Drupal\system\Tests\Upgrade\UpgradePathTestBase->performUpgrade() Drupal\system\Tests\Upgrade\LanguageUpgradePathTest->testLanguageNoPluralsUpgrade() Drupal\simpletest\TestBase->run() simpletest_script_run_one_test('655', 'Drupal\system\Tests\Upgrade\LanguageUpgradePathTest') Uncaught exceptionUpgradePathTestBase.php215Drupal\system\Tests\Upgrade\UpgradePathTestBase->performUpgrade()
HTTP response expected 200, actual 500BrowserUpgradePathTestBase.php214Drupal\system\Tests\Upgrade\UpgradePathTestBase->performUpgrade()
Exception: Initial GET to update.php did not return HTTP 200 status. in Drupal\system\Tests\Upgrade\UpgradePathTestBase->performUpgrade() (line 215 of /var/lib/drupaltestbot/sites/default/files/checkout/core/modules/system/lib/Drupal/system/Tests/Upgrade/UpgradePathTestBase.php). Drupal\system\Tests\Upgrade\UpgradePathTestBase->performUpgrade() Drupal\system\Tests\Upgrade\LanguageUpgradePathTest->testLanguagePermissionsUpgrade() Drupal\simpletest\TestBase->run() simpletest_script_run_one_test('655', 'Drupal\system\Tests\Upgrade\LanguageUpgradePathTest') Uncaught exceptionUpgradePathTestBase.php215Drupal\system\Tests\Upgrade\UpgradePathTestBase->performUpgrade()
ExpandDrupal\system\Tests\Upgrade\MailUpgradePathTest211
MessageGroupFilenameLineFunctionStatus
HTTP response expected 200, actual 500BrowserUpgradePathTestBase.php214Drupal\system\Tests\Upgrade\UpgradePathTestBase->performUpgrade()
Exception: Initial GET to update.php did not return HTTP 200 status. in Drupal\system\Tests\Upgrade\UpgradePathTestBase->performUpgrade() (line 215 of /var/lib/drupaltestbot/sites/default/files/checkout/core/modules/system/lib/Drupal/system/Tests/Upgrade/UpgradePathTestBase.php). Drupal\system\Tests\Upgrade\UpgradePathTestBase->performUpgrade(1) Drupal\system\Tests\Upgrade\MailUpgradePathTest->testMailSystemUpgrade() Drupal\simpletest\TestBase->run() simpletest_script_run_one_test('656', 'Drupal\system\Tests\Upgrade\MailUpgradePathTest') Uncaught exceptionUpgradePathTestBase.php215Drupal\system\Tests\Upgrade\UpgradePathTestBase->performUpgrade()
ExpandDrupal\system\Tests\Upgrade\ShortcutUpgradePathTest311
MessageGroupFilenameLineFunctionStatus
HTTP response expected 200, actual 500BrowserUpgradePathTestBase.php214Drupal\system\Tests\Upgrade\UpgradePathTestBase->performUpgrade()
Exception: Initial GET to update.php did not return HTTP 200 status. in Drupal\system\Tests\Upgrade\UpgradePathTestBase->performUpgrade() (line 215 of /var/lib/drupaltestbot/sites/default/files/checkout/core/modules/system/lib/Drupal/system/Tests/Upgrade/UpgradePathTestBase.php). Drupal\system\Tests\Upgrade\UpgradePathTestBase->performUpgrade() Drupal\system\Tests\Upgrade\ShortcutUpgradePathTest->testContactUpgrade() Drupal\simpletest\TestBase->run() simpletest_script_run_one_test('658', 'Drupal\system\Tests\Upgrade\ShortcutUpgradePathTest') Uncaught exceptionUpgradePathTestBase.php215Drupal\system\Tests\Upgrade\UpgradePathTestBase->performUpgrade()
ExpandDrupal\system\Tests\Upgrade\StateSystemUpgradePathTest211
MessageGroupFilenameLineFunctionStatus
HTTP response expected 200, actual 500BrowserUpgradePathTestBase.php214Drupal\system\Tests\Upgrade\UpgradePathTestBase->performUpgrade()
Exception: Initial GET to update.php did not return HTTP 200 status. in Drupal\system\Tests\Upgrade\UpgradePathTestBase->performUpgrade() (line 215 of /var/lib/drupaltestbot/sites/default/files/checkout/core/modules/system/lib/Drupal/system/Tests/Upgrade/UpgradePathTestBase.php). Drupal\system\Tests\Upgrade\UpgradePathTestBase->performUpgrade() Drupal\system\Tests\Upgrade\StateSystemUpgradePathTest->testSystemVariableUpgrade() Drupal\simpletest\TestBase->run() simpletest_script_run_one_test('659', 'Drupal\system\Tests\Upgrade\StateSystemUpgradePathTest') Uncaught exceptionUpgradePathTestBase.php215Drupal\system\Tests\Upgrade\UpgradePathTestBase->performUpgrade()
ExpandDrupal\system\Tests\Upgrade\SystemUpgradePathTest422
MessageGroupFilenameLineFunctionStatus
HTTP response expected 200, actual 500BrowserUpgradePathTestBase.php214Drupal\system\Tests\Upgrade\UpgradePathTestBase->performUpgrade()
Exception: Initial GET to update.php did not return HTTP 200 status. in Drupal\system\Tests\Upgrade\UpgradePathTestBase->performUpgrade() (line 215 of /var/lib/drupaltestbot/sites/default/files/checkout/core/modules/system/lib/Drupal/system/Tests/Upgrade/UpgradePathTestBase.php). Drupal\system\Tests\Upgrade\UpgradePathTestBase->performUpgrade() Drupal\system\Tests\Upgrade\SystemUpgradePathTest->testVariableUpgrade() Drupal\simpletest\TestBase->run() simpletest_script_run_one_test('660', 'Drupal\system\Tests\Upgrade\SystemUpgradePathTest') Uncaught exceptionUpgradePathTestBase.php215Drupal\system\Tests\Upgrade\UpgradePathTestBase->performUpgrade()
HTTP response expected 200, actual 500BrowserUpgradePathTestBase.php214Drupal\system\Tests\Upgrade\UpgradePathTestBase->performUpgrade()
Exception: Initial GET to update.php did not return HTTP 200 status. in Drupal\system\Tests\Upgrade\UpgradePathTestBase->performUpgrade() (line 215 of /var/lib/drupaltestbot/sites/default/files/checkout/core/modules/system/lib/Drupal/system/Tests/Upgrade/UpgradePathTestBase.php). Drupal\system\Tests\Upgrade\UpgradePathTestBase->performUpgrade() Drupal\system\Tests\Upgrade\SystemUpgradePathTest->testFrontpageUpgrade() Drupal\simpletest\TestBase->run() simpletest_script_run_one_test('660', 'Drupal\system\Tests\Upgrade\SystemUpgradePathTest') Uncaught exceptionUpgradePathTestBase.php215Drupal\system\Tests\Upgrade\UpgradePathTestBase->performUpgrade()
ExpandDrupal\system\Tests\Upgrade\UserPictureUpgradePathTest211
MessageGroupFilenameLineFunctionStatus
HTTP response expected 200, actual 500BrowserUpgradePathTestBase.php214Drupal\system\Tests\Upgrade\UpgradePathTestBase->performUpgrade()
Exception: Initial GET to update.php did not return HTTP 200 status. in Drupal\system\Tests\Upgrade\UpgradePathTestBase->performUpgrade() (line 215 of /var/lib/drupaltestbot/sites/default/files/checkout/core/modules/system/lib/Drupal/system/Tests/Upgrade/UpgradePathTestBase.php). Drupal\system\Tests\Upgrade\UpgradePathTestBase->performUpgrade() Drupal\system\Tests\Upgrade\UserPictureUpgradePathTest->testUserPictureUpgrade() Drupal\simpletest\TestBase->run() simpletest_script_run_one_test('661', 'Drupal\system\Tests\Upgrade\UserPictureUpgradePathTest') Uncaught exceptionUpgradePathTestBase.php215Drupal\system\Tests\Upgrade\UpgradePathTestBase->performUpgrade()
ExpandDrupal\system\Tests\Upgrade\UserRoleUpgradePathTest422
MessageGroupFilenameLineFunctionStatus
HTTP response expected 200, actual 500BrowserUpgradePathTestBase.php214Drupal\system\Tests\Upgrade\UpgradePathTestBase->performUpgrade()
Exception: Initial GET to update.php did not return HTTP 200 status. in Drupal\system\Tests\Upgrade\UpgradePathTestBase->performUpgrade() (line 215 of /var/lib/drupaltestbot/sites/default/files/checkout/core/modules/system/lib/Drupal/system/Tests/Upgrade/UpgradePathTestBase.php). Drupal\system\Tests\Upgrade\UpgradePathTestBase->performUpgrade() Drupal\system\Tests\Upgrade\UserRoleUpgradePathTest->testRoleUpgrade() Drupal\simpletest\TestBase->run() simpletest_script_run_one_test('662', 'Drupal\system\Tests\Upgrade\UserRoleUpgradePathTest') Uncaught exceptionUpgradePathTestBase.php215Drupal\system\Tests\Upgrade\UpgradePathTestBase->performUpgrade()
HTTP response expected 200, actual 500BrowserUpgradePathTestBase.php214Drupal\system\Tests\Upgrade\UpgradePathTestBase->performUpgrade()
Exception: Initial GET to update.php did not return HTTP 200 status. in Drupal\system\Tests\Upgrade\UpgradePathTestBase->performUpgrade() (line 215 of /var/lib/drupaltestbot/sites/default/files/checkout/core/modules/system/lib/Drupal/system/Tests/Upgrade/UpgradePathTestBase.php). Drupal\system\Tests\Upgrade\UpgradePathTestBase->performUpgrade() Drupal\system\Tests\Upgrade\UserRoleUpgradePathTest->testRoleUpgradeToConfig() Drupal\simpletest\TestBase->run() simpletest_script_run_one_test('662', 'Drupal\system\Tests\Upgrade\UserRoleUpgradePathTest') Uncaught exceptionUpgradePathTestBase.php215Drupal\system\Tests\Upgrade\UpgradePathTestBase->performUpgrade()
ExpandDrupal\system\Tests\Upgrade\UuidUpgradePathTest211
MessageGroupFilenameLineFunctionStatus
HTTP response expected 200, actual 500BrowserUpgradePathTestBase.php214Drupal\system\Tests\Upgrade\UpgradePathTestBase->performUpgrade()
Exception: Initial GET to update.php did not return HTTP 200 status. in Drupal\system\Tests\Upgrade\UpgradePathTestBase->performUpgrade() (line 215 of /var/lib/drupaltestbot/sites/default/files/checkout/core/modules/system/lib/Drupal/system/Tests/Upgrade/UpgradePathTestBase.php). Drupal\system\Tests\Upgrade\UpgradePathTestBase->performUpgrade() Drupal\system\Tests\Upgrade\UuidUpgradePathTest->testUuidUpgrade() Drupal\simpletest\TestBase->run() simpletest_script_run_one_test('663', 'Drupal\system\Tests\Upgrade\UuidUpgradePathTest') Uncaught exceptionUpgradePathTestBase.php215Drupal\system\Tests\Upgrade\UpgradePathTestBase->performUpgrade()

All

Test namePassFailException
LeafDrupal\action\Tests\BulkFormTest3300
LeafDrupal\action\Tests\ConfigurationTest3900
LeafDrupal\action\Tests\LoopTest2100
LeafDrupal\aggregator\Tests\AddFeedTest7300
LeafDrupal\aggregator\Tests\AggregatorConfigurationTest2000
LeafDrupal\aggregator\Tests\AggregatorCronTest5500
LeafDrupal\aggregator\Tests\AggregatorRenderingTest22000
LeafDrupal\aggregator\Tests\CategorizeFeedItemTest6100
LeafDrupal\aggregator\Tests\CategorizeFeedTest2500
LeafDrupal\aggregator\Tests\FeedLanguageTest5700
LeafDrupal\aggregator\Tests\FeedParserTest9900
LeafDrupal\aggregator\Tests\ImportOpmlTest6800
LeafDrupal\aggregator\Tests\RemoveFeedItemTest27000
LeafDrupal\aggregator\Tests\RemoveFeedTest2500
LeafDrupal\aggregator\Tests\UpdateFeedItemTest6500
LeafDrupal\aggregator\Tests\UpdateFeedTest7600
LeafDrupal\ban\Tests\IpAddressBlockingTest4300
LeafDrupal\block\Tests\BlockAdminThemeTest1900
LeafDrupal\block\Tests\BlockCacheTest18500
LeafDrupal\block\Tests\BlockHiddenRegionTest1800
LeafDrupal\block\Tests\BlockHtmlIdTest1000
LeafDrupal\block\Tests\BlockInvalidRegionTest2400
LeafDrupal\block\Tests\BlockLanguageCacheTest8200
LeafDrupal\block\Tests\BlockLanguageTest5100
LeafDrupal\block\Tests\BlockLibrarySearchTest1900
LeafDrupal\block\Tests\BlockStorageUnitTest2100
LeafDrupal\block\Tests\BlockTemplateSuggestionsUnitTest300
LeafDrupal\block\Tests\BlockTest22000
LeafDrupal\block\Tests\BlockTitleXSSTest1500
LeafDrupal\block\Tests\BlockUiTest900
LeafDrupal\block\Tests\NewDefaultThemeBlocksTest1700
LeafDrupal\block\Tests\NonDefaultBlockAdminTest1200
LeafDrupal\block\Tests\Views\DisplayBlockTest6900
LeafDrupal\book\Tests\BookTest63600
LeafDrupal\breakpoint\Tests\BreakpointAPITest600
LeafDrupal\breakpoint\Tests\BreakpointCRUDTest2100
LeafDrupal\breakpoint\Tests\BreakpointGroupAPITest400
LeafDrupal\breakpoint\Tests\BreakpointGroupCRUDTest1200
LeafDrupal\breakpoint\Tests\BreakpointMediaQueryTest200
LeafDrupal\breakpoint\Tests\BreakpointThemeTest2300
LeafDrupal\ckeditor\Tests\CKEditorAdminTest5500
LeafDrupal\ckeditor\Tests\CKEditorLoadingTest5100
LeafDrupal\ckeditor\Tests\CKEditorPluginManagerTest1600
LeafDrupal\ckeditor\Tests\CKEditorTest3400
LeafDrupal\color\Tests\ColorTest8700
LeafDrupal\comment\Tests\CommentActionsTest5500
LeafDrupal\comment\Tests\CommentAnonymousTest16300
LeafDrupal\comment\Tests\CommentApprovalTest15200
LeafDrupal\comment\Tests\CommentBlockTest9300
LeafDrupal\comment\Tests\CommentContentRebuildTest3300
LeafDrupal\comment\Tests\CommentCSSTest50100
LeafDrupal\comment\Tests\CommentFieldsTest9800
LeafDrupal\comment\Tests\CommentInterfaceTest24800
LeafDrupal\comment\Tests\CommentLanguageTest7300
ExpandDrupal\comment\Tests\CommentLinksTest109300
MessageGroupFilenameLineFunctionStatus
Changed environment:array ( 'authenticated' => false, 'comment count' => false, 'form' => 'below', 'user_register' => 'visitors', 'contact' => 'optional', 'comments' => 'open', 'access comments' => 0, 'post comments' => 0, 'skip comment approval' => 1, 'edit own comments' => 0, )DebugCommentLinksTest.php205Drupal\comment\Tests\CommentLinksTest->setEnvironment()
Changed environment:array ( 'authenticated' => true, 'comment count' => false, 'form' => 'below', 'user_register' => 'visitors', 'contact' => 'optional', 'comments' => 'open', 'access comments' => 0, 'post comments' => 0, 'skip comment approval' => 1, 'edit own comments' => 0, )DebugCommentLinksTest.php205Drupal\comment\Tests\CommentLinksTest->setEnvironment()
Changed environment:array ( 'authenticated' => false, 'comment count' => true, 'form' => 'below', 'user_register' => 'visitors', 'contact' => 'optional', 'comments' => 'open', 'access comments' => 0, 'post comments' => 0, 'skip comment approval' => 1, 'edit own comments' => 0, )DebugCommentLinksTest.php205Drupal\comment\Tests\CommentLinksTest->setEnvironment()
Changed environment:array ( 'authenticated' => true, 'comment count' => true, 'form' => 'below', 'user_register' => 'visitors', 'contact' => 'optional', 'comments' => 'open', 'access comments' => 0, 'post comments' => 0, 'skip comment approval' => 1, 'edit own comments' => 0, )DebugCommentLinksTest.php205Drupal\comment\Tests\CommentLinksTest->setEnvironment()
Changed environment:array ( 'authenticated' => false, 'comment count' => false, 'form' => 'below', 'user_register' => 'visitors', 'contact' => 'optional', 'comments' => 'open', 'access comments' => 1, 'post comments' => 0, 'skip comment approval' => 1, 'edit own comments' => 0, )DebugCommentLinksTest.php205Drupal\comment\Tests\CommentLinksTest->setEnvironment()
Changed environment:array ( 'authenticated' => true, 'comment count' => false, 'form' => 'below', 'user_register' => 'visitors', 'contact' => 'optional', 'comments' => 'open', 'access comments' => 1, 'post comments' => 0, 'skip comment approval' => 1, 'edit own comments' => 0, )DebugCommentLinksTest.php205Drupal\comment\Tests\CommentLinksTest->setEnvironment()
Changed environment:array ( 'authenticated' => false, 'comment count' => true, 'form' => 'below', 'user_register' => 'visitors', 'contact' => 'optional', 'comments' => 'open', 'access comments' => 1, 'post comments' => 0, 'skip comment approval' => 1, 'edit own comments' => 0, )DebugCommentLinksTest.php205Drupal\comment\Tests\CommentLinksTest->setEnvironment()
Changed environment:array ( 'authenticated' => true, 'comment count' => true, 'form' => 'below', 'user_register' => 'visitors', 'contact' => 'optional', 'comments' => 'open', 'access comments' => 1, 'post comments' => 0, 'skip comment approval' => 1, 'edit own comments' => 0, )DebugCommentLinksTest.php205Drupal\comment\Tests\CommentLinksTest->setEnvironment()
Changed environment:array ( 'authenticated' => false, 'comment count' => false, 'form' => 'below', 'user_register' => 'visitors', 'contact' => 'optional', 'comments' => 'open', 'access comments' => 0, 'post comments' => 1, 'skip comment approval' => 1, 'edit own comments' => 0, )DebugCommentLinksTest.php205Drupal\comment\Tests\CommentLinksTest->setEnvironment()
Changed environment:array ( 'authenticated' => true, 'comment count' => false, 'form' => 'below', 'user_register' => 'visitors', 'contact' => 'optional', 'comments' => 'open', 'access comments' => 0, 'post comments' => 1, 'skip comment approval' => 1, 'edit own comments' => 0, )DebugCommentLinksTest.php205Drupal\comment\Tests\CommentLinksTest->setEnvironment()
Changed environment:array ( 'authenticated' => false, 'comment count' => true, 'form' => 'below', 'user_register' => 'visitors', 'contact' => 'optional', 'comments' => 'open', 'access comments' => 0, 'post comments' => 1, 'skip comment approval' => 1, 'edit own comments' => 0, )DebugCommentLinksTest.php205Drupal\comment\Tests\CommentLinksTest->setEnvironment()
Changed environment:array ( 'authenticated' => true, 'comment count' => true, 'form' => 'below', 'user_register' => 'visitors', 'contact' => 'optional', 'comments' => 'open', 'access comments' => 0, 'post comments' => 1, 'skip comment approval' => 1, 'edit own comments' => 0, )DebugCommentLinksTest.php205Drupal\comment\Tests\CommentLinksTest->setEnvironment()
Changed environment:array ( 'authenticated' => false, 'comment count' => false, 'form' => 'below', 'user_register' => 'visitors', 'contact' => 'optional', 'comments' => 'open', 'access comments' => 1, 'post comments' => 1, 'skip comment approval' => 1, 'edit own comments' => 0, )DebugCommentLinksTest.php205Drupal\comment\Tests\CommentLinksTest->setEnvironment()
Changed environment:array ( 'authenticated' => true, 'comment count' => false, 'form' => 'below', 'user_register' => 'visitors', 'contact' => 'optional', 'comments' => 'open', 'access comments' => 1, 'post comments' => 1, 'skip comment approval' => 1, 'edit own comments' => 0, )DebugCommentLinksTest.php205Drupal\comment\Tests\CommentLinksTest->setEnvironment()
Changed environment:array ( 'authenticated' => false, 'comment count' => true, 'form' => 'below', 'user_register' => 'visitors', 'contact' => 'optional', 'comments' => 'open', 'access comments' => 1, 'post comments' => 1, 'skip comment approval' => 1, 'edit own comments' => 0, )DebugCommentLinksTest.php205Drupal\comment\Tests\CommentLinksTest->setEnvironment()
Changed environment:array ( 'authenticated' => true, 'comment count' => true, 'form' => 'below', 'user_register' => 'visitors', 'contact' => 'optional', 'comments' => 'open', 'access comments' => 1, 'post comments' => 1, 'skip comment approval' => 1, 'edit own comments' => 0, )DebugCommentLinksTest.php205Drupal\comment\Tests\CommentLinksTest->setEnvironment()
Changed environment:array ( 'authenticated' => false, 'comment count' => false, 'form' => 'separate page', 'user_register' => 'visitors', 'contact' => 'optional', 'comments' => 'open', 'access comments' => 0, 'post comments' => 0, 'skip comment approval' => 1, 'edit own comments' => 0, )DebugCommentLinksTest.php205Drupal\comment\Tests\CommentLinksTest->setEnvironment()
Changed environment:array ( 'authenticated' => true, 'comment count' => false, 'form' => 'separate page', 'user_register' => 'visitors', 'contact' => 'optional', 'comments' => 'open', 'access comments' => 0, 'post comments' => 0, 'skip comment approval' => 1, 'edit own comments' => 0, )DebugCommentLinksTest.php205Drupal\comment\Tests\CommentLinksTest->setEnvironment()
Changed environment:array ( 'authenticated' => false, 'comment count' => true, 'form' => 'separate page', 'user_register' => 'visitors', 'contact' => 'optional', 'comments' => 'open', 'access comments' => 0, 'post comments' => 0, 'skip comment approval' => 1, 'edit own comments' => 0, )DebugCommentLinksTest.php205Drupal\comment\Tests\CommentLinksTest->setEnvironment()
Changed environment:array ( 'authenticated' => true, 'comment count' => true, 'form' => 'separate page', 'user_register' => 'visitors', 'contact' => 'optional', 'comments' => 'open', 'access comments' => 0, 'post comments' => 0, 'skip comment approval' => 1, 'edit own comments' => 0, )DebugCommentLinksTest.php205Drupal\comment\Tests\CommentLinksTest->setEnvironment()
Changed environment:array ( 'authenticated' => false, 'comment count' => false, 'form' => 'separate page', 'user_register' => 'visitors', 'contact' => 'optional', 'comments' => 'open', 'access comments' => 1, 'post comments' => 0, 'skip comment approval' => 1, 'edit own comments' => 0, )DebugCommentLinksTest.php205Drupal\comment\Tests\CommentLinksTest->setEnvironment()
Changed environment:array ( 'authenticated' => true, 'comment count' => false, 'form' => 'separate page', 'user_register' => 'visitors', 'contact' => 'optional', 'comments' => 'open', 'access comments' => 1, 'post comments' => 0, 'skip comment approval' => 1, 'edit own comments' => 0, )DebugCommentLinksTest.php205Drupal\comment\Tests\CommentLinksTest->setEnvironment()
Changed environment:array ( 'authenticated' => false, 'comment count' => true, 'form' => 'separate page', 'user_register' => 'visitors', 'contact' => 'optional', 'comments' => 'open', 'access comments' => 1, 'post comments' => 0, 'skip comment approval' => 1, 'edit own comments' => 0, )DebugCommentLinksTest.php205Drupal\comment\Tests\CommentLinksTest->setEnvironment()
Changed environment:array ( 'authenticated' => true, 'comment count' => true, 'form' => 'separate page', 'user_register' => 'visitors', 'contact' => 'optional', 'comments' => 'open', 'access comments' => 1, 'post comments' => 0, 'skip comment approval' => 1, 'edit own comments' => 0, )DebugCommentLinksTest.php205Drupal\comment\Tests\CommentLinksTest->setEnvironment()
Changed environment:array ( 'authenticated' => false, 'comment count' => false, 'form' => 'separate page', 'user_register' => 'visitors', 'contact' => 'optional', 'comments' => 'open', 'access comments' => 0, 'post comments' => 1, 'skip comment approval' => 1, 'edit own comments' => 0, )DebugCommentLinksTest.php205Drupal\comment\Tests\CommentLinksTest->setEnvironment()
Changed environment:array ( 'authenticated' => true, 'comment count' => false, 'form' => 'separate page', 'user_register' => 'visitors', 'contact' => 'optional', 'comments' => 'open', 'access comments' => 0, 'post comments' => 1, 'skip comment approval' => 1, 'edit own comments' => 0, )DebugCommentLinksTest.php205Drupal\comment\Tests\CommentLinksTest->setEnvironment()
Changed environment:array ( 'authenticated' => false, 'comment count' => true, 'form' => 'separate page', 'user_register' => 'visitors', 'contact' => 'optional', 'comments' => 'open', 'access comments' => 0, 'post comments' => 1, 'skip comment approval' => 1, 'edit own comments' => 0, )DebugCommentLinksTest.php205Drupal\comment\Tests\CommentLinksTest->setEnvironment()
Changed environment:array ( 'authenticated' => true, 'comment count' => true, 'form' => 'separate page', 'user_register' => 'visitors', 'contact' => 'optional', 'comments' => 'open', 'access comments' => 0, 'post comments' => 1, 'skip comment approval' => 1, 'edit own comments' => 0, )DebugCommentLinksTest.php205Drupal\comment\Tests\CommentLinksTest->setEnvironment()
Changed environment:array ( 'authenticated' => false, 'comment count' => false, 'form' => 'separate page', 'user_register' => 'visitors', 'contact' => 'optional', 'comments' => 'open', 'access comments' => 1, 'post comments' => 1, 'skip comment approval' => 1, 'edit own comments' => 0, )DebugCommentLinksTest.php205Drupal\comment\Tests\CommentLinksTest->setEnvironment()
Changed environment:array ( 'authenticated' => true, 'comment count' => false, 'form' => 'separate page', 'user_register' => 'visitors', 'contact' => 'optional', 'comments' => 'open', 'access comments' => 1, 'post comments' => 1, 'skip comment approval' => 1, 'edit own comments' => 0, )DebugCommentLinksTest.php205Drupal\comment\Tests\CommentLinksTest->setEnvironment()
Changed environment:array ( 'authenticated' => false, 'comment count' => true, 'form' => 'separate page', 'user_register' => 'visitors', 'contact' => 'optional', 'comments' => 'open', 'access comments' => 1, 'post comments' => 1, 'skip comment approval' => 1, 'edit own comments' => 0, )DebugCommentLinksTest.php205Drupal\comment\Tests\CommentLinksTest->setEnvironment()
Changed environment:array ( 'authenticated' => true, 'comment count' => true, 'form' => 'separate page', 'user_register' => 'visitors', 'contact' => 'optional', 'comments' => 'open', 'access comments' => 1, 'post comments' => 1, 'skip comment approval' => 1, 'edit own comments' => 0, )DebugCommentLinksTest.php205Drupal\comment\Tests\CommentLinksTest->setEnvironment()
Changed environment:array ( 'authenticated' => false, 'comment count' => false, 'form' => 'below', 'user_register' => 'admin_only', 'contact' => 'optional', 'comments' => 'open', 'access comments' => 0, 'post comments' => 0, 'skip comment approval' => 1, 'edit own comments' => 0, )DebugCommentLinksTest.php205Drupal\comment\Tests\CommentLinksTest->setEnvironment()
Changed environment:array ( 'authenticated' => true, 'comment count' => false, 'form' => 'below', 'user_register' => 'admin_only', 'contact' => 'optional', 'comments' => 'open', 'access comments' => 0, 'post comments' => 0, 'skip comment approval' => 1, 'edit own comments' => 0, )DebugCommentLinksTest.php205Drupal\comment\Tests\CommentLinksTest->setEnvironment()
Changed environment:array ( 'authenticated' => false, 'comment count' => true, 'form' => 'below', 'user_register' => 'admin_only', 'contact' => 'optional', 'comments' => 'open', 'access comments' => 0, 'post comments' => 0, 'skip comment approval' => 1, 'edit own comments' => 0, )DebugCommentLinksTest.php205Drupal\comment\Tests\CommentLinksTest->setEnvironment()
Changed environment:array ( 'authenticated' => true, 'comment count' => true, 'form' => 'below', 'user_register' => 'admin_only', 'contact' => 'optional', 'comments' => 'open', 'access comments' => 0, 'post comments' => 0, 'skip comment approval' => 1, 'edit own comments' => 0, )DebugCommentLinksTest.php205Drupal\comment\Tests\CommentLinksTest->setEnvironment()
Changed environment:array ( 'authenticated' => false, 'comment count' => false, 'form' => 'below', 'user_register' => 'admin_only', 'contact' => 'optional', 'comments' => 'open', 'access comments' => 1, 'post comments' => 0, 'skip comment approval' => 1, 'edit own comments' => 0, )DebugCommentLinksTest.php205Drupal\comment\Tests\CommentLinksTest->setEnvironment()
Changed environment:array ( 'authenticated' => true, 'comment count' => false, 'form' => 'below', 'user_register' => 'admin_only', 'contact' => 'optional', 'comments' => 'open', 'access comments' => 1, 'post comments' => 0, 'skip comment approval' => 1, 'edit own comments' => 0, )DebugCommentLinksTest.php205Drupal\comment\Tests\CommentLinksTest->setEnvironment()
Changed environment:array ( 'authenticated' => false, 'comment count' => true, 'form' => 'below', 'user_register' => 'admin_only', 'contact' => 'optional', 'comments' => 'open', 'access comments' => 1, 'post comments' => 0, 'skip comment approval' => 1, 'edit own comments' => 0, )DebugCommentLinksTest.php205Drupal\comment\Tests\CommentLinksTest->setEnvironment()
Changed environment:array ( 'authenticated' => true, 'comment count' => true, 'form' => 'below', 'user_register' => 'admin_only', 'contact' => 'optional', 'comments' => 'open', 'access comments' => 1, 'post comments' => 0, 'skip comment approval' => 1, 'edit own comments' => 0, )DebugCommentLinksTest.php205Drupal\comment\Tests\CommentLinksTest->setEnvironment()
Changed environment:array ( 'authenticated' => false, 'comment count' => false, 'form' => 'below', 'user_register' => 'admin_only', 'contact' => 'optional', 'comments' => 'open', 'access comments' => 0, 'post comments' => 1, 'skip comment approval' => 1, 'edit own comments' => 0, )DebugCommentLinksTest.php205Drupal\comment\Tests\CommentLinksTest->setEnvironment()
Changed environment:array ( 'authenticated' => true, 'comment count' => false, 'form' => 'below', 'user_register' => 'admin_only', 'contact' => 'optional', 'comments' => 'open', 'access comments' => 0, 'post comments' => 1, 'skip comment approval' => 1, 'edit own comments' => 0, )DebugCommentLinksTest.php205Drupal\comment\Tests\CommentLinksTest->setEnvironment()
Changed environment:array ( 'authenticated' => false, 'comment count' => true, 'form' => 'below', 'user_register' => 'admin_only', 'contact' => 'optional', 'comments' => 'open', 'access comments' => 0, 'post comments' => 1, 'skip comment approval' => 1, 'edit own comments' => 0, )DebugCommentLinksTest.php205Drupal\comment\Tests\CommentLinksTest->setEnvironment()
Changed environment:array ( 'authenticated' => true, 'comment count' => true, 'form' => 'below', 'user_register' => 'admin_only', 'contact' => 'optional', 'comments' => 'open', 'access comments' => 0, 'post comments' => 1, 'skip comment approval' => 1, 'edit own comments' => 0, )DebugCommentLinksTest.php205Drupal\comment\Tests\CommentLinksTest->setEnvironment()
Changed environment:array ( 'authenticated' => false, 'comment count' => false, 'form' => 'below', 'user_register' => 'admin_only', 'contact' => 'optional', 'comments' => 'open', 'access comments' => 1, 'post comments' => 1, 'skip comment approval' => 1, 'edit own comments' => 0, )DebugCommentLinksTest.php205Drupal\comment\Tests\CommentLinksTest->setEnvironment()
Changed environment:array ( 'authenticated' => true, 'comment count' => false, 'form' => 'below', 'user_register' => 'admin_only', 'contact' => 'optional', 'comments' => 'open', 'access comments' => 1, 'post comments' => 1, 'skip comment approval' => 1, 'edit own comments' => 0, )DebugCommentLinksTest.php205Drupal\comment\Tests\CommentLinksTest->setEnvironment()
Changed environment:array ( 'authenticated' => false, 'comment count' => true, 'form' => 'below', 'user_register' => 'admin_only', 'contact' => 'optional', 'comments' => 'open', 'access comments' => 1, 'post comments' => 1, 'skip comment approval' => 1, 'edit own comments' => 0, )DebugCommentLinksTest.php205Drupal\comment\Tests\CommentLinksTest->setEnvironment()
Changed environment:array ( 'authenticated' => true, 'comment count' => true, 'form' => 'below', 'user_register' => 'admin_only', 'contact' => 'optional', 'comments' => 'open', 'access comments' => 1, 'post comments' => 1, 'skip comment approval' => 1, 'edit own comments' => 0, )DebugCommentLinksTest.php205Drupal\comment\Tests\CommentLinksTest->setEnvironment()
Changed environment:array ( 'authenticated' => false, 'comment count' => false, 'form' => 'separate page', 'user_register' => 'admin_only', 'contact' => 'optional', 'comments' => 'open', 'access comments' => 0, 'post comments' => 0, 'skip comment approval' => 1, 'edit own comments' => 0, )DebugCommentLinksTest.php205Drupal\comment\Tests\CommentLinksTest->setEnvironment()
Changed environment:array ( 'authenticated' => true, 'comment count' => false, 'form' => 'separate page', 'user_register' => 'admin_only', 'contact' => 'optional', 'comments' => 'open', 'access comments' => 0, 'post comments' => 0, 'skip comment approval' => 1, 'edit own comments' => 0, )DebugCommentLinksTest.php205Drupal\comment\Tests\CommentLinksTest->setEnvironment()
Changed environment:array ( 'authenticated' => false, 'comment count' => true, 'form' => 'separate page', 'user_register' => 'admin_only', 'contact' => 'optional', 'comments' => 'open', 'access comments' => 0, 'post comments' => 0, 'skip comment approval' => 1, 'edit own comments' => 0, )DebugCommentLinksTest.php205Drupal\comment\Tests\CommentLinksTest->setEnvironment()
Changed environment:array ( 'authenticated' => true, 'comment count' => true, 'form' => 'separate page', 'user_register' => 'admin_only', 'contact' => 'optional', 'comments' => 'open', 'access comments' => 0, 'post comments' => 0, 'skip comment approval' => 1, 'edit own comments' => 0, )DebugCommentLinksTest.php205Drupal\comment\Tests\CommentLinksTest->setEnvironment()
Changed environment:array ( 'authenticated' => false, 'comment count' => false, 'form' => 'separate page', 'user_register' => 'admin_only', 'contact' => 'optional', 'comments' => 'open', 'access comments' => 1, 'post comments' => 0, 'skip comment approval' => 1, 'edit own comments' => 0, )DebugCommentLinksTest.php205Drupal\comment\Tests\CommentLinksTest->setEnvironment()
Changed environment:array ( 'authenticated' => true, 'comment count' => false, 'form' => 'separate page', 'user_register' => 'admin_only', 'contact' => 'optional', 'comments' => 'open', 'access comments' => 1, 'post comments' => 0, 'skip comment approval' => 1, 'edit own comments' => 0, )DebugCommentLinksTest.php205Drupal\comment\Tests\CommentLinksTest->setEnvironment()
Changed environment:array ( 'authenticated' => false, 'comment count' => true, 'form' => 'separate page', 'user_register' => 'admin_only', 'contact' => 'optional', 'comments' => 'open', 'access comments' => 1, 'post comments' => 0, 'skip comment approval' => 1, 'edit own comments' => 0, )DebugCommentLinksTest.php205Drupal\comment\Tests\CommentLinksTest->setEnvironment()
Changed environment:array ( 'authenticated' => true, 'comment count' => true, 'form' => 'separate page', 'user_register' => 'admin_only', 'contact' => 'optional', 'comments' => 'open', 'access comments' => 1, 'post comments' => 0, 'skip comment approval' => 1, 'edit own comments' => 0, )DebugCommentLinksTest.php205Drupal\comment\Tests\CommentLinksTest->setEnvironment()
Changed environment:array ( 'authenticated' => false, 'comment count' => false, 'form' => 'separate page', 'user_register' => 'admin_only', 'contact' => 'optional', 'comments' => 'open', 'access comments' => 0, 'post comments' => 1, 'skip comment approval' => 1, 'edit own comments' => 0, )DebugCommentLinksTest.php205Drupal\comment\Tests\CommentLinksTest->setEnvironment()
Changed environment:array ( 'authenticated' => true, 'comment count' => false, 'form' => 'separate page', 'user_register' => 'admin_only', 'contact' => 'optional', 'comments' => 'open', 'access comments' => 0, 'post comments' => 1, 'skip comment approval' => 1, 'edit own comments' => 0, )DebugCommentLinksTest.php205Drupal\comment\Tests\CommentLinksTest->setEnvironment()
Changed environment:array ( 'authenticated' => false, 'comment count' => true, 'form' => 'separate page', 'user_register' => 'admin_only', 'contact' => 'optional', 'comments' => 'open', 'access comments' => 0, 'post comments' => 1, 'skip comment approval' => 1, 'edit own comments' => 0, )DebugCommentLinksTest.php205Drupal\comment\Tests\CommentLinksTest->setEnvironment()
Changed environment:array ( 'authenticated' => true, 'comment count' => true, 'form' => 'separate page', 'user_register' => 'admin_only', 'contact' => 'optional', 'comments' => 'open', 'access comments' => 0, 'post comments' => 1, 'skip comment approval' => 1, 'edit own comments' => 0, )DebugCommentLinksTest.php205Drupal\comment\Tests\CommentLinksTest->setEnvironment()
Changed environment:array ( 'authenticated' => false, 'comment count' => false, 'form' => 'separate page', 'user_register' => 'admin_only', 'contact' => 'optional', 'comments' => 'open', 'access comments' => 1, 'post comments' => 1, 'skip comment approval' => 1, 'edit own comments' => 0, )DebugCommentLinksTest.php205Drupal\comment\Tests\CommentLinksTest->setEnvironment()
Changed environment:array ( 'authenticated' => true, 'comment count' => false, 'form' => 'separate page', 'user_register' => 'admin_only', 'contact' => 'optional', 'comments' => 'open', 'access comments' => 1, 'post comments' => 1, 'skip comment approval' => 1, 'edit own comments' => 0, )DebugCommentLinksTest.php205Drupal\comment\Tests\CommentLinksTest->setEnvironment()
Changed environment:array ( 'authenticated' => false, 'comment count' => true, 'form' => 'separate page', 'user_register' => 'admin_only', 'contact' => 'optional', 'comments' => 'open', 'access comments' => 1, 'post comments' => 1, 'skip comment approval' => 1, 'edit own comments' => 0, )DebugCommentLinksTest.php205Drupal\comment\Tests\CommentLinksTest->setEnvironment()
Changed environment:array ( 'authenticated' => true, 'comment count' => true, 'form' => 'separate page', 'user_register' => 'admin_only', 'contact' => 'optional', 'comments' => 'open', 'access comments' => 1, 'post comments' => 1, 'skip comment approval' => 1, 'edit own comments' => 0, )DebugCommentLinksTest.php205Drupal\comment\Tests\CommentLinksTest->setEnvironment()
LeafDrupal\comment\Tests\CommentNewIndicatorTest4200
LeafDrupal\comment\Tests\CommentNodeAccessTest5700
LeafDrupal\comment\Tests\CommentNodeChangesTest2400
LeafDrupal\comment\Tests\CommentPagerTest21300
LeafDrupal\comment\Tests\CommentPreviewTest10000
LeafDrupal\comment\Tests\CommentRssTest2600
LeafDrupal\comment\Tests\CommentStatisticsTest9800
LeafDrupal\comment\Tests\CommentThreadingTest15900
LeafDrupal\comment\Tests\CommentTokenReplaceTest6600
LeafDrupal\comment\Tests\CommentTranslationUITest18300
LeafDrupal\comment\Tests\Views\ArgumentUserUIDTest1800
LeafDrupal\comment\Tests\Views\DefaultViewRecentComments800
LeafDrupal\comment\Tests\Views\FilterUserUIDTest1800
LeafDrupal\comment\Tests\Views\RowRssTest2400
LeafDrupal\comment\Tests\Views\WizardTest3300
LeafDrupal\config\Tests\ConfigCRUDTest3300
LeafDrupal\config\Tests\ConfigDiffTest1200
LeafDrupal\config\Tests\ConfigEntityListTest6900
LeafDrupal\config\Tests\ConfigEntityStatusTest600
LeafDrupal\config\Tests\ConfigEntityStatusUITest1500
LeafDrupal\config\Tests\ConfigEntityTest14300
LeafDrupal\config\Tests\ConfigEntityUnitTest300
LeafDrupal\config\Tests\ConfigFileContentTest3300
LeafDrupal\config\Tests\ConfigImportTest4600
LeafDrupal\config\Tests\ConfigImportUITest6400
LeafDrupal\config\Tests\ConfigInstallTest1800
LeafDrupal\config\Tests\ConfigInstallWebTest1700
ExpandDrupal\config\Tests\ConfigLocaleOverride110
MessageGroupFilenameLineFunctionStatus
The test did not complete due to a fatal error.Completion checkConfigLocaleOverride.php42Drupal\config\Tests\ConfigLocaleOverride->testConfigLocaleOverride()
LeafDrupal\config\Tests\ConfigLocaleOverrideWebTest3200
LeafDrupal\config\Tests\ConfigOverrideTest2600
ExpandDrupal\config\Tests\ConfigSchemaTest110
MessageGroupFilenameLineFunctionStatus
The test did not complete due to a fatal error.Completion checkConfigSchemaTest.php43Drupal\config\Tests\ConfigSchemaTest->testSchemaMapping()
LeafDrupal\config\Tests\ConfigSnapshotTest1000
LeafDrupal\config\Tests\ConfigUpgradeTest1200
LeafDrupal\config\Tests\Storage\DatabaseStorageTest2200
LeafDrupal\config\Tests\Storage\FileStorageTest2400
LeafDrupal\contact\Tests\ContactAuthenticatedUserTest1300
LeafDrupal\contact\Tests\ContactPersonalTest16200
LeafDrupal\contact\Tests\ContactSitewideTest24500
ExpandDrupal\contact\Tests\ContactUpgradePathTest311
MessageGroupFilenameLineFunctionStatus
HTTP response expected 200, actual 500BrowserUpgradePathTestBase.php214Drupal\system\Tests\Upgrade\UpgradePathTestBase->performUpgrade()
Exception: Initial GET to update.php did not return HTTP 200 status. in Drupal\system\Tests\Upgrade\UpgradePathTestBase->performUpgrade() (line 215 of /var/lib/drupaltestbot/sites/default/files/checkout/core/modules/system/lib/Drupal/system/Tests/Upgrade/UpgradePathTestBase.php). Drupal\system\Tests\Upgrade\UpgradePathTestBase->performUpgrade() Drupal\contact\Tests\ContactUpgradePathTest->testContactUpgrade() Drupal\simpletest\TestBase->run() simpletest_script_run_one_test('138', 'Drupal\contact\Tests\ContactUpgradePathTest') Uncaught exceptionUpgradePathTestBase.php215Drupal\system\Tests\Upgrade\UpgradePathTestBase->performUpgrade()
LeafDrupal\contact\Tests\Views\ContactFieldsTest1200
LeafDrupal\contextual\Tests\ContextualDynamicContextTest1600
LeafDrupal\custom_block\Tests\CustomBlockBuildContentTest500
LeafDrupal\custom_block\Tests\CustomBlockCreationTest2600
LeafDrupal\custom_block\Tests\CustomBlockLoadHooksTest800
LeafDrupal\custom_block\Tests\CustomBlockPageViewTest1200
LeafDrupal\custom_block\Tests\CustomBlockRevisionsTest1300
LeafDrupal\custom_block\Tests\CustomBlockSaveTest3300
LeafDrupal\custom_block\Tests\CustomBlockTranslationUITest14000
LeafDrupal\custom_block\Tests\CustomBlockTypeTest8500
LeafDrupal\custom_block\Tests\PageEditTest3800
LeafDrupal\datetime\Tests\DatetimeFieldTest13100
LeafDrupal\dblog\Tests\DBLogTest37700
LeafDrupal\editor\Tests\EditIntegrationTest2600
LeafDrupal\editor\Tests\EditorAdminTest4200
LeafDrupal\editor\Tests\EditorLoadingTest6600
LeafDrupal\editor\Tests\EditorManagerTest1100
LeafDrupal\edit\Tests\EditorSelectionTest2300
LeafDrupal\edit\Tests\MetadataGeneratorTest1400
LeafDrupal\email\Tests\EmailFieldTest1900
LeafDrupal\email\Tests\EmailItemTest1100
LeafDrupal\entity\Tests\EntityDisplayTest3800
LeafDrupal\entity_reference\Tests\EntityReferenceAdminTest2900
LeafDrupal\entity_reference\Tests\EntityReferenceAutocompleteTest1900
LeafDrupal\entity_reference\Tests\EntityReferenceAutoCreateTest1800
LeafDrupal\entity_reference\Tests\EntityReferenceItemTest1000
LeafDrupal\entity_reference\Tests\EntityReferenceSelectionAccessTest6900
LeafDrupal\entity_reference\Tests\EntityReferenceSelectionSortTest700
LeafDrupal\entity_reference\Tests\Views\SelectionTest600
LeafDrupal\field\Tests\ActiveTest1400
LeafDrupal\field\Tests\BulkDeleteTest8700
LeafDrupal\field\Tests\CrudTest10100
LeafDrupal\field\Tests\DisplayApiTest5400
LeafDrupal\field\Tests\FieldAccessTest2100
LeafDrupal\field\Tests\FieldAttachOtherTest12700
LeafDrupal\field\Tests\FieldAttachStorageTest13000
LeafDrupal\field\Tests\FieldInfoTest10800
LeafDrupal\field\Tests\FieldInstanceCrudTest4400
LeafDrupal\field\Tests\FormTest28100
LeafDrupal\field\Tests\ShapeItemTest1500
LeafDrupal\field\Tests\TestItemTest1100
LeafDrupal\field\Tests\TranslationTest8500
LeafDrupal\field\Tests\TranslationWebTest2300
LeafDrupal\field\Tests\Views\ApiDataTest3000
LeafDrupal\field\Tests\Views\FieldUITest2800
LeafDrupal\field\Tests\Views\HandlerFieldFieldTest4800
LeafDrupal\field_sql_storage\Tests\FieldSqlStorageTest13200
LeafDrupal\field_ui\Tests\AlterTest2100
LeafDrupal\field_ui\Tests\ManageDisplayTest14900
LeafDrupal\field_ui\Tests\ManageFieldsTest29400
LeafDrupal\file\Tests\CopyTest11000
LeafDrupal\file\Tests\DeleteTest2400
LeafDrupal\file\Tests\DownloadTest4500
LeafDrupal\file\Tests\FileFieldDisplayTest5400
LeafDrupal\file\Tests\FileFieldPathTest2800
LeafDrupal\file\Tests\FileFieldRevisionTest6800
LeafDrupal\file\Tests\FileFieldRSSContentTest2400
LeafDrupal\file\Tests\FileFieldValidateTest12100
LeafDrupal\file\Tests\FileFieldWidgetTest29900
LeafDrupal\file\Tests\FileItemTest1700
LeafDrupal\file\Tests\FileManagedFileElementTest26900
LeafDrupal\file\Tests\FilePrivateTest3800
LeafDrupal\file\Tests\FileTokenReplaceTest3600
LeafDrupal\file\Tests\LoadTest3500
LeafDrupal\file\Tests\MoveTest11000
LeafDrupal\file\Tests\RemoteFileSaveUploadTest31200
LeafDrupal\file\Tests\SaveDataTest9300
LeafDrupal\file\Tests\SaveTest1600
LeafDrupal\file\Tests\SaveUploadTest27000
LeafDrupal\file\Tests\SpaceUsedTest1200
LeafDrupal\file\Tests\UsageTest3400
LeafDrupal\file\Tests\ValidateTest1200
LeafDrupal\file\Tests\ValidatorTest2900
LeafDrupal\filter\Tests\FilterAdminTest19800
LeafDrupal\filter\Tests\FilterAPITest700
LeafDrupal\filter\Tests\FilterCrudTest22000
LeafDrupal\filter\Tests\FilterDefaultConfigTest3600
LeafDrupal\filter\Tests\FilterDefaultFormatTest6600
LeafDrupal\filter\Tests\FilterFormatAccessTest36800
LeafDrupal\filter\Tests\FilterHooksTest6600
LeafDrupal\filter\Tests\FilterHtmlImageSecureTest5600
LeafDrupal\filter\Tests\FilterNoFormatTest200
LeafDrupal\filter\Tests\FilterSecurityTest4100
LeafDrupal\filter\Tests\FilterSettingsTest2400
LeafDrupal\filter\Tests\FilterUnitTest36800
LeafDrupal\forum\Tests\ForumBlockTest12200
LeafDrupal\forum\Tests\ForumIndexTest2700
LeafDrupal\forum\Tests\ForumNodeAccessTest5100
LeafDrupal\forum\Tests\ForumTest64700
LeafDrupal\hal\Tests\NormalizeTest1300
LeafDrupal\help\Tests\HelpTest30500
LeafDrupal\help\Tests\NoHelpTest1200
LeafDrupal\history\Tests\Views\HistoryTimestampTest2400
LeafDrupal\image\Tests\ImageAdminStylesTest20500
LeafDrupal\image\Tests\ImageDimensionsScaleUnitTest1500
LeafDrupal\image\Tests\ImageDimensionsTest5600
LeafDrupal\image\Tests\ImageEffectsTest4300
LeafDrupal\image\Tests\ImageFieldDefaultImagesTest4000
LeafDrupal\image\Tests\ImageFieldDisplayTest15900
LeafDrupal\image\Tests\ImageFieldValidateTest3800
LeafDrupal\image\Tests\ImageItemTest2100
LeafDrupal\image\Tests\ImageStylesPathAndUrlTest11600
LeafDrupal\image\Tests\ImageThemeFunctionTest500
LeafDrupal\jsonld\Tests\NormalizeDenormalizeTest1400
LeafDrupal\jsonld\Tests\RdfSchemaSerializationTest600
LeafDrupal\jsonld\Tests\SupportsSerializationTest1000
LeafDrupal\language\Tests\LanguageBrowserDetectionUnitTest10700
LeafDrupal\language\Tests\LanguageConfigurationElementTest5400
LeafDrupal\language\Tests\LanguageConfigurationTest7500
LeafDrupal\language\Tests\LanguageCustomLanguageConfigurationTest3600
LeafDrupal\language\Tests\LanguageDependencyInjectionTest1700
LeafDrupal\language\Tests\LanguageListTest10200
LeafDrupal\language\Tests\LanguageNegotiationInfoTest4900
LeafDrupal\language\Tests\LanguagePathMonolingualTest3500
LeafDrupal\language\Tests\LanguageSwitchingTest2200
LeafDrupal\language\Tests\LanguageUILanguageNegotiationTest14500
LeafDrupal\language\Tests\LanguageUrlRewritingTest4700
LeafDrupal\language\Tests\Views\ArgumentLanguageTest700
LeafDrupal\language\Tests\Views\FieldLanguageTest700
LeafDrupal\language\Tests\Views\FilterLanguageTest700
LeafDrupal\layout\Tests\DisplayInternalLogicTest1100
LeafDrupal\layout\Tests\LayoutDerivativesTest2400
LeafDrupal\link\Tests\LinkFieldTest14000
LeafDrupal\link\Tests\LinkFieldUITest2100
LeafDrupal\link\Tests\LinkItemTest1800
ExpandDrupal\locale\Tests\LocaleConfigTranslationTest8420
MessageGroupFilenameLineFunctionStatus
Got the right number of properties with strict translationOtherLocaleConfigTranslationTest.php106Drupal\locale\Tests\LocaleConfigTranslationTest->testConfigTranslation()
The new site name is displayed on foreign language page.OtherLocaleConfigTranslationTest.php112Drupal\locale\Tests\LocaleConfigTranslationTest->testConfigTranslation()
LeafDrupal\locale\Tests\LocaleContentTest19500
LeafDrupal\locale\Tests\LocaleExportTest5700
LeafDrupal\locale\Tests\LocaleImportFunctionalTest21100
LeafDrupal\locale\Tests\LocaleInstallTest200
LeafDrupal\locale\Tests\LocaleJavascriptTranslation6600
LeafDrupal\locale\Tests\LocaleLibraryInfoAlterTest200
LeafDrupal\locale\Tests\LocalePathTest5900
LeafDrupal\locale\Tests\LocalePluralFormatTest16000
LeafDrupal\locale\Tests\LocaleStringTest2600
LeafDrupal\locale\Tests\LocaleTranslationTest38200
ExpandDrupal\locale\Tests\LocaleUninstallFrenchTest2201
MessageGroupFilenameLineFunctionStatus
Drupal\Core\Database\DatabaseExceptionWrapper: SQLSTATE[42S02]: Base table or view not found: 1146 Table 'drupaltestbotmysql.simpletest826662locales_location' doesn't exist: SELECT l.* FROM {locales_location} l; Array ( ) in Drupal\Core\Database\Connection->query() (line 554 of /var/lib/drupaltestbot/sites/default/files/checkout/core/lib/Drupal/Core/Database/Connection.php). Drupal\Core\Database\Connection->query('SELECT l.* FROM {locales_location} l', Array, Array) Drupal\Core\Database\Query\Select->execute() Drupal\locale\StringDatabaseStorage->getLocations() Drupal\locale\LocaleConfigSubscriber->configSave(Object) call_user_func(Array, Object) Symfony\Component\EventDispatcher\EventDispatcher->doDispatch(Array, 'config.save', Object) Symfony\Component\EventDispatcher\EventDispatcher->dispatch('config.save', Object) Symfony\Component\EventDispatcher\ContainerAwareEventDispatcher->dispatch('config.save', Object) Drupal\Core\Config\Context\ConfigContext->notify('save', Object) Drupal\Core\Config\Config->notify('save') Drupal\Core\Config\Config->save() module_uninstall(Array) Drupal\locale\Tests\LocaleUninstallTest->testUninstallProcess() Drupal\simpletest\TestBase->run() simpletest_script_run_one_test('394', 'Drupal\locale\Tests\LocaleUninstallFrenchTest') Uncaught exceptionConnection.php554Drupal\Core\Database\Connection->query()
ExpandDrupal\locale\Tests\LocaleUninstallTest2201
MessageGroupFilenameLineFunctionStatus
Drupal\Core\Database\DatabaseExceptionWrapper: SQLSTATE[42S02]: Base table or view not found: 1146 Table 'drupaltestbotmysql.simpletest386297locales_location' doesn't exist: SELECT l.* FROM {locales_location} l; Array ( ) in Drupal\Core\Database\Connection->query() (line 554 of /var/lib/drupaltestbot/sites/default/files/checkout/core/lib/Drupal/Core/Database/Connection.php). Drupal\Core\Database\Connection->query('SELECT l.* FROM {locales_location} l', Array, Array) Drupal\Core\Database\Query\Select->execute() Drupal\locale\StringDatabaseStorage->getLocations() Drupal\locale\LocaleConfigSubscriber->configSave(Object) call_user_func(Array, Object) Symfony\Component\EventDispatcher\EventDispatcher->doDispatch(Array, 'config.save', Object) Symfony\Component\EventDispatcher\EventDispatcher->dispatch('config.save', Object) Symfony\Component\EventDispatcher\ContainerAwareEventDispatcher->dispatch('config.save', Object) Drupal\Core\Config\Context\ConfigContext->notify('save', Object) Drupal\Core\Config\Config->notify('save') Drupal\Core\Config\Config->save() module_uninstall(Array) Drupal\locale\Tests\LocaleUninstallTest->testUninstallProcess() Drupal\simpletest\TestBase->run() simpletest_script_run_one_test('395', 'Drupal\locale\Tests\LocaleUninstallTest') Uncaught exceptionConnection.php554Drupal\Core\Database\Connection->query()
LeafDrupal\locale\Tests\LocaleUpdateInterfaceTest5400
LeafDrupal\locale\Tests\LocaleUpdateTest55500
LeafDrupal\menu\Tests\MenuNodeTest6100
LeafDrupal\menu\Tests\MenuTest174400
LeafDrupal\minimal\Tests\MinimalTest1600
LeafDrupal\node\Tests\Condition\NodeConditionTest1600
LeafDrupal\node\Tests\MultiStepNodeFormBasicOptionsTest3400
LeafDrupal\node\Tests\NodeAccessBaseTableTest15900
LeafDrupal\node\Tests\NodeAccessFieldTest5100
LeafDrupal\node\Tests\NodeAccessLanguageAwareCombinationTest14200
LeafDrupal\node\Tests\NodeAccessLanguageAwareTest9100
LeafDrupal\node\Tests\NodeAccessLanguageTest9800
LeafDrupal\node\Tests\NodeAccessPagerTest3000
LeafDrupal\node\Tests\NodeAccessRebuildTest1900
LeafDrupal\node\Tests\NodeAccessRecordsTest2600
LeafDrupal\node\Tests\NodeAccessTest3400
LeafDrupal\node\Tests\NodeAdminTest14500
LeafDrupal\node\Tests\NodeBlockFunctionalTest6300
LeafDrupal\node\Tests\NodeBuildContentTest400
LeafDrupal\node\Tests\NodeCreationTest4900
LeafDrupal\node\Tests\NodeEntityFieldQueryAlterTest3200
LeafDrupal\node\Tests\NodeEntityViewModeAlterTest2000
LeafDrupal\node\Tests\NodeFieldMultilingualTestCase6400
LeafDrupal\node\Tests\NodeFormButtonsTest12500
LeafDrupal\node\Tests\NodeLoadHooksTest700
LeafDrupal\node\Tests\NodeLoadMultipleTest2700
LeafDrupal\node\Tests\NodePostSettingsTest4000
LeafDrupal\node\Tests\NodeQueryAlterTest9900
LeafDrupal\node\Tests\NodeRevisionPermissionsTest4600
LeafDrupal\node\Tests\NodeRevisionsAllTestCase4900
LeafDrupal\node\Tests\NodeRevisionsTest6400
LeafDrupal\node\Tests\NodeRSSContentTest2100
LeafDrupal\node\Tests\NodeSaveTest6000
LeafDrupal\node\Tests\NodeSyndicateBlockTest1400
LeafDrupal\node\Tests\NodeTitleTest2300
LeafDrupal\node\Tests\NodeTitleXSSTest2300
LeafDrupal\node\Tests\NodeTokenReplaceTest4000
LeafDrupal\node\Tests\NodeTranslationUITest20700
LeafDrupal\node\Tests\NodeTypeInitialLanguageTest8000
LeafDrupal\node\Tests\NodeTypePersistenceTest6500
LeafDrupal\node\Tests\NodeTypeTest13000
LeafDrupal\node\Tests\PageEditTest9700
LeafDrupal\node\Tests\PagePreviewTest4100
LeafDrupal\node\Tests\PageViewTest3400
LeafDrupal\node\Tests\SummaryLengthTest1200
LeafDrupal\node\Tests\Views\FieldTypeTest400
LeafDrupal\node\Tests\Views\FilterUidRevisionTest800
LeafDrupal\node\Tests\Views\RevisionRelationships600
LeafDrupal\node\Tests\Views\StatusExtraTest13600
LeafDrupal\number\Tests\NumberFieldTest8800
LeafDrupal\number\Tests\NumberItemTest2300
LeafDrupal\openid\Tests\OpenIDFunctionalTest38400
LeafDrupal\openid\Tests\OpenIDRegistrationTest19900
LeafDrupal\openid\Tests\OpenIDTest4500
ExpandDrupal\openid\Tests\Upgrade\OpenIDAuthmapUpgradePathTest2700
MessageGroupFilenameLineFunctionStatus
'Missing handler: node created sort'Debugviews.module929views_get_handler()
'Missing handler: node sticky sort'Debugviews.module929views_get_handler()
'Missing handler: node promote filter'Debugviews.module929views_get_handler()
'Missing handler: node status filter'Debugviews.module929views_get_handler()
'Missing handler: views area_text_custom area'Debugviews.module929views_get_handler()
'Missing handler: node node_listing_empty area'Debugviews.module929views_get_handler()
'Missing handler: views title area'Debugviews.module929views_get_handler()
'Missing handler: node created sort'Debugviews.module929views_get_handler()
'Missing handler: node sticky sort'Debugviews.module929views_get_handler()
'Missing handler: node promote filter'Debugviews.module929views_get_handler()
'Missing handler: node status filter'Debugviews.module929views_get_handler()
'Missing handler: views area_text_custom area'Debugviews.module929views_get_handler()
'Missing handler: node node_listing_empty area'Debugviews.module929views_get_handler()
'Missing handler: views title area'Debugviews.module929views_get_handler()
LeafDrupal\options\Tests\OptionsDynamicValuesValidationTest900
LeafDrupal\options\Tests\OptionsFieldTest2100
LeafDrupal\options\Tests\OptionsFieldUITest22200
LeafDrupal\options\Tests\OptionsSelectDynamicValuesTest1600
LeafDrupal\options\Tests\OptionsWidgetsTest26100
LeafDrupal\path\Tests\PathAliasTest14000
LeafDrupal\path\Tests\PathLanguageTest8100
LeafDrupal\path\Tests\PathLanguageUiTest10800
LeafDrupal\path\Tests\PathTaxonomyTermTest3700
LeafDrupal\php\Tests\PhpAccessTest3800
LeafDrupal\php\Tests\PhpFilterTest4200
LeafDrupal\picture\Tests\PictureAdminUITest5400
LeafDrupal\picture\Tests\PictureFieldDisplayTest11500
LeafDrupal\rdf\Tests\CommentAttributesTest11800
LeafDrupal\rdf\Tests\CrudTest1000
LeafDrupal\rdf\Tests\GetNamespacesTest700
LeafDrupal\rdf\Tests\GetRdfNamespacesTest500
LeafDrupal\rdf\Tests\MappingDefinitionTest2300
LeafDrupal\rdf\Tests\MappingHookTest600
LeafDrupal\rdf\Tests\NodeAttributesTest1000
LeafDrupal\rdf\Tests\RdfaMarkupTest3700
LeafDrupal\rdf\Tests\RdfMappingEventTest300
LeafDrupal\rdf\Tests\SiteSchemaTest300
LeafDrupal\rdf\Tests\TaxonomyAttributesTest700
LeafDrupal\rdf\Tests\TrackerAttributesTest3000
LeafDrupal\rdf\Tests\UserAttributesTest4000
LeafDrupal\rest\Tests\CreateTest4400
LeafDrupal\rest\Tests\DBLogTest1800
LeafDrupal\rest\Tests\DeleteTest3700
LeafDrupal\rest\Tests\ReadTest3900
LeafDrupal\rest\Tests\UpdateTest4500
ExpandDrupal\rest\Tests\Views\StyleSerializerTest5200
MessageGroupFilenameLineFunctionStatus
'setDisplay() called with invalid display ID "ws_endpoint_1".'DebugViewExecutable.php675Drupal\views\ViewExecutable->setDisplay()
LeafDrupal\search\Tests\SearchAdvancedSearchFormTest3400
LeafDrupal\search\Tests\SearchBlockTest3800
LeafDrupal\search\Tests\SearchCommentCountToggleTest3100
LeafDrupal\search\Tests\SearchCommentTest23000
LeafDrupal\search\Tests\SearchConfigSettingsFormTest15900
LeafDrupal\search\Tests\SearchEmbedFormTest3200
LeafDrupal\search\Tests\SearchExactTest2500
LeafDrupal\search\Tests\SearchExcerptTest1800
LeafDrupal\search\Tests\SearchExpressionInsertExtractTest2400
LeafDrupal\search\Tests\SearchKeywordsConditionsTest2800
LeafDrupal\search\Tests\SearchLanguageTest4300
LeafDrupal\search\Tests\SearchMatchTest14700
LeafDrupal\search\Tests\SearchMultilingualEntityTest1000
LeafDrupal\search\Tests\SearchNodeAccessTest1600
LeafDrupal\search\Tests\SearchNumberMatchingTest29500
LeafDrupal\search\Tests\SearchNumbersTest17500
LeafDrupal\search\Tests\SearchPageOverrideTest1500
LeafDrupal\search\Tests\SearchPageTextTest3700
LeafDrupal\search\Tests\SearchPreprocessLangcodeTest3900
LeafDrupal\search\Tests\SearchRankingTest5900
LeafDrupal\search\Tests\SearchSimplifyTest65700
LeafDrupal\search\Tests\SearchTokenizerTest800
LeafDrupal\serialization\Tests\EntitySerializationTest2100
LeafDrupal\serialization\Tests\SerializationTest200
LeafDrupal\shortcut\Tests\ShortcutLinksTest17800
LeafDrupal\shortcut\Tests\ShortcutSetsTest25000
LeafDrupal\simpletest\Tests\BrokenSetUpTest2100
LeafDrupal\simpletest\Tests\BrowserTest1900
LeafDrupal\simpletest\Tests\DrupalUnitTestBaseTest7000
LeafDrupal\simpletest\Tests\FolderTest400
LeafDrupal\simpletest\Tests\InstallationProfileModuleTestsTest3300
LeafDrupal\simpletest\Tests\MailCaptureTest2400
LeafDrupal\simpletest\Tests\MissingCheckedRequirementsTest2800
LeafDrupal\simpletest\Tests\OtherInstallationProfileModuleTestsTest2100
LeafDrupal\simpletest\Tests\PhpUnitErrorTest100
LeafDrupal\simpletest\Tests\SimpleTestTest11400
LeafDrupal\simpletest\Tests\UserHelpersTest4600
LeafDrupal\standard\Tests\StandardTest2800
LeafDrupal\statistics\Tests\StatisticsAdminTest5800
LeafDrupal\statistics\Tests\StatisticsLoggingTest2100
LeafDrupal\statistics\Tests\StatisticsReportsTest1900
LeafDrupal\statistics\Tests\StatisticsTokenReplaceTest3000
LeafDrupal\statistics\Tests\Views\IntegrationTest3200
LeafDrupal\syslog\Tests\SyslogTest1700
LeafDrupal\system\Tests\Ajax\AjaxCommandsUnitTest4600
LeafDrupal\system\Tests\Ajax\CommandsTest7700
LeafDrupal\system\Tests\Ajax\DialogTest2600
LeafDrupal\system\Tests\Ajax\ElementValidationTest700
LeafDrupal\system\Tests\Ajax\FormValuesTest2900
LeafDrupal\system\Tests\Ajax\FrameworkTest4200
LeafDrupal\system\Tests\Ajax\MultiFormTest3700
LeafDrupal\system\Tests\Batch\PageTest1600
LeafDrupal\system\Tests\Batch\PercentagesUnitTest1800
LeafDrupal\system\Tests\Batch\ProcessingTest16100
LeafDrupal\system\Tests\Bootstrap\GetFilenameUnitTest700
LeafDrupal\system\Tests\Bootstrap\HookExitTest1900
LeafDrupal\system\Tests\Bootstrap\IpAddressTest1100
LeafDrupal\system\Tests\Bootstrap\MiscUnitTest400
LeafDrupal\system\Tests\Bootstrap\OverrideServerVariablesUnitTest600
LeafDrupal\system\Tests\Bootstrap\PageCacheTest7900
LeafDrupal\system\Tests\Bootstrap\ResettableStaticUnitTest500
LeafDrupal\system\Tests\Bootstrap\TimerUnitTest500
LeafDrupal\system\Tests\Bootstrap\VariableTest900
LeafDrupal\system\Tests\Bundle\BundleTest900
LeafDrupal\system\Tests\Cache\BackendChainUnitTest13700
LeafDrupal\system\Tests\Cache\ClearTest900
LeafDrupal\system\Tests\Cache\DatabaseBackendUnitTest14800
LeafDrupal\system\Tests\Cache\MemoryBackendUnitTest13700
LeafDrupal\system\Tests\Common\AddFeedTest700
LeafDrupal\system\Tests\Common\AlterTest700
LeafDrupal\system\Tests\Common\AttributesUnitTest700
LeafDrupal\system\Tests\Common\AutocompleteTagsUnitTest800
LeafDrupal\system\Tests\Common\CascadingStylesheetsTest3600
LeafDrupal\system\Tests\Common\CascadingStylesheetsUnitTest1200
LeafDrupal\system\Tests\Common\ColorTest8500
LeafDrupal\system\Tests\Common\DiffArrayUnitTest100
LeafDrupal\system\Tests\Common\FormatDateTest7300
LeafDrupal\system\Tests\Common\GotoTest2700
LeafDrupal\system\Tests\Common\HtmlIdentifierUnitTest1000
LeafDrupal\system\Tests\Common\HttpRequestTest3600
LeafDrupal\system\Tests\Common\InstallerLanguageTest800
LeafDrupal\system\Tests\Common\JavaScriptTest9000
LeafDrupal\system\Tests\Common\JsonUnitTest2100
LeafDrupal\system\Tests\Common\ParseInfoFileUnitTest300
LeafDrupal\system\Tests\Common\RegionContentTest1800
LeafDrupal\system\Tests\Common\RenderTest5400
LeafDrupal\system\Tests\Common\SimpleTestErrorCollectorTest1600
LeafDrupal\system\Tests\Common\SizeUnitTest3500
LeafDrupal\system\Tests\Common\SystemListingTest600
LeafDrupal\system\Tests\Common\TableSortExtenderUnitTest600
LeafDrupal\system\Tests\Common\UrlTest7000
LeafDrupal\system\Tests\Common\ValidNumberStepUnitTest2400
LeafDrupal\system\Tests\Common\ValidUrlUnitTest7900
LeafDrupal\system\Tests\Common\WriteRecordTest3400
LeafDrupal\system\Tests\Common\XssUnitTest2100
LeafDrupal\system\Tests\Condition\ConditionFormTest900
LeafDrupal\system\Tests\Database\AlterTest3400
LeafDrupal\system\Tests\Database\BasicSyntaxTest1400
LeafDrupal\system\Tests\Database\CaseSensitivityTest400
LeafDrupal\system\Tests\Database\ConnectionTest2200
LeafDrupal\system\Tests\Database\ConnectionUnitTest1200
LeafDrupal\system\Tests\Database\DatabaseExceptionWrapperTest100
LeafDrupal\system\Tests\Database\DeleteTruncateTest1100
LeafDrupal\system\Tests\Database\EmptyStatementTest400
LeafDrupal\system\Tests\Database\FetchTest3800
LeafDrupal\system\Tests\Database\InsertDefaultsTest1000
LeafDrupal\system\Tests\Database\InsertLobTest700
LeafDrupal\system\Tests\Database\InsertTest4600
LeafDrupal\system\Tests\Database\InvalidDataTest800
LeafDrupal\system\Tests\Database\LoggingTest4800
LeafDrupal\system\Tests\Database\MergeTest10200
LeafDrupal\system\Tests\Database\NextIdTest800
LeafDrupal\system\Tests\Database\QueryTest600
LeafDrupal\system\Tests\Database\RangeQueryTest800
LeafDrupal\system\Tests\Database\RegressionTest3000
LeafDrupal\system\Tests\Database\SchemaTest71800
LeafDrupal\system\Tests\Database\SelectCloneTest800
LeafDrupal\system\Tests\Database\SelectComplexTest16000
LeafDrupal\system\Tests\Database\SelectOrderedTest2900
LeafDrupal\system\Tests\Database\SelectPagerDefaultTest2200
LeafDrupal\system\Tests\Database\SelectSubqueryTest1900
LeafDrupal\system\Tests\Database\SelectTableSortDefaultTest3000
LeafDrupal\system\Tests\Database\SelectTest8600
LeafDrupal\system\Tests\Database\SerializeQueryTest300
LeafDrupal\system\Tests\Database\TaggingTest1600
LeafDrupal\system\Tests\Database\TemporaryQueryTest600
LeafDrupal\system\Tests\Database\TransactionTest5400
LeafDrupal\system\Tests\Database\UpdateComplexTest3500
LeafDrupal\system\Tests\Database\UpdateLobTest700
LeafDrupal\system\Tests\Database\UpdateTest3100
LeafDrupal\system\Tests\Datetime\DateTimePlusTest5400
LeafDrupal\system\Tests\Datetime\DrupalDateTimeTest1400
LeafDrupal\system\Tests\DrupalKernel\ContentNegotiationTest4000
LeafDrupal\system\Tests\DrupalKernel\DrupalKernelTest800
LeafDrupal\system\Tests\DrupalKernel\ServiceDestructionTest800
LeafDrupal\system\Tests\Entity\ConfigEntityQueryTest12100
ExpandDrupal\system\Tests\Entity\EntityAccessTest810
MessageGroupFilenameLineFunctionStatus
The test did not complete due to a fatal error.Completion checkEntityAccessTest.php62Drupal\system\Tests\Entity\EntityAccessTest->testEntityAccess()
LeafDrupal\system\Tests\Entity\EntityApiInfoTest600
LeafDrupal\system\Tests\Entity\EntityApiTest3000
LeafDrupal\system\Tests\Entity\EntityBCDecoratorTest1700
LeafDrupal\system\Tests\Entity\EntityCrudHookTest21600
LeafDrupal\system\Tests\Entity\EntityFieldTest70700
LeafDrupal\system\Tests\Entity\EntityFormTest7700
LeafDrupal\system\Tests\Entity\EntityLabelTest800
LeafDrupal\system\Tests\Entity\EntityManagerTest1000
LeafDrupal\system\Tests\Entity\EntityQueryAggregateTest4900
LeafDrupal\system\Tests\Entity\EntityQueryRelationshipTest2300
LeafDrupal\system\Tests\Entity\EntityQueryTest8700
LeafDrupal\system\Tests\Entity\EntityRevisionsTest5300
LeafDrupal\system\Tests\Entity\EntityTranslationFormTest3600
ExpandDrupal\system\Tests\Entity\EntityTranslationTest810
MessageGroupFilenameLineFunctionStatus
The test did not complete due to a fatal error.Completion checkEntityTranslationTest.php95Drupal\system\Tests\Entity\EntityTranslationTest->testEntityLanguageMethods()
LeafDrupal\system\Tests\Entity\EntityUriTest700
LeafDrupal\system\Tests\Entity\EntityUUIDTest8400
LeafDrupal\system\Tests\Entity\FieldAccessTest600
LeafDrupal\system\Tests\FileTransfer\FileTransferTest200
LeafDrupal\system\Tests\File\ConfigTest2100
LeafDrupal\system\Tests\File\DirectoryTest2700
LeafDrupal\system\Tests\File\MimeTypeTest4200
LeafDrupal\system\Tests\File\NameMungingTest600
LeafDrupal\system\Tests\File\ReadOnlyStreamWrapperTest1600
LeafDrupal\system\Tests\File\RemoteFileDirectoryTest3200
LeafDrupal\system\Tests\File\RemoteFileScanDirectoryTest3200
LeafDrupal\system\Tests\File\RemoteFileUnmanagedCopyTest3200
LeafDrupal\system\Tests\File\RemoteFileUnmanagedDeleteRecursiveTest2100
LeafDrupal\system\Tests\File\RemoteFileUnmanagedDeleteTest1000
LeafDrupal\system\Tests\File\RemoteFileUnmanagedMoveTest2300
LeafDrupal\system\Tests\File\RemoteFileUnmanagedSaveDataTest800
LeafDrupal\system\Tests\File\ScanDirectoryTest2900
LeafDrupal\system\Tests\File\StreamWrapperTest1900
LeafDrupal\system\Tests\File\UnmanagedCopyTest2900
LeafDrupal\system\Tests\File\UnmanagedDeleteRecursiveTest1700
LeafDrupal\system\Tests\File\UnmanagedDeleteTest700
LeafDrupal\system\Tests\File\UnmanagedMoveTest2000
LeafDrupal\system\Tests\File\UnmanagedSaveDataTest700
LeafDrupal\system\Tests\File\UrlRewritingTest1400
LeafDrupal\system\Tests\Form\AlterTest400
LeafDrupal\system\Tests\Form\ArbitraryRebuildTest1600
LeafDrupal\system\Tests\Form\CheckboxTest9700
LeafDrupal\system\Tests\Form\ConfirmFormTest2700
LeafDrupal\system\Tests\Form\ElementsLabelsTest2000
LeafDrupal\system\Tests\Form\ElementsTableSelectTest6900
LeafDrupal\system\Tests\Form\ElementsVerticalTabsTest3900
LeafDrupal\system\Tests\Form\ElementTest5700
LeafDrupal\system\Tests\Form\EmailTest1700
LeafDrupal\system\Tests\Form\FileInclusionTest1100
LeafDrupal\system\Tests\Form\FormCacheTest1400
LeafDrupal\system\Tests\Form\FormObjectTest4100
LeafDrupal\system\Tests\Form\FormTest64900
LeafDrupal\system\Tests\Form\HTMLIdTest700
LeafDrupal\system\Tests\Form\LanguageSelectElementTest4400
LeafDrupal\system\Tests\Form\ProgrammaticTest2400
LeafDrupal\system\Tests\Form\RebuildTest5300
LeafDrupal\system\Tests\Form\RedirectTest3100
LeafDrupal\system\Tests\Form\StateValuesCleanAdvancedTest700
LeafDrupal\system\Tests\Form\StateValuesCleanTest1400
LeafDrupal\system\Tests\Form\StorageTest12000
LeafDrupal\system\Tests\Form\SystemConfigFormTest700
LeafDrupal\system\Tests\Form\TriggeringElementTest5000
LeafDrupal\system\Tests\Form\UrlTest1700
LeafDrupal\system\Tests\Form\ValidationTest11200
LeafDrupal\system\Tests\Form\WrapperTest500
LeafDrupal\system\Tests\Graph\GraphUnitTest2800
LeafDrupal\system\Tests\Image\FileMoveTest400
LeafDrupal\system\Tests\Image\ToolkitGdTest20500
LeafDrupal\system\Tests\Image\ToolkitTest5300
LeafDrupal\system\Tests\KeyValueStore\DatabaseStorageExpirableTest6800
LeafDrupal\system\Tests\KeyValueStore\DatabaseStorageTest3600
LeafDrupal\system\Tests\KeyValueStore\GarbageCollectionTest200
LeafDrupal\system\Tests\KeyValueStore\MemoryStorageTest3600
LeafDrupal\system\Tests\Lock\LockFunctionalTest1800
LeafDrupal\system\Tests\Lock\LockUnitTest1300
LeafDrupal\system\Tests\Mail\HtmlToTextTest8600
LeafDrupal\system\Tests\Mail\MailTest700
LeafDrupal\system\Tests\Mail\WrapMailUnitTest200
LeafDrupal\system\Tests\Menu\BreadcrumbTest40900
LeafDrupal\system\Tests\Menu\LinksTest5000
LeafDrupal\system\Tests\Menu\LocalTasksTest5700
LeafDrupal\system\Tests\Menu\MenuRouterTest22900
LeafDrupal\system\Tests\Menu\RebuildTest500
LeafDrupal\system\Tests\Menu\TrailTest6800
LeafDrupal\system\Tests\Menu\TreeAccessTest300
LeafDrupal\system\Tests\Menu\TreeDataUnitTest400
LeafDrupal\system\Tests\Menu\TreeOutputTest900
LeafDrupal\system\Tests\Module\ClassLoaderTest1000
LeafDrupal\system\Tests\Module\DependencyTest17900
ExpandDrupal\system\Tests\Module\EnableDisableTest241600
MessageGroupFilenameLineFunctionStatus
'Missing handler: node created sort'Debugviews.module929views_get_handler()
'Missing handler: node sticky sort'Debugviews.module929views_get_handler()
'Missing handler: node promote filter'Debugviews.module929views_get_handler()
'Missing handler: node status filter'Debugviews.module929views_get_handler()
'Missing handler: views area_text_custom area'Debugviews.module929views_get_handler()
'Missing handler: node node_listing_empty area'Debugviews.module929views_get_handler()
'Missing handler: views title area'Debugviews.module929views_get_handler()
'Missing handler: node created sort'Debugviews.module929views_get_handler()
'Missing handler: node sticky sort'Debugviews.module929views_get_handler()
'Missing handler: node promote filter'Debugviews.module929views_get_handler()
'Missing handler: node status filter'Debugviews.module929views_get_handler()
'Missing handler: views area_text_custom area'Debugviews.module929views_get_handler()
'Missing handler: node node_listing_empty area'Debugviews.module929views_get_handler()
'Missing handler: views title area'Debugviews.module929views_get_handler()
LeafDrupal\system\Tests\Module\HookRequirementsTest1600
LeafDrupal\system\Tests\Module\InstallTest300
LeafDrupal\system\Tests\Module\ModuleApiTest7000
LeafDrupal\system\Tests\Module\ModuleEnable300
LeafDrupal\system\Tests\Module\RequiredTest2000
LeafDrupal\system\Tests\Module\UninstallTest200
LeafDrupal\system\Tests\Module\VersionTest8700
LeafDrupal\system\Tests\Pager\PagerTest12300
LeafDrupal\system\Tests\ParamConverter\UpcastingTest1700
LeafDrupal\system\Tests\PathProcessor\PathProcessorTest500
LeafDrupal\system\Tests\Path\AliasTest4200
LeafDrupal\system\Tests\Path\MatchPathTest4100
LeafDrupal\system\Tests\Path\UrlAlterFunctionalTest3700
LeafDrupal\system\Tests\Plugin\AlterDecoratorTest300
LeafDrupal\system\Tests\Plugin\CacheDecoratorLanguageTest3800
LeafDrupal\system\Tests\Plugin\CacheDecoratorTest1400
LeafDrupal\system\Tests\Plugin\ContextPluginTest2500
LeafDrupal\system\Tests\Plugin\DerivativeTest1200
LeafDrupal\system\Tests\Plugin\Discovery\AnnotatedClassDiscoveryTest700
LeafDrupal\system\Tests\Plugin\Discovery\StaticDiscoveryTest600
LeafDrupal\system\Tests\Plugin\FactoryTest900
LeafDrupal\system\Tests\Plugin\InspectionTest1000
LeafDrupal\system\Tests\Plugin\PluginBagTest2800
LeafDrupal\system\Tests\Queue\QueueTest1700
LeafDrupal\system\Tests\Routing\ControllerResolverTest100
LeafDrupal\system\Tests\Routing\MatcherDumperTest800
LeafDrupal\system\Tests\Routing\MimeTypeMatcherTest1000
LeafDrupal\system\Tests\Routing\RouteProviderTest3900
LeafDrupal\system\Tests\Routing\RouterPermissionTest2300
LeafDrupal\system\Tests\Routing\RouterTest3500
LeafDrupal\system\Tests\Routing\RouteTest600
LeafDrupal\system\Tests\Routing\UrlGeneratorTest200
LeafDrupal\system\Tests\Session\SessionHttpsTest8300
LeafDrupal\system\Tests\Session\SessionTest24400
LeafDrupal\system\Tests\System\AccessDeniedTest6400
LeafDrupal\system\Tests\System\AdminMetaTagTest300
LeafDrupal\system\Tests\System\AdminTest18100
LeafDrupal\system\Tests\System\CronRunTest5200
LeafDrupal\system\Tests\System\DateFormatsLanguageTest6200
LeafDrupal\system\Tests\System\DateTimeTest8800
LeafDrupal\system\Tests\System\DefaultMobileMetaTagsTest1200
LeafDrupal\system\Tests\System\ErrorHandlerTest4000
LeafDrupal\system\Tests\System\ExceptionControllerTest200
LeafDrupal\system\Tests\System\FloodTest1000
LeafDrupal\system\Tests\System\FrontPageTest3700
LeafDrupal\system\Tests\System\IndexPhpTest600
LeafDrupal\system\Tests\System\InfoAlterTest1000
LeafDrupal\system\Tests\System\MainContentFallbackTest6000
LeafDrupal\system\Tests\System\PageNotFoundTest1800
LeafDrupal\system\Tests\System\PageTitleFilteringTest4400
LeafDrupal\system\Tests\System\PasswordHashingTest1000
LeafDrupal\system\Tests\System\RetrieveFileTest700
LeafDrupal\system\Tests\System\SettingsRewriteTest500
LeafDrupal\system\Tests\System\ShutdownFunctionsTest500
LeafDrupal\system\Tests\System\SiteMaintenanceTest7700
LeafDrupal\system\Tests\System\SystemAuthorizeTest1600
LeafDrupal\system\Tests\System\SystemInitTest100
LeafDrupal\system\Tests\System\ThemeTest20500
LeafDrupal\system\Tests\System\TokenReplaceTest3600
LeafDrupal\system\Tests\System\TokenScanTest400
LeafDrupal\system\Tests\System\UnicodeUnitTest18200
LeafDrupal\system\Tests\Theme\EntityFilteringThemeTest5600
LeafDrupal\system\Tests\Theme\FastTest1200
LeafDrupal\system\Tests\Theme\FunctionsTest2600
LeafDrupal\system\Tests\Theme\HookInitTest500
LeafDrupal\system\Tests\Theme\HtmlTagUnitTest200
LeafDrupal\system\Tests\Theme\HtmlTplPhpAttributesTest500
LeafDrupal\system\Tests\Theme\RegistryTest600
LeafDrupal\system\Tests\Theme\TableTest600
LeafDrupal\system\Tests\Theme\ThemeInfoStylesTest1300
LeafDrupal\system\Tests\Theme\ThemeTest4800
LeafDrupal\system\Tests\Theme\ThemeTestTwig1000
LeafDrupal\system\Tests\Theme\TwigDebugMarkupTest900
LeafDrupal\system\Tests\Theme\TwigReferenceUnitTest1500
LeafDrupal\system\Tests\Transliteration\TransliterationTest3100
LeafDrupal\system\Tests\TypedData\TypedDataTest21600
LeafDrupal\system\Tests\Update\DependencyHookInvocationTest400
LeafDrupal\system\Tests\Update\DependencyMissingTest400
LeafDrupal\system\Tests\Update\DependencyOrderingTest500
LeafDrupal\system\Tests\Update\UpdateScriptTest20100
ExpandDrupal\system\Tests\Upgrade\BareMinimalUpgradePathTest6700
MessageGroupFilenameLineFunctionStatus
'Missing handler: node created sort'Debugviews.module929views_get_handler()
'Missing handler: node sticky sort'Debugviews.module929views_get_handler()
'Missing handler: node promote filter'Debugviews.module929views_get_handler()
'Missing handler: node status filter'Debugviews.module929views_get_handler()
'Missing handler: views area_text_custom area'Debugviews.module929views_get_handler()
'Missing handler: node node_listing_empty area'Debugviews.module929views_get_handler()
'Missing handler: views title area'Debugviews.module929views_get_handler()
'Missing handler: node created sort'Debugviews.module929views_get_handler()
'Missing handler: node sticky sort'Debugviews.module929views_get_handler()
'Missing handler: node promote filter'Debugviews.module929views_get_handler()
'Missing handler: node status filter'Debugviews.module929views_get_handler()
'Missing handler: views area_text_custom area'Debugviews.module929views_get_handler()
'Missing handler: node node_listing_empty area'Debugviews.module929views_get_handler()
'Missing handler: views title area'Debugviews.module929views_get_handler()
ExpandDrupal\system\Tests\Upgrade\BareStandardUpgradePathTest211
MessageGroupFilenameLineFunctionStatus
HTTP response expected 200, actual 500BrowserUpgradePathTestBase.php214Drupal\system\Tests\Upgrade\UpgradePathTestBase->performUpgrade()
Exception: Initial GET to update.php did not return HTTP 200 status. in Drupal\system\Tests\Upgrade\UpgradePathTestBase->performUpgrade() (line 215 of /var/lib/drupaltestbot/sites/default/files/checkout/core/modules/system/lib/Drupal/system/Tests/Upgrade/UpgradePathTestBase.php). Drupal\system\Tests\Upgrade\UpgradePathTestBase->performUpgrade() Drupal\system\Tests\Upgrade\BareStandardUpgradePathTest->testBasicStandardUpgrade() Drupal\simpletest\TestBase->run() simpletest_script_run_one_test('646', 'Drupal\system\Tests\Upgrade\BareStandardUpgradePathTest') Uncaught exceptionUpgradePathTestBase.php215Drupal\system\Tests\Upgrade\UpgradePathTestBase->performUpgrade()
LeafDrupal\system\Tests\Upgrade\BlockUpgradePathTest3600
ExpandDrupal\system\Tests\Upgrade\DateUpgradePathTest211
MessageGroupFilenameLineFunctionStatus
HTTP response expected 200, actual 500BrowserUpgradePathTestBase.php214Drupal\system\Tests\Upgrade\UpgradePathTestBase->performUpgrade()
Exception: Initial GET to update.php did not return HTTP 200 status. in Drupal\system\Tests\Upgrade\UpgradePathTestBase->performUpgrade() (line 215 of /var/lib/drupaltestbot/sites/default/files/checkout/core/modules/system/lib/Drupal/system/Tests/Upgrade/UpgradePathTestBase.php). Drupal\system\Tests\Upgrade\UpgradePathTestBase->performUpgrade() Drupal\system\Tests\Upgrade\DateUpgradePathTest->testDateUpgrade() Drupal\simpletest\TestBase->run() simpletest_script_run_one_test('648', 'Drupal\system\Tests\Upgrade\DateUpgradePathTest') Uncaught exceptionUpgradePathTestBase.php215Drupal\system\Tests\Upgrade\UpgradePathTestBase->performUpgrade()
ExpandDrupal\system\Tests\Upgrade\FieldUIUpgradePathTest211
MessageGroupFilenameLineFunctionStatus
HTTP response expected 200, actual 500BrowserUpgradePathTestBase.php214Drupal\system\Tests\Upgrade\UpgradePathTestBase->performUpgrade()
Exception: Initial GET to update.php did not return HTTP 200 status. in Drupal\system\Tests\Upgrade\UpgradePathTestBase->performUpgrade() (line 215 of /var/lib/drupaltestbot/sites/default/files/checkout/core/modules/system/lib/Drupal/system/Tests/Upgrade/UpgradePathTestBase.php). Drupal\system\Tests\Upgrade\UpgradePathTestBase->performUpgrade() Drupal\system\Tests\Upgrade\FieldUIUpgradePathTest->testFieldUIPermissions() Drupal\simpletest\TestBase->run() simpletest_script_run_one_test('649', 'Drupal\system\Tests\Upgrade\FieldUIUpgradePathTest') Uncaught exceptionUpgradePathTestBase.php215Drupal\system\Tests\Upgrade\UpgradePathTestBase->performUpgrade()
ExpandDrupal\system\Tests\Upgrade\FieldUpgradePathTest211
MessageGroupFilenameLineFunctionStatus
HTTP response expected 200, actual 500BrowserUpgradePathTestBase.php214Drupal\system\Tests\Upgrade\UpgradePathTestBase->performUpgrade()
Exception: Initial GET to update.php did not return HTTP 200 status. in Drupal\system\Tests\Upgrade\UpgradePathTestBase->performUpgrade() (line 215 of /var/lib/drupaltestbot/sites/default/files/checkout/core/modules/system/lib/Drupal/system/Tests/Upgrade/UpgradePathTestBase.php). Drupal\system\Tests\Upgrade\UpgradePathTestBase->performUpgrade() Drupal\system\Tests\Upgrade\FieldUpgradePathTest->testEntityDisplayUpgrade() Drupal\simpletest\TestBase->run() simpletest_script_run_one_test('650', 'Drupal\system\Tests\Upgrade\FieldUpgradePathTest') Uncaught exceptionUpgradePathTestBase.php215Drupal\system\Tests\Upgrade\UpgradePathTestBase->performUpgrade()
LeafDrupal\system\Tests\Upgrade\FilledMinimalUpgradePathTest6800
ExpandDrupal\system\Tests\Upgrade\FilledStandardUpgradePathTest211
MessageGroupFilenameLineFunctionStatus
HTTP response expected 200, actual 500BrowserUpgradePathTestBase.php214Drupal\system\Tests\Upgrade\UpgradePathTestBase->performUpgrade()
Exception: Initial GET to update.php did not return HTTP 200 status. in Drupal\system\Tests\Upgrade\UpgradePathTestBase->performUpgrade() (line 215 of /var/lib/drupaltestbot/sites/default/files/checkout/core/modules/system/lib/Drupal/system/Tests/Upgrade/UpgradePathTestBase.php). Drupal\system\Tests\Upgrade\UpgradePathTestBase->performUpgrade() Drupal\system\Tests\Upgrade\FilledStandardUpgradePathTest->testFilledStandardUpgrade() Drupal\simpletest\TestBase->run() simpletest_script_run_one_test('652', 'Drupal\system\Tests\Upgrade\FilledStandardUpgradePathTest') Uncaught exceptionUpgradePathTestBase.php215Drupal\system\Tests\Upgrade\UpgradePathTestBase->performUpgrade()
ExpandDrupal\system\Tests\Upgrade\FilterFormatUpgradePathTest211
MessageGroupFilenameLineFunctionStatus
HTTP response expected 200, actual 500BrowserUpgradePathTestBase.php214Drupal\system\Tests\Upgrade\UpgradePathTestBase->performUpgrade()
Exception: Initial GET to update.php did not return HTTP 200 status. in Drupal\system\Tests\Upgrade\UpgradePathTestBase->performUpgrade() (line 215 of /var/lib/drupaltestbot/sites/default/files/checkout/core/modules/system/lib/Drupal/system/Tests/Upgrade/UpgradePathTestBase.php). Drupal\system\Tests\Upgrade\UpgradePathTestBase->performUpgrade() Drupal\system\Tests\Upgrade\FilterFormatUpgradePathTest->testFilterFormatUpgrade() Drupal\simpletest\TestBase->run() simpletest_script_run_one_test('653', 'Drupal\system\Tests\Upgrade\FilterFormatUpgradePathTest') Uncaught exceptionUpgradePathTestBase.php215Drupal\system\Tests\Upgrade\UpgradePathTestBase->performUpgrade()
ExpandDrupal\system\Tests\Upgrade\ImageUpgradePathTest211
MessageGroupFilenameLineFunctionStatus
HTTP response expected 200, actual 500BrowserUpgradePathTestBase.php214Drupal\system\Tests\Upgrade\UpgradePathTestBase->performUpgrade()
Exception: Initial GET to update.php did not return HTTP 200 status. in Drupal\system\Tests\Upgrade\UpgradePathTestBase->performUpgrade() (line 215 of /var/lib/drupaltestbot/sites/default/files/checkout/core/modules/system/lib/Drupal/system/Tests/Upgrade/UpgradePathTestBase.php). Drupal\system\Tests\Upgrade\UpgradePathTestBase->performUpgrade() Drupal\system\Tests\Upgrade\ImageUpgradePathTest->testImageStyleUpgrade() Drupal\simpletest\TestBase->run() simpletest_script_run_one_test('654', 'Drupal\system\Tests\Upgrade\ImageUpgradePathTest') Uncaught exceptionUpgradePathTestBase.php215Drupal\system\Tests\Upgrade\UpgradePathTestBase->performUpgrade()
ExpandDrupal\system\Tests\Upgrade\LanguageUpgradePathTest844
MessageGroupFilenameLineFunctionStatus
HTTP response expected 200, actual 500BrowserUpgradePathTestBase.php214Drupal\system\Tests\Upgrade\UpgradePathTestBase->performUpgrade()
Exception: Initial GET to update.php did not return HTTP 200 status. in Drupal\system\Tests\Upgrade\UpgradePathTestBase->performUpgrade() (line 215 of /var/lib/drupaltestbot/sites/default/files/checkout/core/modules/system/lib/Drupal/system/Tests/Upgrade/UpgradePathTestBase.php). Drupal\system\Tests\Upgrade\UpgradePathTestBase->performUpgrade() Drupal\system\Tests\Upgrade\LanguageUpgradePathTest->testLanguageUpgrade() Drupal\simpletest\TestBase->run() simpletest_script_run_one_test('655', 'Drupal\system\Tests\Upgrade\LanguageUpgradePathTest') Uncaught exceptionUpgradePathTestBase.php215Drupal\system\Tests\Upgrade\UpgradePathTestBase->performUpgrade()
HTTP response expected 200, actual 500BrowserUpgradePathTestBase.php214Drupal\system\Tests\Upgrade\UpgradePathTestBase->performUpgrade()
Exception: Initial GET to update.php did not return HTTP 200 status. in Drupal\system\Tests\Upgrade\UpgradePathTestBase->performUpgrade() (line 215 of /var/lib/drupaltestbot/sites/default/files/checkout/core/modules/system/lib/Drupal/system/Tests/Upgrade/UpgradePathTestBase.php). Drupal\system\Tests\Upgrade\UpgradePathTestBase->performUpgrade() Drupal\system\Tests\Upgrade\LanguageUpgradePathTest->testLanguageUrlUpgrade() Drupal\simpletest\TestBase->run() simpletest_script_run_one_test('655', 'Drupal\system\Tests\Upgrade\LanguageUpgradePathTest') Uncaught exceptionUpgradePathTestBase.php215Drupal\system\Tests\Upgrade\UpgradePathTestBase->performUpgrade()
HTTP response expected 200, actual 500BrowserUpgradePathTestBase.php214Drupal\system\Tests\Upgrade\UpgradePathTestBase->performUpgrade()
Exception: Initial GET to update.php did not return HTTP 200 status. in Drupal\system\Tests\Upgrade\UpgradePathTestBase->performUpgrade() (line 215 of /var/lib/drupaltestbot/sites/default/files/checkout/core/modules/system/lib/Drupal/system/Tests/Upgrade/UpgradePathTestBase.php). Drupal\system\Tests\Upgrade\UpgradePathTestBase->performUpgrade() Drupal\system\Tests\Upgrade\LanguageUpgradePathTest->testLanguageNoPluralsUpgrade() Drupal\simpletest\TestBase->run() simpletest_script_run_one_test('655', 'Drupal\system\Tests\Upgrade\LanguageUpgradePathTest') Uncaught exceptionUpgradePathTestBase.php215Drupal\system\Tests\Upgrade\UpgradePathTestBase->performUpgrade()
HTTP response expected 200, actual 500BrowserUpgradePathTestBase.php214Drupal\system\Tests\Upgrade\UpgradePathTestBase->performUpgrade()
Exception: Initial GET to update.php did not return HTTP 200 status. in Drupal\system\Tests\Upgrade\UpgradePathTestBase->performUpgrade() (line 215 of /var/lib/drupaltestbot/sites/default/files/checkout/core/modules/system/lib/Drupal/system/Tests/Upgrade/UpgradePathTestBase.php). Drupal\system\Tests\Upgrade\UpgradePathTestBase->performUpgrade() Drupal\system\Tests\Upgrade\LanguageUpgradePathTest->testLanguagePermissionsUpgrade() Drupal\simpletest\TestBase->run() simpletest_script_run_one_test('655', 'Drupal\system\Tests\Upgrade\LanguageUpgradePathTest') Uncaught exceptionUpgradePathTestBase.php215Drupal\system\Tests\Upgrade\UpgradePathTestBase->performUpgrade()
ExpandDrupal\system\Tests\Upgrade\MailUpgradePathTest211
MessageGroupFilenameLineFunctionStatus
HTTP response expected 200, actual 500BrowserUpgradePathTestBase.php214Drupal\system\Tests\Upgrade\UpgradePathTestBase->performUpgrade()
Exception: Initial GET to update.php did not return HTTP 200 status. in Drupal\system\Tests\Upgrade\UpgradePathTestBase->performUpgrade() (line 215 of /var/lib/drupaltestbot/sites/default/files/checkout/core/modules/system/lib/Drupal/system/Tests/Upgrade/UpgradePathTestBase.php). Drupal\system\Tests\Upgrade\UpgradePathTestBase->performUpgrade(1) Drupal\system\Tests\Upgrade\MailUpgradePathTest->testMailSystemUpgrade() Drupal\simpletest\TestBase->run() simpletest_script_run_one_test('656', 'Drupal\system\Tests\Upgrade\MailUpgradePathTest') Uncaught exceptionUpgradePathTestBase.php215Drupal\system\Tests\Upgrade\UpgradePathTestBase->performUpgrade()
ExpandDrupal\system\Tests\Upgrade\ModulesDisabledUpgradePathTest4800
MessageGroupFilenameLineFunctionStatus
'Missing handler: node created sort'Debugviews.module929views_get_handler()
'Missing handler: node sticky sort'Debugviews.module929views_get_handler()
'Missing handler: node promote filter'Debugviews.module929views_get_handler()
'Missing handler: node status filter'Debugviews.module929views_get_handler()
'Missing handler: node node_listing_empty area'Debugviews.module929views_get_handler()
'Missing handler: node created sort'Debugviews.module929views_get_handler()
'Missing handler: node sticky sort'Debugviews.module929views_get_handler()
'Missing handler: node promote filter'Debugviews.module929views_get_handler()
'Missing handler: node status filter'Debugviews.module929views_get_handler()
'Missing handler: node node_listing_empty area'Debugviews.module929views_get_handler()
ExpandDrupal\system\Tests\Upgrade\ShortcutUpgradePathTest311
MessageGroupFilenameLineFunctionStatus
HTTP response expected 200, actual 500BrowserUpgradePathTestBase.php214Drupal\system\Tests\Upgrade\UpgradePathTestBase->performUpgrade()
Exception: Initial GET to update.php did not return HTTP 200 status. in Drupal\system\Tests\Upgrade\UpgradePathTestBase->performUpgrade() (line 215 of /var/lib/drupaltestbot/sites/default/files/checkout/core/modules/system/lib/Drupal/system/Tests/Upgrade/UpgradePathTestBase.php). Drupal\system\Tests\Upgrade\UpgradePathTestBase->performUpgrade() Drupal\system\Tests\Upgrade\ShortcutUpgradePathTest->testContactUpgrade() Drupal\simpletest\TestBase->run() simpletest_script_run_one_test('658', 'Drupal\system\Tests\Upgrade\ShortcutUpgradePathTest') Uncaught exceptionUpgradePathTestBase.php215Drupal\system\Tests\Upgrade\UpgradePathTestBase->performUpgrade()
ExpandDrupal\system\Tests\Upgrade\StateSystemUpgradePathTest211
MessageGroupFilenameLineFunctionStatus
HTTP response expected 200, actual 500BrowserUpgradePathTestBase.php214Drupal\system\Tests\Upgrade\UpgradePathTestBase->performUpgrade()
Exception: Initial GET to update.php did not return HTTP 200 status. in Drupal\system\Tests\Upgrade\UpgradePathTestBase->performUpgrade() (line 215 of /var/lib/drupaltestbot/sites/default/files/checkout/core/modules/system/lib/Drupal/system/Tests/Upgrade/UpgradePathTestBase.php). Drupal\system\Tests\Upgrade\UpgradePathTestBase->performUpgrade() Drupal\system\Tests\Upgrade\StateSystemUpgradePathTest->testSystemVariableUpgrade() Drupal\simpletest\TestBase->run() simpletest_script_run_one_test('659', 'Drupal\system\Tests\Upgrade\StateSystemUpgradePathTest') Uncaught exceptionUpgradePathTestBase.php215Drupal\system\Tests\Upgrade\UpgradePathTestBase->performUpgrade()
ExpandDrupal\system\Tests\Upgrade\SystemUpgradePathTest422
MessageGroupFilenameLineFunctionStatus
HTTP response expected 200, actual 500BrowserUpgradePathTestBase.php214Drupal\system\Tests\Upgrade\UpgradePathTestBase->performUpgrade()
Exception: Initial GET to update.php did not return HTTP 200 status. in Drupal\system\Tests\Upgrade\UpgradePathTestBase->performUpgrade() (line 215 of /var/lib/drupaltestbot/sites/default/files/checkout/core/modules/system/lib/Drupal/system/Tests/Upgrade/UpgradePathTestBase.php). Drupal\system\Tests\Upgrade\UpgradePathTestBase->performUpgrade() Drupal\system\Tests\Upgrade\SystemUpgradePathTest->testVariableUpgrade() Drupal\simpletest\TestBase->run() simpletest_script_run_one_test('660', 'Drupal\system\Tests\Upgrade\SystemUpgradePathTest') Uncaught exceptionUpgradePathTestBase.php215Drupal\system\Tests\Upgrade\UpgradePathTestBase->performUpgrade()
HTTP response expected 200, actual 500BrowserUpgradePathTestBase.php214Drupal\system\Tests\Upgrade\UpgradePathTestBase->performUpgrade()
Exception: Initial GET to update.php did not return HTTP 200 status. in Drupal\system\Tests\Upgrade\UpgradePathTestBase->performUpgrade() (line 215 of /var/lib/drupaltestbot/sites/default/files/checkout/core/modules/system/lib/Drupal/system/Tests/Upgrade/UpgradePathTestBase.php). Drupal\system\Tests\Upgrade\UpgradePathTestBase->performUpgrade() Drupal\system\Tests\Upgrade\SystemUpgradePathTest->testFrontpageUpgrade() Drupal\simpletest\TestBase->run() simpletest_script_run_one_test('660', 'Drupal\system\Tests\Upgrade\SystemUpgradePathTest') Uncaught exceptionUpgradePathTestBase.php215Drupal\system\Tests\Upgrade\UpgradePathTestBase->performUpgrade()
ExpandDrupal\system\Tests\Upgrade\UserPictureUpgradePathTest211
MessageGroupFilenameLineFunctionStatus
HTTP response expected 200, actual 500BrowserUpgradePathTestBase.php214Drupal\system\Tests\Upgrade\UpgradePathTestBase->performUpgrade()
Exception: Initial GET to update.php did not return HTTP 200 status. in Drupal\system\Tests\Upgrade\UpgradePathTestBase->performUpgrade() (line 215 of /var/lib/drupaltestbot/sites/default/files/checkout/core/modules/system/lib/Drupal/system/Tests/Upgrade/UpgradePathTestBase.php). Drupal\system\Tests\Upgrade\UpgradePathTestBase->performUpgrade() Drupal\system\Tests\Upgrade\UserPictureUpgradePathTest->testUserPictureUpgrade() Drupal\simpletest\TestBase->run() simpletest_script_run_one_test('661', 'Drupal\system\Tests\Upgrade\UserPictureUpgradePathTest') Uncaught exceptionUpgradePathTestBase.php215Drupal\system\Tests\Upgrade\UpgradePathTestBase->performUpgrade()
ExpandDrupal\system\Tests\Upgrade\UserRoleUpgradePathTest422
MessageGroupFilenameLineFunctionStatus
HTTP response expected 200, actual 500BrowserUpgradePathTestBase.php214Drupal\system\Tests\Upgrade\UpgradePathTestBase->performUpgrade()
Exception: Initial GET to update.php did not return HTTP 200 status. in Drupal\system\Tests\Upgrade\UpgradePathTestBase->performUpgrade() (line 215 of /var/lib/drupaltestbot/sites/default/files/checkout/core/modules/system/lib/Drupal/system/Tests/Upgrade/UpgradePathTestBase.php). Drupal\system\Tests\Upgrade\UpgradePathTestBase->performUpgrade() Drupal\system\Tests\Upgrade\UserRoleUpgradePathTest->testRoleUpgrade() Drupal\simpletest\TestBase->run() simpletest_script_run_one_test('662', 'Drupal\system\Tests\Upgrade\UserRoleUpgradePathTest') Uncaught exceptionUpgradePathTestBase.php215Drupal\system\Tests\Upgrade\UpgradePathTestBase->performUpgrade()
HTTP response expected 200, actual 500BrowserUpgradePathTestBase.php214Drupal\system\Tests\Upgrade\UpgradePathTestBase->performUpgrade()
Exception: Initial GET to update.php did not return HTTP 200 status. in Drupal\system\Tests\Upgrade\UpgradePathTestBase->performUpgrade() (line 215 of /var/lib/drupaltestbot/sites/default/files/checkout/core/modules/system/lib/Drupal/system/Tests/Upgrade/UpgradePathTestBase.php). Drupal\system\Tests\Upgrade\UpgradePathTestBase->performUpgrade() Drupal\system\Tests\Upgrade\UserRoleUpgradePathTest->testRoleUpgradeToConfig() Drupal\simpletest\TestBase->run() simpletest_script_run_one_test('662', 'Drupal\system\Tests\Upgrade\UserRoleUpgradePathTest') Uncaught exceptionUpgradePathTestBase.php215Drupal\system\Tests\Upgrade\UpgradePathTestBase->performUpgrade()
ExpandDrupal\system\Tests\Upgrade\UuidUpgradePathTest211
MessageGroupFilenameLineFunctionStatus
HTTP response expected 200, actual 500BrowserUpgradePathTestBase.php214Drupal\system\Tests\Upgrade\UpgradePathTestBase->performUpgrade()
Exception: Initial GET to update.php did not return HTTP 200 status. in Drupal\system\Tests\Upgrade\UpgradePathTestBase->performUpgrade() (line 215 of /var/lib/drupaltestbot/sites/default/files/checkout/core/modules/system/lib/Drupal/system/Tests/Upgrade/UpgradePathTestBase.php). Drupal\system\Tests\Upgrade\UpgradePathTestBase->performUpgrade() Drupal\system\Tests\Upgrade\UuidUpgradePathTest->testUuidUpgrade() Drupal\simpletest\TestBase->run() simpletest_script_run_one_test('663', 'Drupal\system\Tests\Upgrade\UuidUpgradePathTest') Uncaught exceptionUpgradePathTestBase.php215Drupal\system\Tests\Upgrade\UpgradePathTestBase->performUpgrade()
LeafDrupal\system\Tests\Uuid\UuidUnitTest700
LeafDrupal\taxonomy\Tests\EfqTest1400
LeafDrupal\taxonomy\Tests\HooksTest2300
LeafDrupal\taxonomy\Tests\LegacyTest1400
LeafDrupal\taxonomy\Tests\LoadMultipleTest1800
LeafDrupal\taxonomy\Tests\RssTest2600
LeafDrupal\taxonomy\Tests\TaxonomyTermReferenceItemTest1600
LeafDrupal\taxonomy\Tests\TermFieldMultipleVocabularyTest2600
LeafDrupal\taxonomy\Tests\TermFieldTest4500
LeafDrupal\taxonomy\Tests\TermIndexTest4600
LeafDrupal\taxonomy\Tests\TermLanguageTest6400
LeafDrupal\taxonomy\Tests\TermTest26400
LeafDrupal\taxonomy\Tests\TermTranslationUITest15300
LeafDrupal\taxonomy\Tests\TermUnitTest1100
LeafDrupal\taxonomy\Tests\ThemeTest1900
LeafDrupal\taxonomy\Tests\TokenReplaceTest5500
ExpandDrupal\taxonomy\Tests\Views\RelationshipNodeTermDataTest400
MessageGroupFilenameLineFunctionStatus
'Missing handler: nid nid sort'Debugviews.module929views_get_handler()
'Missing handler: nid nid sort'Debugviews.module929views_get_handler()
LeafDrupal\taxonomy\Tests\Views\RelationshipRepresentativeNode400
LeafDrupal\taxonomy\Tests\VocabularyLanguageTest6000
LeafDrupal\taxonomy\Tests\VocabularyTest11000
LeafDrupal\taxonomy\Tests\VocabularyUnitTest6800
LeafDrupal\telephone\Tests\TelephoneFieldTest2000
LeafDrupal\telephone\Tests\TelephoneItemTest1100
LeafDrupal\Tests\Component\PhpStorage\FileStorageTest200
LeafDrupal\Tests\Component\PhpStorage\MTimeProtectedFastFileStorageTest200
LeafDrupal\Tests\Core\Cache\BackendChainImplementationUnitTest900
LeafDrupal\Tests\Core\Cache\NullBackendTest100
LeafDrupal\Tests\Core\Extension\ModuleHandlerUnitTest100
LeafDrupal\Tests\Core\NestedArrayUnitTest500
LeafDrupal\text\Tests\Formatter\TextPlainUnitTest600
LeafDrupal\text\Tests\TextFieldTest18600
LeafDrupal\text\Tests\TextSummaryTest13800
LeafDrupal\text\Tests\TextTranslationTest10400
LeafDrupal\toolbar\Tests\ToolbarHookToolbarTest1500
LeafDrupal\toolbar\Tests\ToolbarMenuTranslationTest4400
LeafDrupal\tour\Tests\TourPluginTest200
LeafDrupal\tour\Tests\TourTest3200
LeafDrupal\tracker\Tests\TrackerNodeAccessTest2800
LeafDrupal\tracker\Tests\TrackerTest22800
LeafDrupal\translation\Tests\TranslationTest57800
LeafDrupal\translation_entity\Tests\ConfigTestTranslationUITest1700
LeafDrupal\translation_entity\Tests\EntityTestTranslationUITest11800
LeafDrupal\translation_entity\Tests\EntityTranslationSettingsTest4900
LeafDrupal\translation_entity\Tests\EntityTranslationSyncImageTest2100
LeafDrupal\translation_entity\Tests\EntityTranslationSyncUnitTest1100
LeafDrupal\translation_entity\Tests\EntityTranslationWorkflowsTest16300
LeafDrupal\translation_entity\Tests\Views\TranslationLinkTest2500
LeafDrupal\update\Tests\UpdateContribTest19700
LeafDrupal\update\Tests\UpdateCoreTest22600
LeafDrupal\update\Tests\UpdateCoreUnitTest400
LeafDrupal\update\Tests\UpdateUploadTest6400
LeafDrupal\user\Tests\TempStoreDatabaseTest1900
LeafDrupal\user\Tests\UserAccountLinksTests6100
LeafDrupal\user\Tests\UserAdminSettingsFormTest400
LeafDrupal\user\Tests\UserAdminTest8400
LeafDrupal\user\Tests\UserAutocompleteTest2900
LeafDrupal\user\Tests\UserBlocksTests6600
LeafDrupal\user\Tests\UserCancelTest25400
LeafDrupal\user\Tests\UserCreateTest3900
LeafDrupal\user\Tests\UserDeleteTest1500
LeafDrupal\user\Tests\UserEditedOwnAccountTest2200
LeafDrupal\user\Tests\UserEditTest8800
LeafDrupal\user\Tests\UserEntityCallbacksTest700
LeafDrupal\user\Tests\UserLanguageCreationTest6800
LeafDrupal\user\Tests\UserLanguageTest3900
LeafDrupal\user\Tests\UserLoginTest15900
LeafDrupal\user\Tests\UserPasswordResetTest4500
LeafDrupal\user\Tests\UserPermissionsTest5000
LeafDrupal\user\Tests\UserPictureTest4700
LeafDrupal\user\Tests\UserRegistrationTest12900
LeafDrupal\user\Tests\UserRoleAdminTest5700
LeafDrupal\user\Tests\UserRolesAssignmentTest5100
LeafDrupal\user\Tests\UserSaveTest200
LeafDrupal\user\Tests\UserSearchTest5800
LeafDrupal\user\Tests\UserSignatureTest4500
LeafDrupal\user\Tests\UserTimeZoneTest2900
LeafDrupal\user\Tests\UserTokenReplaceTest4700
LeafDrupal\user\Tests\UserTranslationUITest14300
LeafDrupal\user\Tests\UserValidateCurrentPassCustomFormTest1700
LeafDrupal\user\Tests\UserValidationTest1600
LeafDrupal\user\Tests\Views\AccessPermissionTest2200
LeafDrupal\user\Tests\Views\AccessRoleTest1600
LeafDrupal\user\Tests\Views\ArgumentDefaultTest900
LeafDrupal\user\Tests\Views\ArgumentValidateTest1900
LeafDrupal\user\Tests\Views\HandlerArgumentUserUidTest500
LeafDrupal\user\Tests\Views\HandlerFieldRoleTest1000
LeafDrupal\user\Tests\Views\HandlerFieldUserNameTest700
LeafDrupal\user\Tests\Views\HandlerFilterUserNameTest5000
LeafDrupal\user\Tests\Views\RelationshipRepresentativeNode300
LeafDrupal\user\Tests\Views\UserDataTest400
LeafDrupal\views\Tests\BasicTest1700
ExpandDrupal\views\Tests\DefaultViewsTest7300
MessageGroupFilenameLineFunctionStatus
'Missing handler: node created_year_month argument'Debugviews.module929views_get_handler()
'Missing handler: node created_year_month argument'Debugviews.module929views_get_handler()
'Missing handler: node created_year_month argument'Debugviews.module929views_get_handler()
'Missing handler: search_node_links_to nid argument'Debugviews.module929views_get_handler()
'Missing handler: search_node_links_to nid argument'Debugviews.module929views_get_handler()
'Missing handler: search_node_links_to nid argument'Debugviews.module929views_get_handler()
'Missing handler: history timestamp field'Debugviews.module929views_get_handler()
'Missing handler: history timestamp field'Debugviews.module929views_get_handler()
LeafDrupal\views\Tests\Entity\FieldEntityTest400
LeafDrupal\views\Tests\Entity\FilterEntityBundleTest800
LeafDrupal\views\Tests\GlossaryTest800
LeafDrupal\views\Tests\Handler\AreaEntityTest3100
LeafDrupal\views\Tests\Handler\AreaTest9400
LeafDrupal\views\Tests\Handler\AreaTextTest800
LeafDrupal\views\Tests\Handler\ArgumentDateTest3800
LeafDrupal\views\Tests\Handler\ArgumentNullTest700
LeafDrupal\views\Tests\Handler\ArgumentStringTest400
LeafDrupal\views\Tests\Handler\FieldBooleanTest1300
LeafDrupal\views\Tests\Handler\FieldCounterTest1400
LeafDrupal\views\Tests\Handler\FieldCustomTest400
LeafDrupal\views\Tests\Handler\FieldDateTest1700
LeafDrupal\views\Tests\Handler\FieldDropButtonTest1300
LeafDrupal\views\Tests\Handler\FieldFileSizeTest1100
LeafDrupal\views\Tests\Handler\FieldUnitTest14500
LeafDrupal\views\Tests\Handler\FieldUrlTest600
LeafDrupal\views\Tests\Handler\FieldWebTest17400
LeafDrupal\views\Tests\Handler\FieldXssTest600
LeafDrupal\views\Tests\Handler\FilterCombineTest400
LeafDrupal\views\Tests\Handler\FilterDateTest2200
LeafDrupal\views\Tests\Handler\FilterEqualityTest2000
LeafDrupal\views\Tests\Handler\FilterInOperatorTest2000
LeafDrupal\views\Tests\Handler\FilterNumericTest5000
LeafDrupal\views\Tests\Handler\FilterStringTest17800
LeafDrupal\views\Tests\Handler\HandlerAliasTest1200
LeafDrupal\views\Tests\Handler\HandlerAllTest26100
ExpandDrupal\views\Tests\Handler\HandlerTest16100
MessageGroupFilenameLineFunctionStatus
'Missing handler: zSMtFSbp lRRy4N16 relationship'Debugviews.module929views_get_handler()
LeafDrupal\views\Tests\Handler\RelationshipTest1100
LeafDrupal\views\Tests\Handler\SortDateTest2700
LeafDrupal\views\Tests\Handler\SortRandomTest900
LeafDrupal\views\Tests\Handler\SortTest1400
ExpandDrupal\views\Tests\ModuleTest4200
MessageGroupFilenameLineFunctionStatus
'Missing handler: pVkFEzZI fbLGsanR field'Debugviews.module929views_get_handler()
'Missing handler: jPZ4wQBW bhaXl6jk area'Debugviews.module929views_get_handler()
'Missing handler: mVhcECNS jJUEaPck filter'Debugviews.module929views_get_handler()
LeafDrupal\views\Tests\PluginBaseUnitTest1400
LeafDrupal\views\Tests\PluginInstanceTest15200
LeafDrupal\views\Tests\PluginTypeListTest100
LeafDrupal\views\Tests\Plugin\AccessTest3900
LeafDrupal\views\Tests\Plugin\ArgumentDefaultTest2400
LeafDrupal\views\Tests\Plugin\ArgumentValidatorTest1000
LeafDrupal\views\Tests\Plugin\CacheTest1200
LeafDrupal\views\Tests\Plugin\DisplayAttachmentTest600
LeafDrupal\views\Tests\Plugin\DisplayExtenderTest600
LeafDrupal\views\Tests\Plugin\DisplayFeedTest4300
LeafDrupal\views\Tests\Plugin\DisplayPageTest700
LeafDrupal\views\Tests\Plugin\DisplayTest5000
LeafDrupal\views\Tests\Plugin\ExposedFormTest13100
LeafDrupal\views\Tests\Plugin\FilterTest1300
LeafDrupal\views\Tests\Plugin\JoinTest2800
LeafDrupal\views\Tests\Plugin\MiniPagerTest3000
ExpandDrupal\views\Tests\Plugin\PagerTest9900
MessageGroupFilenameLineFunctionStatus
'Missing handler: views_test_data age field'Debugviews.module929views_get_handler()
'Missing handler: views_test_data id field'Debugviews.module929views_get_handler()
'Missing handler: views_test_data name field'Debugviews.module929views_get_handler()
'Missing handler: views_test_data id sort'Debugviews.module929views_get_handler()
'Missing handler: views_test_data age field'Debugviews.module929views_get_handler()
'Missing handler: views_test_data id field'Debugviews.module929views_get_handler()
'Missing handler: views_test_data name field'Debugviews.module929views_get_handler()
'Missing handler: views_test_data id sort'Debugviews.module929views_get_handler()
'Missing handler: views_test_data age field'Debugviews.module929views_get_handler()
'Missing handler: views_test_data id field'Debugviews.module929views_get_handler()
'Missing handler: views_test_data name field'Debugviews.module929views_get_handler()
'Missing handler: views_test_data id sort'Debugviews.module929views_get_handler()
LeafDrupal\views\Tests\Plugin\QueryTest700
LeafDrupal\views\Tests\Plugin\StyleMappingTest4500
LeafDrupal\views\Tests\Plugin\StyleTest2000
LeafDrupal\views\Tests\Plugin\StyleUnformattedTest2000
LeafDrupal\views\Tests\QueryGroupByTest4400
LeafDrupal\views\Tests\TokenReplaceTest1500
LeafDrupal\views\Tests\UI\AnalyzeTest2100
LeafDrupal\views\Tests\UI\CachedDataUITest4300
LeafDrupal\views\Tests\UI\CustomBooleanTest4200
ExpandDrupal\views\Tests\UI\DefaultViewsTest11000
MessageGroupFilenameLineFunctionStatus
'Missing handler: node created_year_month argument'Debugviews.module929views_get_handler()
'Missing handler: node created_year_month argument'Debugviews.module929views_get_handler()
'Missing handler: node created_year_month argument'Debugviews.module929views_get_handler()
'Missing handler: node created_year_month argument'Debugviews.module929views_get_handler()
'Missing handler: node created_year_month argument'Debugviews.module929views_get_handler()
'Missing handler: node created_year_month argument'Debugviews.module929views_get_handler()
'Missing handler: node created_year_month argument'Debugviews.module929views_get_handler()
'Missing handler: node created_year_month argument'Debugviews.module929views_get_handler()
'Missing handler: node created_year_month argument'Debugviews.module929views_get_handler()
'Missing handler: node created_year_month argument'Debugviews.module929views_get_handler()
'Missing handler: node created_year_month argument'Debugviews.module929views_get_handler()
'Missing handler: node created_year_month argument'Debugviews.module929views_get_handler()
LeafDrupal\views\Tests\UI\DisplayAttachmentTest2400
LeafDrupal\views\Tests\UI\DisplayExtenderUITest2300
LeafDrupal\views\Tests\UI\DisplayPath2200
LeafDrupal\views\Tests\UI\DisplayTest27400
LeafDrupal\views\Tests\UI\GroupByTest2900
LeafDrupal\views\Tests\UI\HandlerTest18700
LeafDrupal\views\Tests\UI\OverrideDisplaysTest14700
LeafDrupal\views\Tests\UI\PreviewTest4200
LeafDrupal\views\Tests\UI\QueryTest1900
LeafDrupal\views\Tests\UI\RedirectTest2600
LeafDrupal\views\Tests\UI\RowUITest3000
LeafDrupal\views\Tests\UI\SettingsTest8800
LeafDrupal\views\Tests\UI\StorageTest2200
LeafDrupal\views\Tests\UI\StyleUITest3000
LeafDrupal\views\Tests\UI\TagTest1400
LeafDrupal\views\Tests\ViewElementTest1500
ExpandDrupal\views\Tests\ViewExecutableTest18500
MessageGroupFilenameLineFunctionStatus
'setDisplay() called with invalid display ID "invalid".'DebugViewExecutable.php675Drupal\views\ViewExecutable->setDisplay()
LeafDrupal\views\Tests\ViewRenderTest200
LeafDrupal\views\Tests\ViewsDataTest3400
LeafDrupal\views\Tests\ViewsHooksTest900
LeafDrupal\views\Tests\ViewStorageTest10500
LeafDrupal\views\Tests\Wizard\BasicTest9100
LeafDrupal\views\Tests\Wizard\ItemsPerPageTest3800
LeafDrupal\views\Tests\Wizard\MenuTest1900
LeafDrupal\views\Tests\Wizard\SortingTest3500
LeafDrupal\views\Tests\Wizard\TaggedWithTest7800
LeafDrupal\views\Tests\Wizard\WizardPluginBaseUnitTest1100
LeafDrupal\xmlrpc\Tests\XmlRpcBasicTest900
LeafDrupal\xmlrpc\Tests\XmlRpcMessagesTest700
LeafDrupal\xmlrpc\Tests\XmlRpcValidatorTest1000