731724-comment-decouple-335.patch

Test status
StatusResult
Last receivedMon, 02/18/2013 - 02:41:21
Last requestedMon, 02/18/2013 - 02:47:01
Last testedMon, 02/18/2013 - 04:12:55
Test count2
Environment status
MySQLfail
File information
File731724-comment-decouple-335.patch
BranchDrupal core - 8.x
LinkIssue Link
SummaryFAILED: [[SimpleTest]]: [MySQL] 50,452 pass(es), 15 fail(s), and 31 exception(s).
Details

MySQL

  1. Setup environment
  2. Detect an invalid patch URL
  3. Detect invalid repository information
  4. Detect invalid patch format
  5. Detect a non-applicable patch
  6. Detect invalid PHP syntax
  7. Detect a Drupal installation failure
  8. Detect a test run failure
  9. Detect a failing test
    Review the test failures below then if necessary run them locally until the problem has been fixed.
  10. Complete test suite with all tests passing
50,452 pass(es), 15 fail(s), and 31 exception(s)

Non-pass

Test namePassFailException
ExpandDrupal\file\Tests\FileFieldWidgetTest2921110
MessageGroupFilenameLineFunctionStatus
Failed to set field comment[und][0][comment] to 2OtherFileFieldWidgetTest.php274Drupal\file\Tests\FileFieldWidgetTest->testPrivateFileComment()
Found the requested form fields at node/add/articleOtherFileFieldWidgetTest.php274Drupal\file\Tests\FileFieldWidgetTest->testPrivateFileComment()
Failed to set field files[field_i17ab7u2_und_0] to /var/lib/drupaltestbot/sites/default/files/checkout/sites/default/files/simpletest/785447/text-0.txtOtherFileFieldWidgetTest.php283Drupal\file\Tests\FileFieldWidgetTest->testPrivateFileComment()
Failed to set field comment_body[und][0][value] to fGah4NuoOtherFileFieldWidgetTest.php283Drupal\file\Tests\FileFieldWidgetTest->testPrivateFileComment()
Found the Save buttonOtherFileFieldWidgetTest.php283Drupal\file\Tests\FileFieldWidgetTest->testPrivateFileComment()
Found the requested form fields at OtherFileFieldWidgetTest.php283Drupal\file\Tests\FileFieldWidgetTest->testPrivateFileComment()
Undefined offset: 1Drupal\file\Tests\FileFieldWidgetTest->testPrivateFileComment() Drupal\simpletest\TestBase->run() simpletest_script_run_one_test('245', 'Drupal\file\Tests\FileFieldWidgetTest') NoticeFileFieldWidgetTest.php287Drupal\file\Tests\FileFieldWidgetTest->testPrivateFileComment()
array_flip(): Can only flip STRING and INTEGER values!array_flip(Array) Drupal\Core\Entity\DatabaseStorageController->load(Array) entity_load_multiple('comment', Array, ) entity_load('comment', NULL) comment_load(NULL) Drupal\file\Tests\FileFieldWidgetTest->testPrivateFileComment() Drupal\simpletest\TestBase->run() simpletest_script_run_one_test('245', 'Drupal\file\Tests\FileFieldWidgetTest') WarningDatabaseStorageController.php182Drupal\Core\Entity\DatabaseStorageController->load()
Trying to get property of non-objectDrupal\file\Tests\FileFieldWidgetTest->testPrivateFileComment() Drupal\simpletest\TestBase->run() simpletest_script_run_one_test('245', 'Drupal\file\Tests\FileFieldWidgetTest') NoticeFileFieldWidgetTest.php293Drupal\file\Tests\FileFieldWidgetTest->testPrivateFileComment()
array_flip(): Can only flip STRING and INTEGER values!array_flip(Array) Drupal\Core\Entity\DatabaseStorageController->load(Array) entity_load_multiple('file', Array, ) file_load_multiple(Array, ) file_load(NULL) Drupal\file\Tests\FileFieldWidgetTest->testPrivateFileComment() Drupal\simpletest\TestBase->run() simpletest_script_run_one_test('245', 'Drupal\file\Tests\FileFieldWidgetTest') WarningDatabaseStorageController.php182Drupal\Core\Entity\DatabaseStorageController->load()
Trying to get property of non-objectDrupal\file\Tests\FileFieldTestBase->assertFileExists(, 'New file saved to disk on node creation.') Drupal\file\Tests\FileFieldWidgetTest->testPrivateFileComment() Drupal\simpletest\TestBase->run() simpletest_script_run_one_test('245', 'Drupal\file\Tests\FileFieldWidgetTest') NoticeFileFieldTestBase.php188Drupal\file\Tests\FileFieldTestBase->assertFileExists()
New file saved to disk on node creation.OtherFileFieldWidgetTest.php294Drupal\file\Tests\FileFieldWidgetTest->testPrivateFileComment()
Trying to get property of non-objectDrupal\file\Tests\FileFieldWidgetTest->testPrivateFileComment() Drupal\simpletest\TestBase->run() simpletest_script_run_one_test('245', 'Drupal\file\Tests\FileFieldWidgetTest') NoticeFileFieldWidgetTest.php296Drupal\file\Tests\FileFieldWidgetTest->testPrivateFileComment()
Trying to get property of non-objectDrupal\file\Tests\FileFieldWidgetTest->testPrivateFileComment() Drupal\simpletest\TestBase->run() simpletest_script_run_one_test('245', 'Drupal\file\Tests\FileFieldWidgetTest') NoticeFileFieldWidgetTest.php298Drupal\file\Tests\FileFieldWidgetTest->testPrivateFileComment()
Trying to get property of non-objectDrupal\file\Tests\FileFieldWidgetTest->testPrivateFileComment() Drupal\simpletest\TestBase->run() simpletest_script_run_one_test('245', 'Drupal\file\Tests\FileFieldWidgetTest') NoticeFileFieldWidgetTest.php303Drupal\file\Tests\FileFieldWidgetTest->testPrivateFileComment()
Confirmed that access is denied for the file without the needed permission.BrowserFileFieldWidgetTest.php304Drupal\file\Tests\FileFieldWidgetTest->testPrivateFileComment()
Trying to get property of non-objectDrupal\file\Tests\FileFieldWidgetTest->testPrivateFileComment() Drupal\simpletest\TestBase->run() simpletest_script_run_one_test('245', 'Drupal\file\Tests\FileFieldWidgetTest') NoticeFileFieldWidgetTest.php308Drupal\file\Tests\FileFieldWidgetTest->testPrivateFileComment()
Found the Save and unpublish buttonOtherFileFieldWidgetTest.php308Drupal\file\Tests\FileFieldWidgetTest->testPrivateFileComment()
Found the requested form fields at node//editOtherFileFieldWidgetTest.php308Drupal\file\Tests\FileFieldWidgetTest->testPrivateFileComment()
Trying to get property of non-objectDrupal\file\Tests\FileFieldWidgetTest->testPrivateFileComment() Drupal\simpletest\TestBase->run() simpletest_script_run_one_test('245', 'Drupal\file\Tests\FileFieldWidgetTest') NoticeFileFieldWidgetTest.php312Drupal\file\Tests\FileFieldWidgetTest->testPrivateFileComment()
Confirmed that access is denied for the file without the needed permission.BrowserFileFieldWidgetTest.php313Drupal\file\Tests\FileFieldWidgetTest->testPrivateFileComment()
ExpandDrupal\filter\Tests\FilterHtmlImageSecureTest1010
MessageGroupFilenameLineFunctionStatus
The test did not complete due to a fatal error.Completion checkFilterHtmlImageSecureTest.php77Drupal\filter\Tests\FilterHtmlImageSecureTest->testImageSource()
ExpandDrupal\node\Tests\NodeAccessPagerTest1901
MessageGroupFilenameLineFunctionStatus
Drupal\Core\Entity\EntityStorageException: SQLSTATE[23000]: Integrity constraint violation: 1048 Column 'comment_status' cannot be null: INSERT INTO {field_data_comment} (entity_type, entity_id, revision_id, bundle, delta, langcode, comment_status) VALUES (:db_insert_placeholder_0, :db_insert_placeholder_1, :db_insert_placeholder_2, :db_insert_placeholder_3, :db_insert_placeholder_4, :db_insert_placeholder_5, :db_insert_placeholder_6); Array ( [:db_insert_placeholder_0] => node [:db_insert_placeholder_1] => 1 [:db_insert_placeholder_2] => 1 [:db_insert_placeholder_3] => page [:db_insert_placeholder_4] => 0 [:db_insert_placeholder_5] => und [:db_insert_placeholder_6] => ) in Drupal\Core\Entity\DatabaseStorageController->save() (line 557 of /var/lib/drupaltestbot/sites/default/files/checkout/core/lib/Drupal/Core/Entity/DatabaseStorageController.php). Drupal\Core\Entity\DatabaseStorageController->save(Object) Drupal\Core\Entity\Entity->save() Drupal\simpletest\WebTestBase->drupalCreateNode(Array) Drupal\node\Tests\NodeAccessPagerTest->testCommentPager() Drupal\simpletest\TestBase->run() simpletest_script_run_one_test('399', 'Drupal\node\Tests\NodeAccessPagerTest') Uncaught exceptionDatabaseStorageController.php557Drupal\Core\Entity\DatabaseStorageController->save()
ExpandDrupal\node\Tests\NodeTitleTest1101
MessageGroupFilenameLineFunctionStatus
Drupal\Core\Entity\EntityStorageException: SQLSTATE[23000]: Integrity constraint violation: 1048 Column 'comment_status' cannot be null: INSERT INTO {field_data_comment} (entity_type, entity_id, revision_id, bundle, delta, langcode, comment_status) VALUES (:db_insert_placeholder_0, :db_insert_placeholder_1, :db_insert_placeholder_2, :db_insert_placeholder_3, :db_insert_placeholder_4, :db_insert_placeholder_5, :db_insert_placeholder_6); Array ( [:db_insert_placeholder_0] => node [:db_insert_placeholder_1] => 1 [:db_insert_placeholder_2] => 1 [:db_insert_placeholder_3] => page [:db_insert_placeholder_4] => 0 [:db_insert_placeholder_5] => und [:db_insert_placeholder_6] => ) in Drupal\Core\Entity\DatabaseStorageController->save() (line 557 of /var/lib/drupaltestbot/sites/default/files/checkout/core/lib/Drupal/Core/Entity/DatabaseStorageController.php). Drupal\Core\Entity\DatabaseStorageController->save(Object) Drupal\Core\Entity\Entity->save() Drupal\simpletest\WebTestBase->drupalCreateNode(Array) Drupal\node\Tests\NodeTitleTest->testNodeTitle() Drupal\simpletest\TestBase->run() simpletest_script_run_one_test('421', 'Drupal\node\Tests\NodeTitleTest') Uncaught exceptionDatabaseStorageController.php557Drupal\Core\Entity\DatabaseStorageController->save()
ExpandDrupal\rdf\Tests\CommentAttributesTest1810
MessageGroupFilenameLineFunctionStatus
The test did not complete due to a fatal error.Completion checkCommentAttributesTest.php64Drupal\rdf\Tests\CommentAttributesTest->testNumberOfCommentsRdfaMarkup()
ExpandDrupal\rdf\Tests\TrackerAttributesTest201
MessageGroupFilenameLineFunctionStatus
Drupal\Core\Entity\EntityStorageException: SQLSTATE[23000]: Integrity constraint violation: 1048 Column 'comment_status' cannot be null: INSERT INTO {field_data_comment} (entity_type, entity_id, revision_id, bundle, delta, langcode, comment_status) VALUES (:db_insert_placeholder_0, :db_insert_placeholder_1, :db_insert_placeholder_2, :db_insert_placeholder_3, :db_insert_placeholder_4, :db_insert_placeholder_5, :db_insert_placeholder_6); Array ( [:db_insert_placeholder_0] => node [:db_insert_placeholder_1] => 1 [:db_insert_placeholder_2] => 1 [:db_insert_placeholder_3] => article [:db_insert_placeholder_4] => 0 [:db_insert_placeholder_5] => und [:db_insert_placeholder_6] => ) in Drupal\Core\Entity\DatabaseStorageController->save() (line 557 of /var/lib/drupaltestbot/sites/default/files/checkout/core/lib/Drupal/Core/Entity/DatabaseStorageController.php). Drupal\Core\Entity\DatabaseStorageController->save(Object) Drupal\Core\Entity\Entity->save() Drupal\simpletest\WebTestBase->drupalCreateNode(Array) Drupal\rdf\Tests\TrackerAttributesTest->testAttributesInTracker() Drupal\simpletest\TestBase->run() simpletest_script_run_one_test('474', 'Drupal\rdf\Tests\TrackerAttributesTest') Uncaught exceptionDatabaseStorageController.php557Drupal\Core\Entity\DatabaseStorageController->save()
ExpandDrupal\search\Tests\SearchCommentCountToggleTest410
MessageGroupFilenameLineFunctionStatus
The test did not complete due to a fatal error.Completion checkSearchCommentCountToggleTest.php86Drupal\search\Tests\SearchCommentCountToggleTest->testSearchCommentCountToggle()
ExpandDrupal\search\Tests\SearchCommentTest4803
MessageGroupFilenameLineFunctionStatus
Drupal\Core\Entity\EntityStorageException: SQLSTATE[23000]: Integrity constraint violation: 1048 Column 'comment_status' cannot be null: INSERT INTO {field_data_comment} (entity_type, entity_id, revision_id, bundle, delta, langcode, comment_status) VALUES (:db_insert_placeholder_0, :db_insert_placeholder_1, :db_insert_placeholder_2, :db_insert_placeholder_3, :db_insert_placeholder_4, :db_insert_placeholder_5, :db_insert_placeholder_6); Array ( [:db_insert_placeholder_0] => node [:db_insert_placeholder_1] => 1 [:db_insert_placeholder_2] => 1 [:db_insert_placeholder_3] => article [:db_insert_placeholder_4] => 0 [:db_insert_placeholder_5] => und [:db_insert_placeholder_6] => ) in Drupal\Core\Entity\DatabaseStorageController->save() (line 557 of /var/lib/drupaltestbot/sites/default/files/checkout/core/lib/Drupal/Core/Entity/DatabaseStorageController.php). Drupal\Core\Entity\DatabaseStorageController->save(Object) Drupal\Core\Entity\Entity->save() Drupal\simpletest\WebTestBase->drupalCreateNode(Array) Drupal\search\Tests\SearchCommentTest->testSearchResultsComment() Drupal\simpletest\TestBase->run() simpletest_script_run_one_test('492', 'Drupal\search\Tests\SearchCommentTest') Uncaught exceptionDatabaseStorageController.php557Drupal\Core\Entity\DatabaseStorageController->save()
Drupal\Core\Entity\EntityStorageException: SQLSTATE[23000]: Integrity constraint violation: 1048 Column 'comment_status' cannot be null: INSERT INTO {field_data_comment} (entity_type, entity_id, revision_id, bundle, delta, langcode, comment_status) VALUES (:db_insert_placeholder_0, :db_insert_placeholder_1, :db_insert_placeholder_2, :db_insert_placeholder_3, :db_insert_placeholder_4, :db_insert_placeholder_5, :db_insert_placeholder_6); Array ( [:db_insert_placeholder_0] => node [:db_insert_placeholder_1] => 1 [:db_insert_placeholder_2] => 1 [:db_insert_placeholder_3] => article [:db_insert_placeholder_4] => 0 [:db_insert_placeholder_5] => und [:db_insert_placeholder_6] => ) in Drupal\Core\Entity\DatabaseStorageController->save() (line 557 of /var/lib/drupaltestbot/sites/default/files/checkout/core/lib/Drupal/Core/Entity/DatabaseStorageController.php). Drupal\Core\Entity\DatabaseStorageController->save(Object) Drupal\Core\Entity\Entity->save() Drupal\simpletest\WebTestBase->drupalCreateNode(Array) Drupal\search\Tests\SearchCommentTest->testSearchResultsCommentAccess() Drupal\simpletest\TestBase->run() simpletest_script_run_one_test('492', 'Drupal\search\Tests\SearchCommentTest') Uncaught exceptionDatabaseStorageController.php557Drupal\Core\Entity\DatabaseStorageController->save()
Drupal\Core\Entity\EntityStorageException: SQLSTATE[23000]: Integrity constraint violation: 1048 Column 'comment_status' cannot be null: INSERT INTO {field_data_comment} (entity_type, entity_id, revision_id, bundle, delta, langcode, comment_status) VALUES (:db_insert_placeholder_0, :db_insert_placeholder_1, :db_insert_placeholder_2, :db_insert_placeholder_3, :db_insert_placeholder_4, :db_insert_placeholder_5, :db_insert_placeholder_6); Array ( [:db_insert_placeholder_0] => node [:db_insert_placeholder_1] => 1 [:db_insert_placeholder_2] => 1 [:db_insert_placeholder_3] => article [:db_insert_placeholder_4] => 0 [:db_insert_placeholder_5] => und [:db_insert_placeholder_6] => ) in Drupal\Core\Entity\DatabaseStorageController->save() (line 557 of /var/lib/drupaltestbot/sites/default/files/checkout/core/lib/Drupal/Core/Entity/DatabaseStorageController.php). Drupal\Core\Entity\DatabaseStorageController->save(Object) Drupal\Core\Entity\Entity->save() Drupal\simpletest\WebTestBase->drupalCreateNode(Array) Drupal\search\Tests\SearchCommentTest->testAddNewComment() Drupal\simpletest\TestBase->run() simpletest_script_run_one_test('492', 'Drupal\search\Tests\SearchCommentTest') Uncaught exceptionDatabaseStorageController.php557Drupal\Core\Entity\DatabaseStorageController->save()
ExpandDrupal\search\Tests\SearchRankingTest4701
MessageGroupFilenameLineFunctionStatus
Drupal\Core\Entity\EntityStorageException: SQLSTATE[23000]: Integrity constraint violation: 1048 Column 'comment_status' cannot be null: INSERT INTO {field_data_comment} (entity_type, entity_id, revision_id, bundle, delta, langcode, comment_status) VALUES (:db_insert_placeholder_0, :db_insert_placeholder_1, :db_insert_placeholder_2, :db_insert_placeholder_3, :db_insert_placeholder_4, :db_insert_placeholder_5, :db_insert_placeholder_6); Array ( [:db_insert_placeholder_0] => node [:db_insert_placeholder_1] => 1 [:db_insert_placeholder_2] => 1 [:db_insert_placeholder_3] => page [:db_insert_placeholder_4] => 0 [:db_insert_placeholder_5] => und [:db_insert_placeholder_6] => ) in Drupal\Core\Entity\DatabaseStorageController->save() (line 557 of /var/lib/drupaltestbot/sites/default/files/checkout/core/lib/Drupal/Core/Entity/DatabaseStorageController.php). Drupal\Core\Entity\DatabaseStorageController->save(Object) Drupal\Core\Entity\Entity->save() Drupal\simpletest\WebTestBase->drupalCreateNode(Array) Drupal\search\Tests\SearchRankingTest->testRankings() Drupal\simpletest\TestBase->run() simpletest_script_run_one_test('508', 'Drupal\search\Tests\SearchRankingTest') Uncaught exceptionDatabaseStorageController.php557Drupal\Core\Entity\DatabaseStorageController->save()
ExpandDrupal\system\Tests\Entity\EntityCrudHookTest13601
MessageGroupFilenameLineFunctionStatus
Drupal\Core\Entity\EntityStorageException: SQLSTATE[23000]: Integrity constraint violation: 1048 Column 'comment_status' cannot be null: INSERT INTO {field_data_comment} (entity_type, entity_id, revision_id, bundle, delta, langcode, comment_status) VALUES (:db_insert_placeholder_0, :db_insert_placeholder_1, :db_insert_placeholder_2, :db_insert_placeholder_3, :db_insert_placeholder_4, :db_insert_placeholder_5, :db_insert_placeholder_6); Array ( [:db_insert_placeholder_0] => node [:db_insert_placeholder_1] => 1 [:db_insert_placeholder_2] => 1 [:db_insert_placeholder_3] => article [:db_insert_placeholder_4] => 0 [:db_insert_placeholder_5] => und [:db_insert_placeholder_6] => ) in Drupal\Core\Entity\DatabaseStorageController->save() (line 557 of /var/lib/drupaltestbot/sites/default/files/checkout/core/lib/Drupal/Core/Entity/DatabaseStorageController.php). Drupal\Core\Entity\DatabaseStorageController->save(Object) Drupal\Core\Entity\Entity->save() Drupal\system\Tests\Entity\EntityCrudHookTest->testCommentHooks() Drupal\simpletest\TestBase->run() simpletest_script_run_one_test('186', 'Drupal\system\Tests\Entity\EntityCrudHookTest') Uncaught exceptionDatabaseStorageController.php557Drupal\Core\Entity\DatabaseStorageController->save()
ExpandDrupal\tracker\Tests\TrackerTest10705
MessageGroupFilenameLineFunctionStatus
Drupal\Core\Entity\EntityStorageException: SQLSTATE[23000]: Integrity constraint violation: 1048 Column 'comment_status' cannot be null: INSERT INTO {field_data_comment} (entity_type, entity_id, revision_id, bundle, delta, langcode, comment_status) VALUES (:db_insert_placeholder_0, :db_insert_placeholder_1, :db_insert_placeholder_2, :db_insert_placeholder_3, :db_insert_placeholder_4, :db_insert_placeholder_5, :db_insert_placeholder_6); Array ( [:db_insert_placeholder_0] => node [:db_insert_placeholder_1] => 1 [:db_insert_placeholder_2] => 1 [:db_insert_placeholder_3] => page [:db_insert_placeholder_4] => 0 [:db_insert_placeholder_5] => und [:db_insert_placeholder_6] => ) in Drupal\Core\Entity\DatabaseStorageController->save() (line 557 of /var/lib/drupaltestbot/sites/default/files/checkout/core/lib/Drupal/Core/Entity/DatabaseStorageController.php). Drupal\Core\Entity\DatabaseStorageController->save(Object) Drupal\Core\Entity\Entity->save() Drupal\simpletest\WebTestBase->drupalCreateNode(Array) Drupal\tracker\Tests\TrackerTest->testTrackerAll() Drupal\simpletest\TestBase->run() simpletest_script_run_one_test('599', 'Drupal\tracker\Tests\TrackerTest') Uncaught exceptionDatabaseStorageController.php557Drupal\Core\Entity\DatabaseStorageController->save()
Drupal\Core\Entity\EntityStorageException: SQLSTATE[23000]: Integrity constraint violation: 1048 Column 'comment_status' cannot be null: INSERT INTO {field_data_comment} (entity_type, entity_id, revision_id, bundle, delta, langcode, comment_status) VALUES (:db_insert_placeholder_0, :db_insert_placeholder_1, :db_insert_placeholder_2, :db_insert_placeholder_3, :db_insert_placeholder_4, :db_insert_placeholder_5, :db_insert_placeholder_6); Array ( [:db_insert_placeholder_0] => node [:db_insert_placeholder_1] => 1 [:db_insert_placeholder_2] => 1 [:db_insert_placeholder_3] => page [:db_insert_placeholder_4] => 0 [:db_insert_placeholder_5] => und [:db_insert_placeholder_6] => ) in Drupal\Core\Entity\DatabaseStorageController->save() (line 557 of /var/lib/drupaltestbot/sites/default/files/checkout/core/lib/Drupal/Core/Entity/DatabaseStorageController.php). Drupal\Core\Entity\DatabaseStorageController->save(Object) Drupal\Core\Entity\Entity->save() Drupal\simpletest\WebTestBase->drupalCreateNode(Array) Drupal\tracker\Tests\TrackerTest->testTrackerUser() Drupal\simpletest\TestBase->run() simpletest_script_run_one_test('599', 'Drupal\tracker\Tests\TrackerTest') Uncaught exceptionDatabaseStorageController.php557Drupal\Core\Entity\DatabaseStorageController->save()
Drupal\Core\Entity\EntityStorageException: SQLSTATE[23000]: Integrity constraint violation: 1048 Column 'comment_status' cannot be null: INSERT INTO {field_data_comment} (entity_type, entity_id, revision_id, bundle, delta, langcode, comment_status) VALUES (:db_insert_placeholder_0, :db_insert_placeholder_1, :db_insert_placeholder_2, :db_insert_placeholder_3, :db_insert_placeholder_4, :db_insert_placeholder_5, :db_insert_placeholder_6); Array ( [:db_insert_placeholder_0] => node [:db_insert_placeholder_1] => 1 [:db_insert_placeholder_2] => 1 [:db_insert_placeholder_3] => page [:db_insert_placeholder_4] => 0 [:db_insert_placeholder_5] => und [:db_insert_placeholder_6] => ) in Drupal\Core\Entity\DatabaseStorageController->save() (line 557 of /var/lib/drupaltestbot/sites/default/files/checkout/core/lib/Drupal/Core/Entity/DatabaseStorageController.php). Drupal\Core\Entity\DatabaseStorageController->save(Object) Drupal\Core\Entity\Entity->save() Drupal\simpletest\WebTestBase->drupalCreateNode(Array) Drupal\tracker\Tests\TrackerTest->testTrackerNewComments() Drupal\simpletest\TestBase->run() simpletest_script_run_one_test('599', 'Drupal\tracker\Tests\TrackerTest') Uncaught exceptionDatabaseStorageController.php557Drupal\Core\Entity\DatabaseStorageController->save()
Drupal\Core\Entity\EntityStorageException: SQLSTATE[23000]: Integrity constraint violation: 1048 Column 'comment_status' cannot be null: INSERT INTO {field_data_comment} (entity_type, entity_id, revision_id, bundle, delta, langcode, comment_status) VALUES (:db_insert_placeholder_0, :db_insert_placeholder_1, :db_insert_placeholder_2, :db_insert_placeholder_3, :db_insert_placeholder_4, :db_insert_placeholder_5, :db_insert_placeholder_6); Array ( [:db_insert_placeholder_0] => node [:db_insert_placeholder_1] => 1 [:db_insert_placeholder_2] => 1 [:db_insert_placeholder_3] => page [:db_insert_placeholder_4] => 0 [:db_insert_placeholder_5] => und [:db_insert_placeholder_6] => ) in Drupal\Core\Entity\DatabaseStorageController->save() (line 557 of /var/lib/drupaltestbot/sites/default/files/checkout/core/lib/Drupal/Core/Entity/DatabaseStorageController.php). Drupal\Core\Entity\DatabaseStorageController->save(Object) Drupal\Core\Entity\Entity->save() Drupal\simpletest\WebTestBase->drupalCreateNode(Array) Drupal\tracker\Tests\TrackerTest->testTrackerCronIndexing() Drupal\simpletest\TestBase->run() simpletest_script_run_one_test('599', 'Drupal\tracker\Tests\TrackerTest') Uncaught exceptionDatabaseStorageController.php557Drupal\Core\Entity\DatabaseStorageController->save()
Drupal\Core\Entity\EntityStorageException: SQLSTATE[23000]: Integrity constraint violation: 1048 Column 'comment_status' cannot be null: INSERT INTO {field_data_comment} (entity_type, entity_id, revision_id, bundle, delta, langcode, comment_status) VALUES (:db_insert_placeholder_0, :db_insert_placeholder_1, :db_insert_placeholder_2, :db_insert_placeholder_3, :db_insert_placeholder_4, :db_insert_placeholder_5, :db_insert_placeholder_6); Array ( [:db_insert_placeholder_0] => node [:db_insert_placeholder_1] => 1 [:db_insert_placeholder_2] => 1 [:db_insert_placeholder_3] => page [:db_insert_placeholder_4] => 0 [:db_insert_placeholder_5] => und [:db_insert_placeholder_6] => ) in Drupal\Core\Entity\DatabaseStorageController->save() (line 557 of /var/lib/drupaltestbot/sites/default/files/checkout/core/lib/Drupal/Core/Entity/DatabaseStorageController.php). Drupal\Core\Entity\DatabaseStorageController->save(Object) Drupal\Core\Entity\Entity->save() Drupal\simpletest\WebTestBase->drupalCreateNode(Array) Drupal\tracker\Tests\TrackerTest->testTrackerAdminUnpublish() Drupal\simpletest\TestBase->run() simpletest_script_run_one_test('599', 'Drupal\tracker\Tests\TrackerTest') Uncaught exceptionDatabaseStorageController.php557Drupal\Core\Entity\DatabaseStorageController->save()
ExpandDrupal\user\Tests\UserCancelTest17205
MessageGroupFilenameLineFunctionStatus
Drupal\Core\Entity\EntityStorageException: SQLSTATE[23000]: Integrity constraint violation: 1048 Column 'comment_status' cannot be null: INSERT INTO {field_data_comment} (entity_type, entity_id, revision_id, bundle, delta, langcode, comment_status) VALUES (:db_insert_placeholder_0, :db_insert_placeholder_1, :db_insert_placeholder_2, :db_insert_placeholder_3, :db_insert_placeholder_4, :db_insert_placeholder_5, :db_insert_placeholder_6); Array ( [:db_insert_placeholder_0] => node [:db_insert_placeholder_1] => 1 [:db_insert_placeholder_2] => 1 [:db_insert_placeholder_3] => page [:db_insert_placeholder_4] => 0 [:db_insert_placeholder_5] => und [:db_insert_placeholder_6] => ) in Drupal\Core\Entity\DatabaseStorageController->save() (line 557 of /var/lib/drupaltestbot/sites/default/files/checkout/core/lib/Drupal/Core/Entity/DatabaseStorageController.php). Drupal\Core\Entity\DatabaseStorageController->save(Object) Drupal\Core\Entity\Entity->save() Drupal\simpletest\WebTestBase->drupalCreateNode(Array) Drupal\user\Tests\UserCancelTest->testUserCancelWithoutPermission() Drupal\simpletest\TestBase->run() simpletest_script_run_one_test('635', 'Drupal\user\Tests\UserCancelTest') Uncaught exceptionDatabaseStorageController.php557Drupal\Core\Entity\DatabaseStorageController->save()
Drupal\Core\Entity\EntityStorageException: SQLSTATE[23000]: Integrity constraint violation: 1048 Column 'comment_status' cannot be null: INSERT INTO {field_data_comment} (entity_type, entity_id, revision_id, bundle, delta, langcode, comment_status) VALUES (:db_insert_placeholder_0, :db_insert_placeholder_1, :db_insert_placeholder_2, :db_insert_placeholder_3, :db_insert_placeholder_4, :db_insert_placeholder_5, :db_insert_placeholder_6); Array ( [:db_insert_placeholder_0] => node [:db_insert_placeholder_1] => 1 [:db_insert_placeholder_2] => 1 [:db_insert_placeholder_3] => page [:db_insert_placeholder_4] => 0 [:db_insert_placeholder_5] => und [:db_insert_placeholder_6] => ) in Drupal\Core\Entity\DatabaseStorageController->save() (line 557 of /var/lib/drupaltestbot/sites/default/files/checkout/core/lib/Drupal/Core/Entity/DatabaseStorageController.php). Drupal\Core\Entity\DatabaseStorageController->save(Object) Drupal\Core\Entity\Entity->save() Drupal\simpletest\WebTestBase->drupalCreateNode(Array) Drupal\user\Tests\UserCancelTest->testUserCancelInvalid() Drupal\simpletest\TestBase->run() simpletest_script_run_one_test('635', 'Drupal\user\Tests\UserCancelTest') Uncaught exceptionDatabaseStorageController.php557Drupal\Core\Entity\DatabaseStorageController->save()
Drupal\Core\Entity\EntityStorageException: SQLSTATE[23000]: Integrity constraint violation: 1048 Column 'comment_status' cannot be null: INSERT INTO {field_data_comment} (entity_type, entity_id, revision_id, bundle, delta, langcode, comment_status) VALUES (:db_insert_placeholder_0, :db_insert_placeholder_1, :db_insert_placeholder_2, :db_insert_placeholder_3, :db_insert_placeholder_4, :db_insert_placeholder_5, :db_insert_placeholder_6); Array ( [:db_insert_placeholder_0] => node [:db_insert_placeholder_1] => 1 [:db_insert_placeholder_2] => 1 [:db_insert_placeholder_3] => page [:db_insert_placeholder_4] => 0 [:db_insert_placeholder_5] => und [:db_insert_placeholder_6] => ) in Drupal\Core\Entity\DatabaseStorageController->save() (line 557 of /var/lib/drupaltestbot/sites/default/files/checkout/core/lib/Drupal/Core/Entity/DatabaseStorageController.php). Drupal\Core\Entity\DatabaseStorageController->save(Object) Drupal\Core\Entity\Entity->save() Drupal\simpletest\WebTestBase->drupalCreateNode(Array) Drupal\user\Tests\UserCancelTest->testUserBlockUnpublish() Drupal\simpletest\TestBase->run() simpletest_script_run_one_test('635', 'Drupal\user\Tests\UserCancelTest') Uncaught exceptionDatabaseStorageController.php557Drupal\Core\Entity\DatabaseStorageController->save()
Drupal\Core\Entity\EntityStorageException: SQLSTATE[23000]: Integrity constraint violation: 1048 Column 'comment_status' cannot be null: INSERT INTO {field_data_comment} (entity_type, entity_id, revision_id, bundle, delta, langcode, comment_status) VALUES (:db_insert_placeholder_0, :db_insert_placeholder_1, :db_insert_placeholder_2, :db_insert_placeholder_3, :db_insert_placeholder_4, :db_insert_placeholder_5, :db_insert_placeholder_6); Array ( [:db_insert_placeholder_0] => node [:db_insert_placeholder_1] => 1 [:db_insert_placeholder_2] => 1 [:db_insert_placeholder_3] => page [:db_insert_placeholder_4] => 0 [:db_insert_placeholder_5] => und [:db_insert_placeholder_6] => ) in Drupal\Core\Entity\DatabaseStorageController->save() (line 557 of /var/lib/drupaltestbot/sites/default/files/checkout/core/lib/Drupal/Core/Entity/DatabaseStorageController.php). Drupal\Core\Entity\DatabaseStorageController->save(Object) Drupal\Core\Entity\Entity->save() Drupal\simpletest\WebTestBase->drupalCreateNode(Array) Drupal\user\Tests\UserCancelTest->testUserAnonymize() Drupal\simpletest\TestBase->run() simpletest_script_run_one_test('635', 'Drupal\user\Tests\UserCancelTest') Uncaught exceptionDatabaseStorageController.php557Drupal\Core\Entity\DatabaseStorageController->save()
Drupal\Core\Entity\EntityStorageException: SQLSTATE[23000]: Integrity constraint violation: 1048 Column 'comment_status' cannot be null: INSERT INTO {field_data_comment} (entity_type, entity_id, revision_id, bundle, delta, langcode, comment_status) VALUES (:db_insert_placeholder_0, :db_insert_placeholder_1, :db_insert_placeholder_2, :db_insert_placeholder_3, :db_insert_placeholder_4, :db_insert_placeholder_5, :db_insert_placeholder_6); Array ( [:db_insert_placeholder_0] => node [:db_insert_placeholder_1] => 1 [:db_insert_placeholder_2] => 1 [:db_insert_placeholder_3] => page [:db_insert_placeholder_4] => 0 [:db_insert_placeholder_5] => und [:db_insert_placeholder_6] => ) in Drupal\Core\Entity\DatabaseStorageController->save() (line 557 of /var/lib/drupaltestbot/sites/default/files/checkout/core/lib/Drupal/Core/Entity/DatabaseStorageController.php). Drupal\Core\Entity\DatabaseStorageController->save(Object) Drupal\Core\Entity\Entity->save() Drupal\simpletest\WebTestBase->drupalCreateNode(Array) Drupal\user\Tests\UserCancelTest->testUserDelete() Drupal\simpletest\TestBase->run() simpletest_script_run_one_test('635', 'Drupal\user\Tests\UserCancelTest') Uncaught exceptionDatabaseStorageController.php557Drupal\Core\Entity\DatabaseStorageController->save()
ExpandDrupal\user\Tests\UserPictureTest3901
MessageGroupFilenameLineFunctionStatus
Drupal\Core\Entity\EntityStorageException: SQLSTATE[23000]: Integrity constraint violation: 1048 Column 'comment_status' cannot be null: INSERT INTO {field_data_comment} (entity_type, entity_id, revision_id, bundle, delta, langcode, comment_status) VALUES (:db_insert_placeholder_0, :db_insert_placeholder_1, :db_insert_placeholder_2, :db_insert_placeholder_3, :db_insert_placeholder_4, :db_insert_placeholder_5, :db_insert_placeholder_6); Array ( [:db_insert_placeholder_0] => node [:db_insert_placeholder_1] => 1 [:db_insert_placeholder_2] => 1 [:db_insert_placeholder_3] => article [:db_insert_placeholder_4] => 0 [:db_insert_placeholder_5] => und [:db_insert_placeholder_6] => ) in Drupal\Core\Entity\DatabaseStorageController->save() (line 557 of /var/lib/drupaltestbot/sites/default/files/checkout/core/lib/Drupal/Core/Entity/DatabaseStorageController.php). Drupal\Core\Entity\DatabaseStorageController->save(Object) Drupal\Core\Entity\Entity->save() Drupal\simpletest\WebTestBase->drupalCreateNode(Array) Drupal\user\Tests\UserPictureTest->testPictureOnNodeComment() Drupal\simpletest\TestBase->run() simpletest_script_run_one_test('646', 'Drupal\user\Tests\UserPictureTest') Uncaught exceptionDatabaseStorageController.php557Drupal\Core\Entity\DatabaseStorageController->save()
ExpandDrupal\user\Tests\UserSignatureTest801
MessageGroupFilenameLineFunctionStatus
Drupal\Core\Entity\EntityStorageException: SQLSTATE[23000]: Integrity constraint violation: 1048 Column 'comment_status' cannot be null: INSERT INTO {field_data_comment} (entity_type, entity_id, revision_id, bundle, delta, langcode, comment_status) VALUES (:db_insert_placeholder_0, :db_insert_placeholder_1, :db_insert_placeholder_2, :db_insert_placeholder_3, :db_insert_placeholder_4, :db_insert_placeholder_5, :db_insert_placeholder_6); Array ( [:db_insert_placeholder_0] => node [:db_insert_placeholder_1] => 1 [:db_insert_placeholder_2] => 1 [:db_insert_placeholder_3] => page [:db_insert_placeholder_4] => 0 [:db_insert_placeholder_5] => und [:db_insert_placeholder_6] => ) in Drupal\Core\Entity\DatabaseStorageController->save() (line 557 of /var/lib/drupaltestbot/sites/default/files/checkout/core/lib/Drupal/Core/Entity/DatabaseStorageController.php). Drupal\Core\Entity\DatabaseStorageController->save(Object) Drupal\Core\Entity\Entity->save() Drupal\simpletest\WebTestBase->drupalCreateNode(Array) Drupal\user\Tests\UserSignatureTest->testUserSignature() Drupal\simpletest\TestBase->run() simpletest_script_run_one_test('652', 'Drupal\user\Tests\UserSignatureTest') Uncaught exceptionDatabaseStorageController.php557Drupal\Core\Entity\DatabaseStorageController->save()
ExpandDrupal\views\Tests\DefaultViewsTest210
MessageGroupFilenameLineFunctionStatus
The test did not complete due to a fatal error.Completion checkDefaultViewsTest.php124Drupal\views\Tests\DefaultViewsTest->testDefaultViews()
ExpandDrupal\views\Tests\Entity\FieldEntityTest101
MessageGroupFilenameLineFunctionStatus
Drupal\Core\Entity\EntityStorageException: SQLSTATE[23000]: Integrity constraint violation: 1048 Column 'comment_status' cannot be null: INSERT INTO {field_data_comment} (entity_type, entity_id, revision_id, bundle, delta, langcode, comment_status) VALUES (:db_insert_placeholder_0, :db_insert_placeholder_1, :db_insert_placeholder_2, :db_insert_placeholder_3, :db_insert_placeholder_4, :db_insert_placeholder_5, :db_insert_placeholder_6); Array ( [:db_insert_placeholder_0] => node [:db_insert_placeholder_1] => 1 [:db_insert_placeholder_2] => 1 [:db_insert_placeholder_3] => page [:db_insert_placeholder_4] => 0 [:db_insert_placeholder_5] => und [:db_insert_placeholder_6] => ) in Drupal\Core\Entity\DatabaseStorageController->save() (line 557 of /var/lib/drupaltestbot/sites/default/files/checkout/core/lib/Drupal/Core/Entity/DatabaseStorageController.php). Drupal\Core\Entity\DatabaseStorageController->save(Object) Drupal\Core\Entity\Entity->save() Drupal\views\Tests\Entity\FieldEntityTest->testGetEntity() Drupal\simpletest\TestBase->run() simpletest_script_run_one_test('732', 'Drupal\views\Tests\Entity\FieldEntityTest') Uncaught exceptionDatabaseStorageController.php557Drupal\Core\Entity\DatabaseStorageController->save()

All

Test namePassFailException
LeafDrupal\action\Tests\BulkFormTest3300
LeafDrupal\action\Tests\ConfigurationTest3900
LeafDrupal\action\Tests\LoopTest2100
LeafDrupal\aggregator\Tests\AddFeedTest7300
LeafDrupal\aggregator\Tests\AggregatorConfigurationTest2000
LeafDrupal\aggregator\Tests\AggregatorCronTest5500
LeafDrupal\aggregator\Tests\AggregatorRenderingTest22000
LeafDrupal\aggregator\Tests\CategorizeFeedItemTest6100
LeafDrupal\aggregator\Tests\CategorizeFeedTest2100
LeafDrupal\aggregator\Tests\FeedLanguageTest5700
LeafDrupal\aggregator\Tests\FeedParserTest7200
LeafDrupal\aggregator\Tests\ImportOpmlTest6800
LeafDrupal\aggregator\Tests\RemoveFeedItemTest27000
LeafDrupal\aggregator\Tests\RemoveFeedTest2500
LeafDrupal\aggregator\Tests\UpdateFeedItemTest6500
LeafDrupal\aggregator\Tests\UpdateFeedTest7600
LeafDrupal\ban\Tests\IpAddressBlockingTest4300
LeafDrupal\block\Tests\BlockAdminThemeTest1900
LeafDrupal\block\Tests\BlockCacheTest18500
LeafDrupal\block\Tests\BlockHiddenRegionTest1800
LeafDrupal\block\Tests\BlockHtmlIdTest1000
LeafDrupal\block\Tests\BlockInvalidRegionTest2400
LeafDrupal\block\Tests\BlockLanguageCacheTest8200
LeafDrupal\block\Tests\BlockLanguageTest5100
LeafDrupal\block\Tests\BlockLibrarySearchTest1900
LeafDrupal\block\Tests\BlockStorageUnitTest1800
LeafDrupal\block\Tests\BlockTemplateSuggestionsUnitTest300
LeafDrupal\block\Tests\BlockTest33000
LeafDrupal\block\Tests\BlockTitleXSSTest1500
LeafDrupal\block\Tests\BlockUiTest900
LeafDrupal\block\Tests\NewDefaultThemeBlocksTest1700
LeafDrupal\block\Tests\NonDefaultBlockAdminTest1200
LeafDrupal\block\Tests\Views\DisplayBlockTest3500
LeafDrupal\book\Tests\BookTest50300
LeafDrupal\breakpoint\Tests\BreakpointAPITest600
LeafDrupal\breakpoint\Tests\BreakpointCRUDTest2100
LeafDrupal\breakpoint\Tests\BreakpointGroupAPITest400
LeafDrupal\breakpoint\Tests\BreakpointGroupCRUDTest1200
LeafDrupal\breakpoint\Tests\BreakpointMediaQueryTest6300
LeafDrupal\breakpoint\Tests\BreakpointThemeTest2300
LeafDrupal\ckeditor\Tests\CKEditorAdminTest5500
LeafDrupal\ckeditor\Tests\CKEditorLoadingTest5100
LeafDrupal\ckeditor\Tests\CKEditorPluginManagerTest1200
LeafDrupal\ckeditor\Tests\CKEditorTest1700
LeafDrupal\color\Tests\ColorTest8700
LeafDrupal\comment\Tests\CommentActionsTest5500
LeafDrupal\comment\Tests\CommentAnonymousTest16300
LeafDrupal\comment\Tests\CommentApprovalTest15200
LeafDrupal\comment\Tests\CommentBlockTest9300
LeafDrupal\comment\Tests\CommentContentRebuildTest3300
LeafDrupal\comment\Tests\CommentCSSTest50100
LeafDrupal\comment\Tests\CommentFieldsTest6000
LeafDrupal\comment\Tests\CommentInterfaceTest26100
LeafDrupal\comment\Tests\CommentLanguageTest7300
ExpandDrupal\comment\Tests\CommentLinksTest122100
MessageGroupFilenameLineFunctionStatus
Changed environment:array ( 'authenticated' => false, 'comment count' => false, 'form' => 'below', 'user_register' => 'visitors', 'contact' => 'optional', 'comments' => 'open', 'access comments' => 0, 'post comments' => 0, 'skip comment approval' => 1, 'edit own comments' => 0, )DebugCommentLinksTest.php195Drupal\comment\Tests\CommentLinksTest->setEnvironment()
Changed environment:array ( 'authenticated' => true, 'comment count' => false, 'form' => 'below', 'user_register' => 'visitors', 'contact' => 'optional', 'comments' => 'open', 'access comments' => 0, 'post comments' => 0, 'skip comment approval' => 1, 'edit own comments' => 0, )DebugCommentLinksTest.php195Drupal\comment\Tests\CommentLinksTest->setEnvironment()
Changed environment:array ( 'authenticated' => false, 'comment count' => true, 'form' => 'below', 'user_register' => 'visitors', 'contact' => 'optional', 'comments' => 'open', 'access comments' => 0, 'post comments' => 0, 'skip comment approval' => 1, 'edit own comments' => 0, )DebugCommentLinksTest.php195Drupal\comment\Tests\CommentLinksTest->setEnvironment()
Changed environment:array ( 'authenticated' => true, 'comment count' => true, 'form' => 'below', 'user_register' => 'visitors', 'contact' => 'optional', 'comments' => 'open', 'access comments' => 0, 'post comments' => 0, 'skip comment approval' => 1, 'edit own comments' => 0, )DebugCommentLinksTest.php195Drupal\comment\Tests\CommentLinksTest->setEnvironment()
Changed environment:array ( 'authenticated' => false, 'comment count' => false, 'form' => 'below', 'user_register' => 'visitors', 'contact' => 'optional', 'comments' => 'open', 'access comments' => 1, 'post comments' => 0, 'skip comment approval' => 1, 'edit own comments' => 0, )DebugCommentLinksTest.php195Drupal\comment\Tests\CommentLinksTest->setEnvironment()
Changed environment:array ( 'authenticated' => true, 'comment count' => false, 'form' => 'below', 'user_register' => 'visitors', 'contact' => 'optional', 'comments' => 'open', 'access comments' => 1, 'post comments' => 0, 'skip comment approval' => 1, 'edit own comments' => 0, )DebugCommentLinksTest.php195Drupal\comment\Tests\CommentLinksTest->setEnvironment()
Changed environment:array ( 'authenticated' => false, 'comment count' => true, 'form' => 'below', 'user_register' => 'visitors', 'contact' => 'optional', 'comments' => 'open', 'access comments' => 1, 'post comments' => 0, 'skip comment approval' => 1, 'edit own comments' => 0, )DebugCommentLinksTest.php195Drupal\comment\Tests\CommentLinksTest->setEnvironment()
Changed environment:array ( 'authenticated' => true, 'comment count' => true, 'form' => 'below', 'user_register' => 'visitors', 'contact' => 'optional', 'comments' => 'open', 'access comments' => 1, 'post comments' => 0, 'skip comment approval' => 1, 'edit own comments' => 0, )DebugCommentLinksTest.php195Drupal\comment\Tests\CommentLinksTest->setEnvironment()
Changed environment:array ( 'authenticated' => false, 'comment count' => false, 'form' => 'below', 'user_register' => 'visitors', 'contact' => 'optional', 'comments' => 'open', 'access comments' => 0, 'post comments' => 1, 'skip comment approval' => 1, 'edit own comments' => 0, )DebugCommentLinksTest.php195Drupal\comment\Tests\CommentLinksTest->setEnvironment()
Changed environment:array ( 'authenticated' => true, 'comment count' => false, 'form' => 'below', 'user_register' => 'visitors', 'contact' => 'optional', 'comments' => 'open', 'access comments' => 0, 'post comments' => 1, 'skip comment approval' => 1, 'edit own comments' => 0, )DebugCommentLinksTest.php195Drupal\comment\Tests\CommentLinksTest->setEnvironment()
Changed environment:array ( 'authenticated' => false, 'comment count' => true, 'form' => 'below', 'user_register' => 'visitors', 'contact' => 'optional', 'comments' => 'open', 'access comments' => 0, 'post comments' => 1, 'skip comment approval' => 1, 'edit own comments' => 0, )DebugCommentLinksTest.php195Drupal\comment\Tests\CommentLinksTest->setEnvironment()
Changed environment:array ( 'authenticated' => true, 'comment count' => true, 'form' => 'below', 'user_register' => 'visitors', 'contact' => 'optional', 'comments' => 'open', 'access comments' => 0, 'post comments' => 1, 'skip comment approval' => 1, 'edit own comments' => 0, )DebugCommentLinksTest.php195Drupal\comment\Tests\CommentLinksTest->setEnvironment()
Changed environment:array ( 'authenticated' => false, 'comment count' => false, 'form' => 'below', 'user_register' => 'visitors', 'contact' => 'optional', 'comments' => 'open', 'access comments' => 1, 'post comments' => 1, 'skip comment approval' => 1, 'edit own comments' => 0, )DebugCommentLinksTest.php195Drupal\comment\Tests\CommentLinksTest->setEnvironment()
Changed environment:array ( 'authenticated' => true, 'comment count' => false, 'form' => 'below', 'user_register' => 'visitors', 'contact' => 'optional', 'comments' => 'open', 'access comments' => 1, 'post comments' => 1, 'skip comment approval' => 1, 'edit own comments' => 0, )DebugCommentLinksTest.php195Drupal\comment\Tests\CommentLinksTest->setEnvironment()
Changed environment:array ( 'authenticated' => false, 'comment count' => true, 'form' => 'below', 'user_register' => 'visitors', 'contact' => 'optional', 'comments' => 'open', 'access comments' => 1, 'post comments' => 1, 'skip comment approval' => 1, 'edit own comments' => 0, )DebugCommentLinksTest.php195Drupal\comment\Tests\CommentLinksTest->setEnvironment()
Changed environment:array ( 'authenticated' => true, 'comment count' => true, 'form' => 'below', 'user_register' => 'visitors', 'contact' => 'optional', 'comments' => 'open', 'access comments' => 1, 'post comments' => 1, 'skip comment approval' => 1, 'edit own comments' => 0, )DebugCommentLinksTest.php195Drupal\comment\Tests\CommentLinksTest->setEnvironment()
Changed environment:array ( 'authenticated' => false, 'comment count' => false, 'form' => 'separate page', 'user_register' => 'visitors', 'contact' => 'optional', 'comments' => 'open', 'access comments' => 0, 'post comments' => 0, 'skip comment approval' => 1, 'edit own comments' => 0, )DebugCommentLinksTest.php195Drupal\comment\Tests\CommentLinksTest->setEnvironment()
Changed environment:array ( 'authenticated' => true, 'comment count' => false, 'form' => 'separate page', 'user_register' => 'visitors', 'contact' => 'optional', 'comments' => 'open', 'access comments' => 0, 'post comments' => 0, 'skip comment approval' => 1, 'edit own comments' => 0, )DebugCommentLinksTest.php195Drupal\comment\Tests\CommentLinksTest->setEnvironment()
Changed environment:array ( 'authenticated' => false, 'comment count' => true, 'form' => 'separate page', 'user_register' => 'visitors', 'contact' => 'optional', 'comments' => 'open', 'access comments' => 0, 'post comments' => 0, 'skip comment approval' => 1, 'edit own comments' => 0, )DebugCommentLinksTest.php195Drupal\comment\Tests\CommentLinksTest->setEnvironment()
Changed environment:array ( 'authenticated' => true, 'comment count' => true, 'form' => 'separate page', 'user_register' => 'visitors', 'contact' => 'optional', 'comments' => 'open', 'access comments' => 0, 'post comments' => 0, 'skip comment approval' => 1, 'edit own comments' => 0, )DebugCommentLinksTest.php195Drupal\comment\Tests\CommentLinksTest->setEnvironment()
Changed environment:array ( 'authenticated' => false, 'comment count' => false, 'form' => 'separate page', 'user_register' => 'visitors', 'contact' => 'optional', 'comments' => 'open', 'access comments' => 1, 'post comments' => 0, 'skip comment approval' => 1, 'edit own comments' => 0, )DebugCommentLinksTest.php195Drupal\comment\Tests\CommentLinksTest->setEnvironment()
Changed environment:array ( 'authenticated' => true, 'comment count' => false, 'form' => 'separate page', 'user_register' => 'visitors', 'contact' => 'optional', 'comments' => 'open', 'access comments' => 1, 'post comments' => 0, 'skip comment approval' => 1, 'edit own comments' => 0, )DebugCommentLinksTest.php195Drupal\comment\Tests\CommentLinksTest->setEnvironment()
Changed environment:array ( 'authenticated' => false, 'comment count' => true, 'form' => 'separate page', 'user_register' => 'visitors', 'contact' => 'optional', 'comments' => 'open', 'access comments' => 1, 'post comments' => 0, 'skip comment approval' => 1, 'edit own comments' => 0, )DebugCommentLinksTest.php195Drupal\comment\Tests\CommentLinksTest->setEnvironment()
Changed environment:array ( 'authenticated' => true, 'comment count' => true, 'form' => 'separate page', 'user_register' => 'visitors', 'contact' => 'optional', 'comments' => 'open', 'access comments' => 1, 'post comments' => 0, 'skip comment approval' => 1, 'edit own comments' => 0, )DebugCommentLinksTest.php195Drupal\comment\Tests\CommentLinksTest->setEnvironment()
Changed environment:array ( 'authenticated' => false, 'comment count' => false, 'form' => 'separate page', 'user_register' => 'visitors', 'contact' => 'optional', 'comments' => 'open', 'access comments' => 0, 'post comments' => 1, 'skip comment approval' => 1, 'edit own comments' => 0, )DebugCommentLinksTest.php195Drupal\comment\Tests\CommentLinksTest->setEnvironment()
Changed environment:array ( 'authenticated' => true, 'comment count' => false, 'form' => 'separate page', 'user_register' => 'visitors', 'contact' => 'optional', 'comments' => 'open', 'access comments' => 0, 'post comments' => 1, 'skip comment approval' => 1, 'edit own comments' => 0, )DebugCommentLinksTest.php195Drupal\comment\Tests\CommentLinksTest->setEnvironment()
Changed environment:array ( 'authenticated' => false, 'comment count' => true, 'form' => 'separate page', 'user_register' => 'visitors', 'contact' => 'optional', 'comments' => 'open', 'access comments' => 0, 'post comments' => 1, 'skip comment approval' => 1, 'edit own comments' => 0, )DebugCommentLinksTest.php195Drupal\comment\Tests\CommentLinksTest->setEnvironment()
Changed environment:array ( 'authenticated' => true, 'comment count' => true, 'form' => 'separate page', 'user_register' => 'visitors', 'contact' => 'optional', 'comments' => 'open', 'access comments' => 0, 'post comments' => 1, 'skip comment approval' => 1, 'edit own comments' => 0, )DebugCommentLinksTest.php195Drupal\comment\Tests\CommentLinksTest->setEnvironment()
Changed environment:array ( 'authenticated' => false, 'comment count' => false, 'form' => 'separate page', 'user_register' => 'visitors', 'contact' => 'optional', 'comments' => 'open', 'access comments' => 1, 'post comments' => 1, 'skip comment approval' => 1, 'edit own comments' => 0, )DebugCommentLinksTest.php195Drupal\comment\Tests\CommentLinksTest->setEnvironment()
Changed environment:array ( 'authenticated' => true, 'comment count' => false, 'form' => 'separate page', 'user_register' => 'visitors', 'contact' => 'optional', 'comments' => 'open', 'access comments' => 1, 'post comments' => 1, 'skip comment approval' => 1, 'edit own comments' => 0, )DebugCommentLinksTest.php195Drupal\comment\Tests\CommentLinksTest->setEnvironment()
Changed environment:array ( 'authenticated' => false, 'comment count' => true, 'form' => 'separate page', 'user_register' => 'visitors', 'contact' => 'optional', 'comments' => 'open', 'access comments' => 1, 'post comments' => 1, 'skip comment approval' => 1, 'edit own comments' => 0, )DebugCommentLinksTest.php195Drupal\comment\Tests\CommentLinksTest->setEnvironment()
Changed environment:array ( 'authenticated' => true, 'comment count' => true, 'form' => 'separate page', 'user_register' => 'visitors', 'contact' => 'optional', 'comments' => 'open', 'access comments' => 1, 'post comments' => 1, 'skip comment approval' => 1, 'edit own comments' => 0, )DebugCommentLinksTest.php195Drupal\comment\Tests\CommentLinksTest->setEnvironment()
Changed environment:array ( 'authenticated' => false, 'comment count' => false, 'form' => 'below', 'user_register' => 'admin_only', 'contact' => 'optional', 'comments' => 'open', 'access comments' => 0, 'post comments' => 0, 'skip comment approval' => 1, 'edit own comments' => 0, )DebugCommentLinksTest.php195Drupal\comment\Tests\CommentLinksTest->setEnvironment()
Changed environment:array ( 'authenticated' => true, 'comment count' => false, 'form' => 'below', 'user_register' => 'admin_only', 'contact' => 'optional', 'comments' => 'open', 'access comments' => 0, 'post comments' => 0, 'skip comment approval' => 1, 'edit own comments' => 0, )DebugCommentLinksTest.php195Drupal\comment\Tests\CommentLinksTest->setEnvironment()
Changed environment:array ( 'authenticated' => false, 'comment count' => true, 'form' => 'below', 'user_register' => 'admin_only', 'contact' => 'optional', 'comments' => 'open', 'access comments' => 0, 'post comments' => 0, 'skip comment approval' => 1, 'edit own comments' => 0, )DebugCommentLinksTest.php195Drupal\comment\Tests\CommentLinksTest->setEnvironment()
Changed environment:array ( 'authenticated' => true, 'comment count' => true, 'form' => 'below', 'user_register' => 'admin_only', 'contact' => 'optional', 'comments' => 'open', 'access comments' => 0, 'post comments' => 0, 'skip comment approval' => 1, 'edit own comments' => 0, )DebugCommentLinksTest.php195Drupal\comment\Tests\CommentLinksTest->setEnvironment()
Changed environment:array ( 'authenticated' => false, 'comment count' => false, 'form' => 'below', 'user_register' => 'admin_only', 'contact' => 'optional', 'comments' => 'open', 'access comments' => 1, 'post comments' => 0, 'skip comment approval' => 1, 'edit own comments' => 0, )DebugCommentLinksTest.php195Drupal\comment\Tests\CommentLinksTest->setEnvironment()
Changed environment:array ( 'authenticated' => true, 'comment count' => false, 'form' => 'below', 'user_register' => 'admin_only', 'contact' => 'optional', 'comments' => 'open', 'access comments' => 1, 'post comments' => 0, 'skip comment approval' => 1, 'edit own comments' => 0, )DebugCommentLinksTest.php195Drupal\comment\Tests\CommentLinksTest->setEnvironment()
Changed environment:array ( 'authenticated' => false, 'comment count' => true, 'form' => 'below', 'user_register' => 'admin_only', 'contact' => 'optional', 'comments' => 'open', 'access comments' => 1, 'post comments' => 0, 'skip comment approval' => 1, 'edit own comments' => 0, )DebugCommentLinksTest.php195Drupal\comment\Tests\CommentLinksTest->setEnvironment()
Changed environment:array ( 'authenticated' => true, 'comment count' => true, 'form' => 'below', 'user_register' => 'admin_only', 'contact' => 'optional', 'comments' => 'open', 'access comments' => 1, 'post comments' => 0, 'skip comment approval' => 1, 'edit own comments' => 0, )DebugCommentLinksTest.php195Drupal\comment\Tests\CommentLinksTest->setEnvironment()
Changed environment:array ( 'authenticated' => false, 'comment count' => false, 'form' => 'below', 'user_register' => 'admin_only', 'contact' => 'optional', 'comments' => 'open', 'access comments' => 0, 'post comments' => 1, 'skip comment approval' => 1, 'edit own comments' => 0, )DebugCommentLinksTest.php195Drupal\comment\Tests\CommentLinksTest->setEnvironment()
Changed environment:array ( 'authenticated' => true, 'comment count' => false, 'form' => 'below', 'user_register' => 'admin_only', 'contact' => 'optional', 'comments' => 'open', 'access comments' => 0, 'post comments' => 1, 'skip comment approval' => 1, 'edit own comments' => 0, )DebugCommentLinksTest.php195Drupal\comment\Tests\CommentLinksTest->setEnvironment()
Changed environment:array ( 'authenticated' => false, 'comment count' => true, 'form' => 'below', 'user_register' => 'admin_only', 'contact' => 'optional', 'comments' => 'open', 'access comments' => 0, 'post comments' => 1, 'skip comment approval' => 1, 'edit own comments' => 0, )DebugCommentLinksTest.php195Drupal\comment\Tests\CommentLinksTest->setEnvironment()
Changed environment:array ( 'authenticated' => true, 'comment count' => true, 'form' => 'below', 'user_register' => 'admin_only', 'contact' => 'optional', 'comments' => 'open', 'access comments' => 0, 'post comments' => 1, 'skip comment approval' => 1, 'edit own comments' => 0, )DebugCommentLinksTest.php195Drupal\comment\Tests\CommentLinksTest->setEnvironment()
Changed environment:array ( 'authenticated' => false, 'comment count' => false, 'form' => 'below', 'user_register' => 'admin_only', 'contact' => 'optional', 'comments' => 'open', 'access comments' => 1, 'post comments' => 1, 'skip comment approval' => 1, 'edit own comments' => 0, )DebugCommentLinksTest.php195Drupal\comment\Tests\CommentLinksTest->setEnvironment()
Changed environment:array ( 'authenticated' => true, 'comment count' => false, 'form' => 'below', 'user_register' => 'admin_only', 'contact' => 'optional', 'comments' => 'open', 'access comments' => 1, 'post comments' => 1, 'skip comment approval' => 1, 'edit own comments' => 0, )DebugCommentLinksTest.php195Drupal\comment\Tests\CommentLinksTest->setEnvironment()
Changed environment:array ( 'authenticated' => false, 'comment count' => true, 'form' => 'below', 'user_register' => 'admin_only', 'contact' => 'optional', 'comments' => 'open', 'access comments' => 1, 'post comments' => 1, 'skip comment approval' => 1, 'edit own comments' => 0, )DebugCommentLinksTest.php195Drupal\comment\Tests\CommentLinksTest->setEnvironment()
Changed environment:array ( 'authenticated' => true, 'comment count' => true, 'form' => 'below', 'user_register' => 'admin_only', 'contact' => 'optional', 'comments' => 'open', 'access comments' => 1, 'post comments' => 1, 'skip comment approval' => 1, 'edit own comments' => 0, )DebugCommentLinksTest.php195Drupal\comment\Tests\CommentLinksTest->setEnvironment()
Changed environment:array ( 'authenticated' => false, 'comment count' => false, 'form' => 'separate page', 'user_register' => 'admin_only', 'contact' => 'optional', 'comments' => 'open', 'access comments' => 0, 'post comments' => 0, 'skip comment approval' => 1, 'edit own comments' => 0, )DebugCommentLinksTest.php195Drupal\comment\Tests\CommentLinksTest->setEnvironment()
Changed environment:array ( 'authenticated' => true, 'comment count' => false, 'form' => 'separate page', 'user_register' => 'admin_only', 'contact' => 'optional', 'comments' => 'open', 'access comments' => 0, 'post comments' => 0, 'skip comment approval' => 1, 'edit own comments' => 0, )DebugCommentLinksTest.php195Drupal\comment\Tests\CommentLinksTest->setEnvironment()
Changed environment:array ( 'authenticated' => false, 'comment count' => true, 'form' => 'separate page', 'user_register' => 'admin_only', 'contact' => 'optional', 'comments' => 'open', 'access comments' => 0, 'post comments' => 0, 'skip comment approval' => 1, 'edit own comments' => 0, )DebugCommentLinksTest.php195Drupal\comment\Tests\CommentLinksTest->setEnvironment()
Changed environment:array ( 'authenticated' => true, 'comment count' => true, 'form' => 'separate page', 'user_register' => 'admin_only', 'contact' => 'optional', 'comments' => 'open', 'access comments' => 0, 'post comments' => 0, 'skip comment approval' => 1, 'edit own comments' => 0, )DebugCommentLinksTest.php195Drupal\comment\Tests\CommentLinksTest->setEnvironment()
Changed environment:array ( 'authenticated' => false, 'comment count' => false, 'form' => 'separate page', 'user_register' => 'admin_only', 'contact' => 'optional', 'comments' => 'open', 'access comments' => 1, 'post comments' => 0, 'skip comment approval' => 1, 'edit own comments' => 0, )DebugCommentLinksTest.php195Drupal\comment\Tests\CommentLinksTest->setEnvironment()
Changed environment:array ( 'authenticated' => true, 'comment count' => false, 'form' => 'separate page', 'user_register' => 'admin_only', 'contact' => 'optional', 'comments' => 'open', 'access comments' => 1, 'post comments' => 0, 'skip comment approval' => 1, 'edit own comments' => 0, )DebugCommentLinksTest.php195Drupal\comment\Tests\CommentLinksTest->setEnvironment()
Changed environment:array ( 'authenticated' => false, 'comment count' => true, 'form' => 'separate page', 'user_register' => 'admin_only', 'contact' => 'optional', 'comments' => 'open', 'access comments' => 1, 'post comments' => 0, 'skip comment approval' => 1, 'edit own comments' => 0, )DebugCommentLinksTest.php195Drupal\comment\Tests\CommentLinksTest->setEnvironment()
Changed environment:array ( 'authenticated' => true, 'comment count' => true, 'form' => 'separate page', 'user_register' => 'admin_only', 'contact' => 'optional', 'comments' => 'open', 'access comments' => 1, 'post comments' => 0, 'skip comment approval' => 1, 'edit own comments' => 0, )DebugCommentLinksTest.php195Drupal\comment\Tests\CommentLinksTest->setEnvironment()
Changed environment:array ( 'authenticated' => false, 'comment count' => false, 'form' => 'separate page', 'user_register' => 'admin_only', 'contact' => 'optional', 'comments' => 'open', 'access comments' => 0, 'post comments' => 1, 'skip comment approval' => 1, 'edit own comments' => 0, )DebugCommentLinksTest.php195Drupal\comment\Tests\CommentLinksTest->setEnvironment()
Changed environment:array ( 'authenticated' => true, 'comment count' => false, 'form' => 'separate page', 'user_register' => 'admin_only', 'contact' => 'optional', 'comments' => 'open', 'access comments' => 0, 'post comments' => 1, 'skip comment approval' => 1, 'edit own comments' => 0, )DebugCommentLinksTest.php195Drupal\comment\Tests\CommentLinksTest->setEnvironment()
Changed environment:array ( 'authenticated' => false, 'comment count' => true, 'form' => 'separate page', 'user_register' => 'admin_only', 'contact' => 'optional', 'comments' => 'open', 'access comments' => 0, 'post comments' => 1, 'skip comment approval' => 1, 'edit own comments' => 0, )DebugCommentLinksTest.php195Drupal\comment\Tests\CommentLinksTest->setEnvironment()
Changed environment:array ( 'authenticated' => true, 'comment count' => true, 'form' => 'separate page', 'user_register' => 'admin_only', 'contact' => 'optional', 'comments' => 'open', 'access comments' => 0, 'post comments' => 1, 'skip comment approval' => 1, 'edit own comments' => 0, )DebugCommentLinksTest.php195Drupal\comment\Tests\CommentLinksTest->setEnvironment()
Changed environment:array ( 'authenticated' => false, 'comment count' => false, 'form' => 'separate page', 'user_register' => 'admin_only', 'contact' => 'optional', 'comments' => 'open', 'access comments' => 1, 'post comments' => 1, 'skip comment approval' => 1, 'edit own comments' => 0, )DebugCommentLinksTest.php195Drupal\comment\Tests\CommentLinksTest->setEnvironment()
Changed environment:array ( 'authenticated' => true, 'comment count' => false, 'form' => 'separate page', 'user_register' => 'admin_only', 'contact' => 'optional', 'comments' => 'open', 'access comments' => 1, 'post comments' => 1, 'skip comment approval' => 1, 'edit own comments' => 0, )DebugCommentLinksTest.php195Drupal\comment\Tests\CommentLinksTest->setEnvironment()
Changed environment:array ( 'authenticated' => false, 'comment count' => true, 'form' => 'separate page', 'user_register' => 'admin_only', 'contact' => 'optional', 'comments' => 'open', 'access comments' => 1, 'post comments' => 1, 'skip comment approval' => 1, 'edit own comments' => 0, )DebugCommentLinksTest.php195Drupal\comment\Tests\CommentLinksTest->setEnvironment()
Changed environment:array ( 'authenticated' => true, 'comment count' => true, 'form' => 'separate page', 'user_register' => 'admin_only', 'contact' => 'optional', 'comments' => 'open', 'access comments' => 1, 'post comments' => 1, 'skip comment approval' => 1, 'edit own comments' => 0, )DebugCommentLinksTest.php195Drupal\comment\Tests\CommentLinksTest->setEnvironment()
LeafDrupal\comment\Tests\CommentNewIndicatorTest4200
LeafDrupal\comment\Tests\CommentNodeAccessTest5700
LeafDrupal\comment\Tests\CommentNodeChangesTest2400
LeafDrupal\comment\Tests\CommentPagerTest21300
LeafDrupal\comment\Tests\CommentPreviewTest10000
LeafDrupal\comment\Tests\CommentRssTest2600
LeafDrupal\comment\Tests\CommentStatisticsTest9800
LeafDrupal\comment\Tests\CommentThreadingTest15900
LeafDrupal\comment\Tests\CommentTokenReplaceTest6600
LeafDrupal\comment\Tests\CommentTranslationUITest18300
LeafDrupal\comment\Tests\CommentUserTest8900
LeafDrupal\comment\Tests\Views\ArgumentUserUIDTest900
LeafDrupal\comment\Tests\Views\DefaultViewRecentComments800
LeafDrupal\comment\Tests\Views\FilterUserUIDTest900
ExpandDrupal\comment\Tests\Views\RowRssTest1200
MessageGroupFilenameLineFunctionStatus
'Missing handler: comment node relationship'Debugviews.module926views_get_handler()
ExpandDrupal\comment\Tests\Views\WizardTest6500
MessageGroupFilenameLineFunctionStatus
'Missing handler: comment node relationship'Debugviews.module926views_get_handler()
'Missing handler: comment node relationship'Debugviews.module926views_get_handler()
'Missing handler: comment node relationship'Debugviews.module926views_get_handler()
'Missing handler: comment node relationship'Debugviews.module926views_get_handler()
'Missing handler: comment node relationship'Debugviews.module926views_get_handler()
'Missing handler: comment node relationship'Debugviews.module926views_get_handler()
'Missing handler: comment node relationship'Debugviews.module926views_get_handler()
'Missing handler: comment node relationship'Debugviews.module926views_get_handler()
'Missing handler: comment node relationship'Debugviews.module926views_get_handler()
'Missing handler: comment node relationship'Debugviews.module926views_get_handler()
'Missing handler: comment node relationship'Debugviews.module926views_get_handler()
'Missing handler: comment node relationship'Debugviews.module926views_get_handler()
'Missing handler: comment node relationship'Debugviews.module926views_get_handler()
'Missing handler: comment node relationship'Debugviews.module926views_get_handler()
'Missing handler: comment node relationship'Debugviews.module926views_get_handler()
'Missing handler: comment node relationship'Debugviews.module926views_get_handler()
'Missing handler: comment node relationship'Debugviews.module926views_get_handler()
'Missing handler: comment node relationship'Debugviews.module926views_get_handler()
'Missing handler: comment node relationship'Debugviews.module926views_get_handler()
'Missing handler: comment node relationship'Debugviews.module926views_get_handler()
'Missing handler: comment node relationship'Debugviews.module926views_get_handler()
'Missing handler: comment node relationship'Debugviews.module926views_get_handler()
'Missing handler: comment node relationship'Debugviews.module926views_get_handler()
'Missing handler: comment node relationship'Debugviews.module926views_get_handler()
LeafDrupal\config\Tests\ConfigCRUDTest2600
LeafDrupal\config\Tests\ConfigEntityListTest6900
LeafDrupal\config\Tests\ConfigEntityStatusTest500
LeafDrupal\config\Tests\ConfigEntityStatusUITest1500
LeafDrupal\config\Tests\ConfigEntityTest13800
LeafDrupal\config\Tests\ConfigEntityUnitTest100
LeafDrupal\config\Tests\ConfigFileContentTest3100
LeafDrupal\config\Tests\ConfigImportTest3800
LeafDrupal\config\Tests\ConfigImportUITest4600
LeafDrupal\config\Tests\ConfigInstallTest1500
LeafDrupal\config\Tests\ConfigOverrideTest1800
LeafDrupal\config\Tests\ConfigSchemaTest2000
LeafDrupal\config\Tests\ConfigUpgradeTest1200
LeafDrupal\config\Tests\LocaleConfigOverride200
LeafDrupal\config\Tests\Storage\DatabaseStorageTest2100
LeafDrupal\config\Tests\Storage\FileStorageTest2300
LeafDrupal\contact\Tests\ContactAuthenticatedUserTest1300
LeafDrupal\contact\Tests\ContactPersonalTest16600
LeafDrupal\contact\Tests\ContactSitewideTest24600
LeafDrupal\contact\Tests\ContactUpgradePathTest4800
LeafDrupal\contact\Tests\Views\ContactFieldsTest600
LeafDrupal\contextual\Tests\ContextualDynamicContextTest1600
LeafDrupal\datetime\Tests\DatetimeFieldTest13100
LeafDrupal\dblog\Tests\DBLogTest37700
LeafDrupal\editor\Tests\EditorAdminTest4200
LeafDrupal\editor\Tests\EditorLoadingTest6700
LeafDrupal\editor\Tests\EditorManagerTest700
LeafDrupal\edit\Tests\EditorSelectionTest1000
LeafDrupal\edit\Tests\MetadataGeneratorTest300
LeafDrupal\email\Tests\EmailFieldTest1900
LeafDrupal\email\Tests\EmailItemTest600
LeafDrupal\entity\Tests\EntityDisplayTest2900
LeafDrupal\entity_reference\Tests\EntityReferenceAdminTest2900
LeafDrupal\entity_reference\Tests\EntityReferenceAutocompleteTest1900
LeafDrupal\entity_reference\Tests\EntityReferenceAutoCreateTest1800
LeafDrupal\entity_reference\Tests\EntityReferenceItemTest1000
LeafDrupal\entity_reference\Tests\EntityReferenceSelectionAccessTest6900
LeafDrupal\entity_reference\Tests\EntityReferenceSelectionSortTest700
LeafDrupal\entity_reference\Tests\Views\SelectionTest300
LeafDrupal\field\Tests\BulkDeleteTest7500
LeafDrupal\field\Tests\CrudTest7500
LeafDrupal\field\Tests\DisplayApiTest4600
LeafDrupal\field\Tests\EntityPropertiesTest400
LeafDrupal\field\Tests\FieldAccessTest2100
LeafDrupal\field\Tests\FieldAttachOtherTest10300
LeafDrupal\field\Tests\FieldAttachStorageTest9400
LeafDrupal\field\Tests\FieldInfoTest7300
LeafDrupal\field\Tests\FieldInstanceCrudTest2800
LeafDrupal\field\Tests\FormTest28100
LeafDrupal\field\Tests\ShapeItemTest1000
LeafDrupal\field\Tests\TestItemTest600
LeafDrupal\field\Tests\TranslationTest9900
LeafDrupal\field\Tests\Views\ApiDataTest1500
LeafDrupal\field\Tests\Views\FieldUITest2800
LeafDrupal\field\Tests\Views\HandlerFieldFieldTest2400
LeafDrupal\field_sql_storage\Tests\FieldSqlStorageTest9200
LeafDrupal\field_ui\Tests\AlterTest2100
LeafDrupal\field_ui\Tests\ManageDisplayTest14900
LeafDrupal\field_ui\Tests\ManageFieldsTest29400
LeafDrupal\file\Tests\CopyTest11000
LeafDrupal\file\Tests\DeleteTest2400
LeafDrupal\file\Tests\DownloadTest4500
LeafDrupal\file\Tests\FileFieldDisplayTest5100
LeafDrupal\file\Tests\FileFieldPathTest2800
LeafDrupal\file\Tests\FileFieldRevisionTest6800
LeafDrupal\file\Tests\FileFieldRSSContentTest2400
LeafDrupal\file\Tests\FileFieldValidateTest12100
ExpandDrupal\file\Tests\FileFieldWidgetTest2921110
MessageGroupFilenameLineFunctionStatus
Failed to set field comment[und][0][comment] to 2OtherFileFieldWidgetTest.php274Drupal\file\Tests\FileFieldWidgetTest->testPrivateFileComment()
Found the requested form fields at node/add/articleOtherFileFieldWidgetTest.php274Drupal\file\Tests\FileFieldWidgetTest->testPrivateFileComment()
Failed to set field files[field_i17ab7u2_und_0] to /var/lib/drupaltestbot/sites/default/files/checkout/sites/default/files/simpletest/785447/text-0.txtOtherFileFieldWidgetTest.php283Drupal\file\Tests\FileFieldWidgetTest->testPrivateFileComment()
Failed to set field comment_body[und][0][value] to fGah4NuoOtherFileFieldWidgetTest.php283Drupal\file\Tests\FileFieldWidgetTest->testPrivateFileComment()
Found the Save buttonOtherFileFieldWidgetTest.php283Drupal\file\Tests\FileFieldWidgetTest->testPrivateFileComment()
Found the requested form fields at OtherFileFieldWidgetTest.php283Drupal\file\Tests\FileFieldWidgetTest->testPrivateFileComment()
Undefined offset: 1Drupal\file\Tests\FileFieldWidgetTest->testPrivateFileComment() Drupal\simpletest\TestBase->run() simpletest_script_run_one_test('245', 'Drupal\file\Tests\FileFieldWidgetTest') NoticeFileFieldWidgetTest.php287Drupal\file\Tests\FileFieldWidgetTest->testPrivateFileComment()
array_flip(): Can only flip STRING and INTEGER values!array_flip(Array) Drupal\Core\Entity\DatabaseStorageController->load(Array) entity_load_multiple('comment', Array, ) entity_load('comment', NULL) comment_load(NULL) Drupal\file\Tests\FileFieldWidgetTest->testPrivateFileComment() Drupal\simpletest\TestBase->run() simpletest_script_run_one_test('245', 'Drupal\file\Tests\FileFieldWidgetTest') WarningDatabaseStorageController.php182Drupal\Core\Entity\DatabaseStorageController->load()
Trying to get property of non-objectDrupal\file\Tests\FileFieldWidgetTest->testPrivateFileComment() Drupal\simpletest\TestBase->run() simpletest_script_run_one_test('245', 'Drupal\file\Tests\FileFieldWidgetTest') NoticeFileFieldWidgetTest.php293Drupal\file\Tests\FileFieldWidgetTest->testPrivateFileComment()
array_flip(): Can only flip STRING and INTEGER values!array_flip(Array) Drupal\Core\Entity\DatabaseStorageController->load(Array) entity_load_multiple('file', Array, ) file_load_multiple(Array, ) file_load(NULL) Drupal\file\Tests\FileFieldWidgetTest->testPrivateFileComment() Drupal\simpletest\TestBase->run() simpletest_script_run_one_test('245', 'Drupal\file\Tests\FileFieldWidgetTest') WarningDatabaseStorageController.php182Drupal\Core\Entity\DatabaseStorageController->load()
Trying to get property of non-objectDrupal\file\Tests\FileFieldTestBase->assertFileExists(, 'New file saved to disk on node creation.') Drupal\file\Tests\FileFieldWidgetTest->testPrivateFileComment() Drupal\simpletest\TestBase->run() simpletest_script_run_one_test('245', 'Drupal\file\Tests\FileFieldWidgetTest') NoticeFileFieldTestBase.php188Drupal\file\Tests\FileFieldTestBase->assertFileExists()
New file saved to disk on node creation.OtherFileFieldWidgetTest.php294Drupal\file\Tests\FileFieldWidgetTest->testPrivateFileComment()
Trying to get property of non-objectDrupal\file\Tests\FileFieldWidgetTest->testPrivateFileComment() Drupal\simpletest\TestBase->run() simpletest_script_run_one_test('245', 'Drupal\file\Tests\FileFieldWidgetTest') NoticeFileFieldWidgetTest.php296Drupal\file\Tests\FileFieldWidgetTest->testPrivateFileComment()
Trying to get property of non-objectDrupal\file\Tests\FileFieldWidgetTest->testPrivateFileComment() Drupal\simpletest\TestBase->run() simpletest_script_run_one_test('245', 'Drupal\file\Tests\FileFieldWidgetTest') NoticeFileFieldWidgetTest.php298Drupal\file\Tests\FileFieldWidgetTest->testPrivateFileComment()
Trying to get property of non-objectDrupal\file\Tests\FileFieldWidgetTest->testPrivateFileComment() Drupal\simpletest\TestBase->run() simpletest_script_run_one_test('245', 'Drupal\file\Tests\FileFieldWidgetTest') NoticeFileFieldWidgetTest.php303Drupal\file\Tests\FileFieldWidgetTest->testPrivateFileComment()
Confirmed that access is denied for the file without the needed permission.BrowserFileFieldWidgetTest.php304Drupal\file\Tests\FileFieldWidgetTest->testPrivateFileComment()
Trying to get property of non-objectDrupal\file\Tests\FileFieldWidgetTest->testPrivateFileComment() Drupal\simpletest\TestBase->run() simpletest_script_run_one_test('245', 'Drupal\file\Tests\FileFieldWidgetTest') NoticeFileFieldWidgetTest.php308Drupal\file\Tests\FileFieldWidgetTest->testPrivateFileComment()
Found the Save and unpublish buttonOtherFileFieldWidgetTest.php308Drupal\file\Tests\FileFieldWidgetTest->testPrivateFileComment()
Found the requested form fields at node//editOtherFileFieldWidgetTest.php308Drupal\file\Tests\FileFieldWidgetTest->testPrivateFileComment()
Trying to get property of non-objectDrupal\file\Tests\FileFieldWidgetTest->testPrivateFileComment() Drupal\simpletest\TestBase->run() simpletest_script_run_one_test('245', 'Drupal\file\Tests\FileFieldWidgetTest') NoticeFileFieldWidgetTest.php312Drupal\file\Tests\FileFieldWidgetTest->testPrivateFileComment()
Confirmed that access is denied for the file without the needed permission.BrowserFileFieldWidgetTest.php313Drupal\file\Tests\FileFieldWidgetTest->testPrivateFileComment()
LeafDrupal\file\Tests\FileManagedFileElementTest26900
LeafDrupal\file\Tests\FilePrivateTest3800
LeafDrupal\file\Tests\FileTokenReplaceTest3600
LeafDrupal\file\Tests\LoadTest3500
LeafDrupal\file\Tests\MoveTest11000
LeafDrupal\file\Tests\RemoteFileSaveUploadTest30300
LeafDrupal\file\Tests\SaveDataTest9300
LeafDrupal\file\Tests\SaveTest1600
LeafDrupal\file\Tests\SaveUploadTest27000
LeafDrupal\file\Tests\SpaceUsedTest1200
LeafDrupal\file\Tests\UsageTest3400
LeafDrupal\file\Tests\ValidateTest1200
LeafDrupal\file\Tests\ValidatorTest2900
LeafDrupal\filter\Tests\FilterAdminTest19800
LeafDrupal\filter\Tests\FilterAPITest500
LeafDrupal\filter\Tests\FilterCrudTest12200
LeafDrupal\filter\Tests\FilterDefaultConfigTest2800
LeafDrupal\filter\Tests\FilterDefaultFormatTest3300
LeafDrupal\filter\Tests\FilterFormatAccessTest36200
LeafDrupal\filter\Tests\FilterHooksTest3300
ExpandDrupal\filter\Tests\FilterHtmlImageSecureTest1010
MessageGroupFilenameLineFunctionStatus
The test did not complete due to a fatal error.Completion checkFilterHtmlImageSecureTest.php77Drupal\filter\Tests\FilterHtmlImageSecureTest->testImageSource()
LeafDrupal\filter\Tests\FilterNoFormatTest100
LeafDrupal\filter\Tests\FilterSecurityTest4000
LeafDrupal\filter\Tests\FilterSettingsTest1200
LeafDrupal\filter\Tests\FilterUnitTest21500
LeafDrupal\forum\Tests\ForumBlockTest12200
LeafDrupal\forum\Tests\ForumIndexTest2700
LeafDrupal\forum\Tests\ForumNodeAccessTest5100
LeafDrupal\forum\Tests\ForumTest64700
LeafDrupal\help\Tests\HelpTest29600
LeafDrupal\help\Tests\NoHelpTest1200
LeafDrupal\history\Tests\Views\HistoryTimestampTest1200
LeafDrupal\image\Tests\ImageAdminStylesTest20500
LeafDrupal\image\Tests\ImageDimensionsScaleUnitTest1500
LeafDrupal\image\Tests\ImageDimensionsTest5600
LeafDrupal\image\Tests\ImageEffectsTest4300
LeafDrupal\image\Tests\ImageFieldDefaultImagesTest4000
LeafDrupal\image\Tests\ImageFieldDisplayTest15900
LeafDrupal\image\Tests\ImageFieldValidateTest3800
LeafDrupal\image\Tests\ImageStylesPathAndUrlTest7100
LeafDrupal\image\Tests\ImageThemeFunctionTest500
LeafDrupal\jsonld\Tests\NormalizeDenormalizeTest1400
LeafDrupal\jsonld\Tests\RdfSchemaSerializationTest400
LeafDrupal\jsonld\Tests\SupportsSerializationTest1000
LeafDrupal\language\Tests\LanguageBrowserDetectionUnitTest10700
LeafDrupal\language\Tests\LanguageConfigurationElementTest5400
LeafDrupal\language\Tests\LanguageConfigurationTest7500
LeafDrupal\language\Tests\LanguageCustomLanguageConfigurationTest3600
LeafDrupal\language\Tests\LanguageDependencyInjectionTest1700
LeafDrupal\language\Tests\LanguageListTest10200
LeafDrupal\language\Tests\LanguageNegotiationInfoTest4900
LeafDrupal\language\Tests\LanguagePathMonolingualTest3500
LeafDrupal\language\Tests\LanguageSwitchingTest2200
LeafDrupal\language\Tests\LanguageUILanguageNegotiationTest14500
LeafDrupal\language\Tests\LanguageUrlRewritingTest4700
LeafDrupal\language\Tests\Views\ArgumentLanguageTest200
LeafDrupal\language\Tests\Views\FieldLanguageTest200
LeafDrupal\language\Tests\Views\FilterLanguageTest200
LeafDrupal\layout\Tests\DisplayInternalLogicTest1100
LeafDrupal\layout\Tests\LayoutDerivativesTest2400
LeafDrupal\link\Tests\LinkFieldTest14000
LeafDrupal\link\Tests\LinkFieldUITest2100
LeafDrupal\locale\Tests\LocaleContentTest17200
LeafDrupal\locale\Tests\LocaleExportTest5700
LeafDrupal\locale\Tests\LocaleImportFunctionalTest16600
LeafDrupal\locale\Tests\LocaleInstallTest200
LeafDrupal\locale\Tests\LocaleJavascriptTranslation6600
LeafDrupal\locale\Tests\LocaleLibraryInfoAlterTest200
LeafDrupal\locale\Tests\LocalePathTest5100
LeafDrupal\locale\Tests\LocalePluralFormatTest16000
LeafDrupal\locale\Tests\LocaleStringTest2600
LeafDrupal\locale\Tests\LocaleTranslationTest35800
LeafDrupal\locale\Tests\LocaleUninstallFrenchTest3400
LeafDrupal\locale\Tests\LocaleUninstallTest3400
LeafDrupal\locale\Tests\LocaleUpdateInterfaceTest4600
LeafDrupal\locale\Tests\LocaleUpdateTest51400
LeafDrupal\menu\Tests\MenuNodeTest6100
LeafDrupal\menu\Tests\MenuTest162200
LeafDrupal\minimal\Tests\MinimalTest1600
LeafDrupal\node\Tests\MultiStepNodeFormBasicOptionsTest1700
LeafDrupal\node\Tests\NodeAccessBaseTableTest15900
LeafDrupal\node\Tests\NodeAccessFieldTest5000
LeafDrupal\node\Tests\NodeAccessLanguageTest2500
ExpandDrupal\node\Tests\NodeAccessPagerTest1901
MessageGroupFilenameLineFunctionStatus
Drupal\Core\Entity\EntityStorageException: SQLSTATE[23000]: Integrity constraint violation: 1048 Column 'comment_status' cannot be null: INSERT INTO {field_data_comment} (entity_type, entity_id, revision_id, bundle, delta, langcode, comment_status) VALUES (:db_insert_placeholder_0, :db_insert_placeholder_1, :db_insert_placeholder_2, :db_insert_placeholder_3, :db_insert_placeholder_4, :db_insert_placeholder_5, :db_insert_placeholder_6); Array ( [:db_insert_placeholder_0] => node [:db_insert_placeholder_1] => 1 [:db_insert_placeholder_2] => 1 [:db_insert_placeholder_3] => page [:db_insert_placeholder_4] => 0 [:db_insert_placeholder_5] => und [:db_insert_placeholder_6] => ) in Drupal\Core\Entity\DatabaseStorageController->save() (line 557 of /var/lib/drupaltestbot/sites/default/files/checkout/core/lib/Drupal/Core/Entity/DatabaseStorageController.php). Drupal\Core\Entity\DatabaseStorageController->save(Object) Drupal\Core\Entity\Entity->save() Drupal\simpletest\WebTestBase->drupalCreateNode(Array) Drupal\node\Tests\NodeAccessPagerTest->testCommentPager() Drupal\simpletest\TestBase->run() simpletest_script_run_one_test('399', 'Drupal\node\Tests\NodeAccessPagerTest') Uncaught exceptionDatabaseStorageController.php557Drupal\Core\Entity\DatabaseStorageController->save()
LeafDrupal\node\Tests\NodeAccessRebuildTest1900
LeafDrupal\node\Tests\NodeAccessRecordsTest2600
LeafDrupal\node\Tests\NodeAccessTest3400
LeafDrupal\node\Tests\NodeAdminTest18100
LeafDrupal\node\Tests\NodeBlockFunctionalTest12400
LeafDrupal\node\Tests\NodeBuildContentTest600
LeafDrupal\node\Tests\NodeCreationTest6600
LeafDrupal\node\Tests\NodeEntityFieldQueryAlterTest4500
LeafDrupal\node\Tests\NodeEntityViewModeAlterTest2100
LeafDrupal\node\Tests\NodeFeedTest100
LeafDrupal\node\Tests\NodeFieldMultilingualTestCase6400
LeafDrupal\node\Tests\NodeFormButtonsTest12500
LeafDrupal\node\Tests\NodeLoadHooksTest700
LeafDrupal\node\Tests\NodeLoadMultipleTest2700
LeafDrupal\node\Tests\NodePostSettingsTest4000
LeafDrupal\node\Tests\NodeQueryAlterTest9900
LeafDrupal\node\Tests\NodeRevisionPermissionsTest3800
LeafDrupal\node\Tests\NodeRevisionsAllTestCase4900
LeafDrupal\node\Tests\NodeRevisionsTest6400
LeafDrupal\node\Tests\NodeRSSContentTest2100
LeafDrupal\node\Tests\NodeSaveTest6000
LeafDrupal\node\Tests\NodeSyndicateBlockTest1400
ExpandDrupal\node\Tests\NodeTitleTest1101
MessageGroupFilenameLineFunctionStatus
Drupal\Core\Entity\EntityStorageException: SQLSTATE[23000]: Integrity constraint violation: 1048 Column 'comment_status' cannot be null: INSERT INTO {field_data_comment} (entity_type, entity_id, revision_id, bundle, delta, langcode, comment_status) VALUES (:db_insert_placeholder_0, :db_insert_placeholder_1, :db_insert_placeholder_2, :db_insert_placeholder_3, :db_insert_placeholder_4, :db_insert_placeholder_5, :db_insert_placeholder_6); Array ( [:db_insert_placeholder_0] => node [:db_insert_placeholder_1] => 1 [:db_insert_placeholder_2] => 1 [:db_insert_placeholder_3] => page [:db_insert_placeholder_4] => 0 [:db_insert_placeholder_5] => und [:db_insert_placeholder_6] => ) in Drupal\Core\Entity\DatabaseStorageController->save() (line 557 of /var/lib/drupaltestbot/sites/default/files/checkout/core/lib/Drupal/Core/Entity/DatabaseStorageController.php). Drupal\Core\Entity\DatabaseStorageController->save(Object) Drupal\Core\Entity\Entity->save() Drupal\simpletest\WebTestBase->drupalCreateNode(Array) Drupal\node\Tests\NodeTitleTest->testNodeTitle() Drupal\simpletest\TestBase->run() simpletest_script_run_one_test('421', 'Drupal\node\Tests\NodeTitleTest') Uncaught exceptionDatabaseStorageController.php557Drupal\Core\Entity\DatabaseStorageController->save()
LeafDrupal\node\Tests\NodeTitleXSSTest2300
LeafDrupal\node\Tests\NodeTokenReplaceTest4000
LeafDrupal\node\Tests\NodeTranslationUITest20700
LeafDrupal\node\Tests\NodeTypeInitialLanguageTest8000
LeafDrupal\node\Tests\NodeTypePersistenceTest6500
LeafDrupal\node\Tests\NodeTypeTest13000
LeafDrupal\node\Tests\PageEditTest9700
LeafDrupal\node\Tests\PagePreviewTest4100
LeafDrupal\node\Tests\PageViewTest3400
LeafDrupal\node\Tests\SummaryLengthTest1200
LeafDrupal\node\Tests\Views\FieldTypeTest200
LeafDrupal\node\Tests\Views\FilterUidRevisionTest400
LeafDrupal\node\Tests\Views\RevisionRelationships300
LeafDrupal\node\Tests\Views\StatusExtraTest6800
LeafDrupal\number\Tests\NumberFieldTest8800
LeafDrupal\number\Tests\NumberItemTest1800
LeafDrupal\openid\Tests\OpenIDFunctionalTest38400
LeafDrupal\openid\Tests\OpenIDRegistrationTest19900
LeafDrupal\openid\Tests\OpenIDTest3800
LeafDrupal\openid\Tests\Upgrade\OpenIDAuthmapUpgradePathTest3000
LeafDrupal\options\Tests\OptionsDynamicValuesValidationTest900
LeafDrupal\options\Tests\OptionsFieldTest1600
LeafDrupal\options\Tests\OptionsFieldUITest22200
LeafDrupal\options\Tests\OptionsSelectDynamicValuesTest1600
LeafDrupal\options\Tests\OptionsWidgetsTest26100
LeafDrupal\path\Tests\PathAliasTest13800
LeafDrupal\path\Tests\PathLanguageTest7500
LeafDrupal\path\Tests\PathLanguageUiTest9000
LeafDrupal\path\Tests\PathTaxonomyTermTest3700
LeafDrupal\php\Tests\PhpAccessTest3800
LeafDrupal\php\Tests\PhpFilterTest4200
LeafDrupal\picture\Tests\PictureAdminUITest5400
LeafDrupal\picture\Tests\PictureFieldDisplayTest11500
ExpandDrupal\rdf\Tests\CommentAttributesTest1810
MessageGroupFilenameLineFunctionStatus
The test did not complete due to a fatal error.Completion checkCommentAttributesTest.php64Drupal\rdf\Tests\CommentAttributesTest->testNumberOfCommentsRdfaMarkup()
LeafDrupal\rdf\Tests\CrudTest1000
LeafDrupal\rdf\Tests\GetNamespacesTest700
LeafDrupal\rdf\Tests\GetRdfNamespacesTest500
LeafDrupal\rdf\Tests\MappingDefinitionTest2300
LeafDrupal\rdf\Tests\MappingHookTest600
LeafDrupal\rdf\Tests\NodeAttributesTest1000
LeafDrupal\rdf\Tests\RdfaMarkupTest3700
LeafDrupal\rdf\Tests\RdfMappingEventTest300
LeafDrupal\rdf\Tests\SiteSchemaTest300
LeafDrupal\rdf\Tests\TaxonomyAttributesTest700
ExpandDrupal\rdf\Tests\TrackerAttributesTest201
MessageGroupFilenameLineFunctionStatus
Drupal\Core\Entity\EntityStorageException: SQLSTATE[23000]: Integrity constraint violation: 1048 Column 'comment_status' cannot be null: INSERT INTO {field_data_comment} (entity_type, entity_id, revision_id, bundle, delta, langcode, comment_status) VALUES (:db_insert_placeholder_0, :db_insert_placeholder_1, :db_insert_placeholder_2, :db_insert_placeholder_3, :db_insert_placeholder_4, :db_insert_placeholder_5, :db_insert_placeholder_6); Array ( [:db_insert_placeholder_0] => node [:db_insert_placeholder_1] => 1 [:db_insert_placeholder_2] => 1 [:db_insert_placeholder_3] => article [:db_insert_placeholder_4] => 0 [:db_insert_placeholder_5] => und [:db_insert_placeholder_6] => ) in Drupal\Core\Entity\DatabaseStorageController->save() (line 557 of /var/lib/drupaltestbot/sites/default/files/checkout/core/lib/Drupal/Core/Entity/DatabaseStorageController.php). Drupal\Core\Entity\DatabaseStorageController->save(Object) Drupal\Core\Entity\Entity->save() Drupal\simpletest\WebTestBase->drupalCreateNode(Array) Drupal\rdf\Tests\TrackerAttributesTest->testAttributesInTracker() Drupal\simpletest\TestBase->run() simpletest_script_run_one_test('474', 'Drupal\rdf\Tests\TrackerAttributesTest') Uncaught exceptionDatabaseStorageController.php557Drupal\Core\Entity\DatabaseStorageController->save()
LeafDrupal\rdf\Tests\UserAttributesTest4000
LeafDrupal\rest\Tests\CreateTest4000
LeafDrupal\rest\Tests\DBLogTest1800
LeafDrupal\rest\Tests\DeleteTest8900
LeafDrupal\rest\Tests\ReadTest3500
LeafDrupal\rest\Tests\UpdateTest7500
LeafDrupal\rest\Tests\Views\StyleSerializerTest5200
LeafDrupal\search\Tests\SearchAdvancedSearchFormTest3400
LeafDrupal\search\Tests\SearchBlockTest3800
ExpandDrupal\search\Tests\SearchCommentCountToggleTest410
MessageGroupFilenameLineFunctionStatus
The test did not complete due to a fatal error.Completion checkSearchCommentCountToggleTest.php86Drupal\search\Tests\SearchCommentCountToggleTest->testSearchCommentCountToggle()
ExpandDrupal\search\Tests\SearchCommentTest4803
MessageGroupFilenameLineFunctionStatus
Drupal\Core\Entity\EntityStorageException: SQLSTATE[23000]: Integrity constraint violation: 1048 Column 'comment_status' cannot be null: INSERT INTO {field_data_comment} (entity_type, entity_id, revision_id, bundle, delta, langcode, comment_status) VALUES (:db_insert_placeholder_0, :db_insert_placeholder_1, :db_insert_placeholder_2, :db_insert_placeholder_3, :db_insert_placeholder_4, :db_insert_placeholder_5, :db_insert_placeholder_6); Array ( [:db_insert_placeholder_0] => node [:db_insert_placeholder_1] => 1 [:db_insert_placeholder_2] => 1 [:db_insert_placeholder_3] => article [:db_insert_placeholder_4] => 0 [:db_insert_placeholder_5] => und [:db_insert_placeholder_6] => ) in Drupal\Core\Entity\DatabaseStorageController->save() (line 557 of /var/lib/drupaltestbot/sites/default/files/checkout/core/lib/Drupal/Core/Entity/DatabaseStorageController.php). Drupal\Core\Entity\DatabaseStorageController->save(Object) Drupal\Core\Entity\Entity->save() Drupal\simpletest\WebTestBase->drupalCreateNode(Array) Drupal\search\Tests\SearchCommentTest->testSearchResultsComment() Drupal\simpletest\TestBase->run() simpletest_script_run_one_test('492', 'Drupal\search\Tests\SearchCommentTest') Uncaught exceptionDatabaseStorageController.php557Drupal\Core\Entity\DatabaseStorageController->save()
Drupal\Core\Entity\EntityStorageException: SQLSTATE[23000]: Integrity constraint violation: 1048 Column 'comment_status' cannot be null: INSERT INTO {field_data_comment} (entity_type, entity_id, revision_id, bundle, delta, langcode, comment_status) VALUES (:db_insert_placeholder_0, :db_insert_placeholder_1, :db_insert_placeholder_2, :db_insert_placeholder_3, :db_insert_placeholder_4, :db_insert_placeholder_5, :db_insert_placeholder_6); Array ( [:db_insert_placeholder_0] => node [:db_insert_placeholder_1] => 1 [:db_insert_placeholder_2] => 1 [:db_insert_placeholder_3] => article [:db_insert_placeholder_4] => 0 [:db_insert_placeholder_5] => und [:db_insert_placeholder_6] => ) in Drupal\Core\Entity\DatabaseStorageController->save() (line 557 of /var/lib/drupaltestbot/sites/default/files/checkout/core/lib/Drupal/Core/Entity/DatabaseStorageController.php). Drupal\Core\Entity\DatabaseStorageController->save(Object) Drupal\Core\Entity\Entity->save() Drupal\simpletest\WebTestBase->drupalCreateNode(Array) Drupal\search\Tests\SearchCommentTest->testSearchResultsCommentAccess() Drupal\simpletest\TestBase->run() simpletest_script_run_one_test('492', 'Drupal\search\Tests\SearchCommentTest') Uncaught exceptionDatabaseStorageController.php557Drupal\Core\Entity\DatabaseStorageController->save()
Drupal\Core\Entity\EntityStorageException: SQLSTATE[23000]: Integrity constraint violation: 1048 Column 'comment_status' cannot be null: INSERT INTO {field_data_comment} (entity_type, entity_id, revision_id, bundle, delta, langcode, comment_status) VALUES (:db_insert_placeholder_0, :db_insert_placeholder_1, :db_insert_placeholder_2, :db_insert_placeholder_3, :db_insert_placeholder_4, :db_insert_placeholder_5, :db_insert_placeholder_6); Array ( [:db_insert_placeholder_0] => node [:db_insert_placeholder_1] => 1 [:db_insert_placeholder_2] => 1 [:db_insert_placeholder_3] => article [:db_insert_placeholder_4] => 0 [:db_insert_placeholder_5] => und [:db_insert_placeholder_6] => ) in Drupal\Core\Entity\DatabaseStorageController->save() (line 557 of /var/lib/drupaltestbot/sites/default/files/checkout/core/lib/Drupal/Core/Entity/DatabaseStorageController.php). Drupal\Core\Entity\DatabaseStorageController->save(Object) Drupal\Core\Entity\Entity->save() Drupal\simpletest\WebTestBase->drupalCreateNode(Array) Drupal\search\Tests\SearchCommentTest->testAddNewComment() Drupal\simpletest\TestBase->run() simpletest_script_run_one_test('492', 'Drupal\search\Tests\SearchCommentTest') Uncaught exceptionDatabaseStorageController.php557Drupal\Core\Entity\DatabaseStorageController->save()
LeafDrupal\search\Tests\SearchConfigSettingsFormTest15900
LeafDrupal\search\Tests\SearchEmbedFormTest3200
LeafDrupal\search\Tests\SearchExactTest2500
LeafDrupal\search\Tests\SearchExcerptTest1800
LeafDrupal\search\Tests\SearchExpressionInsertExtractTest2400
LeafDrupal\search\Tests\SearchKeywordsConditionsTest2800
LeafDrupal\search\Tests\SearchLanguageTest4300
LeafDrupal\search\Tests\SearchMatchTest14700
LeafDrupal\search\Tests\SearchMultilingualEntityTest1000
LeafDrupal\search\Tests\SearchNodeAccessTest1600
LeafDrupal\search\Tests\SearchNumberMatchingTest29500
LeafDrupal\search\Tests\SearchNumbersTest17500
LeafDrupal\search\Tests\SearchPageOverrideTest1500
LeafDrupal\search\Tests\SearchPageTextTest3700
LeafDrupal\search\Tests\SearchPreprocessLangcodeTest3900
ExpandDrupal\search\Tests\SearchRankingTest4701
MessageGroupFilenameLineFunctionStatus
Drupal\Core\Entity\EntityStorageException: SQLSTATE[23000]: Integrity constraint violation: 1048 Column 'comment_status' cannot be null: INSERT INTO {field_data_comment} (entity_type, entity_id, revision_id, bundle, delta, langcode, comment_status) VALUES (:db_insert_placeholder_0, :db_insert_placeholder_1, :db_insert_placeholder_2, :db_insert_placeholder_3, :db_insert_placeholder_4, :db_insert_placeholder_5, :db_insert_placeholder_6); Array ( [:db_insert_placeholder_0] => node [:db_insert_placeholder_1] => 1 [:db_insert_placeholder_2] => 1 [:db_insert_placeholder_3] => page [:db_insert_placeholder_4] => 0 [:db_insert_placeholder_5] => und [:db_insert_placeholder_6] => ) in Drupal\Core\Entity\DatabaseStorageController->save() (line 557 of /var/lib/drupaltestbot/sites/default/files/checkout/core/lib/Drupal/Core/Entity/DatabaseStorageController.php). Drupal\Core\Entity\DatabaseStorageController->save(Object) Drupal\Core\Entity\Entity->save() Drupal\simpletest\WebTestBase->drupalCreateNode(Array) Drupal\search\Tests\SearchRankingTest->testRankings() Drupal\simpletest\TestBase->run() simpletest_script_run_one_test('508', 'Drupal\search\Tests\SearchRankingTest') Uncaught exceptionDatabaseStorageController.php557Drupal\Core\Entity\DatabaseStorageController->save()
LeafDrupal\search\Tests\SearchSimplifyTest65700
LeafDrupal\search\Tests\SearchTokenizerTest800
LeafDrupal\serialization\Tests\EntitySerializationTest1700
LeafDrupal\serialization\Tests\SerializationTest200
LeafDrupal\shortcut\Tests\ShortcutLinksTest14800
LeafDrupal\shortcut\Tests\ShortcutSetsTest23500
LeafDrupal\simpletest\Tests\BrokenSetUpTest2100
LeafDrupal\simpletest\Tests\BrowserTest1600
LeafDrupal\simpletest\Tests\DrupalUnitTestBaseTest4000
LeafDrupal\simpletest\Tests\FolderTest200
LeafDrupal\simpletest\Tests\InstallationProfileModuleTestsTest1900
LeafDrupal\simpletest\Tests\MailCaptureTest1200
LeafDrupal\simpletest\Tests\MissingCheckedRequirementsTest1900
LeafDrupal\simpletest\Tests\OtherInstallationProfileModuleTestsTest1200
LeafDrupal\simpletest\Tests\SimpleTestTest11400
LeafDrupal\simpletest\Tests\UserHelpersTest4600
LeafDrupal\standard\Tests\StandardTest700
LeafDrupal\statistics\Tests\StatisticsAdminTest5800
LeafDrupal\statistics\Tests\StatisticsLoggingTest2100
LeafDrupal\statistics\Tests\StatisticsReportsTest1900
LeafDrupal\statistics\Tests\StatisticsTokenReplaceTest3000
LeafDrupal\statistics\Tests\Views\IntegrationTest1600
LeafDrupal\syslog\Tests\SyslogTest1700
LeafDrupal\system\Tests\Ajax\AjaxCommandsUnitTest1600
LeafDrupal\system\Tests\Ajax\CommandsTest7700
LeafDrupal\system\Tests\Ajax\DialogTest300
LeafDrupal\system\Tests\Ajax\ElementValidationTest700
LeafDrupal\system\Tests\Ajax\FormValuesTest2900
LeafDrupal\system\Tests\Ajax\FrameworkTest3400
LeafDrupal\system\Tests\Ajax\MultiFormTest3700
LeafDrupal\system\Tests\Batch\PageTest1600
LeafDrupal\system\Tests\Batch\PercentagesUnitTest1800
LeafDrupal\system\Tests\Batch\ProcessingTest16100
LeafDrupal\system\Tests\Bootstrap\GetFilenameUnitTest700
LeafDrupal\system\Tests\Bootstrap\HookExitTest1900
LeafDrupal\system\Tests\Bootstrap\IpAddressTest1100
LeafDrupal\system\Tests\Bootstrap\MiscUnitTest400
LeafDrupal\system\Tests\Bootstrap\OverrideServerVariablesUnitTest600
LeafDrupal\system\Tests\Bootstrap\PageCacheTest7900
LeafDrupal\system\Tests\Bootstrap\ResettableStaticUnitTest500
LeafDrupal\system\Tests\Bootstrap\TimerUnitTest500
LeafDrupal\system\Tests\Bootstrap\VariableTest900
LeafDrupal\system\Tests\Bundle\BundleTest900
LeafDrupal\system\Tests\Cache\BackendChainImplementationUnitTest4800
LeafDrupal\system\Tests\Cache\BackendChainUnitTest12600
LeafDrupal\system\Tests\Cache\ClearTest900
LeafDrupal\system\Tests\Cache\DatabaseBackendUnitTest12600
LeafDrupal\system\Tests\Cache\MemoryBackendUnitTest12600
LeafDrupal\system\Tests\Cache\NullBackendTest200
LeafDrupal\system\Tests\Common\AddFeedTest700
LeafDrupal\system\Tests\Common\AlterTest700
LeafDrupal\system\Tests\Common\AttributesUnitTest700
LeafDrupal\system\Tests\Common\AutocompleteTagsUnitTest800
LeafDrupal\system\Tests\Common\CascadingStylesheetsTest3700
LeafDrupal\system\Tests\Common\CascadingStylesheetsUnitTest1200
LeafDrupal\system\Tests\Common\ColorTest8500
LeafDrupal\system\Tests\Common\FormatDateTest7300
LeafDrupal\system\Tests\Common\GotoTest2700
LeafDrupal\system\Tests\Common\HtmlIdentifierUnitTest1000
LeafDrupal\system\Tests\Common\HttpRequestTest3600
LeafDrupal\system\Tests\Common\InstallerLanguageTest800
LeafDrupal\system\Tests\Common\JavaScriptTest8900
LeafDrupal\system\Tests\Common\JsonUnitTest2100
LeafDrupal\system\Tests\Common\NestedArrayUnitTest1400
LeafDrupal\system\Tests\Common\ParseInfoFileUnitTest300
LeafDrupal\system\Tests\Common\RegionContentTest1800
LeafDrupal\system\Tests\Common\RenderTest5400
LeafDrupal\system\Tests\Common\SimpleTestErrorCollectorTest1600
LeafDrupal\system\Tests\Common\SizeUnitTest3500
LeafDrupal\system\Tests\Common\SystemListingTest600
LeafDrupal\system\Tests\Common\TableSortExtenderUnitTest600
LeafDrupal\system\Tests\Common\UrlTest7000
LeafDrupal\system\Tests\Common\ValidNumberStepUnitTest2400
LeafDrupal\system\Tests\Common\ValidUrlUnitTest7900
LeafDrupal\system\Tests\Common\WriteRecordTest3400
LeafDrupal\system\Tests\Common\XssUnitTest1700
LeafDrupal\system\Tests\Database\AlterTest2000
LeafDrupal\system\Tests\Database\BasicSyntaxTest600
LeafDrupal\system\Tests\Database\CaseSensitivityTest200
LeafDrupal\system\Tests\Database\ConnectionTest1400
LeafDrupal\system\Tests\Database\ConnectionUnitTest1200
LeafDrupal\system\Tests\Database\DatabaseExceptionWrapperTest100
LeafDrupal\system\Tests\Database\DeleteTruncateTest500
LeafDrupal\system\Tests\Database\EmptyStatementTest400
LeafDrupal\system\Tests\Database\FetchTest2400
LeafDrupal\system\Tests\Database\InsertDefaultsTest400
LeafDrupal\system\Tests\Database\InsertLobTest300
LeafDrupal\system\Tests\Database\InsertTest1500
LeafDrupal\system\Tests\Database\InvalidDataTest200
LeafDrupal\system\Tests\Database\LoggingTest1400
LeafDrupal\system\Tests\Database\MergeTest3500
LeafDrupal\system\Tests\Database\NextIdTest200
LeafDrupal\system\Tests\Database\QueryTest100
LeafDrupal\system\Tests\Database\RangeQueryTest200
LeafDrupal\system\Tests\Database\RegressionTest700
LeafDrupal\system\Tests\Database\SchemaTest89800
LeafDrupal\system\Tests\Database\SelectCloneTest400
LeafDrupal\system\Tests\Database\SelectComplexTest10100
LeafDrupal\system\Tests\Database\SelectOrderedTest2200
LeafDrupal\system\Tests\Database\SelectPagerDefaultTest2200
LeafDrupal\system\Tests\Database\SelectSubqueryTest700
LeafDrupal\system\Tests\Database\SelectTableSortDefaultTest3000
LeafDrupal\system\Tests\Database\SelectTest5400
LeafDrupal\system\Tests\Database\SerializeQueryTest100
LeafDrupal\system\Tests\Database\TaggingTest800
LeafDrupal\system\Tests\Database\TemporaryQueryTest600
LeafDrupal\system\Tests\Database\TransactionTest4400
LeafDrupal\system\Tests\Database\UpdateComplexTest1900
LeafDrupal\system\Tests\Database\UpdateLobTest300
LeafDrupal\system\Tests\Database\UpdateTest1500
LeafDrupal\system\Tests\Datetime\DateTimePlusTest5400
LeafDrupal\system\Tests\Datetime\DrupalDateTimeTest1400
LeafDrupal\system\Tests\DrupalKernel\ContentNegotiationTest4000
LeafDrupal\system\Tests\DrupalKernel\DrupalKernelTest800
LeafDrupal\system\Tests\Entity\ConfigEntityQueryTest11300
LeafDrupal\system\Tests\Entity\EntityAccessTest3400
LeafDrupal\system\Tests\Entity\EntityApiInfoTest600
LeafDrupal\system\Tests\Entity\EntityApiTest2600
ExpandDrupal\system\Tests\Entity\EntityCrudHookTest13601
MessageGroupFilenameLineFunctionStatus
Drupal\Core\Entity\EntityStorageException: SQLSTATE[23000]: Integrity constraint violation: 1048 Column 'comment_status' cannot be null: INSERT INTO {field_data_comment} (entity_type, entity_id, revision_id, bundle, delta, langcode, comment_status) VALUES (:db_insert_placeholder_0, :db_insert_placeholder_1, :db_insert_placeholder_2, :db_insert_placeholder_3, :db_insert_placeholder_4, :db_insert_placeholder_5, :db_insert_placeholder_6); Array ( [:db_insert_placeholder_0] => node [:db_insert_placeholder_1] => 1 [:db_insert_placeholder_2] => 1 [:db_insert_placeholder_3] => article [:db_insert_placeholder_4] => 0 [:db_insert_placeholder_5] => und [:db_insert_placeholder_6] => ) in Drupal\Core\Entity\DatabaseStorageController->save() (line 557 of /var/lib/drupaltestbot/sites/default/files/checkout/core/lib/Drupal/Core/Entity/DatabaseStorageController.php). Drupal\Core\Entity\DatabaseStorageController->save(Object) Drupal\Core\Entity\Entity->save() Drupal\system\Tests\Entity\EntityCrudHookTest->testCommentHooks() Drupal\simpletest\TestBase->run() simpletest_script_run_one_test('186', 'Drupal\system\Tests\Entity\EntityCrudHookTest') Uncaught exceptionDatabaseStorageController.php557Drupal\Core\Entity\DatabaseStorageController->save()
LeafDrupal\system\Tests\Entity\EntityFieldTest68800
LeafDrupal\system\Tests\Entity\EntityFormTest7700
LeafDrupal\system\Tests\Entity\EntityQueryAggregateTest4400
LeafDrupal\system\Tests\Entity\EntityQueryRelationshipTest2000
LeafDrupal\system\Tests\Entity\EntityQueryTest6200
LeafDrupal\system\Tests\Entity\EntityRevisionsTest5300
LeafDrupal\system\Tests\Entity\EntityTranslationFormTest3600
LeafDrupal\system\Tests\Entity\EntityTranslationTest13800
LeafDrupal\system\Tests\Entity\EntityUriTest100
LeafDrupal\system\Tests\Entity\EntityUUIDTest7700
LeafDrupal\system\Tests\FileTransfer\FileTransferTest200
LeafDrupal\system\Tests\File\ConfigTest2100
LeafDrupal\system\Tests\File\DirectoryTest2700
LeafDrupal\system\Tests\File\MimeTypeTest4200
LeafDrupal\system\Tests\File\NameMungingTest600
LeafDrupal\system\Tests\File\ReadOnlyStreamWrapperTest1600
LeafDrupal\system\Tests\File\RemoteFileDirectoryTest3200
LeafDrupal\system\Tests\File\RemoteFileScanDirectoryTest2900
LeafDrupal\system\Tests\File\RemoteFileUnmanagedCopyTest3200
LeafDrupal\system\Tests\File\RemoteFileUnmanagedDeleteRecursiveTest2100
LeafDrupal\system\Tests\File\RemoteFileUnmanagedDeleteTest1000
LeafDrupal\system\Tests\File\RemoteFileUnmanagedMoveTest2300
LeafDrupal\system\Tests\File\RemoteFileUnmanagedSaveDataTest800
LeafDrupal\system\Tests\File\ScanDirectoryTest2900
LeafDrupal\system\Tests\File\StreamWrapperTest1900
LeafDrupal\system\Tests\File\UnmanagedCopyTest2900
LeafDrupal\system\Tests\File\UnmanagedDeleteRecursiveTest1700
LeafDrupal\system\Tests\File\UnmanagedDeleteTest700
LeafDrupal\system\Tests\File\UnmanagedMoveTest2000
LeafDrupal\system\Tests\File\UnmanagedSaveDataTest700
LeafDrupal\system\Tests\File\UrlRewritingTest1400
LeafDrupal\system\Tests\Form\AlterTest400
LeafDrupal\system\Tests\Form\ArbitraryRebuildTest1600
LeafDrupal\system\Tests\Form\CheckboxTest9700
LeafDrupal\system\Tests\Form\ElementsLabelsTest2000
LeafDrupal\system\Tests\Form\ElementsTableSelectTest8600
LeafDrupal\system\Tests\Form\ElementsVerticalTabsTest6500
LeafDrupal\system\Tests\Form\ElementTest8500
LeafDrupal\system\Tests\Form\EmailTest3400
LeafDrupal\system\Tests\Form\FileInclusionTest2200
LeafDrupal\system\Tests\Form\FormObjectTest2200
LeafDrupal\system\Tests\Form\FormTest86900
LeafDrupal\system\Tests\Form\HTMLIdTest800
LeafDrupal\system\Tests\Form\LanguageSelectElementTest4400
LeafDrupal\system\Tests\Form\ProgrammaticTest2400
LeafDrupal\system\Tests\Form\RebuildTest5300
LeafDrupal\system\Tests\Form\RedirectTest3100
LeafDrupal\system\Tests\Form\StateValuesCleanAdvancedTest700
LeafDrupal\system\Tests\Form\StateValuesCleanTest1400
LeafDrupal\system\Tests\Form\StorageTest12000
LeafDrupal\system\Tests\Form\TriggeringElementTest5000
LeafDrupal\system\Tests\Form\UrlTest1700
LeafDrupal\system\Tests\Form\ValidationTest11200
LeafDrupal\system\Tests\Form\WrapperTest500
LeafDrupal\system\Tests\Graph\GraphUnitTest2800
LeafDrupal\system\Tests\Image\FileMoveTest400
LeafDrupal\system\Tests\Image\ToolkitGdTest20400
LeafDrupal\system\Tests\Image\ToolkitTest5300
LeafDrupal\system\Tests\KeyValueStore\DatabaseStorageExpirableTest6800
LeafDrupal\system\Tests\KeyValueStore\DatabaseStorageTest3600
LeafDrupal\system\Tests\KeyValueStore\GarbageCollectionTest200
LeafDrupal\system\Tests\KeyValueStore\MemoryStorageTest3600
LeafDrupal\system\Tests\Lock\LockFunctionalTest1800
LeafDrupal\system\Tests\Lock\LockUnitTest900
LeafDrupal\system\Tests\Mail\HtmlToTextTest8600
LeafDrupal\system\Tests\Mail\MailTest700
LeafDrupal\system\Tests\Mail\WrapMailUnitTest200
LeafDrupal\system\Tests\Menu\BreadcrumbTest40300
LeafDrupal\system\Tests\Menu\LinksTest5000
LeafDrupal\system\Tests\Menu\MenuRouterTest22900
LeafDrupal\system\Tests\Menu\RebuildTest500
LeafDrupal\system\Tests\Menu\TrailTest6800
LeafDrupal\system\Tests\Menu\TreeDataUnitTest400
LeafDrupal\system\Tests\Menu\TreeOutputTest700
LeafDrupal\system\Tests\Module\ClassLoaderTest1000
LeafDrupal\system\Tests\Module\DependencyTest17000
LeafDrupal\system\Tests\Module\EnableDisableTest233500
LeafDrupal\system\Tests\Module\HookRequirementsTest1600
LeafDrupal\system\Tests\Module\InstallTest300
LeafDrupal\system\Tests\Module\ModuleApiTest6600
LeafDrupal\system\Tests\Module\ModuleEnable300
LeafDrupal\system\Tests\Module\RequiredTest2000
LeafDrupal\system\Tests\Module\UninstallTest200
LeafDrupal\system\Tests\Module\VersionTest5100
LeafDrupal\system\Tests\Pager\PagerTest12300
LeafDrupal\system\Tests\ParamConverter\UpcastingTest1700
LeafDrupal\system\Tests\Path\AliasTest2700
LeafDrupal\system\Tests\Path\MatchPathTest4100
LeafDrupal\system\Tests\Path\UrlAlterFunctionalTest3700
LeafDrupal\system\Tests\PhpStorage\FileStorageTest1200
LeafDrupal\system\Tests\PhpStorage\MTimeProtectedFastFileStorageTest1900
LeafDrupal\system\Tests\PhpStorage\MTimeProtectedFileStorageTest1900
LeafDrupal\system\Tests\Plugin\AlterDecoratorTest300
LeafDrupal\system\Tests\Plugin\CacheDecoratorLanguageTest3800
LeafDrupal\system\Tests\Plugin\CacheDecoratorTest1400
LeafDrupal\system\Tests\Plugin\ContextPluginTest2200
LeafDrupal\system\Tests\Plugin\DerivativeTest1200
LeafDrupal\system\Tests\Plugin\Discovery\AnnotatedClassDiscoveryTest700
LeafDrupal\system\Tests\Plugin\Discovery\StaticDiscoveryTest600
LeafDrupal\system\Tests\Plugin\FactoryTest900
LeafDrupal\system\Tests\Plugin\InspectionTest1000
LeafDrupal\system\Tests\Plugin\PluginBagTest2800
LeafDrupal\system\Tests\Queue\QueueTest1400
LeafDrupal\system\Tests\Routing\ControllerResolverTest100
LeafDrupal\system\Tests\Routing\MatcherDumperTest800
LeafDrupal\system\Tests\Routing\MimeTypeMatcherTest1000
LeafDrupal\system\Tests\Routing\RouteProviderTest3700
LeafDrupal\system\Tests\Routing\RouterPermissionTest2300
LeafDrupal\system\Tests\Routing\RouterTest3000
LeafDrupal\system\Tests\Routing\RouteTest600
LeafDrupal\system\Tests\Routing\UrlGeneratorTest200
LeafDrupal\system\Tests\Session\SessionHttpsTest8300
LeafDrupal\system\Tests\Session\SessionTest18700
LeafDrupal\system\Tests\System\AccessDeniedTest6400
LeafDrupal\system\Tests\System\AdminMetaTagTest300
LeafDrupal\system\Tests\System\AdminTest18100
LeafDrupal\system\Tests\System\CronRunTest5200
LeafDrupal\system\Tests\System\DateFormatsLanguageTest5600
LeafDrupal\system\Tests\System\DateTimeTest8800
LeafDrupal\system\Tests\System\DefaultMobileMetaTagsTest1200
LeafDrupal\system\Tests\System\ErrorHandlerTest4000
LeafDrupal\system\Tests\System\ExceptionControllerTest200
LeafDrupal\system\Tests\System\FloodTest1000
LeafDrupal\system\Tests\System\FrontPageTest3700
LeafDrupal\system\Tests\System\IndexPhpTest600
LeafDrupal\system\Tests\System\InfoAlterTest1000
LeafDrupal\system\Tests\System\InfoFileParserUnitTest900
LeafDrupal\system\Tests\System\MainContentFallbackTest6000
LeafDrupal\system\Tests\System\PageNotFoundTest1800
LeafDrupal\system\Tests\System\PageTitleFilteringTest6800
LeafDrupal\system\Tests\System\PasswordHashingTest1000
LeafDrupal\system\Tests\System\RetrieveFileTest700
LeafDrupal\system\Tests\System\ShutdownFunctionsTest500
LeafDrupal\system\Tests\System\SiteMaintenanceTest12600
LeafDrupal\system\Tests\System\SystemAuthorizeTest2600
LeafDrupal\system\Tests\System\ThemeTest32200
LeafDrupal\system\Tests\System\TokenReplaceTest5200
LeafDrupal\system\Tests\System\TokenScanTest800
LeafDrupal\system\Tests\System\UnicodeUnitTest18200
LeafDrupal\system\Tests\Theme\EntityFilteringThemeTest5600
LeafDrupal\system\Tests\Theme\FastTest1200
LeafDrupal\system\Tests\Theme\FunctionsTest2600
LeafDrupal\system\Tests\Theme\HookInitTest500
LeafDrupal\system\Tests\Theme\HtmlTagUnitTest200
LeafDrupal\system\Tests\Theme\HtmlTplPhpAttributesTest500
LeafDrupal\system\Tests\Theme\RegistryTest600
LeafDrupal\system\Tests\Theme\TableTest600
LeafDrupal\system\Tests\Theme\ThemeInfoStylesTest1300
LeafDrupal\system\Tests\Theme\ThemeTest4800
LeafDrupal\system\Tests\Theme\ThemeTestTwig1000
LeafDrupal\system\Tests\Theme\TwigReferenceUnitTest1500
LeafDrupal\system\Tests\Transliteration\TransliterationTest3000
LeafDrupal\system\Tests\TypedData\TypedDataTest13000
LeafDrupal\system\Tests\Update\DependencyHookInvocationTest400
LeafDrupal\system\Tests\Update\DependencyMissingTest400
LeafDrupal\system\Tests\Update\DependencyOrderingTest500
LeafDrupal\system\Tests\Update\UpdateScriptTest20100
LeafDrupal\system\Tests\Upgrade\BareMinimalUpgradePathTest6500
LeafDrupal\system\Tests\Upgrade\BareStandardUpgradePathTest7700
LeafDrupal\system\Tests\Upgrade\BlockUpgradePathTest3700
LeafDrupal\system\Tests\Upgrade\CommentUpgradePathTest4700
LeafDrupal\system\Tests\Upgrade\DateUpgradePathTest5600
LeafDrupal\system\Tests\Upgrade\FieldUIUpgradePathTest6100
LeafDrupal\system\Tests\Upgrade\FieldUpgradePathTest4800
LeafDrupal\system\Tests\Upgrade\FilledMinimalUpgradePathTest6700
LeafDrupal\system\Tests\Upgrade\FilledStandardUpgradePathTest9500
LeafDrupal\system\Tests\Upgrade\FilterFormatUpgradePathTest5400
LeafDrupal\system\Tests\Upgrade\ImageUpgradePathTest4300
LeafDrupal\system\Tests\Upgrade\LanguageUpgradePathTest20000
LeafDrupal\system\Tests\Upgrade\ModulesDisabledUpgradePathTest4300
LeafDrupal\system\Tests\Upgrade\ShortcutUpgradePathTest5100
LeafDrupal\system\Tests\Upgrade\StateSystemUpgradePathTest5900
LeafDrupal\system\Tests\Upgrade\SystemUpgradePathTest10200
LeafDrupal\system\Tests\Upgrade\UserPictureUpgradePathTest5600
LeafDrupal\system\Tests\Upgrade\UserRoleUpgradePathTest9200
LeafDrupal\system\Tests\Upgrade\UuidUpgradePathTest4200
LeafDrupal\system\Tests\Uuid\UuidUnitTest700
LeafDrupal\taxonomy\Tests\EfqTest2800
LeafDrupal\taxonomy\Tests\HooksTest4600
LeafDrupal\taxonomy\Tests\LegacyTest1400
LeafDrupal\taxonomy\Tests\LoadMultipleTest3600
LeafDrupal\taxonomy\Tests\RssTest3000
LeafDrupal\taxonomy\Tests\TaxonomyTermReferenceItemTest1800
LeafDrupal\taxonomy\Tests\TermFieldMultipleVocabularyTest2600
LeafDrupal\taxonomy\Tests\TermFieldTest4500
LeafDrupal\taxonomy\Tests\TermIndexTest4600
LeafDrupal\taxonomy\Tests\TermLanguageTest6400
LeafDrupal\taxonomy\Tests\TermTest26400
LeafDrupal\taxonomy\Tests\TermTranslationUITest15300
LeafDrupal\taxonomy\Tests\TermUnitTest1100
LeafDrupal\taxonomy\Tests\ThemeTest1900
LeafDrupal\taxonomy\Tests\TokenReplaceTest5500
ExpandDrupal\taxonomy\Tests\Views\RelationshipNodeTermDataTest200
MessageGroupFilenameLineFunctionStatus
'Missing handler: nid nid sort'Debugviews.module926views_get_handler()
LeafDrupal\taxonomy\Tests\Views\RelationshipRepresentativeNode200
LeafDrupal\taxonomy\Tests\VocabularyLanguageTest6000
LeafDrupal\taxonomy\Tests\VocabularyTest11000
LeafDrupal\taxonomy\Tests\VocabularyUnitTest6800
LeafDrupal\telephone\Tests\TelephoneFieldTest2000
LeafDrupal\telephone\Tests\TelephoneItemTest600
LeafDrupal\text\Tests\TextFieldTest18600
LeafDrupal\text\Tests\TextSummaryTest13800
LeafDrupal\text\Tests\TextTranslationTest10400
LeafDrupal\toolbar\Tests\ToolbarHookToolbarTest1500
LeafDrupal\toolbar\Tests\ToolbarMenuTranslationTest3800
LeafDrupal\tracker\Tests\TrackerNodeAccessTest2800
ExpandDrupal\tracker\Tests\TrackerTest10705
MessageGroupFilenameLineFunctionStatus
Drupal\Core\Entity\EntityStorageException: SQLSTATE[23000]: Integrity constraint violation: 1048 Column 'comment_status' cannot be null: INSERT INTO {field_data_comment} (entity_type, entity_id, revision_id, bundle, delta, langcode, comment_status) VALUES (:db_insert_placeholder_0, :db_insert_placeholder_1, :db_insert_placeholder_2, :db_insert_placeholder_3, :db_insert_placeholder_4, :db_insert_placeholder_5, :db_insert_placeholder_6); Array ( [:db_insert_placeholder_0] => node [:db_insert_placeholder_1] => 1 [:db_insert_placeholder_2] => 1 [:db_insert_placeholder_3] => page [:db_insert_placeholder_4] => 0 [:db_insert_placeholder_5] => und [:db_insert_placeholder_6] => ) in Drupal\Core\Entity\DatabaseStorageController->save() (line 557 of /var/lib/drupaltestbot/sites/default/files/checkout/core/lib/Drupal/Core/Entity/DatabaseStorageController.php). Drupal\Core\Entity\DatabaseStorageController->save(Object) Drupal\Core\Entity\Entity->save() Drupal\simpletest\WebTestBase->drupalCreateNode(Array) Drupal\tracker\Tests\TrackerTest->testTrackerAll() Drupal\simpletest\TestBase->run() simpletest_script_run_one_test('599', 'Drupal\tracker\Tests\TrackerTest') Uncaught exceptionDatabaseStorageController.php557Drupal\Core\Entity\DatabaseStorageController->save()
Drupal\Core\Entity\EntityStorageException: SQLSTATE[23000]: Integrity constraint violation: 1048 Column 'comment_status' cannot be null: INSERT INTO {field_data_comment} (entity_type, entity_id, revision_id, bundle, delta, langcode, comment_status) VALUES (:db_insert_placeholder_0, :db_insert_placeholder_1, :db_insert_placeholder_2, :db_insert_placeholder_3, :db_insert_placeholder_4, :db_insert_placeholder_5, :db_insert_placeholder_6); Array ( [:db_insert_placeholder_0] => node [:db_insert_placeholder_1] => 1 [:db_insert_placeholder_2] => 1 [:db_insert_placeholder_3] => page [:db_insert_placeholder_4] => 0 [:db_insert_placeholder_5] => und [:db_insert_placeholder_6] => ) in Drupal\Core\Entity\DatabaseStorageController->save() (line 557 of /var/lib/drupaltestbot/sites/default/files/checkout/core/lib/Drupal/Core/Entity/DatabaseStorageController.php). Drupal\Core\Entity\DatabaseStorageController->save(Object) Drupal\Core\Entity\Entity->save() Drupal\simpletest\WebTestBase->drupalCreateNode(Array) Drupal\tracker\Tests\TrackerTest->testTrackerUser() Drupal\simpletest\TestBase->run() simpletest_script_run_one_test('599', 'Drupal\tracker\Tests\TrackerTest') Uncaught exceptionDatabaseStorageController.php557Drupal\Core\Entity\DatabaseStorageController->save()
Drupal\Core\Entity\EntityStorageException: SQLSTATE[23000]: Integrity constraint violation: 1048 Column 'comment_status' cannot be null: INSERT INTO {field_data_comment} (entity_type, entity_id, revision_id, bundle, delta, langcode, comment_status) VALUES (:db_insert_placeholder_0, :db_insert_placeholder_1, :db_insert_placeholder_2, :db_insert_placeholder_3, :db_insert_placeholder_4, :db_insert_placeholder_5, :db_insert_placeholder_6); Array ( [:db_insert_placeholder_0] => node [:db_insert_placeholder_1] => 1 [:db_insert_placeholder_2] => 1 [:db_insert_placeholder_3] => page [:db_insert_placeholder_4] => 0 [:db_insert_placeholder_5] => und [:db_insert_placeholder_6] => ) in Drupal\Core\Entity\DatabaseStorageController->save() (line 557 of /var/lib/drupaltestbot/sites/default/files/checkout/core/lib/Drupal/Core/Entity/DatabaseStorageController.php). Drupal\Core\Entity\DatabaseStorageController->save(Object) Drupal\Core\Entity\Entity->save() Drupal\simpletest\WebTestBase->drupalCreateNode(Array) Drupal\tracker\Tests\TrackerTest->testTrackerNewComments() Drupal\simpletest\TestBase->run() simpletest_script_run_one_test('599', 'Drupal\tracker\Tests\TrackerTest') Uncaught exceptionDatabaseStorageController.php557Drupal\Core\Entity\DatabaseStorageController->save()
Drupal\Core\Entity\EntityStorageException: SQLSTATE[23000]: Integrity constraint violation: 1048 Column 'comment_status' cannot be null: INSERT INTO {field_data_comment} (entity_type, entity_id, revision_id, bundle, delta, langcode, comment_status) VALUES (:db_insert_placeholder_0, :db_insert_placeholder_1, :db_insert_placeholder_2, :db_insert_placeholder_3, :db_insert_placeholder_4, :db_insert_placeholder_5, :db_insert_placeholder_6); Array ( [:db_insert_placeholder_0] => node [:db_insert_placeholder_1] => 1 [:db_insert_placeholder_2] => 1 [:db_insert_placeholder_3] => page [:db_insert_placeholder_4] => 0 [:db_insert_placeholder_5] => und [:db_insert_placeholder_6] => ) in Drupal\Core\Entity\DatabaseStorageController->save() (line 557 of /var/lib/drupaltestbot/sites/default/files/checkout/core/lib/Drupal/Core/Entity/DatabaseStorageController.php). Drupal\Core\Entity\DatabaseStorageController->save(Object) Drupal\Core\Entity\Entity->save() Drupal\simpletest\WebTestBase->drupalCreateNode(Array) Drupal\tracker\Tests\TrackerTest->testTrackerCronIndexing() Drupal\simpletest\TestBase->run() simpletest_script_run_one_test('599', 'Drupal\tracker\Tests\TrackerTest') Uncaught exceptionDatabaseStorageController.php557Drupal\Core\Entity\DatabaseStorageController->save()
Drupal\Core\Entity\EntityStorageException: SQLSTATE[23000]: Integrity constraint violation: 1048 Column 'comment_status' cannot be null: INSERT INTO {field_data_comment} (entity_type, entity_id, revision_id, bundle, delta, langcode, comment_status) VALUES (:db_insert_placeholder_0, :db_insert_placeholder_1, :db_insert_placeholder_2, :db_insert_placeholder_3, :db_insert_placeholder_4, :db_insert_placeholder_5, :db_insert_placeholder_6); Array ( [:db_insert_placeholder_0] => node [:db_insert_placeholder_1] => 1 [:db_insert_placeholder_2] => 1 [:db_insert_placeholder_3] => page [:db_insert_placeholder_4] => 0 [:db_insert_placeholder_5] => und [:db_insert_placeholder_6] => ) in Drupal\Core\Entity\DatabaseStorageController->save() (line 557 of /var/lib/drupaltestbot/sites/default/files/checkout/core/lib/Drupal/Core/Entity/DatabaseStorageController.php). Drupal\Core\Entity\DatabaseStorageController->save(Object) Drupal\Core\Entity\Entity->save() Drupal\simpletest\WebTestBase->drupalCreateNode(Array) Drupal\tracker\Tests\TrackerTest->testTrackerAdminUnpublish() Drupal\simpletest\TestBase->run() simpletest_script_run_one_test('599', 'Drupal\tracker\Tests\TrackerTest') Uncaught exceptionDatabaseStorageController.php557Drupal\Core\Entity\DatabaseStorageController->save()
LeafDrupal\translation\Tests\TranslationTest57800
LeafDrupal\translation_entity\Tests\ConfigTestTranslationUITest1700
LeafDrupal\translation_entity\Tests\EntityTestTranslationUITest11800
LeafDrupal\translation_entity\Tests\EntityTranslationSettingsTest4900
LeafDrupal\translation_entity\Tests\EntityTranslationWorkflowsTest16300
LeafDrupal\translation_entity\Tests\Views\TranslationLinkTest1700
LeafDrupal\update\Tests\UpdateContribTest19700
LeafDrupal\update\Tests\UpdateCoreTest22600
LeafDrupal\update\Tests\UpdateCoreUnitTest400
LeafDrupal\update\Tests\UpdateUploadTest6400
LeafDrupal\user\Tests\TempStoreDatabaseTest1900
LeafDrupal\user\Tests\UserAccountLinksTests6100
LeafDrupal\user\Tests\UserAdminSettingsFormTest400
LeafDrupal\user\Tests\UserAdminTest6100
LeafDrupal\user\Tests\UserAutocompleteTest2900
LeafDrupal\user\Tests\UserBlocksTests6600
ExpandDrupal\user\Tests\UserCancelTest17205
MessageGroupFilenameLineFunctionStatus
Drupal\Core\Entity\EntityStorageException: SQLSTATE[23000]: Integrity constraint violation: 1048 Column 'comment_status' cannot be null: INSERT INTO {field_data_comment} (entity_type, entity_id, revision_id, bundle, delta, langcode, comment_status) VALUES (:db_insert_placeholder_0, :db_insert_placeholder_1, :db_insert_placeholder_2, :db_insert_placeholder_3, :db_insert_placeholder_4, :db_insert_placeholder_5, :db_insert_placeholder_6); Array ( [:db_insert_placeholder_0] => node [:db_insert_placeholder_1] => 1 [:db_insert_placeholder_2] => 1 [:db_insert_placeholder_3] => page [:db_insert_placeholder_4] => 0 [:db_insert_placeholder_5] => und [:db_insert_placeholder_6] => ) in Drupal\Core\Entity\DatabaseStorageController->save() (line 557 of /var/lib/drupaltestbot/sites/default/files/checkout/core/lib/Drupal/Core/Entity/DatabaseStorageController.php). Drupal\Core\Entity\DatabaseStorageController->save(Object) Drupal\Core\Entity\Entity->save() Drupal\simpletest\WebTestBase->drupalCreateNode(Array) Drupal\user\Tests\UserCancelTest->testUserCancelWithoutPermission() Drupal\simpletest\TestBase->run() simpletest_script_run_one_test('635', 'Drupal\user\Tests\UserCancelTest') Uncaught exceptionDatabaseStorageController.php557Drupal\Core\Entity\DatabaseStorageController->save()
Drupal\Core\Entity\EntityStorageException: SQLSTATE[23000]: Integrity constraint violation: 1048 Column 'comment_status' cannot be null: INSERT INTO {field_data_comment} (entity_type, entity_id, revision_id, bundle, delta, langcode, comment_status) VALUES (:db_insert_placeholder_0, :db_insert_placeholder_1, :db_insert_placeholder_2, :db_insert_placeholder_3, :db_insert_placeholder_4, :db_insert_placeholder_5, :db_insert_placeholder_6); Array ( [:db_insert_placeholder_0] => node [:db_insert_placeholder_1] => 1 [:db_insert_placeholder_2] => 1 [:db_insert_placeholder_3] => page [:db_insert_placeholder_4] => 0 [:db_insert_placeholder_5] => und [:db_insert_placeholder_6] => ) in Drupal\Core\Entity\DatabaseStorageController->save() (line 557 of /var/lib/drupaltestbot/sites/default/files/checkout/core/lib/Drupal/Core/Entity/DatabaseStorageController.php). Drupal\Core\Entity\DatabaseStorageController->save(Object) Drupal\Core\Entity\Entity->save() Drupal\simpletest\WebTestBase->drupalCreateNode(Array) Drupal\user\Tests\UserCancelTest->testUserCancelInvalid() Drupal\simpletest\TestBase->run() simpletest_script_run_one_test('635', 'Drupal\user\Tests\UserCancelTest') Uncaught exceptionDatabaseStorageController.php557Drupal\Core\Entity\DatabaseStorageController->save()
Drupal\Core\Entity\EntityStorageException: SQLSTATE[23000]: Integrity constraint violation: 1048 Column 'comment_status' cannot be null: INSERT INTO {field_data_comment} (entity_type, entity_id, revision_id, bundle, delta, langcode, comment_status) VALUES (:db_insert_placeholder_0, :db_insert_placeholder_1, :db_insert_placeholder_2, :db_insert_placeholder_3, :db_insert_placeholder_4, :db_insert_placeholder_5, :db_insert_placeholder_6); Array ( [:db_insert_placeholder_0] => node [:db_insert_placeholder_1] => 1 [:db_insert_placeholder_2] => 1 [:db_insert_placeholder_3] => page [:db_insert_placeholder_4] => 0 [:db_insert_placeholder_5] => und [:db_insert_placeholder_6] => ) in Drupal\Core\Entity\DatabaseStorageController->save() (line 557 of /var/lib/drupaltestbot/sites/default/files/checkout/core/lib/Drupal/Core/Entity/DatabaseStorageController.php). Drupal\Core\Entity\DatabaseStorageController->save(Object) Drupal\Core\Entity\Entity->save() Drupal\simpletest\WebTestBase->drupalCreateNode(Array) Drupal\user\Tests\UserCancelTest->testUserBlockUnpublish() Drupal\simpletest\TestBase->run() simpletest_script_run_one_test('635', 'Drupal\user\Tests\UserCancelTest') Uncaught exceptionDatabaseStorageController.php557Drupal\Core\Entity\DatabaseStorageController->save()
Drupal\Core\Entity\EntityStorageException: SQLSTATE[23000]: Integrity constraint violation: 1048 Column 'comment_status' cannot be null: INSERT INTO {field_data_comment} (entity_type, entity_id, revision_id, bundle, delta, langcode, comment_status) VALUES (:db_insert_placeholder_0, :db_insert_placeholder_1, :db_insert_placeholder_2, :db_insert_placeholder_3, :db_insert_placeholder_4, :db_insert_placeholder_5, :db_insert_placeholder_6); Array ( [:db_insert_placeholder_0] => node [:db_insert_placeholder_1] => 1 [:db_insert_placeholder_2] => 1 [:db_insert_placeholder_3] => page [:db_insert_placeholder_4] => 0 [:db_insert_placeholder_5] => und [:db_insert_placeholder_6] => ) in Drupal\Core\Entity\DatabaseStorageController->save() (line 557 of /var/lib/drupaltestbot/sites/default/files/checkout/core/lib/Drupal/Core/Entity/DatabaseStorageController.php). Drupal\Core\Entity\DatabaseStorageController->save(Object) Drupal\Core\Entity\Entity->save() Drupal\simpletest\WebTestBase->drupalCreateNode(Array) Drupal\user\Tests\UserCancelTest->testUserAnonymize() Drupal\simpletest\TestBase->run() simpletest_script_run_one_test('635', 'Drupal\user\Tests\UserCancelTest') Uncaught exceptionDatabaseStorageController.php557Drupal\Core\Entity\DatabaseStorageController->save()
Drupal\Core\Entity\EntityStorageException: SQLSTATE[23000]: Integrity constraint violation: 1048 Column 'comment_status' cannot be null: INSERT INTO {field_data_comment} (entity_type, entity_id, revision_id, bundle, delta, langcode, comment_status) VALUES (:db_insert_placeholder_0, :db_insert_placeholder_1, :db_insert_placeholder_2, :db_insert_placeholder_3, :db_insert_placeholder_4, :db_insert_placeholder_5, :db_insert_placeholder_6); Array ( [:db_insert_placeholder_0] => node [:db_insert_placeholder_1] => 1 [:db_insert_placeholder_2] => 1 [:db_insert_placeholder_3] => page [:db_insert_placeholder_4] => 0 [:db_insert_placeholder_5] => und [:db_insert_placeholder_6] => ) in Drupal\Core\Entity\DatabaseStorageController->save() (line 557 of /var/lib/drupaltestbot/sites/default/files/checkout/core/lib/Drupal/Core/Entity/DatabaseStorageController.php). Drupal\Core\Entity\DatabaseStorageController->save(Object) Drupal\Core\Entity\Entity->save() Drupal\simpletest\WebTestBase->drupalCreateNode(Array) Drupal\user\Tests\UserCancelTest->testUserDelete() Drupal\simpletest\TestBase->run() simpletest_script_run_one_test('635', 'Drupal\user\Tests\UserCancelTest') Uncaught exceptionDatabaseStorageController.php557Drupal\Core\Entity\DatabaseStorageController->save()
LeafDrupal\user\Tests\UserCreateTest3900
LeafDrupal\user\Tests\UserDeleteTest1500
LeafDrupal\user\Tests\UserEditedOwnAccountTest2200
LeafDrupal\user\Tests\UserEditTest8800
LeafDrupal\user\Tests\UserEntityCallbacksTest700
LeafDrupal\user\Tests\UserLanguageCreationTest6800
LeafDrupal\user\Tests\UserLanguageTest3900
LeafDrupal\user\Tests\UserLoginTest15900
LeafDrupal\user\Tests\UserPasswordResetTest4500
LeafDrupal\user\Tests\UserPermissionsTest5000
ExpandDrupal\user\Tests\UserPictureTest3901
MessageGroupFilenameLineFunctionStatus
Drupal\Core\Entity\EntityStorageException: SQLSTATE[23000]: Integrity constraint violation: 1048 Column 'comment_status' cannot be null: INSERT INTO {field_data_comment} (entity_type, entity_id, revision_id, bundle, delta, langcode, comment_status) VALUES (:db_insert_placeholder_0, :db_insert_placeholder_1, :db_insert_placeholder_2, :db_insert_placeholder_3, :db_insert_placeholder_4, :db_insert_placeholder_5, :db_insert_placeholder_6); Array ( [:db_insert_placeholder_0] => node [:db_insert_placeholder_1] => 1 [:db_insert_placeholder_2] => 1 [:db_insert_placeholder_3] => article [:db_insert_placeholder_4] => 0 [:db_insert_placeholder_5] => und [:db_insert_placeholder_6] => ) in Drupal\Core\Entity\DatabaseStorageController->save() (line 557 of /var/lib/drupaltestbot/sites/default/files/checkout/core/lib/Drupal/Core/Entity/DatabaseStorageController.php). Drupal\Core\Entity\DatabaseStorageController->save(Object) Drupal\Core\Entity\Entity->save() Drupal\simpletest\WebTestBase->drupalCreateNode(Array) Drupal\user\Tests\UserPictureTest->testPictureOnNodeComment() Drupal\simpletest\TestBase->run() simpletest_script_run_one_test('646', 'Drupal\user\Tests\UserPictureTest') Uncaught exceptionDatabaseStorageController.php557Drupal\Core\Entity\DatabaseStorageController->save()
LeafDrupal\user\Tests\UserRegistrationTest12900
LeafDrupal\user\Tests\UserRoleAdminTest5700
LeafDrupal\user\Tests\UserRolesAssignmentTest5100
LeafDrupal\user\Tests\UserSaveTest200
LeafDrupal\user\Tests\UserSearchTest5800
ExpandDrupal\user\Tests\UserSignatureTest801
MessageGroupFilenameLineFunctionStatus
Drupal\Core\Entity\EntityStorageException: SQLSTATE[23000]: Integrity constraint violation: 1048 Column 'comment_status' cannot be null: INSERT INTO {field_data_comment} (entity_type, entity_id, revision_id, bundle, delta, langcode, comment_status) VALUES (:db_insert_placeholder_0, :db_insert_placeholder_1, :db_insert_placeholder_2, :db_insert_placeholder_3, :db_insert_placeholder_4, :db_insert_placeholder_5, :db_insert_placeholder_6); Array ( [:db_insert_placeholder_0] => node [:db_insert_placeholder_1] => 1 [:db_insert_placeholder_2] => 1 [:db_insert_placeholder_3] => page [:db_insert_placeholder_4] => 0 [:db_insert_placeholder_5] => und [:db_insert_placeholder_6] => ) in Drupal\Core\Entity\DatabaseStorageController->save() (line 557 of /var/lib/drupaltestbot/sites/default/files/checkout/core/lib/Drupal/Core/Entity/DatabaseStorageController.php). Drupal\Core\Entity\DatabaseStorageController->save(Object) Drupal\Core\Entity\Entity->save() Drupal\simpletest\WebTestBase->drupalCreateNode(Array) Drupal\user\Tests\UserSignatureTest->testUserSignature() Drupal\simpletest\TestBase->run() simpletest_script_run_one_test('652', 'Drupal\user\Tests\UserSignatureTest') Uncaught exceptionDatabaseStorageController.php557Drupal\Core\Entity\DatabaseStorageController->save()
LeafDrupal\user\Tests\UserTimeZoneTest2900
LeafDrupal\user\Tests\UserTokenReplaceTest4700
LeafDrupal\user\Tests\UserTranslationUITest14300
LeafDrupal\user\Tests\UserValidateCurrentPassCustomFormTest1700
LeafDrupal\user\Tests\UserValidationTest1600
LeafDrupal\user\Tests\Views\AccessPermissionTest1400
LeafDrupal\user\Tests\Views\AccessRoleTest1400
LeafDrupal\user\Tests\Views\ArgumentDefaultTest900
LeafDrupal\user\Tests\Views\ArgumentValidateTest1900
LeafDrupal\user\Tests\Views\HandlerArgumentUserUidTest500
LeafDrupal\user\Tests\Views\HandlerFieldRoleTest1000
LeafDrupal\user\Tests\Views\HandlerFieldUserNameTest700
LeafDrupal\user\Tests\Views\HandlerFilterUserNameTest5000
LeafDrupal\user\Tests\Views\RelationshipRepresentativeNode300
LeafDrupal\views\Tests\AnalyzeTest2100
LeafDrupal\views\Tests\BasicTest800
ExpandDrupal\views\Tests\DefaultViewsTest210
MessageGroupFilenameLineFunctionStatus
The test did not complete due to a fatal error.Completion checkDefaultViewsTest.php124Drupal\views\Tests\DefaultViewsTest->testDefaultViews()
ExpandDrupal\views\Tests\Entity\FieldEntityTest101
MessageGroupFilenameLineFunctionStatus
Drupal\Core\Entity\EntityStorageException: SQLSTATE[23000]: Integrity constraint violation: 1048 Column 'comment_status' cannot be null: INSERT INTO {field_data_comment} (entity_type, entity_id, revision_id, bundle, delta, langcode, comment_status) VALUES (:db_insert_placeholder_0, :db_insert_placeholder_1, :db_insert_placeholder_2, :db_insert_placeholder_3, :db_insert_placeholder_4, :db_insert_placeholder_5, :db_insert_placeholder_6); Array ( [:db_insert_placeholder_0] => node [:db_insert_placeholder_1] => 1 [:db_insert_placeholder_2] => 1 [:db_insert_placeholder_3] => page [:db_insert_placeholder_4] => 0 [:db_insert_placeholder_5] => und [:db_insert_placeholder_6] => ) in Drupal\Core\Entity\DatabaseStorageController->save() (line 557 of /var/lib/drupaltestbot/sites/default/files/checkout/core/lib/Drupal/Core/Entity/DatabaseStorageController.php). Drupal\Core\Entity\DatabaseStorageController->save(Object) Drupal\Core\Entity\Entity->save() Drupal\views\Tests\Entity\FieldEntityTest->testGetEntity() Drupal\simpletest\TestBase->run() simpletest_script_run_one_test('732', 'Drupal\views\Tests\Entity\FieldEntityTest') Uncaught exceptionDatabaseStorageController.php557Drupal\Core\Entity\DatabaseStorageController->save()
LeafDrupal\views\Tests\Entity\FilterEntityBundleTest800
LeafDrupal\views\Tests\GlossaryTest800
LeafDrupal\views\Tests\Handler\AreaTest9000
LeafDrupal\views\Tests\Handler\AreaTextTest400
LeafDrupal\views\Tests\Handler\ArgumentNullTest400
LeafDrupal\views\Tests\Handler\ArgumentStringTest400
LeafDrupal\views\Tests\Handler\FieldBooleanTest1000
LeafDrupal\views\Tests\Handler\FieldCounterTest600
LeafDrupal\views\Tests\Handler\FieldCustomTest100
LeafDrupal\views\Tests\Handler\FieldDateTest1400
LeafDrupal\views\Tests\Handler\FieldDropButtonTest1300
LeafDrupal\views\Tests\Handler\FieldFileSizeTest800
LeafDrupal\views\Tests\Handler\FieldUnitTest10900
LeafDrupal\views\Tests\Handler\FieldUrlTest200
LeafDrupal\views\Tests\Handler\FieldWebTest10900
LeafDrupal\views\Tests\Handler\FieldXssTest300
LeafDrupal\views\Tests\Handler\FilterCombineTest100
LeafDrupal\views\Tests\Handler\FilterDateTest2200
LeafDrupal\views\Tests\Handler\FilterEqualityTest400
LeafDrupal\views\Tests\Handler\FilterInOperatorTest800
LeafDrupal\views\Tests\Handler\FilterNumericTest1400
LeafDrupal\views\Tests\Handler\FilterStringTest2600
LeafDrupal\views\Tests\Handler\HandlerAliasTest800
ExpandDrupal\views\Tests\Handler\HandlerAllTest26700
MessageGroupFilenameLineFunctionStatus
'Missing handler: comment entity_type sort'Debugviews.module926views_get_handler()
'Missing handler: comment field_name sort'Debugviews.module926views_get_handler()
ExpandDrupal\views\Tests\Handler\HandlerTest11600
MessageGroupFilenameLineFunctionStatus
'Missing handler: lciAxmuV mQvS3riu relationship'Debugviews.module926views_get_handler()
LeafDrupal\views\Tests\Handler\RelationshipTest500
LeafDrupal\views\Tests\Handler\SortDateTest2400
LeafDrupal\views\Tests\Handler\SortRandomTest600
LeafDrupal\views\Tests\Handler\SortTest800
ExpandDrupal\views\Tests\ModuleTest3200
MessageGroupFilenameLineFunctionStatus
'Missing handler: iCeNp2qC v3J9hEuW field'Debugviews.module926views_get_handler()
'Missing handler: tRg6Zuom jEvEOz8E area'Debugviews.module926views_get_handler()
'Missing handler: aeK0bnxV cqMdV8mG filter'Debugviews.module926views_get_handler()
LeafDrupal\views\Tests\PluginBaseUnitTest1200
LeafDrupal\views\Tests\PluginInstanceTest14500
LeafDrupal\views\Tests\PluginTypeListTest100
LeafDrupal\views\Tests\Plugin\AccessTest3900
LeafDrupal\views\Tests\Plugin\ArgumentDefaultTest2400
LeafDrupal\views\Tests\Plugin\ArgumentValidatorTest400
LeafDrupal\views\Tests\Plugin\CacheTest1200
LeafDrupal\views\Tests\Plugin\DisplayAttachmentTest600
LeafDrupal\views\Tests\Plugin\DisplayExtenderTest600
LeafDrupal\views\Tests\Plugin\DisplayFeedTest4300
LeafDrupal\views\Tests\Plugin\DisplayPageTest700
LeafDrupal\views\Tests\Plugin\DisplayTest5000
LeafDrupal\views\Tests\Plugin\ExposedFormTest13100
LeafDrupal\views\Tests\Plugin\FilterTest1300
LeafDrupal\views\Tests\Plugin\JoinTest1600
LeafDrupal\views\Tests\Plugin\MiniPagerTest1300
LeafDrupal\views\Tests\Plugin\PagerTest9200
LeafDrupal\views\Tests\Plugin\QueryTest200
LeafDrupal\views\Tests\Plugin\StyleMappingTest4200
LeafDrupal\views\Tests\Plugin\StyleTest2000
LeafDrupal\views\Tests\Plugin\StyleUnformattedTest1700
LeafDrupal\views\Tests\QueryGroupByTest4000
LeafDrupal\views\Tests\TokenReplaceTest1100
LeafDrupal\views\Tests\UI\CachedDataUITest4400
LeafDrupal\views\Tests\UI\CustomBooleanTest4200
LeafDrupal\views\Tests\UI\DefaultViewsTest11000
LeafDrupal\views\Tests\UI\DisplayAttachmentTest2400
LeafDrupal\views\Tests\UI\DisplayExtenderUITest2300
LeafDrupal\views\Tests\UI\DisplayPath2200
LeafDrupal\views\Tests\UI\DisplayTest33300
LeafDrupal\views\Tests\UI\GroupByTest2600
LeafDrupal\views\Tests\UI\HandlerTest18700
LeafDrupal\views\Tests\UI\OverrideDisplaysTest17200
LeafDrupal\views\Tests\UI\PreviewTest4200
LeafDrupal\views\Tests\UI\QueryTest1900
LeafDrupal\views\Tests\UI\RedirectTest2600
LeafDrupal\views\Tests\UI\RowUITest3000
LeafDrupal\views\Tests\UI\SettingsTest13300
LeafDrupal\views\Tests\UI\StorageTest2100
LeafDrupal\views\Tests\UI\StyleUITest4200
LeafDrupal\views\Tests\UI\TagTest1100
LeafDrupal\views\Tests\ViewElementTest1500
LeafDrupal\views\Tests\ViewExecutableTest11500
LeafDrupal\views\Tests\ViewRenderTest200
LeafDrupal\views\Tests\ViewsDataTest2200
LeafDrupal\views\Tests\ViewsHooksTest600
LeafDrupal\views\Tests\ViewStorageTest9700
LeafDrupal\views\Tests\Wizard\BasicTest18200
LeafDrupal\views\Tests\Wizard\ItemsPerPageTest7600
LeafDrupal\views\Tests\Wizard\MenuTest3800
LeafDrupal\views\Tests\Wizard\SortingTest7000
LeafDrupal\views\Tests\Wizard\TaggedWithTest12600
LeafDrupal\xmlrpc\Tests\XmlRpcBasicTest1800
LeafDrupal\xmlrpc\Tests\XmlRpcMessagesTest1400
LeafDrupal\xmlrpc\Tests\XmlRpcValidatorTest2000