node-ng-1818556-70.diff

Test status
StatusResult
Last receivedTue, 02/12/2013 - 20:50:37
Last requestedTue, 02/12/2013 - 20:51:02
Last testedTue, 02/12/2013 - 21:55:48
Test count1
Environment status
MySQLfail
File information
Filenode-ng-1818556-70.diff
BranchDrupal core - 8.x
LinkIssue Link
SummaryFAILED: [[SimpleTest]]: [MySQL] 48,552 pass(es), 252 fail(s), and 55 exception(s).
Details

MySQL

  1. Setup environment
  2. Detect an invalid patch URL
  3. Detect invalid repository information
  4. Detect invalid patch format
  5. Detect a non-applicable patch
  6. Detect invalid PHP syntax
  7. Detect a Drupal installation failure
  8. Detect a test run failure
  9. Detect a failing test
    Review the test failures below then if necessary run them locally until the problem has been fixed.
  10. Complete test suite with all tests passing
48,552 pass(es), 252 fail(s), and 55 exception(s)

Non-pass

Test namePassFailException
ExpandDrupal\comment\Tests\CommentPreviewTest710
MessageGroupFilenameLineFunctionStatus
The test did not complete due to a fatal error.Completion checkCommentPreviewTest.php33Drupal\comment\Tests\CommentPreviewTest->testCommentPreview()
ExpandDrupal\dblog\Tests\DBLogTest37420
MessageGroupFilenameLineFunctionStatus
HTTP response expected 200, actual 500BrowserDBLogTest.php322Drupal\dblog\Tests\DBLogTest->doNode()
DBLog event was recorded: [content updated]OtherDBLogTest.php343Drupal\dblog\Tests\DBLogTest->doNode()
ExpandDrupal\entity_reference\Tests\EntityReferenceAdminTest20115
MessageGroupFilenameLineFunctionStatus
Undefined index: typeNoticeTypedDataManager.php131Drupal\Core\TypedData\TypedDataManager->create()
Found field with name 'instance[settings][handler]' and value 'default'BrowserEntityReferenceAdminTest.php83Drupal\entity_reference\Tests\EntityReferenceAdminTest->testFieldAdminHandler()
Found field with name 'instance[settings][handler_settings][target_bundles][lwv8wg6n_test]'BrowserEntityReferenceAdminTest.php89Drupal\entity_reference\Tests\EntityReferenceAdminTest->testFieldAdminHandler()
Found field with name 'instance[settings][handler_settings][sort][field]' and value '_none'BrowserEntityReferenceAdminTest.php94Drupal\entity_reference\Tests\EntityReferenceAdminTest->testFieldAdminHandler()
Undefined offset: 0Drupal\simpletest\WebTestBase->drupalPostAJAX(NULL, Array, 'instance[settings][handler_settings][sort][field]') Drupal\entity_reference\Tests\EntityReferenceAdminTest->testFieldAdminHandler() Drupal\simpletest\TestBase->run() simpletest_script_run_one_test('193', 'Drupal\entity_reference\Tests\EntityReferenceAdminTest') NoticeWebTestBase.php1388Drupal\simpletest\WebTestBase->drupalPostAJAX()
Undefined index: ajaxDrupal\simpletest\WebTestBase->drupalPostAJAX(NULL, Array, 'instance[settings][handler_settings][sort][field]') Drupal\entity_reference\Tests\EntityReferenceAdminTest->testFieldAdminHandler() Drupal\simpletest\TestBase->run() simpletest_script_run_one_test('193', 'Drupal\entity_reference\Tests\EntityReferenceAdminTest') NoticeWebTestBase.php1389Drupal\simpletest\WebTestBase->drupalPostAJAX()
Failed to set field instance[settings][handler_settings][sort][field] to nidOtherEntityReferenceAdminTest.php97Drupal\entity_reference\Tests\EntityReferenceAdminTest->testFieldAdminHandler()
Found the requested form fields at OtherEntityReferenceAdminTest.php97Drupal\entity_reference\Tests\EntityReferenceAdminTest->testFieldAdminHandler()
Found field with name 'instance[settings][handler_settings][sort][direction]' and value 'ASC'BrowserEntityReferenceAdminTest.php98Drupal\entity_reference\Tests\EntityReferenceAdminTest->testFieldAdminHandler()
Undefined offset: 0Drupal\simpletest\WebTestBase->drupalPostAJAX(NULL, Array, 'instance[settings][handler_settings][sort][field]') Drupal\entity_reference\Tests\EntityReferenceAdminTest->testFieldAdminHandler() Drupal\simpletest\TestBase->run() simpletest_script_run_one_test('193', 'Drupal\entity_reference\Tests\EntityReferenceAdminTest') NoticeWebTestBase.php1388Drupal\simpletest\WebTestBase->drupalPostAJAX()
Undefined index: ajaxDrupal\simpletest\WebTestBase->drupalPostAJAX(NULL, Array, 'instance[settings][handler_settings][sort][field]') Drupal\entity_reference\Tests\EntityReferenceAdminTest->testFieldAdminHandler() Drupal\simpletest\TestBase->run() simpletest_script_run_one_test('193', 'Drupal\entity_reference\Tests\EntityReferenceAdminTest') NoticeWebTestBase.php1389Drupal\simpletest\WebTestBase->drupalPostAJAX()
Failed to set field instance[settings][handler_settings][sort][field] to _noneOtherEntityReferenceAdminTest.php100Drupal\entity_reference\Tests\EntityReferenceAdminTest->testFieldAdminHandler()
Found the requested form fields at OtherEntityReferenceAdminTest.php100Drupal\entity_reference\Tests\EntityReferenceAdminTest->testFieldAdminHandler()
Found the Save settings buttonOtherEntityReferenceAdminTest.php103Drupal\entity_reference\Tests\EntityReferenceAdminTest->testFieldAdminHandler()
Found the requested form fields at OtherEntityReferenceAdminTest.php103Drupal\entity_reference\Tests\EntityReferenceAdminTest->testFieldAdminHandler()
Field was created and appears in the overview page.OtherEntityReferenceAdminTest.php106Drupal\entity_reference\Tests\EntityReferenceAdminTest->testFieldAdminHandler()
ExpandDrupal\entity_reference\Tests\EntityReferenceAutoCreateTest1553
MessageGroupFilenameLineFunctionStatus
Undefined index: typeNoticeTypedDataManager.php131Drupal\Core\TypedData\TypedDataManager->create()
Failed to set field title to uHnNlZEkOtherEntityReferenceAutoCreateTest.php94Drupal\entity_reference\Tests\EntityReferenceAutoCreateTest->testAutoCreate()
Failed to set field test_field[und][0][target_id] to kinmCEYMOtherEntityReferenceAutoCreateTest.php94Drupal\entity_reference\Tests\EntityReferenceAutoCreateTest->testAutoCreate()
Found the Save buttonOtherEntityReferenceAutoCreateTest.php94Drupal\entity_reference\Tests\EntityReferenceAutoCreateTest->testAutoCreate()
Found the requested form fields at node/add/xndo10oqOtherEntityReferenceAutoCreateTest.php94Drupal\entity_reference\Tests\EntityReferenceAutoCreateTest->testAutoCreate()
Referenced node was created.OtherEntityReferenceAutoCreateTest.php99Drupal\entity_reference\Tests\EntityReferenceAutoCreateTest->testAutoCreate()
array_flip(): Can only flip STRING and INTEGER values!array_flip(Array) Drupal\Core\Entity\DatabaseStorageController->load(Array) entity_load_multiple('node', Array, ) entity_load('node', NULL, ) node_load(NULL) Drupal\entity_reference\Tests\EntityReferenceAutoCreateTest->testAutoCreate() Drupal\simpletest\TestBase->run() simpletest_script_run_one_test('195', 'Drupal\entity_reference\Tests\EntityReferenceAutoCreateTest') WarningDatabaseStorageController.php182Drupal\Core\Entity\DatabaseStorageController->load()
Trying to get property of non-objectDrupal\entity_reference\Tests\EntityReferenceAutoCreateTest->testAutoCreate() Drupal\simpletest\TestBase->run() simpletest_script_run_one_test('195', 'Drupal\entity_reference\Tests\EntityReferenceAutoCreateTest') NoticeEntityReferenceAutoCreateTest.php109Drupal\entity_reference\Tests\EntityReferenceAutoCreateTest->testAutoCreate()
ExpandDrupal\entity_reference\Tests\EntityReferenceSelectionSortTest610
MessageGroupFilenameLineFunctionStatus
Query sorted by field returned expected values.OtherEntityReferenceSelectionSortTest.php135Drupal\entity_reference\Tests\EntityReferenceSelectionSortTest->testSort()
ExpandDrupal\file\Tests\FileFieldDisplayTest5010
MessageGroupFilenameLineFunctionStatus
Node revision exists.OtherFileFieldTestBase.php146Drupal\file\Tests\FileFieldTestBase->uploadNodeFile()
ExpandDrupal\file\Tests\FileFieldPathTest2710
MessageGroupFilenameLineFunctionStatus
Node revision exists.OtherFileFieldTestBase.php146Drupal\file\Tests\FileFieldTestBase->uploadNodeFile()
ExpandDrupal\file\Tests\FileFieldRevisionTest56120
MessageGroupFilenameLineFunctionStatus
Node revision exists.OtherFileFieldTestBase.php146Drupal\file\Tests\FileFieldTestBase->uploadNodeFile()
Found the Revert buttonOtherFileFieldRevisionTest.php82Drupal\file\Tests\FileFieldRevisionTest->testRevisions()
Found the requested form fields at node/1/revisions/3/revertOtherFileFieldRevisionTest.php82Drupal\file\Tests\FileFieldRevisionTest->testRevisions()
Original revision file still in place after reverting to the original revision.OtherFileFieldRevisionTest.php86Drupal\file\Tests\FileFieldRevisionTest->testRevisions()
Found the Delete buttonOtherFileFieldRevisionTest.php91Drupal\file\Tests\FileFieldRevisionTest->testRevisions()
Found the requested form fields at node/1/revisions/4/deleteOtherFileFieldRevisionTest.php91Drupal\file\Tests\FileFieldRevisionTest->testRevisions()
Found the Delete buttonOtherFileFieldRevisionTest.php104Drupal\file\Tests\FileFieldRevisionTest->testRevisions()
Found the requested form fields at node/1/revisions/5/deleteOtherFileFieldRevisionTest.php104Drupal\file\Tests\FileFieldRevisionTest->testRevisions()
Second file is now deleted after deleting third revision, since it is no longer being used by any other nodes.OtherFileFieldRevisionTest.php129Drupal\file\Tests\FileFieldRevisionTest->testRevisions()
Second file entry is now deleted after deleting third revision, since it is no longer being used by any other nodes.OtherFileFieldRevisionTest.php130Drupal\file\Tests\FileFieldRevisionTest->testRevisions()
Original file is deleted after deleting the entire node with two revisions remaining.OtherFileFieldRevisionTest.php143Drupal\file\Tests\FileFieldRevisionTest->testRevisions()
Original file entry is deleted after deleting the entire node with two revisions remaining.OtherFileFieldRevisionTest.php144Drupal\file\Tests\FileFieldRevisionTest->testRevisions()
ExpandDrupal\file\Tests\FileFieldValidateTest11830
MessageGroupFilenameLineFunctionStatus
Node revision exists.OtherFileFieldTestBase.php146Drupal\file\Tests\FileFieldTestBase->uploadNodeFile()
Node revision exists.OtherFileFieldTestBase.php146Drupal\file\Tests\FileFieldTestBase->uploadNodeFile()
Node revision exists.OtherFileFieldTestBase.php146Drupal\file\Tests\FileFieldTestBase->uploadNodeFile()
ExpandDrupal\file\Tests\FileFieldWidgetTest29530
MessageGroupFilenameLineFunctionStatus
Node revision exists.OtherFileFieldTestBase.php146Drupal\file\Tests\FileFieldTestBase->uploadNodeFile()
Node revision exists.OtherFileFieldTestBase.php146Drupal\file\Tests\FileFieldTestBase->uploadNodeFile()
Confirmed that access is denied for the file without the needed permission.BrowserFileFieldWidgetTest.php308Drupal\file\Tests\FileFieldWidgetTest->testPrivateFileComment()
ExpandDrupal\file\Tests\FilePrivateTest3710
MessageGroupFilenameLineFunctionStatus
Node revision exists.OtherFileFieldTestBase.php146Drupal\file\Tests\FileFieldTestBase->uploadNodeFile()
ExpandDrupal\file\Tests\FileTokenReplaceTest3510
MessageGroupFilenameLineFunctionStatus
Node revision exists.OtherFileFieldTestBase.php146Drupal\file\Tests\FileFieldTestBase->uploadNodeFile()
ExpandDrupal\forum\Tests\ForumBlockTest11660
MessageGroupFilenameLineFunctionStatus
Forum topic cKktfPXfutScIrgjKS8q found in the "New forum topics" block.OtherForumBlockTest.php69Drupal\forum\Tests\ForumBlockTest->testNewForumTopicsBlock()
Forum topic bKqgYTqZ8eZHyWQs9dd0 found in the "New forum topics" block.OtherForumBlockTest.php69Drupal\forum\Tests\ForumBlockTest->testNewForumTopicsBlock()
Forum topic fUYgG8Ci4zlCAK36WweV found in the "New forum topics" block.OtherForumBlockTest.php81Drupal\forum\Tests\ForumBlockTest->testNewForumTopicsBlock()
Forum topic rFI7HcXkXQMTVCBhvv7J found in the "Active forum topics" block.OtherForumBlockTest.php125Drupal\forum\Tests\ForumBlockTest->testActiveForumTopicsBlock()
Forum topic v8YkZoumnn5su4xdCpK8 found in the "Active forum topics" block.OtherForumBlockTest.php125Drupal\forum\Tests\ForumBlockTest->testActiveForumTopicsBlock()
Forum topic found in the "Active forum topics" block.OtherForumBlockTest.php142Drupal\forum\Tests\ForumBlockTest->testActiveForumTopicsBlock()
ExpandDrupal\forum\Tests\ForumIndexTest2420
MessageGroupFilenameLineFunctionStatus
Unpublished node is no longer accessible.OtherForumIndexTest.php71Drupal\forum\Tests\ForumIndexTest->testForumIndexStatus()
Unpublished forum topic no longer appears on index.OtherForumIndexTest.php75Drupal\forum\Tests\ForumIndexTest->testForumIndexStatus()
ExpandDrupal\forum\Tests\ForumTest633100
MessageGroupFilenameLineFunctionStatus
Forum node was editedOtherForumTest.php597Drupal\forum\Tests\ForumTest->verifyForums()
The forum topic is linked to a different forumOtherForumTest.php604Drupal\forum\Tests\ForumTest->verifyForums()
Forum node was deletedOtherForumTest.php609Drupal\forum\Tests\ForumTest->verifyForums()
Forum node was editedOtherForumTest.php597Drupal\forum\Tests\ForumTest->verifyForums()
The forum topic is linked to a different forumOtherForumTest.php604Drupal\forum\Tests\ForumTest->verifyForums()
Forum node was deletedOtherForumTest.php609Drupal\forum\Tests\ForumTest->verifyForums()
Forum node was editedOtherForumTest.php597Drupal\forum\Tests\ForumTest->verifyForums()
The forum topic is linked to a different forumOtherForumTest.php604Drupal\forum\Tests\ForumTest->verifyForums()
Forum node was deletedOtherForumTest.php609Drupal\forum\Tests\ForumTest->verifyForums()
HTTP response expected 200, actual 500BrowserForumTest.php222Drupal\forum\Tests\ForumTest->testForum()
ExpandDrupal\menu\Tests\MenuNodeTest5601
MessageGroupFilenameLineFunctionStatus
Drupal\Core\Entity\EntityStorageException: SQLSTATE[23000]: Integrity constraint violation: 1048 Column 'tid' cannot be null: INSERT INTO {taxonomy_index} (nid, tid, sticky, created) VALUES (:db_insert_placeholder_0, :db_insert_placeholder_1, :db_insert_placeholder_2, :db_insert_placeholder_3); Array ( [:db_insert_placeholder_0] => 2 [:db_insert_placeholder_1] => [:db_insert_placeholder_2] => 0 [:db_insert_placeholder_3] => 1360703961 ) in Drupal\Core\Entity\DatabaseStorageControllerNG->save() (line 334 of /var/lib/drupaltestbot/sites/default/files/checkout/core/lib/Drupal/Core/Entity/DatabaseStorageControllerNG.php). Drupal\Core\Entity\DatabaseStorageControllerNG->save(Object) Drupal\Core\Entity\Entity->save() Drupal\Core\Entity\EntityBCDecorator->save() Drupal\simpletest\WebTestBase->drupalCreateNode(Array) Drupal\menu\Tests\MenuNodeTest->testMenuNodeFormWidget() Drupal\simpletest\TestBase->run() simpletest_script_run_one_test('370', 'Drupal\menu\Tests\MenuNodeTest') Uncaught exceptionDatabaseStorageControllerNG.php334Drupal\Core\Entity\DatabaseStorageControllerNG->save()
ExpandDrupal\node\Tests\NodeAccessFieldTest4910
MessageGroupFilenameLineFunctionStatus
The updated default value is displayed when creating a new node.OtherNodeAccessFieldTest.php92Drupal\node\Tests\NodeAccessFieldTest->testNodeAccessAdministerField()
ExpandDrupal\node\Tests\NodeAccessTest3220
MessageGroupFilenameLineFunctionStatus
node_access returns false with operation 'view'.OtherNodeAccessTest.php63Drupal\node\Tests\NodeAccessTest->testNodeAccess()
node_access returns false with operation 'view'.OtherNodeAccessTest.php73Drupal\node\Tests\NodeAccessTest->testNodeAccess()
ExpandDrupal\node\Tests\NodeCreationTest4720
MessageGroupFilenameLineFunctionStatus
Current URL is '/checkout/'.OtherNodeCreationTest.php119Drupal\node\Tests\NodeCreationTest->testUnpublishedNodeCreation()
"Test page text" foundOtherNodeCreationTest.php120Drupal\node\Tests\NodeCreationTest->testUnpublishedNodeCreation()
ExpandDrupal\node\Tests\NodeFieldMultilingualTestCase6220
MessageGroupFilenameLineFunctionStatus
Field language correctly set.OtherNodeFieldMultilingualTestCase.php89Drupal\node\Tests\NodeFieldMultilingualTestCase->testMultilingualNodeForm()
Field language correctly changed.OtherNodeFieldMultilingualTestCase.php102Drupal\node\Tests\NodeFieldMultilingualTestCase->testMultilingualNodeForm()
ExpandDrupal\node\Tests\NodeRevisionsAllTestCase34150
MessageGroupFilenameLineFunctionStatus
Correct text displays for version.OtherNodeRevisionsAllTestCase.php93Drupal\node\Tests\NodeRevisionsAllTestCase->testRevisions()
Log message found.OtherNodeRevisionsAllTestCase.php98Drupal\node\Tests\NodeRevisionsAllTestCase->testRevisions()
Log message found.OtherNodeRevisionsAllTestCase.php98Drupal\node\Tests\NodeRevisionsAllTestCase->testRevisions()
Log message found.OtherNodeRevisionsAllTestCase.php98Drupal\node\Tests\NodeRevisionsAllTestCase->testRevisions()
Found the Revert buttonOtherNodeRevisionsAllTestCase.php105Drupal\node\Tests\NodeRevisionsAllTestCase->testRevisions()
Found the requested form fields at node/1/revisions/1/revertOtherNodeRevisionsAllTestCase.php105Drupal\node\Tests\NodeRevisionsAllTestCase->testRevisions()
Revision reverted.OtherNodeRevisionsAllTestCase.php112Drupal\node\Tests\NodeRevisionsAllTestCase->testRevisions()
Third node revision is not the current one.OtherNodeRevisionsAllTestCase.php118Drupal\node\Tests\NodeRevisionsAllTestCase->testRevisions()
Found the Delete buttonOtherNodeRevisionsAllTestCase.php121Drupal\node\Tests\NodeRevisionsAllTestCase->testRevisions()
Found the requested form fields at node/1/revisions/1/deleteOtherNodeRevisionsAllTestCase.php121Drupal\node\Tests\NodeRevisionsAllTestCase->testRevisions()
Revision deleted.OtherNodeRevisionsAllTestCase.php128Drupal\node\Tests\NodeRevisionsAllTestCase->testRevisions()
Revision not found.OtherNodeRevisionsAllTestCase.php131Drupal\node\Tests\NodeRevisionsAllTestCase->testRevisions()
Found the Revert buttonOtherNodeRevisionsAllTestCase.php142Drupal\node\Tests\NodeRevisionsAllTestCase->testRevisions()
Found the requested form fields at node/1/revisions/1/revertOtherNodeRevisionsAllTestCase.php142Drupal\node\Tests\NodeRevisionsAllTestCase->testRevisions()
Raw "Basic page <em class="placeholder">evFk2w2K</em> has been reverted back to the revision from <em class="placeholder">Mon, 02/11/2013 - 21:24</em>." foundOtherNodeRevisionsAllTestCase.php147Drupal\node\Tests\NodeRevisionsAllTestCase->testRevisions()
ExpandDrupal\node\Tests\NodeRevisionsTest77320
MessageGroupFilenameLineFunctionStatus
Correct text displays for version.OtherNodeRevisionsTest.php83Drupal\node\Tests\NodeRevisionsTest->testRevisions()
Log message found.OtherNodeRevisionsTest.php88Drupal\node\Tests\NodeRevisionsTest->testRevisions()
Log message found.OtherNodeRevisionsTest.php88Drupal\node\Tests\NodeRevisionsTest->testRevisions()
Log message found.OtherNodeRevisionsTest.php88Drupal\node\Tests\NodeRevisionsTest->testRevisions()
Found the Revert buttonOtherNodeRevisionsTest.php95Drupal\node\Tests\NodeRevisionsTest->testRevisions()
Found the requested form fields at node/1/revisions/1/revertOtherNodeRevisionsTest.php95Drupal\node\Tests\NodeRevisionsTest->testRevisions()
Revision reverted.OtherNodeRevisionsTest.php98Drupal\node\Tests\NodeRevisionsTest->testRevisions()
Third node revision is not the default one.OtherNodeRevisionsTest.php104Drupal\node\Tests\NodeRevisionsTest->testRevisions()
Found the Delete buttonOtherNodeRevisionsTest.php107Drupal\node\Tests\NodeRevisionsTest->testRevisions()
Found the requested form fields at node/1/revisions/1/deleteOtherNodeRevisionsTest.php107Drupal\node\Tests\NodeRevisionsTest->testRevisions()
Revision deleted.OtherNodeRevisionsTest.php110Drupal\node\Tests\NodeRevisionsTest->testRevisions()
Revision not found.OtherNodeRevisionsTest.php111Drupal\node\Tests\NodeRevisionsTest->testRevisions()
Found the Revert buttonOtherNodeRevisionsTest.php122Drupal\node\Tests\NodeRevisionsTest->testRevisions()
Found the requested form fields at node/1/revisions/1/revertOtherNodeRevisionsTest.php122Drupal\node\Tests\NodeRevisionsTest->testRevisions()
Raw "Basic page <em class="placeholder">ap7fQiNI</em> has been reverted back to the revision from <em class="placeholder">Mon, 02/11/2013 - 21:24</em>." foundOtherNodeRevisionsTest.php127Drupal\node\Tests\NodeRevisionsTest->testRevisions()
Correct text displays for version.OtherNodeRevisionsTest.php83Drupal\node\Tests\NodeRevisionsTest->testRevisions()
Log message found.OtherNodeRevisionsTest.php88Drupal\node\Tests\NodeRevisionsTest->testRevisions()
Log message found.OtherNodeRevisionsTest.php88Drupal\node\Tests\NodeRevisionsTest->testRevisions()
Log message found.OtherNodeRevisionsTest.php88Drupal\node\Tests\NodeRevisionsTest->testRevisions()
Found the Revert buttonOtherNodeRevisionsTest.php95Drupal\node\Tests\NodeRevisionsTest->testRevisions()
Found the requested form fields at node/1/revisions/1/revertOtherNodeRevisionsTest.php95Drupal\node\Tests\NodeRevisionsTest->testRevisions()
Revision reverted.OtherNodeRevisionsTest.php98Drupal\node\Tests\NodeRevisionsTest->testRevisions()
Third node revision is not the default one.OtherNodeRevisionsTest.php104Drupal\node\Tests\NodeRevisionsTest->testRevisions()
Found the Delete buttonOtherNodeRevisionsTest.php107Drupal\node\Tests\NodeRevisionsTest->testRevisions()
Found the requested form fields at node/1/revisions/1/deleteOtherNodeRevisionsTest.php107Drupal\node\Tests\NodeRevisionsTest->testRevisions()
Revision deleted.OtherNodeRevisionsTest.php110Drupal\node\Tests\NodeRevisionsTest->testRevisions()
Revision not found.OtherNodeRevisionsTest.php111Drupal\node\Tests\NodeRevisionsTest->testRevisions()
Found the Revert buttonOtherNodeRevisionsTest.php122Drupal\node\Tests\NodeRevisionsTest->testRevisions()
Found the requested form fields at node/1/revisions/1/revertOtherNodeRevisionsTest.php122Drupal\node\Tests\NodeRevisionsTest->testRevisions()
Raw "Basic page <em class="placeholder">ap7fQiNI</em> has been reverted back to the revision from <em class="placeholder">Mon, 02/11/2013 - 21:24</em>." foundOtherNodeRevisionsTest.php127Drupal\node\Tests\NodeRevisionsTest->testRevisions()
After an existing node revision is re-saved without a log message, the original log message is preserved.OtherNodeRevisionsTest.php180Drupal\node\Tests\NodeRevisionsTest->testNodeRevisionWithoutLogMessage()
After a new node revision is saved with an empty log message, the log message for the node is empty.OtherNodeRevisionsTest.php198Drupal\node\Tests\NodeRevisionsTest->testNodeRevisionWithoutLogMessage()
ExpandDrupal\node\Tests\NodeSaveTest5640
MessageGroupFilenameLineFunctionStatus
Node load by node ID.OtherNodeSaveTest.php68Drupal\node\Tests\NodeSaveTest->testImport()
Node load by node title.OtherNodeSaveTest.php71Drupal\node\Tests\NodeSaveTest->testImport()
Changes have been determined.OtherNodeSaveTest.php153Drupal\node\Tests\NodeSaveTest->testDeterminingChanges()
Static cache has been cleared.OtherNodeSaveTest.php157Drupal\node\Tests\NodeSaveTest->testDeterminingChanges()
ExpandDrupal\node\Tests\NodeTranslationUITest1714511
MessageGroupFilenameLineFunctionStatus
Failed to set field title to oW38WpAdOtherEntityTranslationUITest.php37Drupal\translation_entity\Tests\EntityTranslationUITest->testTranslationUI()
Failed to set field field_test_et_ui_test[it][0][value] to s3T5UtdgiqxFnZnuOtherEntityTranslationUITest.php37Drupal\translation_entity\Tests\EntityTranslationUITest->testTranslationUI()
Found the Save and keep unpublished buttonOtherEntityTranslationUITest.php37Drupal\translation_entity\Tests\EntityTranslationUITest->testTranslationUI()
Found the requested form fields at it/node/1/translations/add/en/itOtherEntityTranslationUITest.php37Drupal\translation_entity\Tests\EntityTranslationUITest->testTranslationUI()
Failed to set field source_langcode[source] to itOtherEntityTranslationUITest.php37Drupal\translation_entity\Tests\EntityTranslationUITest->testTranslationUI()
Found the Change buttonOtherEntityTranslationUITest.php37Drupal\translation_entity\Tests\EntityTranslationUITest->testTranslationUI()
Found the requested form fields at fr/node/1/translations/add/en/frOtherEntityTranslationUITest.php37Drupal\translation_entity\Tests\EntityTranslationUITest->testTranslationUI()
Source language correctly switched.OtherEntityTranslationUITest.php37Drupal\translation_entity\Tests\EntityTranslationUITest->testTranslationUI()
Failed to set field title to oW38WpAdOtherEntityTranslationUITest.php37Drupal\translation_entity\Tests\EntityTranslationUITest->testTranslationUI()
Failed to set field field_test_et_ui_test[fr][0][value] to lf3nKVBPyarlvpRbOtherEntityTranslationUITest.php37Drupal\translation_entity\Tests\EntityTranslationUITest->testTranslationUI()
Failed to set field translation_entity[retranslate] to 1OtherEntityTranslationUITest.php37Drupal\translation_entity\Tests\EntityTranslationUITest->testTranslationUI()
Found the Save and keep unpublished buttonOtherEntityTranslationUITest.php37Drupal\translation_entity\Tests\EntityTranslationUITest->testTranslationUI()
Found the requested form fields at fr/node/1/translations/add/en/frOtherEntityTranslationUITest.php37Drupal\translation_entity\Tests\EntityTranslationUITest->testTranslationUI()
Undefined index: itDrupal\translation_entity\Tests\EntityTranslationUITest->getValue(Object, 'field_test_et_ui_test', 'it') Drupal\translation_entity\Tests\EntityTranslationUITest->assertBasicTranslation() Drupal\translation_entity\Tests\EntityTranslationUITest->testTranslationUI() Drupal\simpletest\TestBase->run() simpletest_script_run_one_test('419', 'Drupal\node\Tests\NodeTranslationUITest') NoticeEntityTranslationUITest.php274Drupal\translation_entity\Tests\EntityTranslationUITest->getValue()
field_test_et_ui_test correctly stored with language it.OtherEntityTranslationUITest.php37Drupal\translation_entity\Tests\EntityTranslationUITest->testTranslationUI()
Undefined index: frDrupal\translation_entity\Tests\EntityTranslationUITest->getValue(Object, 'field_test_et_ui_test', 'fr') Drupal\translation_entity\Tests\EntityTranslationUITest->assertBasicTranslation() Drupal\translation_entity\Tests\EntityTranslationUITest->testTranslationUI() Drupal\simpletest\TestBase->run() simpletest_script_run_one_test('419', 'Drupal\node\Tests\NodeTranslationUITest') NoticeEntityTranslationUITest.php274Drupal\translation_entity\Tests\EntityTranslationUITest->getValue()
field_test_et_ui_test correctly stored with language fr.OtherEntityTranslationUITest.php37Drupal\translation_entity\Tests\EntityTranslationUITest->testTranslationUI()
Failed to set field translation_entity[retranslate] to 1OtherEntityTranslationUITest.php38Drupal\translation_entity\Tests\EntityTranslationUITest->testTranslationUI()
Found the Save and keep unpublished buttonOtherEntityTranslationUITest.php38Drupal\translation_entity\Tests\EntityTranslationUITest->testTranslationUI()
Found the requested form fields at fr/node/1/editOtherEntityTranslationUITest.php38Drupal\translation_entity\Tests\EntityTranslationUITest->testTranslationUI()
The translate flag is checked by default.OtherEntityTranslationUITest.php38Drupal\translation_entity\Tests\EntityTranslationUITest->testTranslationUI()
Failed to set field translation_entity[outdated] to OtherEntityTranslationUITest.php38Drupal\translation_entity\Tests\EntityTranslationUITest->testTranslationUI()
Found the Save and keep unpublished buttonOtherEntityTranslationUITest.php38Drupal\translation_entity\Tests\EntityTranslationUITest->testTranslationUI()
Found the requested form fields at node/1/editOtherEntityTranslationUITest.php38Drupal\translation_entity\Tests\EntityTranslationUITest->testTranslationUI()
The retranslate flag is now shown.OtherEntityTranslationUITest.php38Drupal\translation_entity\Tests\EntityTranslationUITest->testTranslationUI()
The translate flag is checked by default.OtherEntityTranslationUITest.php38Drupal\translation_entity\Tests\EntityTranslationUITest->testTranslationUI()
Failed to set field translation_entity[outdated] to OtherEntityTranslationUITest.php38Drupal\translation_entity\Tests\EntityTranslationUITest->testTranslationUI()
Found the Save and keep unpublished buttonOtherEntityTranslationUITest.php38Drupal\translation_entity\Tests\EntityTranslationUITest->testTranslationUI()
Found the requested form fields at it/node/1/editOtherEntityTranslationUITest.php38Drupal\translation_entity\Tests\EntityTranslationUITest->testTranslationUI()
The retranslate flag is now shown.OtherEntityTranslationUITest.php38Drupal\translation_entity\Tests\EntityTranslationUITest->testTranslationUI()
Undefined index: itDrupal\translation_entity\Tests\EntityTranslationUITest->assertOutdatedStatus() Drupal\translation_entity\Tests\EntityTranslationUITest->testTranslationUI() Drupal\simpletest\TestBase->run() simpletest_script_run_one_test('419', 'Drupal\node\Tests\NodeTranslationUITest') NoticeEntityTranslationUITest.php129Drupal\translation_entity\Tests\EntityTranslationUITest->assertOutdatedStatus()
The retranslate flag is not checked by default.OtherEntityTranslationUITest.php38Drupal\translation_entity\Tests\EntityTranslationUITest->testTranslationUI()
Found the Save and publish buttonOtherEntityTranslationUITest.php39Drupal\translation_entity\Tests\EntityTranslationUITest->testTranslationUI()
Found the requested form fields at node/1/editOtherEntityTranslationUITest.php39Drupal\translation_entity\Tests\EntityTranslationUITest->testTranslationUI()
The translation has been correctly unpublished.OtherEntityTranslationUITest.php39Drupal\translation_entity\Tests\EntityTranslationUITest->testTranslationUI()
Undefined index: itDrupal\node\Tests\NodeTranslationUITest->assertPublishedStatus() Drupal\translation_entity\Tests\EntityTranslationUITest->testTranslationUI() Drupal\simpletest\TestBase->run() simpletest_script_run_one_test('419', 'Drupal\node\Tests\NodeTranslationUITest') NoticeNodeTranslationUITest.php101Drupal\node\Tests\NodeTranslationUITest->assertPublishedStatus()
The translation has been correctly unpublished.OtherEntityTranslationUITest.php39Drupal\translation_entity\Tests\EntityTranslationUITest->testTranslationUI()
Undefined index: frDrupal\node\Tests\NodeTranslationUITest->assertPublishedStatus() Drupal\translation_entity\Tests\EntityTranslationUITest->testTranslationUI() Drupal\simpletest\TestBase->run() simpletest_script_run_one_test('419', 'Drupal\node\Tests\NodeTranslationUITest') NoticeNodeTranslationUITest.php101Drupal\node\Tests\NodeTranslationUITest->assertPublishedStatus()
The translation has been correctly unpublished.OtherEntityTranslationUITest.php39Drupal\translation_entity\Tests\EntityTranslationUITest->testTranslationUI()
Undefined index: itDrupal\node\Tests\NodeTranslationUITest->assertPublishedStatus() Drupal\translation_entity\Tests\EntityTranslationUITest->testTranslationUI() Drupal\simpletest\TestBase->run() simpletest_script_run_one_test('419', 'Drupal\node\Tests\NodeTranslationUITest') NoticeNodeTranslationUITest.php101Drupal\node\Tests\NodeTranslationUITest->assertPublishedStatus()
Undefined index: frDrupal\node\Tests\NodeTranslationUITest->assertPublishedStatus() Drupal\translation_entity\Tests\EntityTranslationUITest->testTranslationUI() Drupal\simpletest\TestBase->run() simpletest_script_run_one_test('419', 'Drupal\node\Tests\NodeTranslationUITest') NoticeNodeTranslationUITest.php101Drupal\node\Tests\NodeTranslationUITest->assertPublishedStatus()
Value false is equal to value 'Translation author correctly stored.'.OtherEntityTranslationUITest.php40Drupal\translation_entity\Tests\EntityTranslationUITest->testTranslationUI()
Value false is equal to value 'Translation date correctly stored.'.OtherEntityTranslationUITest.php40Drupal\translation_entity\Tests\EntityTranslationUITest->testTranslationUI()
Undefined index: itDrupal\node\Tests\NodeTranslationUITest->assertAuthoringInfo() Drupal\translation_entity\Tests\EntityTranslationUITest->testTranslationUI() Drupal\simpletest\TestBase->run() simpletest_script_run_one_test('419', 'Drupal\node\Tests\NodeTranslationUITest') NoticeNodeTranslationUITest.php131Drupal\node\Tests\NodeTranslationUITest->assertAuthoringInfo()
Value false is equal to value 'Translation author correctly stored.'.OtherEntityTranslationUITest.php40Drupal\translation_entity\Tests\EntityTranslationUITest->testTranslationUI()
Undefined index: itDrupal\node\Tests\NodeTranslationUITest->assertAuthoringInfo() Drupal\translation_entity\Tests\EntityTranslationUITest->testTranslationUI() Drupal\simpletest\TestBase->run() simpletest_script_run_one_test('419', 'Drupal\node\Tests\NodeTranslationUITest') NoticeNodeTranslationUITest.php132Drupal\node\Tests\NodeTranslationUITest->assertAuthoringInfo()
Value false is equal to value 'Translation date correctly stored.'.OtherEntityTranslationUITest.php40Drupal\translation_entity\Tests\EntityTranslationUITest->testTranslationUI()
Undefined index: frDrupal\node\Tests\NodeTranslationUITest->assertAuthoringInfo() Drupal\translation_entity\Tests\EntityTranslationUITest->testTranslationUI() Drupal\simpletest\TestBase->run() simpletest_script_run_one_test('419', 'Drupal\node\Tests\NodeTranslationUITest') NoticeNodeTranslationUITest.php131Drupal\node\Tests\NodeTranslationUITest->assertAuthoringInfo()
Value false is equal to value 'Translation author correctly stored.'.OtherEntityTranslationUITest.php40Drupal\translation_entity\Tests\EntityTranslationUITest->testTranslationUI()
Undefined index: frDrupal\node\Tests\NodeTranslationUITest->assertAuthoringInfo() Drupal\translation_entity\Tests\EntityTranslationUITest->testTranslationUI() Drupal\simpletest\TestBase->run() simpletest_script_run_one_test('419', 'Drupal\node\Tests\NodeTranslationUITest') NoticeNodeTranslationUITest.php132Drupal\node\Tests\NodeTranslationUITest->assertAuthoringInfo()
Value false is equal to value 'Translation date correctly stored.'.OtherEntityTranslationUITest.php40Drupal\translation_entity\Tests\EntityTranslationUITest->testTranslationUI()
Found the Delete translation buttonOtherEntityTranslationUITest.php41Drupal\translation_entity\Tests\EntityTranslationUITest->testTranslationUI()
Found the requested form fields at fr/node/1/editOtherEntityTranslationUITest.php41Drupal\translation_entity\Tests\EntityTranslationUITest->testTranslationUI()
Found the Delete buttonOtherEntityTranslationUITest.php41Drupal\translation_entity\Tests\EntityTranslationUITest->testTranslationUI()
Found the requested form fields at OtherEntityTranslationUITest.php41Drupal\translation_entity\Tests\EntityTranslationUITest->testTranslationUI()
Translation successfully deleted.OtherEntityTranslationUITest.php41Drupal\translation_entity\Tests\EntityTranslationUITest->testTranslationUI()
ExpandDrupal\node\Tests\Views\FilterUidRevisionTest310
MessageGroupFilenameLineFunctionStatus
Make sure that the view only returns nodes which match either the node or the revision author.OtherFilterUidRevisionTest.php61Drupal\node\Tests\Views\FilterUidRevisionTest->testFilter()
ExpandDrupal\options\Tests\OptionsFieldUITest21750
MessageGroupFilenameLineFunctionStatus
Unkeyed lists are rejected once the field has data.OtherOptionsFieldUITest.php78Drupal\options\Tests\OptionsFieldUITest->testOptionsAllowedValuesInteger()
Values in use cannot be removed.OtherOptionsFieldUITest.php87Drupal\options\Tests\OptionsFieldUITest->testOptionsAllowedValuesInteger()
Unkeyed lists are rejected once the field has data.OtherOptionsFieldUITest.php128Drupal\options\Tests\OptionsFieldUITest->testOptionsAllowedValuesFloat()
Values in use cannot be removed.OtherOptionsFieldUITest.php137Drupal\options\Tests\OptionsFieldUITest->testOptionsAllowedValuesFloat()
Values in use cannot be removed.OtherOptionsFieldUITest.php192Drupal\options\Tests\OptionsFieldUITest->testOptionsAllowedValuesText()
ExpandDrupal\rdf\Tests\MappingDefinitionTest4202
MessageGroupFilenameLineFunctionStatus
Drupal\Core\Entity\EntityStorageException: SQLSTATE[23000]: Integrity constraint violation: 1048 Column 'tid' cannot be null: INSERT INTO {taxonomy_index} (nid, tid, sticky, created) VALUES (:db_insert_placeholder_0, :db_insert_placeholder_1, :db_insert_placeholder_2, :db_insert_placeholder_3); Array ( [:db_insert_placeholder_0] => 1 [:db_insert_placeholder_1] => [:db_insert_placeholder_2] => 0 [:db_insert_placeholder_3] => 1360704563 ) in Drupal\Core\Entity\DatabaseStorageControllerNG->save() (line 334 of /var/lib/drupaltestbot/sites/default/files/checkout/core/lib/Drupal/Core/Entity/DatabaseStorageControllerNG.php). Drupal\Core\Entity\DatabaseStorageControllerNG->save(Object) Drupal\Core\Entity\Entity->save() Drupal\Core\Entity\EntityBCDecorator->save() Drupal\simpletest\WebTestBase->drupalCreateNode(Array) Drupal\rdf\Tests\MappingDefinitionTest->testAttributesInMarkup1() Drupal\simpletest\TestBase->run() simpletest_script_run_one_test('461', 'Drupal\rdf\Tests\MappingDefinitionTest') Uncaught exceptionDatabaseStorageControllerNG.php334Drupal\Core\Entity\DatabaseStorageControllerNG->save()
Drupal\Core\Entity\EntityStorageException: SQLSTATE[23000]: Integrity constraint violation: 1048 Column 'tid' cannot be null: INSERT INTO {taxonomy_index} (nid, tid, sticky, created) VALUES (:db_insert_placeholder_0, :db_insert_placeholder_1, :db_insert_placeholder_2, :db_insert_placeholder_3); Array ( [:db_insert_placeholder_0] => 1 [:db_insert_placeholder_1] => [:db_insert_placeholder_2] => 0 [:db_insert_placeholder_3] => 1360704563 ) in Drupal\Core\Entity\DatabaseStorageControllerNG->save() (line 334 of /var/lib/drupaltestbot/sites/default/files/checkout/core/lib/Drupal/Core/Entity/DatabaseStorageControllerNG.php). Drupal\Core\Entity\DatabaseStorageControllerNG->save(Object) Drupal\Core\Entity\Entity->save() Drupal\Core\Entity\EntityBCDecorator->save() Drupal\simpletest\WebTestBase->drupalCreateNode(Array) Drupal\rdf\Tests\MappingDefinitionTest->testUserAttributesInMarkup() Drupal\simpletest\TestBase->run() simpletest_script_run_one_test('461', 'Drupal\rdf\Tests\MappingDefinitionTest') Uncaught exceptionDatabaseStorageControllerNG.php334Drupal\Core\Entity\DatabaseStorageControllerNG->save()
ExpandDrupal\rdf\Tests\RdfaMarkupTest1501
MessageGroupFilenameLineFunctionStatus
Drupal\Core\Entity\EntityStorageException: SQLSTATE[23000]: Integrity constraint violation: 1048 Column 'tid' cannot be null: INSERT INTO {taxonomy_index} (nid, tid, sticky, created) VALUES (:db_insert_placeholder_0, :db_insert_placeholder_1, :db_insert_placeholder_2, :db_insert_placeholder_3); Array ( [:db_insert_placeholder_0] => 1 [:db_insert_placeholder_1] => [:db_insert_placeholder_2] => 0 [:db_insert_placeholder_3] => 1360704568 ) in Drupal\Core\Entity\DatabaseStorageControllerNG->save() (line 334 of /var/lib/drupaltestbot/sites/default/files/checkout/core/lib/Drupal/Core/Entity/DatabaseStorageControllerNG.php). Drupal\Core\Entity\DatabaseStorageControllerNG->save(Object) Drupal\Core\Entity\Entity->save() Drupal\Core\Entity\EntityBCDecorator->save() Drupal\simpletest\WebTestBase->drupalCreateNode(Array) Drupal\rdf\Tests\RdfaMarkupTest->testAttributesInMarkupFile() Drupal\simpletest\TestBase->run() simpletest_script_run_one_test('463', 'Drupal\rdf\Tests\RdfaMarkupTest') Uncaught exceptionDatabaseStorageControllerNG.php334Drupal\Core\Entity\DatabaseStorageControllerNG->save()
ExpandDrupal\search\Tests\SearchCommentCountToggleTest411
MessageGroupFilenameLineFunctionStatus
The test did not complete due to a fatal error.Completion checkSearchCommentCountToggleTest.php80Drupal\search\Tests\SearchCommentCountToggleTest->testSearchCommentCountToggle()
Undefined offset: 0Drupal\simpletest\WebTestBase->drupalCreateNode(Array) Drupal\search\Tests\SearchCommentCountToggleTest->setUp() Drupal\simpletest\TestBase->run() simpletest_script_run_one_test('482', 'Drupal\search\Tests\SearchCommentCountToggleTest') NoticeWebTestBase.php264Drupal\simpletest\WebTestBase->drupalCreateNode()
ExpandDrupal\search\Tests\SearchCommentTest4803
MessageGroupFilenameLineFunctionStatus
Drupal\Core\Entity\EntityStorageException: SQLSTATE[23000]: Integrity constraint violation: 1048 Column 'tid' cannot be null: INSERT INTO {taxonomy_index} (nid, tid, sticky, created) VALUES (:db_insert_placeholder_0, :db_insert_placeholder_1, :db_insert_placeholder_2, :db_insert_placeholder_3); Array ( [:db_insert_placeholder_0] => 1 [:db_insert_placeholder_1] => [:db_insert_placeholder_2] => 0 [:db_insert_placeholder_3] => 1360704636 ) in Drupal\Core\Entity\DatabaseStorageControllerNG->save() (line 334 of /var/lib/drupaltestbot/sites/default/files/checkout/core/lib/Drupal/Core/Entity/DatabaseStorageControllerNG.php). Drupal\Core\Entity\DatabaseStorageControllerNG->save(Object) Drupal\Core\Entity\Entity->save() Drupal\Core\Entity\EntityBCDecorator->save() Drupal\simpletest\WebTestBase->drupalCreateNode(Array) Drupal\search\Tests\SearchCommentTest->testSearchResultsComment() Drupal\simpletest\TestBase->run() simpletest_script_run_one_test('483', 'Drupal\search\Tests\SearchCommentTest') Uncaught exceptionDatabaseStorageControllerNG.php334Drupal\Core\Entity\DatabaseStorageControllerNG->save()
Drupal\Core\Entity\EntityStorageException: SQLSTATE[23000]: Integrity constraint violation: 1048 Column 'tid' cannot be null: INSERT INTO {taxonomy_index} (nid, tid, sticky, created) VALUES (:db_insert_placeholder_0, :db_insert_placeholder_1, :db_insert_placeholder_2, :db_insert_placeholder_3); Array ( [:db_insert_placeholder_0] => 1 [:db_insert_placeholder_1] => [:db_insert_placeholder_2] => 0 [:db_insert_placeholder_3] => 1360704636 ) in Drupal\Core\Entity\DatabaseStorageControllerNG->save() (line 334 of /var/lib/drupaltestbot/sites/default/files/checkout/core/lib/Drupal/Core/Entity/DatabaseStorageControllerNG.php). Drupal\Core\Entity\DatabaseStorageControllerNG->save(Object) Drupal\Core\Entity\Entity->save() Drupal\Core\Entity\EntityBCDecorator->save() Drupal\simpletest\WebTestBase->drupalCreateNode(Array) Drupal\search\Tests\SearchCommentTest->testSearchResultsCommentAccess() Drupal\simpletest\TestBase->run() simpletest_script_run_one_test('483', 'Drupal\search\Tests\SearchCommentTest') Uncaught exceptionDatabaseStorageControllerNG.php334Drupal\Core\Entity\DatabaseStorageControllerNG->save()
Drupal\Core\Entity\EntityStorageException: SQLSTATE[23000]: Integrity constraint violation: 1048 Column 'tid' cannot be null: INSERT INTO {taxonomy_index} (nid, tid, sticky, created) VALUES (:db_insert_placeholder_0, :db_insert_placeholder_1, :db_insert_placeholder_2, :db_insert_placeholder_3); Array ( [:db_insert_placeholder_0] => 1 [:db_insert_placeholder_1] => [:db_insert_placeholder_2] => 0 [:db_insert_placeholder_3] => 1360704636 ) in Drupal\Core\Entity\DatabaseStorageControllerNG->save() (line 334 of /var/lib/drupaltestbot/sites/default/files/checkout/core/lib/Drupal/Core/Entity/DatabaseStorageControllerNG.php). Drupal\Core\Entity\DatabaseStorageControllerNG->save(Object) Drupal\Core\Entity\Entity->save() Drupal\Core\Entity\EntityBCDecorator->save() Drupal\simpletest\WebTestBase->drupalCreateNode(Array) Drupal\search\Tests\SearchCommentTest->testAddNewComment() Drupal\simpletest\TestBase->run() simpletest_script_run_one_test('483', 'Drupal\search\Tests\SearchCommentTest') Uncaught exceptionDatabaseStorageControllerNG.php334Drupal\Core\Entity\DatabaseStorageControllerNG->save()
ExpandDrupal\search\Tests\SearchMultilingualEntityTest311
MessageGroupFilenameLineFunctionStatus
The test did not complete due to a fatal error.Completion checkSearchMultilingualEntityTest.php92Drupal\search\Tests\SearchMultilingualEntityTest->testIndexingThrottle()
Undefined offset: 0Drupal\simpletest\WebTestBase->drupalCreateNode(Array) Drupal\search\Tests\SearchMultilingualEntityTest->setUp() Drupal\simpletest\TestBase->run() simpletest_script_run_one_test('492', 'Drupal\search\Tests\SearchMultilingualEntityTest') NoticeWebTestBase.php264Drupal\simpletest\WebTestBase->drupalCreateNode()
ExpandDrupal\system\Tests\Ajax\MultiFormTest3160
MessageGroupFilenameLineFunctionStatus
Found the correct number of field items on the initial page.OtherMultiFormTest.php77Drupal\system\Tests\Ajax\MultiFormTest->testMultiForm()
Found the correct number of field items on the initial page.OtherMultiFormTest.php77Drupal\system\Tests\Ajax\MultiFormTest->testMultiForm()
Found the correct number of field items after an AJAX submission.OtherMultiFormTest.php87Drupal\system\Tests\Ajax\MultiFormTest->testMultiForm()
Found the correct number of field items after an AJAX submission.OtherMultiFormTest.php87Drupal\system\Tests\Ajax\MultiFormTest->testMultiForm()
Found the correct number of field items after an AJAX submission.OtherMultiFormTest.php87Drupal\system\Tests\Ajax\MultiFormTest->testMultiForm()
Found the correct number of field items after an AJAX submission.OtherMultiFormTest.php87Drupal\system\Tests\Ajax\MultiFormTest->testMultiForm()
ExpandDrupal\system\Tests\Entity\EntityFieldTest68831
MessageGroupFilenameLineFunctionStatus
entity_test_mul: User id can be read.OtherEntityFieldTest.php287Drupal\system\Tests\Entity\EntityFieldTest->testSave()
Trying to get property of non-objectDrupal\system\Tests\Entity\EntityFieldTest->assertSave('entity_test_mul') Drupal\system\Tests\Entity\EntityFieldTest->testSave() Drupal\simpletest\TestBase->run() simpletest_script_run_one_test('184', 'Drupal\system\Tests\Entity\EntityFieldTest') NoticeEntityFieldTest.php311Drupal\system\Tests\Entity\EntityFieldTest->assertSave()
entity_test_mul: User name can be read.OtherEntityFieldTest.php287Drupal\system\Tests\Entity\EntityFieldTest->testSave()
Value 0 is equal to value 1.OtherEntityFieldTest.php529Drupal\system\Tests\Entity\EntityFieldTest->testEntityConstraintValidation()
ExpandDrupal\system\Tests\Entity\EntityFormTest7610
MessageGroupFilenameLineFunctionStatus
entity_test_mul: Entity not found in the database.OtherEntityFormTest.php44Drupal\system\Tests\Entity\EntityFormTest->testFormCRUD()
ExpandDrupal\system\Tests\Entity\EntityTranslationTest126120
MessageGroupFilenameLineFunctionStatus
entity_test_mul: The entity author has been correctly stored as language neutral.OtherEntityTranslationTest.php196Drupal\system\Tests\Entity\EntityTranslationTest->testMultilingualProperties()
entity_test_mul: The entity author defaults to neutral language.OtherEntityTranslationTest.php196Drupal\system\Tests\Entity\EntityTranslationTest->testMultilingualProperties()
entity_test_mul: The entity author can be retrieved without specifying a language.OtherEntityTranslationTest.php196Drupal\system\Tests\Entity\EntityTranslationTest->testMultilingualProperties()
entity_test_mul: The entity author has been correctly stored as a language-aware property.OtherEntityTranslationTest.php196Drupal\system\Tests\Entity\EntityTranslationTest->testMultilingualProperties()
entity_test_mul: The entity author defaults to the default language.OtherEntityTranslationTest.php196Drupal\system\Tests\Entity\EntityTranslationTest->testMultilingualProperties()
entity_test_mul: The entity author can be retrieved without specifying a language.OtherEntityTranslationTest.php196Drupal\system\Tests\Entity\EntityTranslationTest->testMultilingualProperties()
entity_test_mul: The entity author has been correctly stored for language l0.OtherEntityTranslationTest.php196Drupal\system\Tests\Entity\EntityTranslationTest->testMultilingualProperties()
entity_test_mul: The entity author has been correctly stored for language l1.OtherEntityTranslationTest.php196Drupal\system\Tests\Entity\EntityTranslationTest->testMultilingualProperties()
entity_test_mul: The entity author has been correctly stored for language l2.OtherEntityTranslationTest.php196Drupal\system\Tests\Entity\EntityTranslationTest->testMultilingualProperties()
entity_test_mul: One entity loaded by name, uid and field value using different language meta conditions.OtherEntityTranslationTest.php196Drupal\system\Tests\Entity\EntityTranslationTest->testMultilingualProperties()
entity_test_mulrev: The entity author has been correctly stored for language l1.OtherEntityTranslationTest.php196Drupal\system\Tests\Entity\EntityTranslationTest->testMultilingualProperties()
entity_test_mulrev: The entity author has been correctly stored for language l2.OtherEntityTranslationTest.php196Drupal\system\Tests\Entity\EntityTranslationTest->testMultilingualProperties()
ExpandDrupal\system\Tests\Entity\EntityUUIDTest7520
MessageGroupFilenameLineFunctionStatus
Value array ( 0 => NULL, ) is equal to value array ( 0 => array ( 'value' => '2', ), ).OtherEntityUUIDTest.php39Drupal\system\Tests\Entity\EntityUUIDTest->testCRUD()
Value array ( 0 => NULL, ) is equal to value array ( 0 => array ( 'value' => '2', ), ).OtherEntityUUIDTest.php39Drupal\system\Tests\Entity\EntityUUIDTest->testCRUD()
ExpandDrupal\system\Tests\Form\RebuildTest10240
MessageGroupFilenameLineFunctionStatus
AJAX submission succeeded.OtherRebuildTest.php96Drupal\system\Tests\Form\RebuildTest->testPreserveFormActionAfterAJAX()
Form retained its state from cache.OtherRebuildTest.php108Drupal\system\Tests\Form\RebuildTest->testPreserveFormActionAfterAJAX()
AJAX submission succeeded.OtherRebuildTest.php96Drupal\system\Tests\Form\RebuildTest->testPreserveFormActionAfterAJAX()
Form retained its state from cache.OtherRebuildTest.php108Drupal\system\Tests\Form\RebuildTest->testPreserveFormActionAfterAJAX()
ExpandDrupal\system\Tests\Menu\BreadcrumbTest13701
MessageGroupFilenameLineFunctionStatus
Drupal\Core\Entity\EntityStorageException: SQLSTATE[23000]: Integrity constraint violation: 1048 Column 'tid' cannot be null: INSERT INTO {taxonomy_index} (nid, tid, sticky, created) VALUES (:db_insert_placeholder_0, :db_insert_placeholder_1, :db_insert_placeholder_2, :db_insert_placeholder_3); Array ( [:db_insert_placeholder_0] => 2 [:db_insert_placeholder_1] => [:db_insert_placeholder_2] => 0 [:db_insert_placeholder_3] => 1360703967 ) in Drupal\Core\Entity\DatabaseStorageControllerNG->save() (line 334 of /var/lib/drupaltestbot/sites/default/files/checkout/core/lib/Drupal/Core/Entity/DatabaseStorageControllerNG.php). Drupal\Core\Entity\DatabaseStorageControllerNG->save(Object) Drupal\Core\Entity\Entity->save() Drupal\Core\Entity\EntityBCDecorator->save() Drupal\simpletest\WebTestBase->drupalCreateNode(Array) Drupal\system\Tests\Menu\BreadcrumbTest->testBreadCrumbs() Drupal\simpletest\TestBase->run() simpletest_script_run_one_test('372', 'Drupal\system\Tests\Menu\BreadcrumbTest') Uncaught exceptionDatabaseStorageControllerNG.php334Drupal\Core\Entity\DatabaseStorageControllerNG->save()
ExpandDrupal\taxonomy\Tests\TermIndexTest4420
MessageGroupFilenameLineFunctionStatus
Term 2 is indexed once.OtherTermIndexTest.php169Drupal\taxonomy\Tests\TermIndexTest->testTaxonomyIndex()
Term 2 is indexed.OtherTermIndexTest.php185Drupal\taxonomy\Tests\TermIndexTest->testTaxonomyIndex()
ExpandDrupal\taxonomy\Tests\TermTest300123
MessageGroupFilenameLineFunctionStatus
Term is displayed when previewing the node.OtherTermTest.php134Drupal\taxonomy\Tests\TermTest->testTaxonomyNode()
Invalid argument supplied for foreach()Drupal\simpletest\WebTestBase->drupalPost(NULL, NULL, 'Preview') Drupal\taxonomy\Tests\TermTest->testTaxonomyNode() Drupal\simpletest\TestBase->run() simpletest_script_run_one_test('563', 'Drupal\taxonomy\Tests\TermTest') WarningWebTestBase.php1314Drupal\simpletest\WebTestBase->drupalPost()
Found the Preview buttonOtherTermTest.php135Drupal\taxonomy\Tests\TermTest->testTaxonomyNode()
Found the requested form fields at OtherTermTest.php135Drupal\taxonomy\Tests\TermTest->testTaxonomyNode()
Term is displayed when previewing the node again.OtherTermTest.php136Drupal\taxonomy\Tests\TermTest->testTaxonomyNode()
Term is displayed when previewing the node.OtherTermTest.php134Drupal\taxonomy\Tests\TermTest->testTaxonomyNode()
Invalid argument supplied for foreach()Drupal\simpletest\WebTestBase->drupalPost(NULL, NULL, 'Preview') Drupal\taxonomy\Tests\TermTest->testTaxonomyNode() Drupal\simpletest\TestBase->run() simpletest_script_run_one_test('563', 'Drupal\taxonomy\Tests\TermTest') WarningWebTestBase.php1314Drupal\simpletest\WebTestBase->drupalPost()
Found the Preview buttonOtherTermTest.php135Drupal\taxonomy\Tests\TermTest->testTaxonomyNode()
Found the requested form fields at OtherTermTest.php135Drupal\taxonomy\Tests\TermTest->testTaxonomyNode()
Term is displayed when previewing the node again.OtherTermTest.php136Drupal\taxonomy\Tests\TermTest->testTaxonomyNode()
array_flip(): Can only flip STRING and INTEGER values!WarningDatabaseStorageController.php182Drupal\Core\Entity\DatabaseStorageController->load()
The term appears on the node previewOtherTermTest.php174Drupal\taxonomy\Tests\TermTest->testNodeTermCreationAndDeletion()
The term appears on the node previewOtherTermTest.php174Drupal\taxonomy\Tests\TermTest->testNodeTermCreationAndDeletion()
The term appears on the node previewOtherTermTest.php174Drupal\taxonomy\Tests\TermTest->testNodeTermCreationAndDeletion()
The term appears on the node previewOtherTermTest.php174Drupal\taxonomy\Tests\TermTest->testNodeTermCreationAndDeletion()
ExpandDrupal\taxonomy\Tests\TokenReplaceTest2802
MessageGroupFilenameLineFunctionStatus
Drupal\Core\Entity\EntityStorageException: SQLSTATE[23000]: Integrity constraint violation: 1048 Column 'tid' cannot be null: INSERT INTO {taxonomy_index} (nid, tid, sticky, created) VALUES (:db_insert_placeholder_0, :db_insert_placeholder_1, :db_insert_placeholder_2, :db_insert_placeholder_3); Array ( [:db_insert_placeholder_0] => 1 [:db_insert_placeholder_1] => [:db_insert_placeholder_2] => 0 [:db_insert_placeholder_3] => 1360705033 ) in Drupal\Core\Entity\DatabaseStorageControllerNG->save() (line 334 of /var/lib/drupaltestbot/sites/default/files/checkout/core/lib/Drupal/Core/Entity/DatabaseStorageControllerNG.php). Drupal\Core\Entity\DatabaseStorageControllerNG->save(Object) Drupal\Core\Entity\Entity->save() Drupal\Core\Entity\EntityBCDecorator->save() Drupal\simpletest\WebTestBase->drupalCreateNode(Array) Drupal\taxonomy\Tests\TokenReplaceTest->testTaxonomyTokenReplacement() Drupal\simpletest\TestBase->run() simpletest_script_run_one_test('567', 'Drupal\taxonomy\Tests\TokenReplaceTest') Uncaught exceptionDatabaseStorageControllerNG.php334Drupal\Core\Entity\DatabaseStorageControllerNG->save()
Drupal\Core\Entity\EntityStorageException: SQLSTATE[23000]: Integrity constraint violation: 1048 Column 'tid' cannot be null: INSERT INTO {taxonomy_index} (nid, tid, sticky, created) VALUES (:db_insert_placeholder_0, :db_insert_placeholder_1, :db_insert_placeholder_2, :db_insert_placeholder_3); Array ( [:db_insert_placeholder_0] => 1 [:db_insert_placeholder_1] => [:db_insert_placeholder_2] => 0 [:db_insert_placeholder_3] => 1360705033 ) in Drupal\Core\Entity\DatabaseStorageControllerNG->save() (line 334 of /var/lib/drupaltestbot/sites/default/files/checkout/core/lib/Drupal/Core/Entity/DatabaseStorageControllerNG.php). Drupal\Core\Entity\DatabaseStorageControllerNG->save(Object) Drupal\Core\Entity\Entity->save() Drupal\Core\Entity\EntityBCDecorator->save() Drupal\simpletest\WebTestBase->drupalCreateNode(Array) Drupal\taxonomy\Tests\TokenReplaceTest->testTaxonomyTokenReplacement() Drupal\simpletest\TestBase->run() simpletest_script_run_one_test('567', 'Drupal\taxonomy\Tests\TokenReplaceTest') Uncaught exceptionDatabaseStorageControllerNG.php334Drupal\Core\Entity\DatabaseStorageControllerNG->save()
ExpandDrupal\translation\Tests\TranslationTest7887
MessageGroupFilenameLineFunctionStatus
The test did not complete due to a fatal error.Completion checkTranslationTest.php70Drupal\translation\Tests\TranslationTest->testContentTranslation()
Basic page created.OtherTranslationTest.php353Drupal\translation\Tests\TranslationTest->createPage()
Node found in database.OtherTranslationTest.php357Drupal\translation\Tests\TranslationTest->createPage()
Trying to get property of non-objectDrupal\translation\Tests\TranslationTest->testContentTranslation() Drupal\simpletest\TestBase->run() simpletest_script_run_one_test('591', 'Drupal\translation\Tests\TranslationTest') NoticeTranslationTest.php78Drupal\translation\Tests\TranslationTest->testContentTranslation()
Found the Save and unpublish buttonOtherTranslationTest.php78Drupal\translation\Tests\TranslationTest->testContentTranslation()
Found the requested form fields at node//editOtherTranslationTest.php78Drupal\translation\Tests\TranslationTest->testContentTranslation()
Trying to get property of non-objectDrupal\translation\Tests\TranslationTest->testContentTranslation() Drupal\simpletest\TestBase->run() simpletest_script_run_one_test('591', 'Drupal\translation\Tests\TranslationTest') NoticeTranslationTest.php79Drupal\translation\Tests\TranslationTest->testContentTranslation()
Trying to get property of non-objectDrupal\translation\Tests\TranslationTest->testContentTranslation() Drupal\simpletest\TestBase->run() simpletest_script_run_one_test('591', 'Drupal\translation\Tests\TranslationTest') NoticeTranslationTest.php80Drupal\translation\Tests\TranslationTest->testContentTranslation()
Found the Save and publish buttonOtherTranslationTest.php80Drupal\translation\Tests\TranslationTest->testContentTranslation()
Found the requested form fields at node//editOtherTranslationTest.php80Drupal\translation\Tests\TranslationTest->testContentTranslation()
Trying to get property of non-objectDrupal\translation\Tests\TranslationTest->testContentTranslation() Drupal\simpletest\TestBase->run() simpletest_script_run_one_test('591', 'Drupal\translation\Tests\TranslationTest') NoticeTranslationTest.php86Drupal\translation\Tests\TranslationTest->testContentTranslation()
Trying to get property of non-objectDrupal\translation\Tests\TranslationTest->testContentTranslation() Drupal\simpletest\TestBase->run() simpletest_script_run_one_test('591', 'Drupal\translation\Tests\TranslationTest') NoticeTranslationTest.php87Drupal\translation\Tests\TranslationTest->testContentTranslation()
The "add translation" link for Spanish points to the localized path of the target language.OtherTranslationTest.php87Drupal\translation\Tests\TranslationTest->testContentTranslation()
Argument 1 passed to Drupal\translation\Tests\TranslationTest::createTranslation() must implement interface Drupal\Core\Entity\EntityInterface, boolean given, called in /var/lib/drupaltestbot/sites/default/files/checkout/core/modules/translation/lib/Drupal/translation/Tests/TranslationTest.php on line 92 and definedDrupal\translation\Tests\TranslationTest->createTranslation(, 'qHyUkIzh', 'hVHrhCmO', 'es') Drupal\translation\Tests\TranslationTest->testContentTranslation() Drupal\simpletest\TestBase->run() simpletest_script_run_one_test('591', 'Drupal\translation\Tests\TranslationTest') Recoverable errorTranslationTest.php377Drupal\translation\Tests\TranslationTest->createTranslation()
Trying to get property of non-objectDrupal\translation\Tests\TranslationTest->createTranslation(, 'qHyUkIzh', 'hVHrhCmO', 'es') Drupal\translation\Tests\TranslationTest->testContentTranslation() Drupal\simpletest\TestBase->run() simpletest_script_run_one_test('591', 'Drupal\translation\Tests\TranslationTest') NoticeTranslationTest.php378Drupal\translation\Tests\TranslationTest->createTranslation()
ExpandDrupal\translation_entity\Tests\EntityTestTranslationUITest95230
MessageGroupFilenameLineFunctionStatus
user_id correctly stored in the default language.OtherEntityTranslationUITest.php37Drupal\translation_entity\Tests\EntityTranslationUITest->testTranslationUI()
Source language correctly switched.OtherEntityTranslationUITest.php37Drupal\translation_entity\Tests\EntityTranslationUITest->testTranslationUI()
user_id correctly stored with language en.OtherEntityTranslationUITest.php37Drupal\translation_entity\Tests\EntityTranslationUITest->testTranslationUI()
user_id correctly stored with language it.OtherEntityTranslationUITest.php37Drupal\translation_entity\Tests\EntityTranslationUITest->testTranslationUI()
user_id correctly stored with language fr.OtherEntityTranslationUITest.php37Drupal\translation_entity\Tests\EntityTranslationUITest->testTranslationUI()
The retranslate flag is now shown.OtherEntityTranslationUITest.php38Drupal\translation_entity\Tests\EntityTranslationUITest->testTranslationUI()
The "outdated" status has been correctly stored.OtherEntityTranslationUITest.php38Drupal\translation_entity\Tests\EntityTranslationUITest->testTranslationUI()
The retranslate flag is now shown.OtherEntityTranslationUITest.php38Drupal\translation_entity\Tests\EntityTranslationUITest->testTranslationUI()
The "outdated" status has been correctly stored.OtherEntityTranslationUITest.php38Drupal\translation_entity\Tests\EntityTranslationUITest->testTranslationUI()
The translation has been correctly unpublished.OtherEntityTranslationUITest.php39Drupal\translation_entity\Tests\EntityTranslationUITest->testTranslationUI()
The translation has been correctly unpublished.OtherEntityTranslationUITest.php39Drupal\translation_entity\Tests\EntityTranslationUITest->testTranslationUI()
The last translation is published and cannot be unpublished.OtherEntityTranslationUITest.php39Drupal\translation_entity\Tests\EntityTranslationUITest->testTranslationUI()
Value false is equal to value 'Translation author correctly stored.'.OtherEntityTranslationUITest.php40Drupal\translation_entity\Tests\EntityTranslationUITest->testTranslationUI()
Value false is equal to value 'Translation date correctly stored.'.OtherEntityTranslationUITest.php40Drupal\translation_entity\Tests\EntityTranslationUITest->testTranslationUI()
Value false is equal to value 'Translation author correctly stored.'.OtherEntityTranslationUITest.php40Drupal\translation_entity\Tests\EntityTranslationUITest->testTranslationUI()
Value false is equal to value 'Translation date correctly stored.'.OtherEntityTranslationUITest.php40Drupal\translation_entity\Tests\EntityTranslationUITest->testTranslationUI()
Value false is equal to value 'Translation author correctly stored.'.OtherEntityTranslationUITest.php40Drupal\translation_entity\Tests\EntityTranslationUITest->testTranslationUI()
Value false is equal to value 'Translation date correctly stored.'.OtherEntityTranslationUITest.php40Drupal\translation_entity\Tests\EntityTranslationUITest->testTranslationUI()
Value false is equal to value 'Translation author correctly kept.'.OtherEntityTranslationUITest.php40Drupal\translation_entity\Tests\EntityTranslationUITest->testTranslationUI()
Value false is equal to value 'Translation date correctly kept.'.OtherEntityTranslationUITest.php40Drupal\translation_entity\Tests\EntityTranslationUITest->testTranslationUI()
Found the Delete buttonOtherEntityTranslationUITest.php41Drupal\translation_entity\Tests\EntityTranslationUITest->testTranslationUI()
Found the requested form fields at OtherEntityTranslationUITest.php41Drupal\translation_entity\Tests\EntityTranslationUITest->testTranslationUI()
Translation successfully deleted.OtherEntityTranslationUITest.php41Drupal\translation_entity\Tests\EntityTranslationUITest->testTranslationUI()
ExpandDrupal\translation_entity\Tests\EntityTranslationWorkflowsTest15182
MessageGroupFilenameLineFunctionStatus
The translation overview points to the translation form when creating translations.OtherEntityTranslationWorkflowsTest.php82Drupal\translation_entity\Tests\EntityTranslationWorkflowsTest->testWorkflows()
Undefined variable: url_targetDrupal\simpletest\WebTestBase->clickLink('edit', 0) Drupal\translation_entity\Tests\EntityTranslationWorkflowsTest->assertWorkflows(Object, Array) Drupal\translation_entity\Tests\EntityTranslationWorkflowsTest->testWorkflows() Drupal\simpletest\TestBase->run() simpletest_script_run_one_test('202', 'Drupal\translation_entity\Tests\EntityTranslationWorkflowsTest') NoticeWebTestBase.php1936Drupal\simpletest\WebTestBase->clickLink()
Clicked link edit () from http://drupaltestbot-staging-mysql/checkout/fr/entity_test_mul/manage/1/translationsBrowserEntityTranslationWorkflowsTest.php82Drupal\translation_entity\Tests\EntityTranslationWorkflowsTest->testWorkflows()
The translation overview points to the translation form for translators when editing translations.OtherEntityTranslationWorkflowsTest.php82Drupal\translation_entity\Tests\EntityTranslationWorkflowsTest->testWorkflows()
The translation overview points to the translation form when creating translations.OtherEntityTranslationWorkflowsTest.php86Drupal\translation_entity\Tests\EntityTranslationWorkflowsTest->testWorkflows()
Undefined variable: url_targetDrupal\simpletest\WebTestBase->clickLink('edit', 1) Drupal\translation_entity\Tests\EntityTranslationWorkflowsTest->assertWorkflows(Object, Array) Drupal\translation_entity\Tests\EntityTranslationWorkflowsTest->testWorkflows() Drupal\simpletest\TestBase->run() simpletest_script_run_one_test('202', 'Drupal\translation_entity\Tests\EntityTranslationWorkflowsTest') NoticeWebTestBase.php1936Drupal\simpletest\WebTestBase->clickLink()
Clicked link edit () from http://drupaltestbot-staging-mysql/checkout/fr/entity_test_mul/manage/1/translationsBrowserEntityTranslationWorkflowsTest.php86Drupal\translation_entity\Tests\EntityTranslationWorkflowsTest->testWorkflows()
The translation overview points to the edit form for editors when editing translations.OtherEntityTranslationWorkflowsTest.php86Drupal\translation_entity\Tests\EntityTranslationWorkflowsTest->testWorkflows()
edit link found.OtherEntityTranslationWorkflowsTest.php101Drupal\translation_entity\Tests\EntityTranslationWorkflowsTest->testWorkflows()
delete link found.OtherEntityTranslationWorkflowsTest.php101Drupal\translation_entity\Tests\EntityTranslationWorkflowsTest->testWorkflows()
ExpandDrupal\views\Tests\DefaultViewsTest72011
MessageGroupFilenameLineFunctionStatus
Undefined index: undDrupal\views\Tests\DefaultViewsTest->setUp() Drupal\simpletest\TestBase->run() simpletest_script_run_one_test('651', 'Drupal\views\Tests\DefaultViewsTest') NoticeDefaultViewsTest.php106Drupal\views\Tests\DefaultViewsTest->setUp()
Undefined index: undDrupal\views\Tests\DefaultViewsTest->setUp() Drupal\simpletest\TestBase->run() simpletest_script_run_one_test('651', 'Drupal\views\Tests\DefaultViewsTest') NoticeDefaultViewsTest.php106Drupal\views\Tests\DefaultViewsTest->setUp()
Undefined index: undDrupal\views\Tests\DefaultViewsTest->setUp() Drupal\simpletest\TestBase->run() simpletest_script_run_one_test('651', 'Drupal\views\Tests\DefaultViewsTest') NoticeDefaultViewsTest.php106Drupal\views\Tests\DefaultViewsTest->setUp()
Undefined index: undDrupal\views\Tests\DefaultViewsTest->setUp() Drupal\simpletest\TestBase->run() simpletest_script_run_one_test('651', 'Drupal\views\Tests\DefaultViewsTest') NoticeDefaultViewsTest.php106Drupal\views\Tests\DefaultViewsTest->setUp()
Undefined index: undDrupal\views\Tests\DefaultViewsTest->setUp() Drupal\simpletest\TestBase->run() simpletest_script_run_one_test('651', 'Drupal\views\Tests\DefaultViewsTest') NoticeDefaultViewsTest.php106Drupal\views\Tests\DefaultViewsTest->setUp()
Undefined index: undDrupal\views\Tests\DefaultViewsTest->setUp() Drupal\simpletest\TestBase->run() simpletest_script_run_one_test('651', 'Drupal\views\Tests\DefaultViewsTest') NoticeDefaultViewsTest.php106Drupal\views\Tests\DefaultViewsTest->setUp()
Undefined index: undDrupal\views\Tests\DefaultViewsTest->setUp() Drupal\simpletest\TestBase->run() simpletest_script_run_one_test('651', 'Drupal\views\Tests\DefaultViewsTest') NoticeDefaultViewsTest.php106Drupal\views\Tests\DefaultViewsTest->setUp()
Undefined index: undDrupal\views\Tests\DefaultViewsTest->setUp() Drupal\simpletest\TestBase->run() simpletest_script_run_one_test('651', 'Drupal\views\Tests\DefaultViewsTest') NoticeDefaultViewsTest.php106Drupal\views\Tests\DefaultViewsTest->setUp()
Undefined index: undDrupal\views\Tests\DefaultViewsTest->setUp() Drupal\simpletest\TestBase->run() simpletest_script_run_one_test('651', 'Drupal\views\Tests\DefaultViewsTest') NoticeDefaultViewsTest.php106Drupal\views\Tests\DefaultViewsTest->setUp()
Undefined index: undDrupal\views\Tests\DefaultViewsTest->setUp() Drupal\simpletest\TestBase->run() simpletest_script_run_one_test('651', 'Drupal\views\Tests\DefaultViewsTest') NoticeDefaultViewsTest.php106Drupal\views\Tests\DefaultViewsTest->setUp()
Undefined index: undDrupal\views\Tests\DefaultViewsTest->setUp() Drupal\simpletest\TestBase->run() simpletest_script_run_one_test('651', 'Drupal\views\Tests\DefaultViewsTest') NoticeDefaultViewsTest.php106Drupal\views\Tests\DefaultViewsTest->setUp()
'Missing handler: search_node_links_to nid argument'Debugviews.module926views_get_handler()
'Missing handler: search_node_links_to nid argument'Debugviews.module926views_get_handler()
'Missing handler: search_node_links_to nid argument'Debugviews.module926views_get_handler()
'Missing handler: field_data_comment_body comment_body field'Debugviews.module926views_get_handler()
'Missing handler: history timestamp field'Debugviews.module926views_get_handler()
'Missing handler: history timestamp field'Debugviews.module926views_get_handler()

All

Test namePassFailException
LeafDrupal\action\Tests\BulkFormTest3300
LeafDrupal\action\Tests\ConfigurationTest3900
LeafDrupal\action\Tests\LoopTest2100
LeafDrupal\aggregator\Tests\AddFeedTest7300
LeafDrupal\aggregator\Tests\AggregatorConfigurationTest2000
LeafDrupal\aggregator\Tests\AggregatorCronTest5500
LeafDrupal\aggregator\Tests\AggregatorRenderingTest22000
LeafDrupal\aggregator\Tests\CategorizeFeedItemTest6100
LeafDrupal\aggregator\Tests\CategorizeFeedTest2100
LeafDrupal\aggregator\Tests\FeedParserTest7200
LeafDrupal\aggregator\Tests\ImportOpmlTest6800
LeafDrupal\aggregator\Tests\RemoveFeedItemTest27000
LeafDrupal\aggregator\Tests\RemoveFeedTest2500
LeafDrupal\aggregator\Tests\UpdateFeedItemTest6500
LeafDrupal\aggregator\Tests\UpdateFeedTest7600
LeafDrupal\ban\Tests\IpAddressBlockingTest4300
LeafDrupal\block\Tests\BlockAdminThemeTest1900
LeafDrupal\block\Tests\BlockCacheTest18500
LeafDrupal\block\Tests\BlockHiddenRegionTest1800
LeafDrupal\block\Tests\BlockHtmlIdTest1000
LeafDrupal\block\Tests\BlockInvalidRegionTest2400
LeafDrupal\block\Tests\BlockLanguageCacheTest8200
LeafDrupal\block\Tests\BlockLanguageTest5100
LeafDrupal\block\Tests\BlockLibrarySearchTest1900
LeafDrupal\block\Tests\BlockStorageUnitTest1800
LeafDrupal\block\Tests\BlockTemplateSuggestionsUnitTest300
LeafDrupal\block\Tests\BlockTest33000
LeafDrupal\block\Tests\BlockTitleXSSTest1500
LeafDrupal\block\Tests\BlockUiTest900
LeafDrupal\block\Tests\NewDefaultThemeBlocksTest1700
LeafDrupal\block\Tests\NonDefaultBlockAdminTest1200
LeafDrupal\block\Tests\Views\DisplayBlockTest3500
LeafDrupal\book\Tests\BookTest50300
LeafDrupal\breakpoint\Tests\BreakpointAPITest600
LeafDrupal\breakpoint\Tests\BreakpointCRUDTest2100
LeafDrupal\breakpoint\Tests\BreakpointGroupAPITest400
LeafDrupal\breakpoint\Tests\BreakpointGroupCRUDTest1200
LeafDrupal\breakpoint\Tests\BreakpointMediaQueryTest6300
LeafDrupal\breakpoint\Tests\BreakpointThemeTest2300
LeafDrupal\ckeditor\Tests\CKEditorAdminTest4700
LeafDrupal\ckeditor\Tests\CKEditorLoadingTest5100
LeafDrupal\ckeditor\Tests\CKEditorPluginManagerTest1200
LeafDrupal\ckeditor\Tests\CKEditorTest1700
LeafDrupal\color\Tests\ColorTest8700
LeafDrupal\comment\Tests\CommentActionsTest5500
LeafDrupal\comment\Tests\CommentAnonymousTest16300
LeafDrupal\comment\Tests\CommentApprovalTest15200
LeafDrupal\comment\Tests\CommentBlockTest9300
LeafDrupal\comment\Tests\CommentContentRebuildTest3300
LeafDrupal\comment\Tests\CommentCSSTest50100
LeafDrupal\comment\Tests\CommentFieldsTest9800
LeafDrupal\comment\Tests\CommentInterfaceTest25100
LeafDrupal\comment\Tests\CommentLanguageTest7300
ExpandDrupal\comment\Tests\CommentLinksTest109300
MessageGroupFilenameLineFunctionStatus
Changed environment:array ( 'authenticated' => false, 'comment count' => false, 'form' => 'below', 'user_register' => 'visitors', 'contact' => 'optional', 'comments' => 'open', 'access comments' => 0, 'post comments' => 0, 'skip comment approval' => 1, 'edit own comments' => 0, )DebugCommentLinksTest.php194Drupal\comment\Tests\CommentLinksTest->setEnvironment()
Changed environment:array ( 'authenticated' => true, 'comment count' => false, 'form' => 'below', 'user_register' => 'visitors', 'contact' => 'optional', 'comments' => 'open', 'access comments' => 0, 'post comments' => 0, 'skip comment approval' => 1, 'edit own comments' => 0, )DebugCommentLinksTest.php194Drupal\comment\Tests\CommentLinksTest->setEnvironment()
Changed environment:array ( 'authenticated' => false, 'comment count' => true, 'form' => 'below', 'user_register' => 'visitors', 'contact' => 'optional', 'comments' => 'open', 'access comments' => 0, 'post comments' => 0, 'skip comment approval' => 1, 'edit own comments' => 0, )DebugCommentLinksTest.php194Drupal\comment\Tests\CommentLinksTest->setEnvironment()
Changed environment:array ( 'authenticated' => true, 'comment count' => true, 'form' => 'below', 'user_register' => 'visitors', 'contact' => 'optional', 'comments' => 'open', 'access comments' => 0, 'post comments' => 0, 'skip comment approval' => 1, 'edit own comments' => 0, )DebugCommentLinksTest.php194Drupal\comment\Tests\CommentLinksTest->setEnvironment()
Changed environment:array ( 'authenticated' => false, 'comment count' => false, 'form' => 'below', 'user_register' => 'visitors', 'contact' => 'optional', 'comments' => 'open', 'access comments' => 1, 'post comments' => 0, 'skip comment approval' => 1, 'edit own comments' => 0, )DebugCommentLinksTest.php194Drupal\comment\Tests\CommentLinksTest->setEnvironment()
Changed environment:array ( 'authenticated' => true, 'comment count' => false, 'form' => 'below', 'user_register' => 'visitors', 'contact' => 'optional', 'comments' => 'open', 'access comments' => 1, 'post comments' => 0, 'skip comment approval' => 1, 'edit own comments' => 0, )DebugCommentLinksTest.php194Drupal\comment\Tests\CommentLinksTest->setEnvironment()
Changed environment:array ( 'authenticated' => false, 'comment count' => true, 'form' => 'below', 'user_register' => 'visitors', 'contact' => 'optional', 'comments' => 'open', 'access comments' => 1, 'post comments' => 0, 'skip comment approval' => 1, 'edit own comments' => 0, )DebugCommentLinksTest.php194Drupal\comment\Tests\CommentLinksTest->setEnvironment()
Changed environment:array ( 'authenticated' => true, 'comment count' => true, 'form' => 'below', 'user_register' => 'visitors', 'contact' => 'optional', 'comments' => 'open', 'access comments' => 1, 'post comments' => 0, 'skip comment approval' => 1, 'edit own comments' => 0, )DebugCommentLinksTest.php194Drupal\comment\Tests\CommentLinksTest->setEnvironment()
Changed environment:array ( 'authenticated' => false, 'comment count' => false, 'form' => 'below', 'user_register' => 'visitors', 'contact' => 'optional', 'comments' => 'open', 'access comments' => 0, 'post comments' => 1, 'skip comment approval' => 1, 'edit own comments' => 0, )DebugCommentLinksTest.php194Drupal\comment\Tests\CommentLinksTest->setEnvironment()
Changed environment:array ( 'authenticated' => true, 'comment count' => false, 'form' => 'below', 'user_register' => 'visitors', 'contact' => 'optional', 'comments' => 'open', 'access comments' => 0, 'post comments' => 1, 'skip comment approval' => 1, 'edit own comments' => 0, )DebugCommentLinksTest.php194Drupal\comment\Tests\CommentLinksTest->setEnvironment()
Changed environment:array ( 'authenticated' => false, 'comment count' => true, 'form' => 'below', 'user_register' => 'visitors', 'contact' => 'optional', 'comments' => 'open', 'access comments' => 0, 'post comments' => 1, 'skip comment approval' => 1, 'edit own comments' => 0, )DebugCommentLinksTest.php194Drupal\comment\Tests\CommentLinksTest->setEnvironment()
Changed environment:array ( 'authenticated' => true, 'comment count' => true, 'form' => 'below', 'user_register' => 'visitors', 'contact' => 'optional', 'comments' => 'open', 'access comments' => 0, 'post comments' => 1, 'skip comment approval' => 1, 'edit own comments' => 0, )DebugCommentLinksTest.php194Drupal\comment\Tests\CommentLinksTest->setEnvironment()
Changed environment:array ( 'authenticated' => false, 'comment count' => false, 'form' => 'below', 'user_register' => 'visitors', 'contact' => 'optional', 'comments' => 'open', 'access comments' => 1, 'post comments' => 1, 'skip comment approval' => 1, 'edit own comments' => 0, )DebugCommentLinksTest.php194Drupal\comment\Tests\CommentLinksTest->setEnvironment()
Changed environment:array ( 'authenticated' => true, 'comment count' => false, 'form' => 'below', 'user_register' => 'visitors', 'contact' => 'optional', 'comments' => 'open', 'access comments' => 1, 'post comments' => 1, 'skip comment approval' => 1, 'edit own comments' => 0, )DebugCommentLinksTest.php194Drupal\comment\Tests\CommentLinksTest->setEnvironment()
Changed environment:array ( 'authenticated' => false, 'comment count' => true, 'form' => 'below', 'user_register' => 'visitors', 'contact' => 'optional', 'comments' => 'open', 'access comments' => 1, 'post comments' => 1, 'skip comment approval' => 1, 'edit own comments' => 0, )DebugCommentLinksTest.php194Drupal\comment\Tests\CommentLinksTest->setEnvironment()
Changed environment:array ( 'authenticated' => true, 'comment count' => true, 'form' => 'below', 'user_register' => 'visitors', 'contact' => 'optional', 'comments' => 'open', 'access comments' => 1, 'post comments' => 1, 'skip comment approval' => 1, 'edit own comments' => 0, )DebugCommentLinksTest.php194Drupal\comment\Tests\CommentLinksTest->setEnvironment()
Changed environment:array ( 'authenticated' => false, 'comment count' => false, 'form' => 'separate page', 'user_register' => 'visitors', 'contact' => 'optional', 'comments' => 'open', 'access comments' => 0, 'post comments' => 0, 'skip comment approval' => 1, 'edit own comments' => 0, )DebugCommentLinksTest.php194Drupal\comment\Tests\CommentLinksTest->setEnvironment()
Changed environment:array ( 'authenticated' => true, 'comment count' => false, 'form' => 'separate page', 'user_register' => 'visitors', 'contact' => 'optional', 'comments' => 'open', 'access comments' => 0, 'post comments' => 0, 'skip comment approval' => 1, 'edit own comments' => 0, )DebugCommentLinksTest.php194Drupal\comment\Tests\CommentLinksTest->setEnvironment()
Changed environment:array ( 'authenticated' => false, 'comment count' => true, 'form' => 'separate page', 'user_register' => 'visitors', 'contact' => 'optional', 'comments' => 'open', 'access comments' => 0, 'post comments' => 0, 'skip comment approval' => 1, 'edit own comments' => 0, )DebugCommentLinksTest.php194Drupal\comment\Tests\CommentLinksTest->setEnvironment()
Changed environment:array ( 'authenticated' => true, 'comment count' => true, 'form' => 'separate page', 'user_register' => 'visitors', 'contact' => 'optional', 'comments' => 'open', 'access comments' => 0, 'post comments' => 0, 'skip comment approval' => 1, 'edit own comments' => 0, )DebugCommentLinksTest.php194Drupal\comment\Tests\CommentLinksTest->setEnvironment()
Changed environment:array ( 'authenticated' => false, 'comment count' => false, 'form' => 'separate page', 'user_register' => 'visitors', 'contact' => 'optional', 'comments' => 'open', 'access comments' => 1, 'post comments' => 0, 'skip comment approval' => 1, 'edit own comments' => 0, )DebugCommentLinksTest.php194Drupal\comment\Tests\CommentLinksTest->setEnvironment()
Changed environment:array ( 'authenticated' => true, 'comment count' => false, 'form' => 'separate page', 'user_register' => 'visitors', 'contact' => 'optional', 'comments' => 'open', 'access comments' => 1, 'post comments' => 0, 'skip comment approval' => 1, 'edit own comments' => 0, )DebugCommentLinksTest.php194Drupal\comment\Tests\CommentLinksTest->setEnvironment()
Changed environment:array ( 'authenticated' => false, 'comment count' => true, 'form' => 'separate page', 'user_register' => 'visitors', 'contact' => 'optional', 'comments' => 'open', 'access comments' => 1, 'post comments' => 0, 'skip comment approval' => 1, 'edit own comments' => 0, )DebugCommentLinksTest.php194Drupal\comment\Tests\CommentLinksTest->setEnvironment()
Changed environment:array ( 'authenticated' => true, 'comment count' => true, 'form' => 'separate page', 'user_register' => 'visitors', 'contact' => 'optional', 'comments' => 'open', 'access comments' => 1, 'post comments' => 0, 'skip comment approval' => 1, 'edit own comments' => 0, )DebugCommentLinksTest.php194Drupal\comment\Tests\CommentLinksTest->setEnvironment()
Changed environment:array ( 'authenticated' => false, 'comment count' => false, 'form' => 'separate page', 'user_register' => 'visitors', 'contact' => 'optional', 'comments' => 'open', 'access comments' => 0, 'post comments' => 1, 'skip comment approval' => 1, 'edit own comments' => 0, )DebugCommentLinksTest.php194Drupal\comment\Tests\CommentLinksTest->setEnvironment()
Changed environment:array ( 'authenticated' => true, 'comment count' => false, 'form' => 'separate page', 'user_register' => 'visitors', 'contact' => 'optional', 'comments' => 'open', 'access comments' => 0, 'post comments' => 1, 'skip comment approval' => 1, 'edit own comments' => 0, )DebugCommentLinksTest.php194Drupal\comment\Tests\CommentLinksTest->setEnvironment()
Changed environment:array ( 'authenticated' => false, 'comment count' => true, 'form' => 'separate page', 'user_register' => 'visitors', 'contact' => 'optional', 'comments' => 'open', 'access comments' => 0, 'post comments' => 1, 'skip comment approval' => 1, 'edit own comments' => 0, )DebugCommentLinksTest.php194Drupal\comment\Tests\CommentLinksTest->setEnvironment()
Changed environment:array ( 'authenticated' => true, 'comment count' => true, 'form' => 'separate page', 'user_register' => 'visitors', 'contact' => 'optional', 'comments' => 'open', 'access comments' => 0, 'post comments' => 1, 'skip comment approval' => 1, 'edit own comments' => 0, )DebugCommentLinksTest.php194Drupal\comment\Tests\CommentLinksTest->setEnvironment()
Changed environment:array ( 'authenticated' => false, 'comment count' => false, 'form' => 'separate page', 'user_register' => 'visitors', 'contact' => 'optional', 'comments' => 'open', 'access comments' => 1, 'post comments' => 1, 'skip comment approval' => 1, 'edit own comments' => 0, )DebugCommentLinksTest.php194Drupal\comment\Tests\CommentLinksTest->setEnvironment()
Changed environment:array ( 'authenticated' => true, 'comment count' => false, 'form' => 'separate page', 'user_register' => 'visitors', 'contact' => 'optional', 'comments' => 'open', 'access comments' => 1, 'post comments' => 1, 'skip comment approval' => 1, 'edit own comments' => 0, )DebugCommentLinksTest.php194Drupal\comment\Tests\CommentLinksTest->setEnvironment()
Changed environment:array ( 'authenticated' => false, 'comment count' => true, 'form' => 'separate page', 'user_register' => 'visitors', 'contact' => 'optional', 'comments' => 'open', 'access comments' => 1, 'post comments' => 1, 'skip comment approval' => 1, 'edit own comments' => 0, )DebugCommentLinksTest.php194Drupal\comment\Tests\CommentLinksTest->setEnvironment()
Changed environment:array ( 'authenticated' => true, 'comment count' => true, 'form' => 'separate page', 'user_register' => 'visitors', 'contact' => 'optional', 'comments' => 'open', 'access comments' => 1, 'post comments' => 1, 'skip comment approval' => 1, 'edit own comments' => 0, )DebugCommentLinksTest.php194Drupal\comment\Tests\CommentLinksTest->setEnvironment()
Changed environment:array ( 'authenticated' => false, 'comment count' => false, 'form' => 'below', 'user_register' => 'admin_only', 'contact' => 'optional', 'comments' => 'open', 'access comments' => 0, 'post comments' => 0, 'skip comment approval' => 1, 'edit own comments' => 0, )DebugCommentLinksTest.php194Drupal\comment\Tests\CommentLinksTest->setEnvironment()
Changed environment:array ( 'authenticated' => true, 'comment count' => false, 'form' => 'below', 'user_register' => 'admin_only', 'contact' => 'optional', 'comments' => 'open', 'access comments' => 0, 'post comments' => 0, 'skip comment approval' => 1, 'edit own comments' => 0, )DebugCommentLinksTest.php194Drupal\comment\Tests\CommentLinksTest->setEnvironment()
Changed environment:array ( 'authenticated' => false, 'comment count' => true, 'form' => 'below', 'user_register' => 'admin_only', 'contact' => 'optional', 'comments' => 'open', 'access comments' => 0, 'post comments' => 0, 'skip comment approval' => 1, 'edit own comments' => 0, )DebugCommentLinksTest.php194Drupal\comment\Tests\CommentLinksTest->setEnvironment()
Changed environment:array ( 'authenticated' => true, 'comment count' => true, 'form' => 'below', 'user_register' => 'admin_only', 'contact' => 'optional', 'comments' => 'open', 'access comments' => 0, 'post comments' => 0, 'skip comment approval' => 1, 'edit own comments' => 0, )DebugCommentLinksTest.php194Drupal\comment\Tests\CommentLinksTest->setEnvironment()
Changed environment:array ( 'authenticated' => false, 'comment count' => false, 'form' => 'below', 'user_register' => 'admin_only', 'contact' => 'optional', 'comments' => 'open', 'access comments' => 1, 'post comments' => 0, 'skip comment approval' => 1, 'edit own comments' => 0, )DebugCommentLinksTest.php194Drupal\comment\Tests\CommentLinksTest->setEnvironment()
Changed environment:array ( 'authenticated' => true, 'comment count' => false, 'form' => 'below', 'user_register' => 'admin_only', 'contact' => 'optional', 'comments' => 'open', 'access comments' => 1, 'post comments' => 0, 'skip comment approval' => 1, 'edit own comments' => 0, )DebugCommentLinksTest.php194Drupal\comment\Tests\CommentLinksTest->setEnvironment()
Changed environment:array ( 'authenticated' => false, 'comment count' => true, 'form' => 'below', 'user_register' => 'admin_only', 'contact' => 'optional', 'comments' => 'open', 'access comments' => 1, 'post comments' => 0, 'skip comment approval' => 1, 'edit own comments' => 0, )DebugCommentLinksTest.php194Drupal\comment\Tests\CommentLinksTest->setEnvironment()
Changed environment:array ( 'authenticated' => true, 'comment count' => true, 'form' => 'below', 'user_register' => 'admin_only', 'contact' => 'optional', 'comments' => 'open', 'access comments' => 1, 'post comments' => 0, 'skip comment approval' => 1, 'edit own comments' => 0, )DebugCommentLinksTest.php194Drupal\comment\Tests\CommentLinksTest->setEnvironment()
Changed environment:array ( 'authenticated' => false, 'comment count' => false, 'form' => 'below', 'user_register' => 'admin_only', 'contact' => 'optional', 'comments' => 'open', 'access comments' => 0, 'post comments' => 1, 'skip comment approval' => 1, 'edit own comments' => 0, )DebugCommentLinksTest.php194Drupal\comment\Tests\CommentLinksTest->setEnvironment()
Changed environment:array ( 'authenticated' => true, 'comment count' => false, 'form' => 'below', 'user_register' => 'admin_only', 'contact' => 'optional', 'comments' => 'open', 'access comments' => 0, 'post comments' => 1, 'skip comment approval' => 1, 'edit own comments' => 0, )DebugCommentLinksTest.php194Drupal\comment\Tests\CommentLinksTest->setEnvironment()
Changed environment:array ( 'authenticated' => false, 'comment count' => true, 'form' => 'below', 'user_register' => 'admin_only', 'contact' => 'optional', 'comments' => 'open', 'access comments' => 0, 'post comments' => 1, 'skip comment approval' => 1, 'edit own comments' => 0, )DebugCommentLinksTest.php194Drupal\comment\Tests\CommentLinksTest->setEnvironment()
Changed environment:array ( 'authenticated' => true, 'comment count' => true, 'form' => 'below', 'user_register' => 'admin_only', 'contact' => 'optional', 'comments' => 'open', 'access comments' => 0, 'post comments' => 1, 'skip comment approval' => 1, 'edit own comments' => 0, )DebugCommentLinksTest.php194Drupal\comment\Tests\CommentLinksTest->setEnvironment()
Changed environment:array ( 'authenticated' => false, 'comment count' => false, 'form' => 'below', 'user_register' => 'admin_only', 'contact' => 'optional', 'comments' => 'open', 'access comments' => 1, 'post comments' => 1, 'skip comment approval' => 1, 'edit own comments' => 0, )DebugCommentLinksTest.php194Drupal\comment\Tests\CommentLinksTest->setEnvironment()
Changed environment:array ( 'authenticated' => true, 'comment count' => false, 'form' => 'below', 'user_register' => 'admin_only', 'contact' => 'optional', 'comments' => 'open', 'access comments' => 1, 'post comments' => 1, 'skip comment approval' => 1, 'edit own comments' => 0, )DebugCommentLinksTest.php194Drupal\comment\Tests\CommentLinksTest->setEnvironment()
Changed environment:array ( 'authenticated' => false, 'comment count' => true, 'form' => 'below', 'user_register' => 'admin_only', 'contact' => 'optional', 'comments' => 'open', 'access comments' => 1, 'post comments' => 1, 'skip comment approval' => 1, 'edit own comments' => 0, )DebugCommentLinksTest.php194Drupal\comment\Tests\CommentLinksTest->setEnvironment()
Changed environment:array ( 'authenticated' => true, 'comment count' => true, 'form' => 'below', 'user_register' => 'admin_only', 'contact' => 'optional', 'comments' => 'open', 'access comments' => 1, 'post comments' => 1, 'skip comment approval' => 1, 'edit own comments' => 0, )DebugCommentLinksTest.php194Drupal\comment\Tests\CommentLinksTest->setEnvironment()
Changed environment:array ( 'authenticated' => false, 'comment count' => false, 'form' => 'separate page', 'user_register' => 'admin_only', 'contact' => 'optional', 'comments' => 'open', 'access comments' => 0, 'post comments' => 0, 'skip comment approval' => 1, 'edit own comments' => 0, )DebugCommentLinksTest.php194Drupal\comment\Tests\CommentLinksTest->setEnvironment()
Changed environment:array ( 'authenticated' => true, 'comment count' => false, 'form' => 'separate page', 'user_register' => 'admin_only', 'contact' => 'optional', 'comments' => 'open', 'access comments' => 0, 'post comments' => 0, 'skip comment approval' => 1, 'edit own comments' => 0, )DebugCommentLinksTest.php194Drupal\comment\Tests\CommentLinksTest->setEnvironment()
Changed environment:array ( 'authenticated' => false, 'comment count' => true, 'form' => 'separate page', 'user_register' => 'admin_only', 'contact' => 'optional', 'comments' => 'open', 'access comments' => 0, 'post comments' => 0, 'skip comment approval' => 1, 'edit own comments' => 0, )DebugCommentLinksTest.php194Drupal\comment\Tests\CommentLinksTest->setEnvironment()
Changed environment:array ( 'authenticated' => true, 'comment count' => true, 'form' => 'separate page', 'user_register' => 'admin_only', 'contact' => 'optional', 'comments' => 'open', 'access comments' => 0, 'post comments' => 0, 'skip comment approval' => 1, 'edit own comments' => 0, )DebugCommentLinksTest.php194Drupal\comment\Tests\CommentLinksTest->setEnvironment()
Changed environment:array ( 'authenticated' => false, 'comment count' => false, 'form' => 'separate page', 'user_register' => 'admin_only', 'contact' => 'optional', 'comments' => 'open', 'access comments' => 1, 'post comments' => 0, 'skip comment approval' => 1, 'edit own comments' => 0, )DebugCommentLinksTest.php194Drupal\comment\Tests\CommentLinksTest->setEnvironment()
Changed environment:array ( 'authenticated' => true, 'comment count' => false, 'form' => 'separate page', 'user_register' => 'admin_only', 'contact' => 'optional', 'comments' => 'open', 'access comments' => 1, 'post comments' => 0, 'skip comment approval' => 1, 'edit own comments' => 0, )DebugCommentLinksTest.php194Drupal\comment\Tests\CommentLinksTest->setEnvironment()
Changed environment:array ( 'authenticated' => false, 'comment count' => true, 'form' => 'separate page', 'user_register' => 'admin_only', 'contact' => 'optional', 'comments' => 'open', 'access comments' => 1, 'post comments' => 0, 'skip comment approval' => 1, 'edit own comments' => 0, )DebugCommentLinksTest.php194Drupal\comment\Tests\CommentLinksTest->setEnvironment()
Changed environment:array ( 'authenticated' => true, 'comment count' => true, 'form' => 'separate page', 'user_register' => 'admin_only', 'contact' => 'optional', 'comments' => 'open', 'access comments' => 1, 'post comments' => 0, 'skip comment approval' => 1, 'edit own comments' => 0, )DebugCommentLinksTest.php194Drupal\comment\Tests\CommentLinksTest->setEnvironment()
Changed environment:array ( 'authenticated' => false, 'comment count' => false, 'form' => 'separate page', 'user_register' => 'admin_only', 'contact' => 'optional', 'comments' => 'open', 'access comments' => 0, 'post comments' => 1, 'skip comment approval' => 1, 'edit own comments' => 0, )DebugCommentLinksTest.php194Drupal\comment\Tests\CommentLinksTest->setEnvironment()
Changed environment:array ( 'authenticated' => true, 'comment count' => false, 'form' => 'separate page', 'user_register' => 'admin_only', 'contact' => 'optional', 'comments' => 'open', 'access comments' => 0, 'post comments' => 1, 'skip comment approval' => 1, 'edit own comments' => 0, )DebugCommentLinksTest.php194Drupal\comment\Tests\CommentLinksTest->setEnvironment()
Changed environment:array ( 'authenticated' => false, 'comment count' => true, 'form' => 'separate page', 'user_register' => 'admin_only', 'contact' => 'optional', 'comments' => 'open', 'access comments' => 0, 'post comments' => 1, 'skip comment approval' => 1, 'edit own comments' => 0, )DebugCommentLinksTest.php194Drupal\comment\Tests\CommentLinksTest->setEnvironment()
Changed environment:array ( 'authenticated' => true, 'comment count' => true, 'form' => 'separate page', 'user_register' => 'admin_only', 'contact' => 'optional', 'comments' => 'open', 'access comments' => 0, 'post comments' => 1, 'skip comment approval' => 1, 'edit own comments' => 0, )DebugCommentLinksTest.php194Drupal\comment\Tests\CommentLinksTest->setEnvironment()
Changed environment:array ( 'authenticated' => false, 'comment count' => false, 'form' => 'separate page', 'user_register' => 'admin_only', 'contact' => 'optional', 'comments' => 'open', 'access comments' => 1, 'post comments' => 1, 'skip comment approval' => 1, 'edit own comments' => 0, )DebugCommentLinksTest.php194Drupal\comment\Tests\CommentLinksTest->setEnvironment()
Changed environment:array ( 'authenticated' => true, 'comment count' => false, 'form' => 'separate page', 'user_register' => 'admin_only', 'contact' => 'optional', 'comments' => 'open', 'access comments' => 1, 'post comments' => 1, 'skip comment approval' => 1, 'edit own comments' => 0, )DebugCommentLinksTest.php194Drupal\comment\Tests\CommentLinksTest->setEnvironment()
Changed environment:array ( 'authenticated' => false, 'comment count' => true, 'form' => 'separate page', 'user_register' => 'admin_only', 'contact' => 'optional', 'comments' => 'open', 'access comments' => 1, 'post comments' => 1, 'skip comment approval' => 1, 'edit own comments' => 0, )DebugCommentLinksTest.php194Drupal\comment\Tests\CommentLinksTest->setEnvironment()
Changed environment:array ( 'authenticated' => true, 'comment count' => true, 'form' => 'separate page', 'user_register' => 'admin_only', 'contact' => 'optional', 'comments' => 'open', 'access comments' => 1, 'post comments' => 1, 'skip comment approval' => 1, 'edit own comments' => 0, )DebugCommentLinksTest.php194Drupal\comment\Tests\CommentLinksTest->setEnvironment()
LeafDrupal\comment\Tests\CommentNewIndicatorTest4200
LeafDrupal\comment\Tests\CommentNodeAccessTest5700
LeafDrupal\comment\Tests\CommentNodeChangesTest2400
LeafDrupal\comment\Tests\CommentPagerTest21300
ExpandDrupal\comment\Tests\CommentPreviewTest710
MessageGroupFilenameLineFunctionStatus
The test did not complete due to a fatal error.Completion checkCommentPreviewTest.php33Drupal\comment\Tests\CommentPreviewTest->testCommentPreview()
LeafDrupal\comment\Tests\CommentRssTest2600
LeafDrupal\comment\Tests\CommentStatisticsTest9800
LeafDrupal\comment\Tests\CommentThreadingTest15900
LeafDrupal\comment\Tests\CommentTokenReplaceTest6600
LeafDrupal\comment\Tests\CommentTranslationUITest18300
LeafDrupal\comment\Tests\Views\ArgumentUserUIDTest900
LeafDrupal\comment\Tests\Views\DefaultViewRecentComments800
LeafDrupal\comment\Tests\Views\FilterUserUIDTest900
LeafDrupal\comment\Tests\Views\RowRssTest1200
LeafDrupal\comment\Tests\Views\WizardTest3300
LeafDrupal\config\Tests\ConfigCRUDTest2600
LeafDrupal\config\Tests\ConfigEntityListTest6900
LeafDrupal\config\Tests\ConfigEntityStatusTest500
LeafDrupal\config\Tests\ConfigEntityStatusUITest1500
LeafDrupal\config\Tests\ConfigEntityTest13800
LeafDrupal\config\Tests\ConfigEntityUnitTest100
LeafDrupal\config\Tests\ConfigFileContentTest3100
LeafDrupal\config\Tests\ConfigImportTest3800
LeafDrupal\config\Tests\ConfigImportUITest4600
LeafDrupal\config\Tests\ConfigInstallTest1500
LeafDrupal\config\Tests\ConfigOverrideTest1800
LeafDrupal\config\Tests\ConfigSchemaTest2000
LeafDrupal\config\Tests\ConfigUpgradeTest1200
LeafDrupal\config\Tests\LocaleConfigOverride200
LeafDrupal\config\Tests\Storage\DatabaseStorageTest2100
LeafDrupal\config\Tests\Storage\FileStorageTest2300
LeafDrupal\contact\Tests\ContactAuthenticatedUserTest1300
LeafDrupal\contact\Tests\ContactPersonalTest16200
LeafDrupal\contact\Tests\ContactSitewideTest26900
LeafDrupal\contact\Tests\ContactUpgradePathTest7000
LeafDrupal\contact\Tests\Views\ContactFieldsTest600
LeafDrupal\contextual\Tests\ContextualDynamicContextTest1600
ExpandDrupal\dblog\Tests\DBLogTest37420
MessageGroupFilenameLineFunctionStatus
HTTP response expected 200, actual 500BrowserDBLogTest.php322Drupal\dblog\Tests\DBLogTest->doNode()
DBLog event was recorded: [content updated]OtherDBLogTest.php343Drupal\dblog\Tests\DBLogTest->doNode()
LeafDrupal\editor\Tests\EditorAdminTest7700
LeafDrupal\editor\Tests\EditorLoadingTest6800
LeafDrupal\editor\Tests\EditorManagerTest1400
LeafDrupal\edit\Tests\EditorSelectionTest1000
LeafDrupal\edit\Tests\MetadataGeneratorTest300
LeafDrupal\email\Tests\EmailFieldTest1900
LeafDrupal\email\Tests\EmailItemTest600
LeafDrupal\entity\Tests\EntityDisplayTest2900
ExpandDrupal\entity_reference\Tests\EntityReferenceAdminTest20115
MessageGroupFilenameLineFunctionStatus
Undefined index: typeNoticeTypedDataManager.php131Drupal\Core\TypedData\TypedDataManager->create()
Found field with name 'instance[settings][handler]' and value 'default'BrowserEntityReferenceAdminTest.php83Drupal\entity_reference\Tests\EntityReferenceAdminTest->testFieldAdminHandler()
Found field with name 'instance[settings][handler_settings][target_bundles][lwv8wg6n_test]'BrowserEntityReferenceAdminTest.php89Drupal\entity_reference\Tests\EntityReferenceAdminTest->testFieldAdminHandler()
Found field with name 'instance[settings][handler_settings][sort][field]' and value '_none'BrowserEntityReferenceAdminTest.php94Drupal\entity_reference\Tests\EntityReferenceAdminTest->testFieldAdminHandler()
Undefined offset: 0Drupal\simpletest\WebTestBase->drupalPostAJAX(NULL, Array, 'instance[settings][handler_settings][sort][field]') Drupal\entity_reference\Tests\EntityReferenceAdminTest->testFieldAdminHandler() Drupal\simpletest\TestBase->run() simpletest_script_run_one_test('193', 'Drupal\entity_reference\Tests\EntityReferenceAdminTest') NoticeWebTestBase.php1388Drupal\simpletest\WebTestBase->drupalPostAJAX()
Undefined index: ajaxDrupal\simpletest\WebTestBase->drupalPostAJAX(NULL, Array, 'instance[settings][handler_settings][sort][field]') Drupal\entity_reference\Tests\EntityReferenceAdminTest->testFieldAdminHandler() Drupal\simpletest\TestBase->run() simpletest_script_run_one_test('193', 'Drupal\entity_reference\Tests\EntityReferenceAdminTest') NoticeWebTestBase.php1389Drupal\simpletest\WebTestBase->drupalPostAJAX()
Failed to set field instance[settings][handler_settings][sort][field] to nidOtherEntityReferenceAdminTest.php97Drupal\entity_reference\Tests\EntityReferenceAdminTest->testFieldAdminHandler()
Found the requested form fields at OtherEntityReferenceAdminTest.php97Drupal\entity_reference\Tests\EntityReferenceAdminTest->testFieldAdminHandler()
Found field with name 'instance[settings][handler_settings][sort][direction]' and value 'ASC'BrowserEntityReferenceAdminTest.php98Drupal\entity_reference\Tests\EntityReferenceAdminTest->testFieldAdminHandler()
Undefined offset: 0Drupal\simpletest\WebTestBase->drupalPostAJAX(NULL, Array, 'instance[settings][handler_settings][sort][field]') Drupal\entity_reference\Tests\EntityReferenceAdminTest->testFieldAdminHandler() Drupal\simpletest\TestBase->run() simpletest_script_run_one_test('193', 'Drupal\entity_reference\Tests\EntityReferenceAdminTest') NoticeWebTestBase.php1388Drupal\simpletest\WebTestBase->drupalPostAJAX()
Undefined index: ajaxDrupal\simpletest\WebTestBase->drupalPostAJAX(NULL, Array, 'instance[settings][handler_settings][sort][field]') Drupal\entity_reference\Tests\EntityReferenceAdminTest->testFieldAdminHandler() Drupal\simpletest\TestBase->run() simpletest_script_run_one_test('193', 'Drupal\entity_reference\Tests\EntityReferenceAdminTest') NoticeWebTestBase.php1389Drupal\simpletest\WebTestBase->drupalPostAJAX()
Failed to set field instance[settings][handler_settings][sort][field] to _noneOtherEntityReferenceAdminTest.php100Drupal\entity_reference\Tests\EntityReferenceAdminTest->testFieldAdminHandler()
Found the requested form fields at OtherEntityReferenceAdminTest.php100Drupal\entity_reference\Tests\EntityReferenceAdminTest->testFieldAdminHandler()
Found the Save settings buttonOtherEntityReferenceAdminTest.php103Drupal\entity_reference\Tests\EntityReferenceAdminTest->testFieldAdminHandler()
Found the requested form fields at OtherEntityReferenceAdminTest.php103Drupal\entity_reference\Tests\EntityReferenceAdminTest->testFieldAdminHandler()
Field was created and appears in the overview page.OtherEntityReferenceAdminTest.php106Drupal\entity_reference\Tests\EntityReferenceAdminTest->testFieldAdminHandler()
LeafDrupal\entity_reference\Tests\EntityReferenceAutocompleteTest1900
ExpandDrupal\entity_reference\Tests\EntityReferenceAutoCreateTest1553
MessageGroupFilenameLineFunctionStatus
Undefined index: typeNoticeTypedDataManager.php131Drupal\Core\TypedData\TypedDataManager->create()
Failed to set field title to uHnNlZEkOtherEntityReferenceAutoCreateTest.php94Drupal\entity_reference\Tests\EntityReferenceAutoCreateTest->testAutoCreate()
Failed to set field test_field[und][0][target_id] to kinmCEYMOtherEntityReferenceAutoCreateTest.php94Drupal\entity_reference\Tests\EntityReferenceAutoCreateTest->testAutoCreate()
Found the Save buttonOtherEntityReferenceAutoCreateTest.php94Drupal\entity_reference\Tests\EntityReferenceAutoCreateTest->testAutoCreate()
Found the requested form fields at node/add/xndo10oqOtherEntityReferenceAutoCreateTest.php94Drupal\entity_reference\Tests\EntityReferenceAutoCreateTest->testAutoCreate()
Referenced node was created.OtherEntityReferenceAutoCreateTest.php99Drupal\entity_reference\Tests\EntityReferenceAutoCreateTest->testAutoCreate()
array_flip(): Can only flip STRING and INTEGER values!array_flip(Array) Drupal\Core\Entity\DatabaseStorageController->load(Array) entity_load_multiple('node', Array, ) entity_load('node', NULL, ) node_load(NULL) Drupal\entity_reference\Tests\EntityReferenceAutoCreateTest->testAutoCreate() Drupal\simpletest\TestBase->run() simpletest_script_run_one_test('195', 'Drupal\entity_reference\Tests\EntityReferenceAutoCreateTest') WarningDatabaseStorageController.php182Drupal\Core\Entity\DatabaseStorageController->load()
Trying to get property of non-objectDrupal\entity_reference\Tests\EntityReferenceAutoCreateTest->testAutoCreate() Drupal\simpletest\TestBase->run() simpletest_script_run_one_test('195', 'Drupal\entity_reference\Tests\EntityReferenceAutoCreateTest') NoticeEntityReferenceAutoCreateTest.php109Drupal\entity_reference\Tests\EntityReferenceAutoCreateTest->testAutoCreate()
LeafDrupal\entity_reference\Tests\EntityReferenceItemTest1000
LeafDrupal\entity_reference\Tests\EntityReferenceSelectionAccessTest6900
ExpandDrupal\entity_reference\Tests\EntityReferenceSelectionSortTest610
MessageGroupFilenameLineFunctionStatus
Query sorted by field returned expected values.OtherEntityReferenceSelectionSortTest.php135Drupal\entity_reference\Tests\EntityReferenceSelectionSortTest->testSort()
LeafDrupal\entity_reference\Tests\Views\SelectionTest300
LeafDrupal\field\Tests\BulkDeleteTest7500
LeafDrupal\field\Tests\CrudTest7500
LeafDrupal\field\Tests\DisplayApiTest4600
LeafDrupal\field\Tests\EntityPropertiesTest400
LeafDrupal\field\Tests\FieldAccessTest2100
LeafDrupal\field\Tests\FieldAttachOtherTest10300
LeafDrupal\field\Tests\FieldAttachStorageTest9400
LeafDrupal\field\Tests\FieldInfoTest7300
LeafDrupal\field\Tests\FieldInstanceCrudTest2800
LeafDrupal\field\Tests\FormTest28100
LeafDrupal\field\Tests\ShapeItemTest1000
LeafDrupal\field\Tests\TestItemTest600
LeafDrupal\field\Tests\TranslationTest9900
LeafDrupal\field\Tests\Views\ApiDataTest1500
LeafDrupal\field\Tests\Views\FieldUITest2800
LeafDrupal\field\Tests\Views\HandlerFieldFieldTest2400
LeafDrupal\field_sql_storage\Tests\FieldSqlStorageTest9200
LeafDrupal\field_ui\Tests\AlterTest2100
LeafDrupal\field_ui\Tests\ManageDisplayTest14900
LeafDrupal\field_ui\Tests\ManageFieldsTest29400
LeafDrupal\file\Tests\CopyTest11000
LeafDrupal\file\Tests\DeleteTest2400
LeafDrupal\file\Tests\DownloadTest4500
ExpandDrupal\file\Tests\FileFieldDisplayTest5010
MessageGroupFilenameLineFunctionStatus
Node revision exists.OtherFileFieldTestBase.php146Drupal\file\Tests\FileFieldTestBase->uploadNodeFile()
ExpandDrupal\file\Tests\FileFieldPathTest2710
MessageGroupFilenameLineFunctionStatus
Node revision exists.OtherFileFieldTestBase.php146Drupal\file\Tests\FileFieldTestBase->uploadNodeFile()
ExpandDrupal\file\Tests\FileFieldRevisionTest56120
MessageGroupFilenameLineFunctionStatus
Node revision exists.OtherFileFieldTestBase.php146Drupal\file\Tests\FileFieldTestBase->uploadNodeFile()
Found the Revert buttonOtherFileFieldRevisionTest.php82Drupal\file\Tests\FileFieldRevisionTest->testRevisions()
Found the requested form fields at node/1/revisions/3/revertOtherFileFieldRevisionTest.php82Drupal\file\Tests\FileFieldRevisionTest->testRevisions()
Original revision file still in place after reverting to the original revision.OtherFileFieldRevisionTest.php86Drupal\file\Tests\FileFieldRevisionTest->testRevisions()
Found the Delete buttonOtherFileFieldRevisionTest.php91Drupal\file\Tests\FileFieldRevisionTest->testRevisions()
Found the requested form fields at node/1/revisions/4/deleteOtherFileFieldRevisionTest.php91Drupal\file\Tests\FileFieldRevisionTest->testRevisions()
Found the Delete buttonOtherFileFieldRevisionTest.php104Drupal\file\Tests\FileFieldRevisionTest->testRevisions()
Found the requested form fields at node/1/revisions/5/deleteOtherFileFieldRevisionTest.php104Drupal\file\Tests\FileFieldRevisionTest->testRevisions()
Second file is now deleted after deleting third revision, since it is no longer being used by any other nodes.OtherFileFieldRevisionTest.php129Drupal\file\Tests\FileFieldRevisionTest->testRevisions()
Second file entry is now deleted after deleting third revision, since it is no longer being used by any other nodes.OtherFileFieldRevisionTest.php130Drupal\file\Tests\FileFieldRevisionTest->testRevisions()
Original file is deleted after deleting the entire node with two revisions remaining.OtherFileFieldRevisionTest.php143Drupal\file\Tests\FileFieldRevisionTest->testRevisions()
Original file entry is deleted after deleting the entire node with two revisions remaining.OtherFileFieldRevisionTest.php144Drupal\file\Tests\FileFieldRevisionTest->testRevisions()
LeafDrupal\file\Tests\FileFieldRSSContentTest2400
ExpandDrupal\file\Tests\FileFieldValidateTest11830
MessageGroupFilenameLineFunctionStatus
Node revision exists.OtherFileFieldTestBase.php146Drupal\file\Tests\FileFieldTestBase->uploadNodeFile()
Node revision exists.OtherFileFieldTestBase.php146Drupal\file\Tests\FileFieldTestBase->uploadNodeFile()
Node revision exists.OtherFileFieldTestBase.php146Drupal\file\Tests\FileFieldTestBase->uploadNodeFile()
ExpandDrupal\file\Tests\FileFieldWidgetTest29530
MessageGroupFilenameLineFunctionStatus
Node revision exists.OtherFileFieldTestBase.php146Drupal\file\Tests\FileFieldTestBase->uploadNodeFile()
Node revision exists.OtherFileFieldTestBase.php146Drupal\file\Tests\FileFieldTestBase->uploadNodeFile()
Confirmed that access is denied for the file without the needed permission.BrowserFileFieldWidgetTest.php308Drupal\file\Tests\FileFieldWidgetTest->testPrivateFileComment()
LeafDrupal\file\Tests\FileManagedFileElementTest26900
ExpandDrupal\file\Tests\FilePrivateTest3710
MessageGroupFilenameLineFunctionStatus
Node revision exists.OtherFileFieldTestBase.php146Drupal\file\Tests\FileFieldTestBase->uploadNodeFile()
ExpandDrupal\file\Tests\FileTokenReplaceTest3510
MessageGroupFilenameLineFunctionStatus
Node revision exists.OtherFileFieldTestBase.php146Drupal\file\Tests\FileFieldTestBase->uploadNodeFile()
LeafDrupal\file\Tests\LoadTest3500
LeafDrupal\file\Tests\MoveTest11000
LeafDrupal\file\Tests\RemoteFileSaveUploadTest27000
LeafDrupal\file\Tests\SaveDataTest9300
LeafDrupal\file\Tests\SaveTest1600
LeafDrupal\file\Tests\SaveUploadTest27000
LeafDrupal\file\Tests\SpaceUsedTest1200
LeafDrupal\file\Tests\UsageTest3400
LeafDrupal\file\Tests\ValidateTest1200
LeafDrupal\file\Tests\ValidatorTest2900
LeafDrupal\filter\Tests\FilterAdminTest28600
LeafDrupal\filter\Tests\FilterAPITest500
LeafDrupal\filter\Tests\FilterCrudTest12200
LeafDrupal\filter\Tests\FilterDefaultConfigTest2800
LeafDrupal\filter\Tests\FilterDefaultFormatTest3300
LeafDrupal\filter\Tests\FilterFormatAccessTest27200
LeafDrupal\filter\Tests\FilterHooksTest3300
LeafDrupal\filter\Tests\FilterHtmlImageSecureTest4600
LeafDrupal\filter\Tests\FilterNoFormatTest100
LeafDrupal\filter\Tests\FilterSecurityTest4000
LeafDrupal\filter\Tests\FilterSettingsTest1200
LeafDrupal\filter\Tests\FilterUnitTest21500
ExpandDrupal\forum\Tests\ForumBlockTest11660
MessageGroupFilenameLineFunctionStatus
Forum topic cKktfPXfutScIrgjKS8q found in the "New forum topics" block.OtherForumBlockTest.php69Drupal\forum\Tests\ForumBlockTest->testNewForumTopicsBlock()
Forum topic bKqgYTqZ8eZHyWQs9dd0 found in the "New forum topics" block.OtherForumBlockTest.php69Drupal\forum\Tests\ForumBlockTest->testNewForumTopicsBlock()
Forum topic fUYgG8Ci4zlCAK36WweV found in the "New forum topics" block.OtherForumBlockTest.php81Drupal\forum\Tests\ForumBlockTest->testNewForumTopicsBlock()
Forum topic rFI7HcXkXQMTVCBhvv7J found in the "Active forum topics" block.OtherForumBlockTest.php125Drupal\forum\Tests\ForumBlockTest->testActiveForumTopicsBlock()
Forum topic v8YkZoumnn5su4xdCpK8 found in the "Active forum topics" block.OtherForumBlockTest.php125Drupal\forum\Tests\ForumBlockTest->testActiveForumTopicsBlock()
Forum topic found in the "Active forum topics" block.OtherForumBlockTest.php142Drupal\forum\Tests\ForumBlockTest->testActiveForumTopicsBlock()
ExpandDrupal\forum\Tests\ForumIndexTest2420
MessageGroupFilenameLineFunctionStatus
Unpublished node is no longer accessible.OtherForumIndexTest.php71Drupal\forum\Tests\ForumIndexTest->testForumIndexStatus()
Unpublished forum topic no longer appears on index.OtherForumIndexTest.php75Drupal\forum\Tests\ForumIndexTest->testForumIndexStatus()
LeafDrupal\forum\Tests\ForumNodeAccessTest5100
ExpandDrupal\forum\Tests\ForumTest633100
MessageGroupFilenameLineFunctionStatus
Forum node was editedOtherForumTest.php597Drupal\forum\Tests\ForumTest->verifyForums()
The forum topic is linked to a different forumOtherForumTest.php604Drupal\forum\Tests\ForumTest->verifyForums()
Forum node was deletedOtherForumTest.php609Drupal\forum\Tests\ForumTest->verifyForums()
Forum node was editedOtherForumTest.php597Drupal\forum\Tests\ForumTest->verifyForums()
The forum topic is linked to a different forumOtherForumTest.php604Drupal\forum\Tests\ForumTest->verifyForums()
Forum node was deletedOtherForumTest.php609Drupal\forum\Tests\ForumTest->verifyForums()
Forum node was editedOtherForumTest.php597Drupal\forum\Tests\ForumTest->verifyForums()
The forum topic is linked to a different forumOtherForumTest.php604Drupal\forum\Tests\ForumTest->verifyForums()
Forum node was deletedOtherForumTest.php609Drupal\forum\Tests\ForumTest->verifyForums()
HTTP response expected 200, actual 500BrowserForumTest.php222Drupal\forum\Tests\ForumTest->testForum()
LeafDrupal\help\Tests\HelpTest29600
LeafDrupal\help\Tests\NoHelpTest1200
LeafDrupal\history\Tests\Views\HistoryTimestampTest1200
LeafDrupal\image\Tests\ImageAdminStylesTest20500
LeafDrupal\image\Tests\ImageDimensionsScaleUnitTest1500
LeafDrupal\image\Tests\ImageDimensionsTest5600
LeafDrupal\image\Tests\ImageEffectsTest4300
LeafDrupal\image\Tests\ImageFieldDefaultImagesTest4000
LeafDrupal\image\Tests\ImageFieldDisplayTest15900
LeafDrupal\image\Tests\ImageFieldValidateTest3800
LeafDrupal\image\Tests\ImageStylesPathAndUrlTest7100
LeafDrupal\image\Tests\ImageThemeFunctionTest500
LeafDrupal\jsonld\Tests\NormalizeDenormalizeTest1400
LeafDrupal\jsonld\Tests\RdfSchemaSerializationTest400
LeafDrupal\jsonld\Tests\SupportsSerializationTest1000
LeafDrupal\language\Tests\LanguageBrowserDetectionUnitTest10700
LeafDrupal\language\Tests\LanguageConfigurationElementTest5400
LeafDrupal\language\Tests\LanguageConfigurationTest7500
LeafDrupal\language\Tests\LanguageCustomLanguageConfigurationTest3600
LeafDrupal\language\Tests\LanguageDependencyInjectionTest1700
LeafDrupal\language\Tests\LanguageListTest10200
LeafDrupal\language\Tests\LanguageNegotiationInfoTest4900
LeafDrupal\language\Tests\LanguagePathMonolingualTest3500
LeafDrupal\language\Tests\LanguageSwitchingTest2200
LeafDrupal\language\Tests\LanguageUILanguageNegotiationTest14500
LeafDrupal\language\Tests\LanguageUrlRewritingTest4700
LeafDrupal\language\Tests\Views\ArgumentLanguageTest200
LeafDrupal\language\Tests\Views\FieldLanguageTest200
LeafDrupal\language\Tests\Views\FilterLanguageTest200
LeafDrupal\layout\Tests\DisplayInternalLogicTest1100
LeafDrupal\layout\Tests\LayoutDerivativesTest2400
LeafDrupal\link\Tests\LinkFieldTest14000
LeafDrupal\link\Tests\LinkFieldUITest2100
LeafDrupal\locale\Tests\LocaleContentTest17200
LeafDrupal\locale\Tests\LocaleExportTest5700
LeafDrupal\locale\Tests\LocaleImportFunctionalTest16600
LeafDrupal\locale\Tests\LocaleInstallTest200
LeafDrupal\locale\Tests\LocaleJavascriptTranslation6600
LeafDrupal\locale\Tests\LocaleLibraryInfoAlterTest200
LeafDrupal\locale\Tests\LocalePathTest5100
LeafDrupal\locale\Tests\LocalePluralFormatTest16000
LeafDrupal\locale\Tests\LocaleStringTest2600
LeafDrupal\locale\Tests\LocaleTranslationTest35800
LeafDrupal\locale\Tests\LocaleUninstallFrenchTest3600
LeafDrupal\locale\Tests\LocaleUninstallTest3600
LeafDrupal\locale\Tests\LocaleUpdateInterfaceTest4600
LeafDrupal\locale\Tests\LocaleUpdateTest46300
ExpandDrupal\menu\Tests\MenuNodeTest5601
MessageGroupFilenameLineFunctionStatus
Drupal\Core\Entity\EntityStorageException: SQLSTATE[23000]: Integrity constraint violation: 1048 Column 'tid' cannot be null: INSERT INTO {taxonomy_index} (nid, tid, sticky, created) VALUES (:db_insert_placeholder_0, :db_insert_placeholder_1, :db_insert_placeholder_2, :db_insert_placeholder_3); Array ( [:db_insert_placeholder_0] => 2 [:db_insert_placeholder_1] => [:db_insert_placeholder_2] => 0 [:db_insert_placeholder_3] => 1360703961 ) in Drupal\Core\Entity\DatabaseStorageControllerNG->save() (line 334 of /var/lib/drupaltestbot/sites/default/files/checkout/core/lib/Drupal/Core/Entity/DatabaseStorageControllerNG.php). Drupal\Core\Entity\DatabaseStorageControllerNG->save(Object) Drupal\Core\Entity\Entity->save() Drupal\Core\Entity\EntityBCDecorator->save() Drupal\simpletest\WebTestBase->drupalCreateNode(Array) Drupal\menu\Tests\MenuNodeTest->testMenuNodeFormWidget() Drupal\simpletest\TestBase->run() simpletest_script_run_one_test('370', 'Drupal\menu\Tests\MenuNodeTest') Uncaught exceptionDatabaseStorageControllerNG.php334Drupal\Core\Entity\DatabaseStorageControllerNG->save()
LeafDrupal\menu\Tests\MenuTest162200
LeafDrupal\minimal\Tests\MinimalTest1600
LeafDrupal\node\Tests\MultiStepNodeFormBasicOptionsTest1700
LeafDrupal\node\Tests\NodeAccessBaseTableTest15900
ExpandDrupal\node\Tests\NodeAccessFieldTest4910
MessageGroupFilenameLineFunctionStatus
The updated default value is displayed when creating a new node.OtherNodeAccessFieldTest.php92Drupal\node\Tests\NodeAccessFieldTest->testNodeAccessAdministerField()
LeafDrupal\node\Tests\NodeAccessLanguageTest2500
LeafDrupal\node\Tests\NodeAccessPagerTest3000
LeafDrupal\node\Tests\NodeAccessRebuildTest1900
LeafDrupal\node\Tests\NodeAccessRecordsTest2600
ExpandDrupal\node\Tests\NodeAccessTest3220
MessageGroupFilenameLineFunctionStatus
node_access returns false with operation 'view'.OtherNodeAccessTest.php63Drupal\node\Tests\NodeAccessTest->testNodeAccess()
node_access returns false with operation 'view'.OtherNodeAccessTest.php73Drupal\node\Tests\NodeAccessTest->testNodeAccess()
LeafDrupal\node\Tests\NodeAdminTest14500
LeafDrupal\node\Tests\NodeBlockFunctionalTest6300
LeafDrupal\node\Tests\NodeBuildContentTest400
ExpandDrupal\node\Tests\NodeCreationTest4720
MessageGroupFilenameLineFunctionStatus
Current URL is '/checkout/'.OtherNodeCreationTest.php119Drupal\node\Tests\NodeCreationTest->testUnpublishedNodeCreation()
"Test page text" foundOtherNodeCreationTest.php120Drupal\node\Tests\NodeCreationTest->testUnpublishedNodeCreation()
LeafDrupal\node\Tests\NodeEntityFieldQueryAlterTest3200
LeafDrupal\node\Tests\NodeEntityViewModeAlterTest2000
LeafDrupal\node\Tests\NodeFeedTest100
ExpandDrupal\node\Tests\NodeFieldMultilingualTestCase6220
MessageGroupFilenameLineFunctionStatus
Field language correctly set.OtherNodeFieldMultilingualTestCase.php89Drupal\node\Tests\NodeFieldMultilingualTestCase->testMultilingualNodeForm()
Field language correctly changed.OtherNodeFieldMultilingualTestCase.php102Drupal\node\Tests\NodeFieldMultilingualTestCase->testMultilingualNodeForm()
LeafDrupal\node\Tests\NodeFormButtonsTest12500
LeafDrupal\node\Tests\NodeLoadHooksTest700
LeafDrupal\node\Tests\NodeLoadMultipleTest2700
LeafDrupal\node\Tests\NodePostSettingsTest5900
LeafDrupal\node\Tests\NodeQueryAlterTest12500
LeafDrupal\node\Tests\NodeRevisionPermissionsTest7400
ExpandDrupal\node\Tests\NodeRevisionsAllTestCase34150
MessageGroupFilenameLineFunctionStatus
Correct text displays for version.OtherNodeRevisionsAllTestCase.php93Drupal\node\Tests\NodeRevisionsAllTestCase->testRevisions()
Log message found.OtherNodeRevisionsAllTestCase.php98Drupal\node\Tests\NodeRevisionsAllTestCase->testRevisions()
Log message found.OtherNodeRevisionsAllTestCase.php98Drupal\node\Tests\NodeRevisionsAllTestCase->testRevisions()
Log message found.OtherNodeRevisionsAllTestCase.php98Drupal\node\Tests\NodeRevisionsAllTestCase->testRevisions()
Found the Revert buttonOtherNodeRevisionsAllTestCase.php105Drupal\node\Tests\NodeRevisionsAllTestCase->testRevisions()
Found the requested form fields at node/1/revisions/1/revertOtherNodeRevisionsAllTestCase.php105Drupal\node\Tests\NodeRevisionsAllTestCase->testRevisions()
Revision reverted.OtherNodeRevisionsAllTestCase.php112Drupal\node\Tests\NodeRevisionsAllTestCase->testRevisions()
Third node revision is not the current one.OtherNodeRevisionsAllTestCase.php118Drupal\node\Tests\NodeRevisionsAllTestCase->testRevisions()
Found the Delete buttonOtherNodeRevisionsAllTestCase.php121Drupal\node\Tests\NodeRevisionsAllTestCase->testRevisions()
Found the requested form fields at node/1/revisions/1/deleteOtherNodeRevisionsAllTestCase.php121Drupal\node\Tests\NodeRevisionsAllTestCase->testRevisions()
Revision deleted.OtherNodeRevisionsAllTestCase.php128Drupal\node\Tests\NodeRevisionsAllTestCase->testRevisions()
Revision not found.OtherNodeRevisionsAllTestCase.php131Drupal\node\Tests\NodeRevisionsAllTestCase->testRevisions()
Found the Revert buttonOtherNodeRevisionsAllTestCase.php142Drupal\node\Tests\NodeRevisionsAllTestCase->testRevisions()
Found the requested form fields at node/1/revisions/1/revertOtherNodeRevisionsAllTestCase.php142Drupal\node\Tests\NodeRevisionsAllTestCase->testRevisions()
Raw "Basic page <em class="placeholder">evFk2w2K</em> has been reverted back to the revision from <em class="placeholder">Mon, 02/11/2013 - 21:24</em>." foundOtherNodeRevisionsAllTestCase.php147Drupal\node\Tests\NodeRevisionsAllTestCase->testRevisions()
ExpandDrupal\node\Tests\NodeRevisionsTest77320
MessageGroupFilenameLineFunctionStatus
Correct text displays for version.OtherNodeRevisionsTest.php83Drupal\node\Tests\NodeRevisionsTest->testRevisions()
Log message found.OtherNodeRevisionsTest.php88Drupal\node\Tests\NodeRevisionsTest->testRevisions()
Log message found.OtherNodeRevisionsTest.php88Drupal\node\Tests\NodeRevisionsTest->testRevisions()
Log message found.OtherNodeRevisionsTest.php88Drupal\node\Tests\NodeRevisionsTest->testRevisions()
Found the Revert buttonOtherNodeRevisionsTest.php95Drupal\node\Tests\NodeRevisionsTest->testRevisions()
Found the requested form fields at node/1/revisions/1/revertOtherNodeRevisionsTest.php95Drupal\node\Tests\NodeRevisionsTest->testRevisions()
Revision reverted.OtherNodeRevisionsTest.php98Drupal\node\Tests\NodeRevisionsTest->testRevisions()
Third node revision is not the default one.OtherNodeRevisionsTest.php104Drupal\node\Tests\NodeRevisionsTest->testRevisions()
Found the Delete buttonOtherNodeRevisionsTest.php107Drupal\node\Tests\NodeRevisionsTest->testRevisions()
Found the requested form fields at node/1/revisions/1/deleteOtherNodeRevisionsTest.php107Drupal\node\Tests\NodeRevisionsTest->testRevisions()
Revision deleted.OtherNodeRevisionsTest.php110Drupal\node\Tests\NodeRevisionsTest->testRevisions()
Revision not found.OtherNodeRevisionsTest.php111Drupal\node\Tests\NodeRevisionsTest->testRevisions()
Found the Revert buttonOtherNodeRevisionsTest.php122Drupal\node\Tests\NodeRevisionsTest->testRevisions()
Found the requested form fields at node/1/revisions/1/revertOtherNodeRevisionsTest.php122Drupal\node\Tests\NodeRevisionsTest->testRevisions()
Raw "Basic page <em class="placeholder">ap7fQiNI</em> has been reverted back to the revision from <em class="placeholder">Mon, 02/11/2013 - 21:24</em>." foundOtherNodeRevisionsTest.php127Drupal\node\Tests\NodeRevisionsTest->testRevisions()
Correct text displays for version.OtherNodeRevisionsTest.php83Drupal\node\Tests\NodeRevisionsTest->testRevisions()
Log message found.OtherNodeRevisionsTest.php88Drupal\node\Tests\NodeRevisionsTest->testRevisions()
Log message found.OtherNodeRevisionsTest.php88Drupal\node\Tests\NodeRevisionsTest->testRevisions()
Log message found.OtherNodeRevisionsTest.php88Drupal\node\Tests\NodeRevisionsTest->testRevisions()
Found the Revert buttonOtherNodeRevisionsTest.php95Drupal\node\Tests\NodeRevisionsTest->testRevisions()
Found the requested form fields at node/1/revisions/1/revertOtherNodeRevisionsTest.php95Drupal\node\Tests\NodeRevisionsTest->testRevisions()
Revision reverted.OtherNodeRevisionsTest.php98Drupal\node\Tests\NodeRevisionsTest->testRevisions()
Third node revision is not the default one.OtherNodeRevisionsTest.php104Drupal\node\Tests\NodeRevisionsTest->testRevisions()
Found the Delete buttonOtherNodeRevisionsTest.php107Drupal\node\Tests\NodeRevisionsTest->testRevisions()
Found the requested form fields at node/1/revisions/1/deleteOtherNodeRevisionsTest.php107Drupal\node\Tests\NodeRevisionsTest->testRevisions()
Revision deleted.OtherNodeRevisionsTest.php110Drupal\node\Tests\NodeRevisionsTest->testRevisions()
Revision not found.OtherNodeRevisionsTest.php111Drupal\node\Tests\NodeRevisionsTest->testRevisions()
Found the Revert buttonOtherNodeRevisionsTest.php122Drupal\node\Tests\NodeRevisionsTest->testRevisions()
Found the requested form fields at node/1/revisions/1/revertOtherNodeRevisionsTest.php122Drupal\node\Tests\NodeRevisionsTest->testRevisions()
Raw "Basic page <em class="placeholder">ap7fQiNI</em> has been reverted back to the revision from <em class="placeholder">Mon, 02/11/2013 - 21:24</em>." foundOtherNodeRevisionsTest.php127Drupal\node\Tests\NodeRevisionsTest->testRevisions()
After an existing node revision is re-saved without a log message, the original log message is preserved.OtherNodeRevisionsTest.php180Drupal\node\Tests\NodeRevisionsTest->testNodeRevisionWithoutLogMessage()
After a new node revision is saved with an empty log message, the log message for the node is empty.OtherNodeRevisionsTest.php198Drupal\node\Tests\NodeRevisionsTest->testNodeRevisionWithoutLogMessage()
LeafDrupal\node\Tests\NodeRSSContentTest4000
ExpandDrupal\node\Tests\NodeSaveTest5640
MessageGroupFilenameLineFunctionStatus
Node load by node ID.OtherNodeSaveTest.php68Drupal\node\Tests\NodeSaveTest->testImport()
Node load by node title.OtherNodeSaveTest.php71Drupal\node\Tests\NodeSaveTest->testImport()
Changes have been determined.OtherNodeSaveTest.php153Drupal\node\Tests\NodeSaveTest->testDeterminingChanges()
Static cache has been cleared.OtherNodeSaveTest.php157Drupal\node\Tests\NodeSaveTest->testDeterminingChanges()
LeafDrupal\node\Tests\NodeSyndicateBlockTest1400
LeafDrupal\node\Tests\NodeTitleTest2300
LeafDrupal\node\Tests\NodeTitleXSSTest2300
LeafDrupal\node\Tests\NodeTokenReplaceTest4000
ExpandDrupal\node\Tests\NodeTranslationUITest1714511
MessageGroupFilenameLineFunctionStatus
Failed to set field title to oW38WpAdOtherEntityTranslationUITest.php37Drupal\translation_entity\Tests\EntityTranslationUITest->testTranslationUI()
Failed to set field field_test_et_ui_test[it][0][value] to s3T5UtdgiqxFnZnuOtherEntityTranslationUITest.php37Drupal\translation_entity\Tests\EntityTranslationUITest->testTranslationUI()
Found the Save and keep unpublished buttonOtherEntityTranslationUITest.php37Drupal\translation_entity\Tests\EntityTranslationUITest->testTranslationUI()
Found the requested form fields at it/node/1/translations/add/en/itOtherEntityTranslationUITest.php37Drupal\translation_entity\Tests\EntityTranslationUITest->testTranslationUI()
Failed to set field source_langcode[source] to itOtherEntityTranslationUITest.php37Drupal\translation_entity\Tests\EntityTranslationUITest->testTranslationUI()
Found the Change buttonOtherEntityTranslationUITest.php37Drupal\translation_entity\Tests\EntityTranslationUITest->testTranslationUI()
Found the requested form fields at fr/node/1/translations/add/en/frOtherEntityTranslationUITest.php37Drupal\translation_entity\Tests\EntityTranslationUITest->testTranslationUI()
Source language correctly switched.OtherEntityTranslationUITest.php37Drupal\translation_entity\Tests\EntityTranslationUITest->testTranslationUI()
Failed to set field title to oW38WpAdOtherEntityTranslationUITest.php37Drupal\translation_entity\Tests\EntityTranslationUITest->testTranslationUI()
Failed to set field field_test_et_ui_test[fr][0][value] to lf3nKVBPyarlvpRbOtherEntityTranslationUITest.php37Drupal\translation_entity\Tests\EntityTranslationUITest->testTranslationUI()
Failed to set field translation_entity[retranslate] to 1OtherEntityTranslationUITest.php37Drupal\translation_entity\Tests\EntityTranslationUITest->testTranslationUI()
Found the Save and keep unpublished buttonOtherEntityTranslationUITest.php37Drupal\translation_entity\Tests\EntityTranslationUITest->testTranslationUI()
Found the requested form fields at fr/node/1/translations/add/en/frOtherEntityTranslationUITest.php37Drupal\translation_entity\Tests\EntityTranslationUITest->testTranslationUI()
Undefined index: itDrupal\translation_entity\Tests\EntityTranslationUITest->getValue(Object, 'field_test_et_ui_test', 'it') Drupal\translation_entity\Tests\EntityTranslationUITest->assertBasicTranslation() Drupal\translation_entity\Tests\EntityTranslationUITest->testTranslationUI() Drupal\simpletest\TestBase->run() simpletest_script_run_one_test('419', 'Drupal\node\Tests\NodeTranslationUITest') NoticeEntityTranslationUITest.php274Drupal\translation_entity\Tests\EntityTranslationUITest->getValue()
field_test_et_ui_test correctly stored with language it.OtherEntityTranslationUITest.php37Drupal\translation_entity\Tests\EntityTranslationUITest->testTranslationUI()
Undefined index: frDrupal\translation_entity\Tests\EntityTranslationUITest->getValue(Object, 'field_test_et_ui_test', 'fr') Drupal\translation_entity\Tests\EntityTranslationUITest->assertBasicTranslation() Drupal\translation_entity\Tests\EntityTranslationUITest->testTranslationUI() Drupal\simpletest\TestBase->run() simpletest_script_run_one_test('419', 'Drupal\node\Tests\NodeTranslationUITest') NoticeEntityTranslationUITest.php274Drupal\translation_entity\Tests\EntityTranslationUITest->getValue()
field_test_et_ui_test correctly stored with language fr.OtherEntityTranslationUITest.php37Drupal\translation_entity\Tests\EntityTranslationUITest->testTranslationUI()
Failed to set field translation_entity[retranslate] to 1OtherEntityTranslationUITest.php38Drupal\translation_entity\Tests\EntityTranslationUITest->testTranslationUI()
Found the Save and keep unpublished buttonOtherEntityTranslationUITest.php38Drupal\translation_entity\Tests\EntityTranslationUITest->testTranslationUI()
Found the requested form fields at fr/node/1/editOtherEntityTranslationUITest.php38Drupal\translation_entity\Tests\EntityTranslationUITest->testTranslationUI()
The translate flag is checked by default.OtherEntityTranslationUITest.php38Drupal\translation_entity\Tests\EntityTranslationUITest->testTranslationUI()
Failed to set field translation_entity[outdated] to OtherEntityTranslationUITest.php38Drupal\translation_entity\Tests\EntityTranslationUITest->testTranslationUI()
Found the Save and keep unpublished buttonOtherEntityTranslationUITest.php38Drupal\translation_entity\Tests\EntityTranslationUITest->testTranslationUI()
Found the requested form fields at node/1/editOtherEntityTranslationUITest.php38Drupal\translation_entity\Tests\EntityTranslationUITest->testTranslationUI()
The retranslate flag is now shown.OtherEntityTranslationUITest.php38Drupal\translation_entity\Tests\EntityTranslationUITest->testTranslationUI()
The translate flag is checked by default.OtherEntityTranslationUITest.php38Drupal\translation_entity\Tests\EntityTranslationUITest->testTranslationUI()
Failed to set field translation_entity[outdated] to OtherEntityTranslationUITest.php38Drupal\translation_entity\Tests\EntityTranslationUITest->testTranslationUI()
Found the Save and keep unpublished buttonOtherEntityTranslationUITest.php38Drupal\translation_entity\Tests\EntityTranslationUITest->testTranslationUI()
Found the requested form fields at it/node/1/editOtherEntityTranslationUITest.php38Drupal\translation_entity\Tests\EntityTranslationUITest->testTranslationUI()
The retranslate flag is now shown.OtherEntityTranslationUITest.php38Drupal\translation_entity\Tests\EntityTranslationUITest->testTranslationUI()
Undefined index: itDrupal\translation_entity\Tests\EntityTranslationUITest->assertOutdatedStatus() Drupal\translation_entity\Tests\EntityTranslationUITest->testTranslationUI() Drupal\simpletest\TestBase->run() simpletest_script_run_one_test('419', 'Drupal\node\Tests\NodeTranslationUITest') NoticeEntityTranslationUITest.php129Drupal\translation_entity\Tests\EntityTranslationUITest->assertOutdatedStatus()
The retranslate flag is not checked by default.OtherEntityTranslationUITest.php38Drupal\translation_entity\Tests\EntityTranslationUITest->testTranslationUI()
Found the Save and publish buttonOtherEntityTranslationUITest.php39Drupal\translation_entity\Tests\EntityTranslationUITest->testTranslationUI()
Found the requested form fields at node/1/editOtherEntityTranslationUITest.php39Drupal\translation_entity\Tests\EntityTranslationUITest->testTranslationUI()
The translation has been correctly unpublished.OtherEntityTranslationUITest.php39Drupal\translation_entity\Tests\EntityTranslationUITest->testTranslationUI()
Undefined index: itDrupal\node\Tests\NodeTranslationUITest->assertPublishedStatus() Drupal\translation_entity\Tests\EntityTranslationUITest->testTranslationUI() Drupal\simpletest\TestBase->run() simpletest_script_run_one_test('419', 'Drupal\node\Tests\NodeTranslationUITest') NoticeNodeTranslationUITest.php101Drupal\node\Tests\NodeTranslationUITest->assertPublishedStatus()
The translation has been correctly unpublished.OtherEntityTranslationUITest.php39Drupal\translation_entity\Tests\EntityTranslationUITest->testTranslationUI()
Undefined index: frDrupal\node\Tests\NodeTranslationUITest->assertPublishedStatus() Drupal\translation_entity\Tests\EntityTranslationUITest->testTranslationUI() Drupal\simpletest\TestBase->run() simpletest_script_run_one_test('419', 'Drupal\node\Tests\NodeTranslationUITest') NoticeNodeTranslationUITest.php101Drupal\node\Tests\NodeTranslationUITest->assertPublishedStatus()
The translation has been correctly unpublished.OtherEntityTranslationUITest.php39Drupal\translation_entity\Tests\EntityTranslationUITest->testTranslationUI()
Undefined index: itDrupal\node\Tests\NodeTranslationUITest->assertPublishedStatus() Drupal\translation_entity\Tests\EntityTranslationUITest->testTranslationUI() Drupal\simpletest\TestBase->run() simpletest_script_run_one_test('419', 'Drupal\node\Tests\NodeTranslationUITest') NoticeNodeTranslationUITest.php101Drupal\node\Tests\NodeTranslationUITest->assertPublishedStatus()
Undefined index: frDrupal\node\Tests\NodeTranslationUITest->assertPublishedStatus() Drupal\translation_entity\Tests\EntityTranslationUITest->testTranslationUI() Drupal\simpletest\TestBase->run() simpletest_script_run_one_test('419', 'Drupal\node\Tests\NodeTranslationUITest') NoticeNodeTranslationUITest.php101Drupal\node\Tests\NodeTranslationUITest->assertPublishedStatus()
Value false is equal to value 'Translation author correctly stored.'.OtherEntityTranslationUITest.php40Drupal\translation_entity\Tests\EntityTranslationUITest->testTranslationUI()
Value false is equal to value 'Translation date correctly stored.'.OtherEntityTranslationUITest.php40Drupal\translation_entity\Tests\EntityTranslationUITest->testTranslationUI()
Undefined index: itDrupal\node\Tests\NodeTranslationUITest->assertAuthoringInfo() Drupal\translation_entity\Tests\EntityTranslationUITest->testTranslationUI() Drupal\simpletest\TestBase->run() simpletest_script_run_one_test('419', 'Drupal\node\Tests\NodeTranslationUITest') NoticeNodeTranslationUITest.php131Drupal\node\Tests\NodeTranslationUITest->assertAuthoringInfo()
Value false is equal to value 'Translation author correctly stored.'.OtherEntityTranslationUITest.php40Drupal\translation_entity\Tests\EntityTranslationUITest->testTranslationUI()
Undefined index: itDrupal\node\Tests\NodeTranslationUITest->assertAuthoringInfo() Drupal\translation_entity\Tests\EntityTranslationUITest->testTranslationUI() Drupal\simpletest\TestBase->run() simpletest_script_run_one_test('419', 'Drupal\node\Tests\NodeTranslationUITest') NoticeNodeTranslationUITest.php132Drupal\node\Tests\NodeTranslationUITest->assertAuthoringInfo()
Value false is equal to value 'Translation date correctly stored.'.OtherEntityTranslationUITest.php40Drupal\translation_entity\Tests\EntityTranslationUITest->testTranslationUI()
Undefined index: frDrupal\node\Tests\NodeTranslationUITest->assertAuthoringInfo() Drupal\translation_entity\Tests\EntityTranslationUITest->testTranslationUI() Drupal\simpletest\TestBase->run() simpletest_script_run_one_test('419', 'Drupal\node\Tests\NodeTranslationUITest') NoticeNodeTranslationUITest.php131Drupal\node\Tests\NodeTranslationUITest->assertAuthoringInfo()
Value false is equal to value 'Translation author correctly stored.'.OtherEntityTranslationUITest.php40Drupal\translation_entity\Tests\EntityTranslationUITest->testTranslationUI()
Undefined index: frDrupal\node\Tests\NodeTranslationUITest->assertAuthoringInfo() Drupal\translation_entity\Tests\EntityTranslationUITest->testTranslationUI() Drupal\simpletest\TestBase->run() simpletest_script_run_one_test('419', 'Drupal\node\Tests\NodeTranslationUITest') NoticeNodeTranslationUITest.php132Drupal\node\Tests\NodeTranslationUITest->assertAuthoringInfo()
Value false is equal to value 'Translation date correctly stored.'.OtherEntityTranslationUITest.php40Drupal\translation_entity\Tests\EntityTranslationUITest->testTranslationUI()
Found the Delete translation buttonOtherEntityTranslationUITest.php41Drupal\translation_entity\Tests\EntityTranslationUITest->testTranslationUI()
Found the requested form fields at fr/node/1/editOtherEntityTranslationUITest.php41Drupal\translation_entity\Tests\EntityTranslationUITest->testTranslationUI()
Found the Delete buttonOtherEntityTranslationUITest.php41Drupal\translation_entity\Tests\EntityTranslationUITest->testTranslationUI()
Found the requested form fields at OtherEntityTranslationUITest.php41Drupal\translation_entity\Tests\EntityTranslationUITest->testTranslationUI()
Translation successfully deleted.OtherEntityTranslationUITest.php41Drupal\translation_entity\Tests\EntityTranslationUITest->testTranslationUI()
LeafDrupal\node\Tests\NodeTypeInitialLanguageTest8000
LeafDrupal\node\Tests\NodeTypePersistenceTest6500
LeafDrupal\node\Tests\NodeTypeTest13000
LeafDrupal\node\Tests\PageEditTest9700
LeafDrupal\node\Tests\PagePreviewTest4100
LeafDrupal\node\Tests\PageViewTest3400
LeafDrupal\node\Tests\SummaryLengthTest1200
LeafDrupal\node\Tests\Views\FieldTypeTest200
ExpandDrupal\node\Tests\Views\FilterUidRevisionTest310
MessageGroupFilenameLineFunctionStatus
Make sure that the view only returns nodes which match either the node or the revision author.OtherFilterUidRevisionTest.php61Drupal\node\Tests\Views\FilterUidRevisionTest->testFilter()
LeafDrupal\node\Tests\Views\RevisionRelationships300
LeafDrupal\node\Tests\Views\StatusExtraTest6800
LeafDrupal\number\Tests\NumberFieldTest8800
LeafDrupal\number\Tests\NumberItemTest1800
LeafDrupal\openid\Tests\OpenIDFunctionalTest38400
LeafDrupal\openid\Tests\OpenIDRegistrationTest19900
LeafDrupal\openid\Tests\OpenIDTest3800
LeafDrupal\openid\Tests\Upgrade\OpenIDAuthmapUpgradePathTest2600
LeafDrupal\options\Tests\OptionsDynamicValuesValidationTest900
LeafDrupal\options\Tests\OptionsFieldTest1600
ExpandDrupal\options\Tests\OptionsFieldUITest21750
MessageGroupFilenameLineFunctionStatus
Unkeyed lists are rejected once the field has data.OtherOptionsFieldUITest.php78Drupal\options\Tests\OptionsFieldUITest->testOptionsAllowedValuesInteger()
Values in use cannot be removed.OtherOptionsFieldUITest.php87Drupal\options\Tests\OptionsFieldUITest->testOptionsAllowedValuesInteger()
Unkeyed lists are rejected once the field has data.OtherOptionsFieldUITest.php128Drupal\options\Tests\OptionsFieldUITest->testOptionsAllowedValuesFloat()
Values in use cannot be removed.OtherOptionsFieldUITest.php137Drupal\options\Tests\OptionsFieldUITest->testOptionsAllowedValuesFloat()
Values in use cannot be removed.OtherOptionsFieldUITest.php192Drupal\options\Tests\OptionsFieldUITest->testOptionsAllowedValuesText()
LeafDrupal\options\Tests\OptionsSelectDynamicValuesTest1600
LeafDrupal\options\Tests\OptionsWidgetsTest26100
LeafDrupal\path\Tests\PathAliasTest13800
LeafDrupal\path\Tests\PathLanguageTest7500
LeafDrupal\path\Tests\PathLanguageUiTest9000
LeafDrupal\path\Tests\PathTaxonomyTermTest3700
LeafDrupal\php\Tests\PhpAccessTest3800
LeafDrupal\php\Tests\PhpFilterTest4200
LeafDrupal\picture\Tests\PictureAdminUITest5400
LeafDrupal\picture\Tests\PictureFieldDisplayTest11500
LeafDrupal\rdf\Tests\CommentAttributesTest11800
LeafDrupal\rdf\Tests\CrudTest1000
LeafDrupal\rdf\Tests\GetNamespacesTest700
LeafDrupal\rdf\Tests\GetRdfNamespacesTest500
ExpandDrupal\rdf\Tests\MappingDefinitionTest4202
MessageGroupFilenameLineFunctionStatus
Drupal\Core\Entity\EntityStorageException: SQLSTATE[23000]: Integrity constraint violation: 1048 Column 'tid' cannot be null: INSERT INTO {taxonomy_index} (nid, tid, sticky, created) VALUES (:db_insert_placeholder_0, :db_insert_placeholder_1, :db_insert_placeholder_2, :db_insert_placeholder_3); Array ( [:db_insert_placeholder_0] => 1 [:db_insert_placeholder_1] => [:db_insert_placeholder_2] => 0 [:db_insert_placeholder_3] => 1360704563 ) in Drupal\Core\Entity\DatabaseStorageControllerNG->save() (line 334 of /var/lib/drupaltestbot/sites/default/files/checkout/core/lib/Drupal/Core/Entity/DatabaseStorageControllerNG.php). Drupal\Core\Entity\DatabaseStorageControllerNG->save(Object) Drupal\Core\Entity\Entity->save() Drupal\Core\Entity\EntityBCDecorator->save() Drupal\simpletest\WebTestBase->drupalCreateNode(Array) Drupal\rdf\Tests\MappingDefinitionTest->testAttributesInMarkup1() Drupal\simpletest\TestBase->run() simpletest_script_run_one_test('461', 'Drupal\rdf\Tests\MappingDefinitionTest') Uncaught exceptionDatabaseStorageControllerNG.php334Drupal\Core\Entity\DatabaseStorageControllerNG->save()
Drupal\Core\Entity\EntityStorageException: SQLSTATE[23000]: Integrity constraint violation: 1048 Column 'tid' cannot be null: INSERT INTO {taxonomy_index} (nid, tid, sticky, created) VALUES (:db_insert_placeholder_0, :db_insert_placeholder_1, :db_insert_placeholder_2, :db_insert_placeholder_3); Array ( [:db_insert_placeholder_0] => 1 [:db_insert_placeholder_1] => [:db_insert_placeholder_2] => 0 [:db_insert_placeholder_3] => 1360704563 ) in Drupal\Core\Entity\DatabaseStorageControllerNG->save() (line 334 of /var/lib/drupaltestbot/sites/default/files/checkout/core/lib/Drupal/Core/Entity/DatabaseStorageControllerNG.php). Drupal\Core\Entity\DatabaseStorageControllerNG->save(Object) Drupal\Core\Entity\Entity->save() Drupal\Core\Entity\EntityBCDecorator->save() Drupal\simpletest\WebTestBase->drupalCreateNode(Array) Drupal\rdf\Tests\MappingDefinitionTest->testUserAttributesInMarkup() Drupal\simpletest\TestBase->run() simpletest_script_run_one_test('461', 'Drupal\rdf\Tests\MappingDefinitionTest') Uncaught exceptionDatabaseStorageControllerNG.php334Drupal\Core\Entity\DatabaseStorageControllerNG->save()
LeafDrupal\rdf\Tests\MappingHookTest600
ExpandDrupal\rdf\Tests\RdfaMarkupTest1501
MessageGroupFilenameLineFunctionStatus
Drupal\Core\Entity\EntityStorageException: SQLSTATE[23000]: Integrity constraint violation: 1048 Column 'tid' cannot be null: INSERT INTO {taxonomy_index} (nid, tid, sticky, created) VALUES (:db_insert_placeholder_0, :db_insert_placeholder_1, :db_insert_placeholder_2, :db_insert_placeholder_3); Array ( [:db_insert_placeholder_0] => 1 [:db_insert_placeholder_1] => [:db_insert_placeholder_2] => 0 [:db_insert_placeholder_3] => 1360704568 ) in Drupal\Core\Entity\DatabaseStorageControllerNG->save() (line 334 of /var/lib/drupaltestbot/sites/default/files/checkout/core/lib/Drupal/Core/Entity/DatabaseStorageControllerNG.php). Drupal\Core\Entity\DatabaseStorageControllerNG->save(Object) Drupal\Core\Entity\Entity->save() Drupal\Core\Entity\EntityBCDecorator->save() Drupal\simpletest\WebTestBase->drupalCreateNode(Array) Drupal\rdf\Tests\RdfaMarkupTest->testAttributesInMarkupFile() Drupal\simpletest\TestBase->run() simpletest_script_run_one_test('463', 'Drupal\rdf\Tests\RdfaMarkupTest') Uncaught exceptionDatabaseStorageControllerNG.php334Drupal\Core\Entity\DatabaseStorageControllerNG->save()
LeafDrupal\rdf\Tests\RdfMappingEventTest300
LeafDrupal\rdf\Tests\SiteSchemaTest300
LeafDrupal\rdf\Tests\TrackerAttributesTest3000
LeafDrupal\rest\Tests\CreateTest3700
LeafDrupal\rest\Tests\DBLogTest1800
LeafDrupal\rest\Tests\DeleteTest8900
LeafDrupal\rest\Tests\ReadTest3500
LeafDrupal\rest\Tests\UpdateTest7500
LeafDrupal\rest\Tests\Views\StyleSerializerTest5200
LeafDrupal\search\Tests\SearchAdvancedSearchFormTest3400
LeafDrupal\search\Tests\SearchBlockTest3800
ExpandDrupal\search\Tests\SearchCommentCountToggleTest411
MessageGroupFilenameLineFunctionStatus
The test did not complete due to a fatal error.Completion checkSearchCommentCountToggleTest.php80Drupal\search\Tests\SearchCommentCountToggleTest->testSearchCommentCountToggle()
Undefined offset: 0Drupal\simpletest\WebTestBase->drupalCreateNode(Array) Drupal\search\Tests\SearchCommentCountToggleTest->setUp() Drupal\simpletest\TestBase->run() simpletest_script_run_one_test('482', 'Drupal\search\Tests\SearchCommentCountToggleTest') NoticeWebTestBase.php264Drupal\simpletest\WebTestBase->drupalCreateNode()
ExpandDrupal\search\Tests\SearchCommentTest4803
MessageGroupFilenameLineFunctionStatus
Drupal\Core\Entity\EntityStorageException: SQLSTATE[23000]: Integrity constraint violation: 1048 Column 'tid' cannot be null: INSERT INTO {taxonomy_index} (nid, tid, sticky, created) VALUES (:db_insert_placeholder_0, :db_insert_placeholder_1, :db_insert_placeholder_2, :db_insert_placeholder_3); Array ( [:db_insert_placeholder_0] => 1 [:db_insert_placeholder_1] => [:db_insert_placeholder_2] => 0 [:db_insert_placeholder_3] => 1360704636 ) in Drupal\Core\Entity\DatabaseStorageControllerNG->save() (line 334 of /var/lib/drupaltestbot/sites/default/files/checkout/core/lib/Drupal/Core/Entity/DatabaseStorageControllerNG.php). Drupal\Core\Entity\DatabaseStorageControllerNG->save(Object) Drupal\Core\Entity\Entity->save() Drupal\Core\Entity\EntityBCDecorator->save() Drupal\simpletest\WebTestBase->drupalCreateNode(Array) Drupal\search\Tests\SearchCommentTest->testSearchResultsComment() Drupal\simpletest\TestBase->run() simpletest_script_run_one_test('483', 'Drupal\search\Tests\SearchCommentTest') Uncaught exceptionDatabaseStorageControllerNG.php334Drupal\Core\Entity\DatabaseStorageControllerNG->save()
Drupal\Core\Entity\EntityStorageException: SQLSTATE[23000]: Integrity constraint violation: 1048 Column 'tid' cannot be null: INSERT INTO {taxonomy_index} (nid, tid, sticky, created) VALUES (:db_insert_placeholder_0, :db_insert_placeholder_1, :db_insert_placeholder_2, :db_insert_placeholder_3); Array ( [:db_insert_placeholder_0] => 1 [:db_insert_placeholder_1] => [:db_insert_placeholder_2] => 0 [:db_insert_placeholder_3] => 1360704636 ) in Drupal\Core\Entity\DatabaseStorageControllerNG->save() (line 334 of /var/lib/drupaltestbot/sites/default/files/checkout/core/lib/Drupal/Core/Entity/DatabaseStorageControllerNG.php). Drupal\Core\Entity\DatabaseStorageControllerNG->save(Object) Drupal\Core\Entity\Entity->save() Drupal\Core\Entity\EntityBCDecorator->save() Drupal\simpletest\WebTestBase->drupalCreateNode(Array) Drupal\search\Tests\SearchCommentTest->testSearchResultsCommentAccess() Drupal\simpletest\TestBase->run() simpletest_script_run_one_test('483', 'Drupal\search\Tests\SearchCommentTest') Uncaught exceptionDatabaseStorageControllerNG.php334Drupal\Core\Entity\DatabaseStorageControllerNG->save()
Drupal\Core\Entity\EntityStorageException: SQLSTATE[23000]: Integrity constraint violation: 1048 Column 'tid' cannot be null: INSERT INTO {taxonomy_index} (nid, tid, sticky, created) VALUES (:db_insert_placeholder_0, :db_insert_placeholder_1, :db_insert_placeholder_2, :db_insert_placeholder_3); Array ( [:db_insert_placeholder_0] => 1 [:db_insert_placeholder_1] => [:db_insert_placeholder_2] => 0 [:db_insert_placeholder_3] => 1360704636 ) in Drupal\Core\Entity\DatabaseStorageControllerNG->save() (line 334 of /var/lib/drupaltestbot/sites/default/files/checkout/core/lib/Drupal/Core/Entity/DatabaseStorageControllerNG.php). Drupal\Core\Entity\DatabaseStorageControllerNG->save(Object) Drupal\Core\Entity\Entity->save() Drupal\Core\Entity\EntityBCDecorator->save() Drupal\simpletest\WebTestBase->drupalCreateNode(Array) Drupal\search\Tests\SearchCommentTest->testAddNewComment() Drupal\simpletest\TestBase->run() simpletest_script_run_one_test('483', 'Drupal\search\Tests\SearchCommentTest') Uncaught exceptionDatabaseStorageControllerNG.php334Drupal\Core\Entity\DatabaseStorageControllerNG->save()
LeafDrupal\search\Tests\SearchConfigSettingsFormTest15900
LeafDrupal\search\Tests\SearchEmbedFormTest3200
LeafDrupal\search\Tests\SearchExactTest2500
LeafDrupal\search\Tests\SearchExcerptTest1800
LeafDrupal\search\Tests\SearchExpressionInsertExtractTest2400
LeafDrupal\search\Tests\SearchKeywordsConditionsTest2800
LeafDrupal\search\Tests\SearchLanguageTest4300
LeafDrupal\search\Tests\SearchMatchTest14700
ExpandDrupal\search\Tests\SearchMultilingualEntityTest311
MessageGroupFilenameLineFunctionStatus
The test did not complete due to a fatal error.Completion checkSearchMultilingualEntityTest.php92Drupal\search\Tests\SearchMultilingualEntityTest->testIndexingThrottle()
Undefined offset: 0Drupal\simpletest\WebTestBase->drupalCreateNode(Array) Drupal\search\Tests\SearchMultilingualEntityTest->setUp() Drupal\simpletest\TestBase->run() simpletest_script_run_one_test('492', 'Drupal\search\Tests\SearchMultilingualEntityTest') NoticeWebTestBase.php264Drupal\simpletest\WebTestBase->drupalCreateNode()
LeafDrupal\search\Tests\SearchNodeAccessTest1600
LeafDrupal\search\Tests\SearchNumberMatchingTest29500
LeafDrupal\search\Tests\SearchNumbersTest17500
LeafDrupal\search\Tests\SearchPageOverrideTest1500
LeafDrupal\search\Tests\SearchPageTextTest3700
LeafDrupal\search\Tests\SearchPreprocessLangcodeTest3900
LeafDrupal\search\Tests\SearchRankingTest5900
LeafDrupal\search\Tests\SearchSimplifyTest65700
LeafDrupal\search\Tests\SearchTokenizerTest800
LeafDrupal\serialization\Tests\EntitySerializationTest1700
LeafDrupal\serialization\Tests\SerializationTest200
LeafDrupal\shortcut\Tests\ShortcutLinksTest14800
LeafDrupal\shortcut\Tests\ShortcutSetsTest21600
LeafDrupal\simpletest\Tests\BrokenSetUpTest2100
LeafDrupal\simpletest\Tests\BrowserTest1600
LeafDrupal\simpletest\Tests\DrupalUnitTestBaseTest4000
LeafDrupal\simpletest\Tests\FolderTest200
LeafDrupal\simpletest\Tests\InstallationProfileModuleTestsTest1900
LeafDrupal\simpletest\Tests\MailCaptureTest1200
LeafDrupal\simpletest\Tests\MissingCheckedRequirementsTest1900
LeafDrupal\simpletest\Tests\OtherInstallationProfileModuleTestsTest1200
LeafDrupal\simpletest\Tests\SimpleTestTest11400
LeafDrupal\simpletest\Tests\UserHelpersTest4600
LeafDrupal\standard\Tests\StandardTest700
LeafDrupal\statistics\Tests\StatisticsAdminTest5800
LeafDrupal\statistics\Tests\StatisticsLoggingTest2100
LeafDrupal\statistics\Tests\StatisticsReportsTest1900
LeafDrupal\statistics\Tests\StatisticsTokenReplaceTest3000
LeafDrupal\statistics\Tests\Views\IntegrationTest1600
LeafDrupal\syslog\Tests\SyslogTest1700
LeafDrupal\system\Tests\Ajax\AjaxCommandsUnitTest1600
LeafDrupal\system\Tests\Ajax\CommandsTest7700
LeafDrupal\system\Tests\Ajax\DialogTest300
LeafDrupal\system\Tests\Ajax\ElementValidationTest700
LeafDrupal\system\Tests\Ajax\FormValuesTest2900
LeafDrupal\system\Tests\Ajax\FrameworkTest3400
ExpandDrupal\system\Tests\Ajax\MultiFormTest3160
MessageGroupFilenameLineFunctionStatus
Found the correct number of field items on the initial page.OtherMultiFormTest.php77Drupal\system\Tests\Ajax\MultiFormTest->testMultiForm()
Found the correct number of field items on the initial page.OtherMultiFormTest.php77Drupal\system\Tests\Ajax\MultiFormTest->testMultiForm()
Found the correct number of field items after an AJAX submission.OtherMultiFormTest.php87Drupal\system\Tests\Ajax\MultiFormTest->testMultiForm()
Found the correct number of field items after an AJAX submission.OtherMultiFormTest.php87Drupal\system\Tests\Ajax\MultiFormTest->testMultiForm()
Found the correct number of field items after an AJAX submission.OtherMultiFormTest.php87Drupal\system\Tests\Ajax\MultiFormTest->testMultiForm()
Found the correct number of field items after an AJAX submission.OtherMultiFormTest.php87Drupal\system\Tests\Ajax\MultiFormTest->testMultiForm()
LeafDrupal\system\Tests\Batch\PageTest1600
LeafDrupal\system\Tests\Batch\PercentagesUnitTest1800
LeafDrupal\system\Tests\Batch\ProcessingTest16100
LeafDrupal\system\Tests\Bootstrap\GetFilenameUnitTest600
LeafDrupal\system\Tests\Bootstrap\HookExitTest1900
LeafDrupal\system\Tests\Bootstrap\IpAddressTest1100
LeafDrupal\system\Tests\Bootstrap\MiscUnitTest400
LeafDrupal\system\Tests\Bootstrap\OverrideServerVariablesUnitTest600
LeafDrupal\system\Tests\Bootstrap\PageCacheTest7900
LeafDrupal\system\Tests\Bootstrap\ResettableStaticUnitTest500
LeafDrupal\system\Tests\Bootstrap\TimerUnitTest500
LeafDrupal\system\Tests\Bootstrap\VariableTest900
LeafDrupal\system\Tests\Bundle\BundleTest900
LeafDrupal\system\Tests\Cache\BackendChainImplementationUnitTest4800
LeafDrupal\system\Tests\Cache\BackendChainUnitTest12600
LeafDrupal\system\Tests\Cache\ClearTest900
LeafDrupal\system\Tests\Cache\DatabaseBackendUnitTest12600
LeafDrupal\system\Tests\Cache\MemoryBackendUnitTest12600
LeafDrupal\system\Tests\Cache\NullBackendTest200
LeafDrupal\system\Tests\Common\AddFeedTest700
LeafDrupal\system\Tests\Common\AlterTest700
LeafDrupal\system\Tests\Common\AttributesUnitTest700
LeafDrupal\system\Tests\Common\AutocompleteTagsUnitTest800
LeafDrupal\system\Tests\Common\CascadingStylesheetsTest3800
LeafDrupal\system\Tests\Common\CascadingStylesheetsUnitTest1200
LeafDrupal\system\Tests\Common\ColorTest8500
LeafDrupal\system\Tests\Common\FormatDateTest7300
LeafDrupal\system\Tests\Common\GotoTest2700
LeafDrupal\system\Tests\Common\HtmlIdentifierUnitTest1000
LeafDrupal\system\Tests\Common\HttpRequestTest3600
LeafDrupal\system\Tests\Common\InstallerLanguageTest800
LeafDrupal\system\Tests\Common\JavaScriptTest8900
LeafDrupal\system\Tests\Common\JsonUnitTest2100
LeafDrupal\system\Tests\Common\NestedArrayUnitTest1400
LeafDrupal\system\Tests\Common\ParseInfoFileUnitTest300
LeafDrupal\system\Tests\Common\RegionContentTest1800
LeafDrupal\system\Tests\Common\RenderTest5400
LeafDrupal\system\Tests\Common\SimpleTestErrorCollectorTest1600
LeafDrupal\system\Tests\Common\SizeUnitTest3500
LeafDrupal\system\Tests\Common\SystemListingTest600
LeafDrupal\system\Tests\Common\TableSortExtenderUnitTest600
LeafDrupal\system\Tests\Common\UrlTest7600
LeafDrupal\system\Tests\Common\ValidNumberStepUnitTest2400
LeafDrupal\system\Tests\Common\ValidUrlUnitTest7900
LeafDrupal\system\Tests\Common\WriteRecordTest3400
LeafDrupal\system\Tests\Common\XssUnitTest1700
LeafDrupal\system\Tests\Database\AlterTest2000
LeafDrupal\system\Tests\Database\BasicSyntaxTest600
LeafDrupal\system\Tests\Database\CaseSensitivityTest200
LeafDrupal\system\Tests\Database\ConnectionTest1400
LeafDrupal\system\Tests\Database\ConnectionUnitTest1200
LeafDrupal\system\Tests\Database\DatabaseExceptionWrapperTest100
LeafDrupal\system\Tests\Database\DeleteTruncateTest500
LeafDrupal\system\Tests\Database\EmptyStatementTest400
LeafDrupal\system\Tests\Database\FetchTest2400
LeafDrupal\system\Tests\Database\InsertDefaultsTest400
LeafDrupal\system\Tests\Database\InsertLobTest300
LeafDrupal\system\Tests\Database\InsertTest1500
LeafDrupal\system\Tests\Database\InvalidDataTest200
LeafDrupal\system\Tests\Database\LoggingTest1400
LeafDrupal\system\Tests\Database\MergeTest3500
LeafDrupal\system\Tests\Database\NextIdTest200
LeafDrupal\system\Tests\Database\QueryTest100
LeafDrupal\system\Tests\Database\RangeQueryTest200
LeafDrupal\system\Tests\Database\RegressionTest700
LeafDrupal\system\Tests\Database\SchemaTest78600
LeafDrupal\system\Tests\Database\SelectCloneTest200
LeafDrupal\system\Tests\Database\SelectComplexTest6900
LeafDrupal\system\Tests\Database\SelectOrderedTest1100
LeafDrupal\system\Tests\Database\SelectPagerDefaultTest2700
LeafDrupal\system\Tests\Database\SelectSubqueryTest1400
LeafDrupal\system\Tests\Database\SelectTableSortDefaultTest3100
LeafDrupal\system\Tests\Database\SelectTest10800
LeafDrupal\system\Tests\Database\SerializeQueryTest200
LeafDrupal\system\Tests\Database\TaggingTest1600
LeafDrupal\system\Tests\Database\TemporaryQueryTest600
LeafDrupal\system\Tests\Database\TransactionTest8800
LeafDrupal\system\Tests\Database\UpdateComplexTest1900
LeafDrupal\system\Tests\Database\UpdateLobTest300
LeafDrupal\system\Tests\Database\UpdateTest1500
LeafDrupal\system\Tests\Datetime\DateTimePlusTest5400
LeafDrupal\system\Tests\Datetime\DrupalDateTimeTest1400
LeafDrupal\system\Tests\DrupalKernel\ContentNegotiationTest4000
LeafDrupal\system\Tests\DrupalKernel\DrupalKernelTest800
LeafDrupal\system\Tests\Entity\ConfigEntityQueryTest11300
LeafDrupal\system\Tests\Entity\EntityAccessTest3400
LeafDrupal\system\Tests\Entity\EntityApiInfoTest600
LeafDrupal\system\Tests\Entity\EntityApiTest2600
LeafDrupal\system\Tests\Entity\EntityCrudHookTest15700
ExpandDrupal\system\Tests\Entity\EntityFieldTest68831
MessageGroupFilenameLineFunctionStatus
entity_test_mul: User id can be read.OtherEntityFieldTest.php287Drupal\system\Tests\Entity\EntityFieldTest->testSave()
Trying to get property of non-objectDrupal\system\Tests\Entity\EntityFieldTest->assertSave('entity_test_mul') Drupal\system\Tests\Entity\EntityFieldTest->testSave() Drupal\simpletest\TestBase->run() simpletest_script_run_one_test('184', 'Drupal\system\Tests\Entity\EntityFieldTest') NoticeEntityFieldTest.php311Drupal\system\Tests\Entity\EntityFieldTest->assertSave()
entity_test_mul: User name can be read.OtherEntityFieldTest.php287Drupal\system\Tests\Entity\EntityFieldTest->testSave()
Value 0 is equal to value 1.OtherEntityFieldTest.php529Drupal\system\Tests\Entity\EntityFieldTest->testEntityConstraintValidation()
ExpandDrupal\system\Tests\Entity\EntityFormTest7610
MessageGroupFilenameLineFunctionStatus
entity_test_mul: Entity not found in the database.OtherEntityFormTest.php44Drupal\system\Tests\Entity\EntityFormTest->testFormCRUD()
LeafDrupal\system\Tests\Entity\EntityQueryRelationshipTest2000
LeafDrupal\system\Tests\Entity\EntityQueryTest6200
LeafDrupal\system\Tests\Entity\EntityRevisionsTest5300
LeafDrupal\system\Tests\Entity\EntityTranslationFormTest3600
ExpandDrupal\system\Tests\Entity\EntityTranslationTest126120
MessageGroupFilenameLineFunctionStatus
entity_test_mul: The entity author has been correctly stored as language neutral.OtherEntityTranslationTest.php196Drupal\system\Tests\Entity\EntityTranslationTest->testMultilingualProperties()
entity_test_mul: The entity author defaults to neutral language.OtherEntityTranslationTest.php196Drupal\system\Tests\Entity\EntityTranslationTest->testMultilingualProperties()
entity_test_mul: The entity author can be retrieved without specifying a language.OtherEntityTranslationTest.php196Drupal\system\Tests\Entity\EntityTranslationTest->testMultilingualProperties()
entity_test_mul: The entity author has been correctly stored as a language-aware property.OtherEntityTranslationTest.php196Drupal\system\Tests\Entity\EntityTranslationTest->testMultilingualProperties()
entity_test_mul: The entity author defaults to the default language.OtherEntityTranslationTest.php196Drupal\system\Tests\Entity\EntityTranslationTest->testMultilingualProperties()
entity_test_mul: The entity author can be retrieved without specifying a language.OtherEntityTranslationTest.php196Drupal\system\Tests\Entity\EntityTranslationTest->testMultilingualProperties()
entity_test_mul: The entity author has been correctly stored for language l0.OtherEntityTranslationTest.php196Drupal\system\Tests\Entity\EntityTranslationTest->testMultilingualProperties()
entity_test_mul: The entity author has been correctly stored for language l1.OtherEntityTranslationTest.php196Drupal\system\Tests\Entity\EntityTranslationTest->testMultilingualProperties()
entity_test_mul: The entity author has been correctly stored for language l2.OtherEntityTranslationTest.php196Drupal\system\Tests\Entity\EntityTranslationTest->testMultilingualProperties()
entity_test_mul: One entity loaded by name, uid and field value using different language meta conditions.OtherEntityTranslationTest.php196Drupal\system\Tests\Entity\EntityTranslationTest->testMultilingualProperties()
entity_test_mulrev: The entity author has been correctly stored for language l1.OtherEntityTranslationTest.php196Drupal\system\Tests\Entity\EntityTranslationTest->testMultilingualProperties()
entity_test_mulrev: The entity author has been correctly stored for language l2.OtherEntityTranslationTest.php196Drupal\system\Tests\Entity\EntityTranslationTest->testMultilingualProperties()
LeafDrupal\system\Tests\Entity\EntityUriTest100
ExpandDrupal\system\Tests\Entity\EntityUUIDTest7520
MessageGroupFilenameLineFunctionStatus
Value array ( 0 => NULL, ) is equal to value array ( 0 => array ( 'value' => '2', ), ).OtherEntityUUIDTest.php39Drupal\system\Tests\Entity\EntityUUIDTest->testCRUD()
Value array ( 0 => NULL, ) is equal to value array ( 0 => array ( 'value' => '2', ), ).OtherEntityUUIDTest.php39Drupal\system\Tests\Entity\EntityUUIDTest->testCRUD()
LeafDrupal\system\Tests\FileTransfer\FileTransferTest200
LeafDrupal\system\Tests\File\DirectoryTest2700
LeafDrupal\system\Tests\File\MimeTypeTest4200
LeafDrupal\system\Tests\File\NameMungingTest600
LeafDrupal\system\Tests\File\ReadOnlyStreamWrapperTest1600
LeafDrupal\system\Tests\File\RemoteFileDirectoryTest3200
LeafDrupal\system\Tests\File\RemoteFileScanDirectoryTest2900
LeafDrupal\system\Tests\File\RemoteFileUnmanagedCopyTest3200
LeafDrupal\system\Tests\File\RemoteFileUnmanagedDeleteRecursiveTest2100
LeafDrupal\system\Tests\File\RemoteFileUnmanagedDeleteTest1000
LeafDrupal\system\Tests\File\RemoteFileUnmanagedMoveTest2300
LeafDrupal\system\Tests\File\RemoteFileUnmanagedSaveDataTest800
LeafDrupal\system\Tests\File\ScanDirectoryTest2900
LeafDrupal\system\Tests\File\StreamWrapperTest1900
LeafDrupal\system\Tests\File\UnmanagedCopyTest2900
LeafDrupal\system\Tests\File\UnmanagedDeleteRecursiveTest1700
LeafDrupal\system\Tests\File\UnmanagedDeleteTest700
LeafDrupal\system\Tests\File\UnmanagedMoveTest2000
LeafDrupal\system\Tests\File\UnmanagedSaveDataTest700
LeafDrupal\system\Tests\File\UrlRewritingTest1400
LeafDrupal\system\Tests\Form\AlterTest400
LeafDrupal\system\Tests\Form\ArbitraryRebuildTest1600
LeafDrupal\system\Tests\Form\CallbackBuilderTest500
LeafDrupal\system\Tests\Form\CheckboxTest9700
LeafDrupal\system\Tests\Form\ElementsLabelsTest2000
LeafDrupal\system\Tests\Form\ElementsTableSelectTest9400
LeafDrupal\system\Tests\Form\ElementsVerticalTabsTest3900
LeafDrupal\system\Tests\Form\ElementTest7700
LeafDrupal\system\Tests\Form\EmailTest1700
LeafDrupal\system\Tests\Form\FileInclusionTest1100
LeafDrupal\system\Tests\Form\FormTest68600
LeafDrupal\system\Tests\Form\HTMLIdTest700
LeafDrupal\system\Tests\Form\LanguageSelectElementTest7900
LeafDrupal\system\Tests\Form\ProgrammaticTest3200
ExpandDrupal\system\Tests\Form\RebuildTest10240
MessageGroupFilenameLineFunctionStatus
AJAX submission succeeded.OtherRebuildTest.php96Drupal\system\Tests\Form\RebuildTest->testPreserveFormActionAfterAJAX()
Form retained its state from cache.OtherRebuildTest.php108Drupal\system\Tests\Form\RebuildTest->testPreserveFormActionAfterAJAX()
AJAX submission succeeded.OtherRebuildTest.php96Drupal\system\Tests\Form\RebuildTest->testPreserveFormActionAfterAJAX()
Form retained its state from cache.OtherRebuildTest.php108Drupal\system\Tests\Form\RebuildTest->testPreserveFormActionAfterAJAX()
LeafDrupal\system\Tests\Form\RedirectTest6200
LeafDrupal\system\Tests\Form\StateValuesCleanAdvancedTest1400
LeafDrupal\system\Tests\Form\StateValuesCleanTest2800
LeafDrupal\system\Tests\Form\StorageTest14600
LeafDrupal\system\Tests\Form\TriggeringElementTest9400
LeafDrupal\system\Tests\Form\UrlTest3400
LeafDrupal\system\Tests\Form\ValidationTest13100
LeafDrupal\system\Tests\Form\WrapperTest1000
LeafDrupal\system\Tests\Graph\GraphUnitTest2800
LeafDrupal\system\Tests\Image\FileMoveTest400
LeafDrupal\system\Tests\Image\ToolkitGdTest20400
LeafDrupal\system\Tests\Image\ToolkitTest5300
LeafDrupal\system\Tests\KeyValueStore\DatabaseStorageExpirableTest6800
LeafDrupal\system\Tests\KeyValueStore\DatabaseStorageTest3600
LeafDrupal\system\Tests\KeyValueStore\GarbageCollectionTest200
LeafDrupal\system\Tests\KeyValueStore\MemoryStorageTest3600
LeafDrupal\system\Tests\Lock\LockFunctionalTest1800
LeafDrupal\system\Tests\Lock\LockUnitTest900
LeafDrupal\system\Tests\Mail\HtmlToTextTest8600
LeafDrupal\system\Tests\Mail\MailTest700
LeafDrupal\system\Tests\Mail\WrapMailUnitTest200
ExpandDrupal\system\Tests\Menu\BreadcrumbTest13701
MessageGroupFilenameLineFunctionStatus
Drupal\Core\Entity\EntityStorageException: SQLSTATE[23000]: Integrity constraint violation: 1048 Column 'tid' cannot be null: INSERT INTO {taxonomy_index} (nid, tid, sticky, created) VALUES (:db_insert_placeholder_0, :db_insert_placeholder_1, :db_insert_placeholder_2, :db_insert_placeholder_3); Array ( [:db_insert_placeholder_0] => 2 [:db_insert_placeholder_1] => [:db_insert_placeholder_2] => 0 [:db_insert_placeholder_3] => 1360703967 ) in Drupal\Core\Entity\DatabaseStorageControllerNG->save() (line 334 of /var/lib/drupaltestbot/sites/default/files/checkout/core/lib/Drupal/Core/Entity/DatabaseStorageControllerNG.php). Drupal\Core\Entity\DatabaseStorageControllerNG->save(Object) Drupal\Core\Entity\Entity->save() Drupal\Core\Entity\EntityBCDecorator->save() Drupal\simpletest\WebTestBase->drupalCreateNode(Array) Drupal\system\Tests\Menu\BreadcrumbTest->testBreadCrumbs() Drupal\simpletest\TestBase->run() simpletest_script_run_one_test('372', 'Drupal\system\Tests\Menu\BreadcrumbTest') Uncaught exceptionDatabaseStorageControllerNG.php334Drupal\Core\Entity\DatabaseStorageControllerNG->save()
LeafDrupal\system\Tests\Menu\LinksTest5000
LeafDrupal\system\Tests\Menu\MenuRouterTest25400
LeafDrupal\system\Tests\Menu\RebuildTest500
LeafDrupal\system\Tests\Menu\TrailTest6800
LeafDrupal\system\Tests\Menu\TreeDataUnitTest400
LeafDrupal\system\Tests\Menu\TreeOutputTest700
LeafDrupal\system\Tests\Module\ClassLoaderTest1000
LeafDrupal\system\Tests\Module\DependencyTest16000
LeafDrupal\system\Tests\Module\EnableDisableTest229100
LeafDrupal\system\Tests\Module\HookRequirementsTest1600
LeafDrupal\system\Tests\Module\InstallTest300
LeafDrupal\system\Tests\Module\ModuleApiTest6600
LeafDrupal\system\Tests\Module\ModuleEnable300
LeafDrupal\system\Tests\Module\RequiredTest2000
LeafDrupal\system\Tests\Module\UninstallTest200
LeafDrupal\system\Tests\Module\VersionTest5100
LeafDrupal\system\Tests\Pager\PagerTest12300
LeafDrupal\system\Tests\ParamConverter\UpcastingTest1700
LeafDrupal\system\Tests\Path\AliasTest2700
LeafDrupal\system\Tests\Path\MatchPathTest4100
LeafDrupal\system\Tests\Path\UrlAlterFunctionalTest3700
LeafDrupal\system\Tests\PhpStorage\FileStorageTest1200
LeafDrupal\system\Tests\PhpStorage\MTimeProtectedFastFileStorageTest1900
LeafDrupal\system\Tests\PhpStorage\MTimeProtectedFileStorageTest1900
LeafDrupal\system\Tests\Plugin\AlterDecoratorTest300
LeafDrupal\system\Tests\Plugin\CacheDecoratorLanguageTest3800
LeafDrupal\system\Tests\Plugin\CacheDecoratorTest1400
LeafDrupal\system\Tests\Plugin\DerivativeTest900
LeafDrupal\system\Tests\Plugin\Discovery\AnnotatedClassDiscoveryTest700
LeafDrupal\system\Tests\Plugin\Discovery\StaticDiscoveryTest600
LeafDrupal\system\Tests\Plugin\FactoryTest900
LeafDrupal\system\Tests\Plugin\InspectionTest1000
LeafDrupal\system\Tests\Plugin\PluginBagTest1900
LeafDrupal\system\Tests\Queue\QueueTest1400
LeafDrupal\system\Tests\Routing\ControllerResolverTest100
LeafDrupal\system\Tests\Routing\MatcherDumperTest800
LeafDrupal\system\Tests\Routing\MimeTypeMatcherTest1000
LeafDrupal\system\Tests\Routing\RouteProviderTest3700
LeafDrupal\system\Tests\Routing\RouterPermissionTest2300
LeafDrupal\system\Tests\Routing\RouterTest3000
LeafDrupal\system\Tests\Routing\RouteTest600
LeafDrupal\system\Tests\Routing\UrlGeneratorTest200
LeafDrupal\system\Tests\Session\SessionHttpsTest8300
LeafDrupal\system\Tests\Session\SessionTest18700
LeafDrupal\system\Tests\System\AccessDeniedTest6400
LeafDrupal\system\Tests\System\AdminMetaTagTest300
LeafDrupal\system\Tests\System\AdminTest18100
LeafDrupal\system\Tests\System\CronRunTest5200
LeafDrupal\system\Tests\System\DateFormatsLanguageTest5600
LeafDrupal\system\Tests\System\DateTimeTest8800
LeafDrupal\system\Tests\System\DefaultMobileMetaTagsTest1200
LeafDrupal\system\Tests\System\ErrorHandlerTest4000
LeafDrupal\system\Tests\System\ExceptionControllerTest200
LeafDrupal\system\Tests\System\FloodTest1000
LeafDrupal\system\Tests\System\FrontPageTest3700
LeafDrupal\system\Tests\System\IndexPhpTest600
LeafDrupal\system\Tests\System\InfoAlterTest1000
LeafDrupal\system\Tests\System\InfoFileParserUnitTest900
LeafDrupal\system\Tests\System\MainContentFallbackTest6000
LeafDrupal\system\Tests\System\PageNotFoundTest1800
LeafDrupal\system\Tests\System\PageTitleFilteringTest4400
LeafDrupal\system\Tests\System\PasswordHashingTest1000
LeafDrupal\system\Tests\System\RetrieveFileTest700
LeafDrupal\system\Tests\System\ShutdownFunctionsTest500
LeafDrupal\system\Tests\System\SiteMaintenanceTest7700
LeafDrupal\system\Tests\System\SystemAuthorizeTest1600
LeafDrupal\system\Tests\System\ThemeTest21400
LeafDrupal\system\Tests\System\TokenReplaceTest3600
LeafDrupal\system\Tests\System\TokenScanTest400
LeafDrupal\system\Tests\System\UnicodeUnitTest18200
LeafDrupal\system\Tests\Theme\EntityFilteringThemeTest5600
LeafDrupal\system\Tests\Theme\FastTest1200
LeafDrupal\system\Tests\Theme\FunctionsTest2600
LeafDrupal\system\Tests\Theme\HookInitTest500
LeafDrupal\system\Tests\Theme\HtmlTagUnitTest200
LeafDrupal\system\Tests\Theme\HtmlTplPhpAttributesTest500
LeafDrupal\system\Tests\Theme\RegistryTest600
LeafDrupal\system\Tests\Theme\TableTest600
LeafDrupal\system\Tests\Theme\ThemeInfoStylesTest1300
LeafDrupal\system\Tests\Theme\ThemeTest4800
LeafDrupal\system\Tests\Theme\ThemeTestTwig1000
LeafDrupal\system\Tests\Theme\TwigReferenceUnitTest1500
LeafDrupal\system\Tests\Transliteration\TransliterationTest3000
LeafDrupal\system\Tests\TypedData\TypedDataTest13000
LeafDrupal\system\Tests\Update\DependencyHookInvocationTest400
LeafDrupal\system\Tests\Update\DependencyMissingTest400
LeafDrupal\system\Tests\Update\DependencyOrderingTest500
LeafDrupal\system\Tests\Update\UpdateScriptTest20100
LeafDrupal\system\Tests\Upgrade\BareMinimalUpgradePathTest6700
LeafDrupal\system\Tests\Upgrade\BareStandardUpgradePathTest7100
LeafDrupal\system\Tests\Upgrade\BlockUpgradePathTest3300
LeafDrupal\system\Tests\Upgrade\DateUpgradePathTest4600
LeafDrupal\system\Tests\Upgrade\FieldUIUpgradePathTest5700
LeafDrupal\system\Tests\Upgrade\FieldUpgradePathTest4200
LeafDrupal\system\Tests\Upgrade\FilledMinimalUpgradePathTest6500
LeafDrupal\system\Tests\Upgrade\FilledStandardUpgradePathTest8500
LeafDrupal\system\Tests\Upgrade\FilterFormatUpgradePathTest4400
LeafDrupal\system\Tests\Upgrade\ImageUpgradePathTest3300
LeafDrupal\system\Tests\Upgrade\LanguageUpgradePathTest16600
LeafDrupal\system\Tests\Upgrade\ModulesDisabledUpgradePathTest3300
LeafDrupal\system\Tests\Upgrade\ShortcutUpgradePathTest3900
LeafDrupal\system\Tests\Upgrade\StateSystemUpgradePathTest5100
LeafDrupal\system\Tests\Upgrade\SystemUpgradePathTest9200
LeafDrupal\system\Tests\Upgrade\UserPictureUpgradePathTest4800
LeafDrupal\system\Tests\Upgrade\UserRoleUpgradePathTest8000
LeafDrupal\system\Tests\Upgrade\UuidUpgradePathTest3600
LeafDrupal\system\Tests\Uuid\UuidUnitTest700
LeafDrupal\taxonomy\Tests\EfqTest1400
LeafDrupal\taxonomy\Tests\HooksTest2300
LeafDrupal\taxonomy\Tests\LegacyTest1400
LeafDrupal\taxonomy\Tests\LoadMultipleTest1800
LeafDrupal\taxonomy\Tests\RssTest2600
LeafDrupal\taxonomy\Tests\TaxonomyTermReferenceItemTest900
LeafDrupal\taxonomy\Tests\TermFieldMultipleVocabularyTest2600
LeafDrupal\taxonomy\Tests\TermFieldTest5700
ExpandDrupal\taxonomy\Tests\TermIndexTest4420
MessageGroupFilenameLineFunctionStatus
Term 2 is indexed once.OtherTermIndexTest.php169Drupal\taxonomy\Tests\TermIndexTest->testTaxonomyIndex()
Term 2 is indexed.OtherTermIndexTest.php185Drupal\taxonomy\Tests\TermIndexTest->testTaxonomyIndex()
LeafDrupal\taxonomy\Tests\TermLanguageTest6900
ExpandDrupal\taxonomy\Tests\TermTest300123
MessageGroupFilenameLineFunctionStatus
Term is displayed when previewing the node.OtherTermTest.php134Drupal\taxonomy\Tests\TermTest->testTaxonomyNode()
Invalid argument supplied for foreach()Drupal\simpletest\WebTestBase->drupalPost(NULL, NULL, 'Preview') Drupal\taxonomy\Tests\TermTest->testTaxonomyNode() Drupal\simpletest\TestBase->run() simpletest_script_run_one_test('563', 'Drupal\taxonomy\Tests\TermTest') WarningWebTestBase.php1314Drupal\simpletest\WebTestBase->drupalPost()
Found the Preview buttonOtherTermTest.php135Drupal\taxonomy\Tests\TermTest->testTaxonomyNode()
Found the requested form fields at OtherTermTest.php135Drupal\taxonomy\Tests\TermTest->testTaxonomyNode()
Term is displayed when previewing the node again.OtherTermTest.php136Drupal\taxonomy\Tests\TermTest->testTaxonomyNode()
Term is displayed when previewing the node.OtherTermTest.php134Drupal\taxonomy\Tests\TermTest->testTaxonomyNode()
Invalid argument supplied for foreach()Drupal\simpletest\WebTestBase->drupalPost(NULL, NULL, 'Preview') Drupal\taxonomy\Tests\TermTest->testTaxonomyNode() Drupal\simpletest\TestBase->run() simpletest_script_run_one_test('563', 'Drupal\taxonomy\Tests\TermTest') WarningWebTestBase.php1314Drupal\simpletest\WebTestBase->drupalPost()
Found the Preview buttonOtherTermTest.php135Drupal\taxonomy\Tests\TermTest->testTaxonomyNode()
Found the requested form fields at OtherTermTest.php135Drupal\taxonomy\Tests\TermTest->testTaxonomyNode()
Term is displayed when previewing the node again.OtherTermTest.php136Drupal\taxonomy\Tests\TermTest->testTaxonomyNode()
array_flip(): Can only flip STRING and INTEGER values!WarningDatabaseStorageController.php182Drupal\Core\Entity\DatabaseStorageController->load()
The term appears on the node previewOtherTermTest.php174Drupal\taxonomy\Tests\TermTest->testNodeTermCreationAndDeletion()
The term appears on the node previewOtherTermTest.php174Drupal\taxonomy\Tests\TermTest->testNodeTermCreationAndDeletion()
The term appears on the node previewOtherTermTest.php174Drupal\taxonomy\Tests\TermTest->testNodeTermCreationAndDeletion()
The term appears on the node previewOtherTermTest.php174Drupal\taxonomy\Tests\TermTest->testNodeTermCreationAndDeletion()
LeafDrupal\taxonomy\Tests\TermTranslationUITest20800
LeafDrupal\taxonomy\Tests\TermUnitTest2000
LeafDrupal\taxonomy\Tests\ThemeTest3700
ExpandDrupal\taxonomy\Tests\TokenReplaceTest2802
MessageGroupFilenameLineFunctionStatus
Drupal\Core\Entity\EntityStorageException: SQLSTATE[23000]: Integrity constraint violation: 1048 Column 'tid' cannot be null: INSERT INTO {taxonomy_index} (nid, tid, sticky, created) VALUES (:db_insert_placeholder_0, :db_insert_placeholder_1, :db_insert_placeholder_2, :db_insert_placeholder_3); Array ( [:db_insert_placeholder_0] => 1 [:db_insert_placeholder_1] => [:db_insert_placeholder_2] => 0 [:db_insert_placeholder_3] => 1360705033 ) in Drupal\Core\Entity\DatabaseStorageControllerNG->save() (line 334 of /var/lib/drupaltestbot/sites/default/files/checkout/core/lib/Drupal/Core/Entity/DatabaseStorageControllerNG.php). Drupal\Core\Entity\DatabaseStorageControllerNG->save(Object) Drupal\Core\Entity\Entity->save() Drupal\Core\Entity\EntityBCDecorator->save() Drupal\simpletest\WebTestBase->drupalCreateNode(Array) Drupal\taxonomy\Tests\TokenReplaceTest->testTaxonomyTokenReplacement() Drupal\simpletest\TestBase->run() simpletest_script_run_one_test('567', 'Drupal\taxonomy\Tests\TokenReplaceTest') Uncaught exceptionDatabaseStorageControllerNG.php334Drupal\Core\Entity\DatabaseStorageControllerNG->save()
Drupal\Core\Entity\EntityStorageException: SQLSTATE[23000]: Integrity constraint violation: 1048 Column 'tid' cannot be null: INSERT INTO {taxonomy_index} (nid, tid, sticky, created) VALUES (:db_insert_placeholder_0, :db_insert_placeholder_1, :db_insert_placeholder_2, :db_insert_placeholder_3); Array ( [:db_insert_placeholder_0] => 1 [:db_insert_placeholder_1] => [:db_insert_placeholder_2] => 0 [:db_insert_placeholder_3] => 1360705033 ) in Drupal\Core\Entity\DatabaseStorageControllerNG->save() (line 334 of /var/lib/drupaltestbot/sites/default/files/checkout/core/lib/Drupal/Core/Entity/DatabaseStorageControllerNG.php). Drupal\Core\Entity\DatabaseStorageControllerNG->save(Object) Drupal\Core\Entity\Entity->save() Drupal\Core\Entity\EntityBCDecorator->save() Drupal\simpletest\WebTestBase->drupalCreateNode(Array) Drupal\taxonomy\Tests\TokenReplaceTest->testTaxonomyTokenReplacement() Drupal\simpletest\TestBase->run() simpletest_script_run_one_test('567', 'Drupal\taxonomy\Tests\TokenReplaceTest') Uncaught exceptionDatabaseStorageControllerNG.php334Drupal\Core\Entity\DatabaseStorageControllerNG->save()
ExpandDrupal\taxonomy\Tests\Views\RelationshipNodeTermDataTest200
MessageGroupFilenameLineFunctionStatus
'Missing handler: nid nid sort'Debugviews.module926views_get_handler()
LeafDrupal\taxonomy\Tests\Views\RelationshipRepresentativeNode200
LeafDrupal\taxonomy\Tests\VocabularyLanguageTest8300
LeafDrupal\taxonomy\Tests\VocabularyTest15500
LeafDrupal\taxonomy\Tests\VocabularyUnitTest8100
LeafDrupal\telephone\Tests\TelephoneFieldTest2000
LeafDrupal\telephone\Tests\TelephoneItemTest600
LeafDrupal\text\Tests\TextFieldTest18600
LeafDrupal\text\Tests\TextSummaryTest13800
LeafDrupal\text\Tests\TextTranslationTest10400
LeafDrupal\toolbar\Tests\ToolbarHookToolbarTest1500
LeafDrupal\toolbar\Tests\ToolbarMenuTranslationTest3800
LeafDrupal\tracker\Tests\TrackerNodeAccessTest2800
LeafDrupal\tracker\Tests\TrackerTest22800
ExpandDrupal\translation\Tests\TranslationTest7887
MessageGroupFilenameLineFunctionStatus
The test did not complete due to a fatal error.Completion checkTranslationTest.php70Drupal\translation\Tests\TranslationTest->testContentTranslation()
Basic page created.OtherTranslationTest.php353Drupal\translation\Tests\TranslationTest->createPage()
Node found in database.OtherTranslationTest.php357Drupal\translation\Tests\TranslationTest->createPage()
Trying to get property of non-objectDrupal\translation\Tests\TranslationTest->testContentTranslation() Drupal\simpletest\TestBase->run() simpletest_script_run_one_test('591', 'Drupal\translation\Tests\TranslationTest') NoticeTranslationTest.php78Drupal\translation\Tests\TranslationTest->testContentTranslation()
Found the Save and unpublish buttonOtherTranslationTest.php78Drupal\translation\Tests\TranslationTest->testContentTranslation()
Found the requested form fields at node//editOtherTranslationTest.php78Drupal\translation\Tests\TranslationTest->testContentTranslation()
Trying to get property of non-objectDrupal\translation\Tests\TranslationTest->testContentTranslation() Drupal\simpletest\TestBase->run() simpletest_script_run_one_test('591', 'Drupal\translation\Tests\TranslationTest') NoticeTranslationTest.php79Drupal\translation\Tests\TranslationTest->testContentTranslation()
Trying to get property of non-objectDrupal\translation\Tests\TranslationTest->testContentTranslation() Drupal\simpletest\TestBase->run() simpletest_script_run_one_test('591', 'Drupal\translation\Tests\TranslationTest') NoticeTranslationTest.php80Drupal\translation\Tests\TranslationTest->testContentTranslation()
Found the Save and publish buttonOtherTranslationTest.php80Drupal\translation\Tests\TranslationTest->testContentTranslation()
Found the requested form fields at node//editOtherTranslationTest.php80Drupal\translation\Tests\TranslationTest->testContentTranslation()
Trying to get property of non-objectDrupal\translation\Tests\TranslationTest->testContentTranslation() Drupal\simpletest\TestBase->run() simpletest_script_run_one_test('591', 'Drupal\translation\Tests\TranslationTest') NoticeTranslationTest.php86Drupal\translation\Tests\TranslationTest->testContentTranslation()
Trying to get property of non-objectDrupal\translation\Tests\TranslationTest->testContentTranslation() Drupal\simpletest\TestBase->run() simpletest_script_run_one_test('591', 'Drupal\translation\Tests\TranslationTest') NoticeTranslationTest.php87Drupal\translation\Tests\TranslationTest->testContentTranslation()
The "add translation" link for Spanish points to the localized path of the target language.OtherTranslationTest.php87Drupal\translation\Tests\TranslationTest->testContentTranslation()
Argument 1 passed to Drupal\translation\Tests\TranslationTest::createTranslation() must implement interface Drupal\Core\Entity\EntityInterface, boolean given, called in /var/lib/drupaltestbot/sites/default/files/checkout/core/modules/translation/lib/Drupal/translation/Tests/TranslationTest.php on line 92 and definedDrupal\translation\Tests\TranslationTest->createTranslation(, 'qHyUkIzh', 'hVHrhCmO', 'es') Drupal\translation\Tests\TranslationTest->testContentTranslation() Drupal\simpletest\TestBase->run() simpletest_script_run_one_test('591', 'Drupal\translation\Tests\TranslationTest') Recoverable errorTranslationTest.php377Drupal\translation\Tests\TranslationTest->createTranslation()
Trying to get property of non-objectDrupal\translation\Tests\TranslationTest->createTranslation(, 'qHyUkIzh', 'hVHrhCmO', 'es') Drupal\translation\Tests\TranslationTest->testContentTranslation() Drupal\simpletest\TestBase->run() simpletest_script_run_one_test('591', 'Drupal\translation\Tests\TranslationTest') NoticeTranslationTest.php378Drupal\translation\Tests\TranslationTest->createTranslation()
LeafDrupal\translation_entity\Tests\ConfigTestTranslationUITest1700
ExpandDrupal\translation_entity\Tests\EntityTestTranslationUITest95230
MessageGroupFilenameLineFunctionStatus
user_id correctly stored in the default language.OtherEntityTranslationUITest.php37Drupal\translation_entity\Tests\EntityTranslationUITest->testTranslationUI()
Source language correctly switched.OtherEntityTranslationUITest.php37Drupal\translation_entity\Tests\EntityTranslationUITest->testTranslationUI()
user_id correctly stored with language en.OtherEntityTranslationUITest.php37Drupal\translation_entity\Tests\EntityTranslationUITest->testTranslationUI()
user_id correctly stored with language it.OtherEntityTranslationUITest.php37Drupal\translation_entity\Tests\EntityTranslationUITest->testTranslationUI()
user_id correctly stored with language fr.OtherEntityTranslationUITest.php37Drupal\translation_entity\Tests\EntityTranslationUITest->testTranslationUI()
The retranslate flag is now shown.OtherEntityTranslationUITest.php38Drupal\translation_entity\Tests\EntityTranslationUITest->testTranslationUI()
The "outdated" status has been correctly stored.OtherEntityTranslationUITest.php38Drupal\translation_entity\Tests\EntityTranslationUITest->testTranslationUI()
The retranslate flag is now shown.OtherEntityTranslationUITest.php38Drupal\translation_entity\Tests\EntityTranslationUITest->testTranslationUI()
The "outdated" status has been correctly stored.OtherEntityTranslationUITest.php38Drupal\translation_entity\Tests\EntityTranslationUITest->testTranslationUI()
The translation has been correctly unpublished.OtherEntityTranslationUITest.php39Drupal\translation_entity\Tests\EntityTranslationUITest->testTranslationUI()
The translation has been correctly unpublished.OtherEntityTranslationUITest.php39Drupal\translation_entity\Tests\EntityTranslationUITest->testTranslationUI()
The last translation is published and cannot be unpublished.OtherEntityTranslationUITest.php39Drupal\translation_entity\Tests\EntityTranslationUITest->testTranslationUI()
Value false is equal to value 'Translation author correctly stored.'.OtherEntityTranslationUITest.php40Drupal\translation_entity\Tests\EntityTranslationUITest->testTranslationUI()
Value false is equal to value 'Translation date correctly stored.'.OtherEntityTranslationUITest.php40Drupal\translation_entity\Tests\EntityTranslationUITest->testTranslationUI()
Value false is equal to value 'Translation author correctly stored.'.OtherEntityTranslationUITest.php40Drupal\translation_entity\Tests\EntityTranslationUITest->testTranslationUI()
Value false is equal to value 'Translation date correctly stored.'.OtherEntityTranslationUITest.php40Drupal\translation_entity\Tests\EntityTranslationUITest->testTranslationUI()
Value false is equal to value 'Translation author correctly stored.'.OtherEntityTranslationUITest.php40Drupal\translation_entity\Tests\EntityTranslationUITest->testTranslationUI()
Value false is equal to value 'Translation date correctly stored.'.OtherEntityTranslationUITest.php40Drupal\translation_entity\Tests\EntityTranslationUITest->testTranslationUI()
Value false is equal to value 'Translation author correctly kept.'.OtherEntityTranslationUITest.php40Drupal\translation_entity\Tests\EntityTranslationUITest->testTranslationUI()
Value false is equal to value 'Translation date correctly kept.'.OtherEntityTranslationUITest.php40Drupal\translation_entity\Tests\EntityTranslationUITest->testTranslationUI()
Found the Delete buttonOtherEntityTranslationUITest.php41Drupal\translation_entity\Tests\EntityTranslationUITest->testTranslationUI()
Found the requested form fields at OtherEntityTranslationUITest.php41Drupal\translation_entity\Tests\EntityTranslationUITest->testTranslationUI()
Translation successfully deleted.OtherEntityTranslationUITest.php41Drupal\translation_entity\Tests\EntityTranslationUITest->testTranslationUI()
LeafDrupal\translation_entity\Tests\EntityTranslationSettingsTest4900
ExpandDrupal\translation_entity\Tests\EntityTranslationWorkflowsTest15182
MessageGroupFilenameLineFunctionStatus
The translation overview points to the translation form when creating translations.OtherEntityTranslationWorkflowsTest.php82Drupal\translation_entity\Tests\EntityTranslationWorkflowsTest->testWorkflows()
Undefined variable: url_targetDrupal\simpletest\WebTestBase->clickLink('edit', 0) Drupal\translation_entity\Tests\EntityTranslationWorkflowsTest->assertWorkflows(Object, Array) Drupal\translation_entity\Tests\EntityTranslationWorkflowsTest->testWorkflows() Drupal\simpletest\TestBase->run() simpletest_script_run_one_test('202', 'Drupal\translation_entity\Tests\EntityTranslationWorkflowsTest') NoticeWebTestBase.php1936Drupal\simpletest\WebTestBase->clickLink()
Clicked link edit () from http://drupaltestbot-staging-mysql/checkout/fr/entity_test_mul/manage/1/translationsBrowserEntityTranslationWorkflowsTest.php82Drupal\translation_entity\Tests\EntityTranslationWorkflowsTest->testWorkflows()
The translation overview points to the translation form for translators when editing translations.OtherEntityTranslationWorkflowsTest.php82Drupal\translation_entity\Tests\EntityTranslationWorkflowsTest->testWorkflows()
The translation overview points to the translation form when creating translations.OtherEntityTranslationWorkflowsTest.php86Drupal\translation_entity\Tests\EntityTranslationWorkflowsTest->testWorkflows()
Undefined variable: url_targetDrupal\simpletest\WebTestBase->clickLink('edit', 1) Drupal\translation_entity\Tests\EntityTranslationWorkflowsTest->assertWorkflows(Object, Array) Drupal\translation_entity\Tests\EntityTranslationWorkflowsTest->testWorkflows() Drupal\simpletest\TestBase->run() simpletest_script_run_one_test('202', 'Drupal\translation_entity\Tests\EntityTranslationWorkflowsTest') NoticeWebTestBase.php1936Drupal\simpletest\WebTestBase->clickLink()
Clicked link edit () from http://drupaltestbot-staging-mysql/checkout/fr/entity_test_mul/manage/1/translationsBrowserEntityTranslationWorkflowsTest.php86Drupal\translation_entity\Tests\EntityTranslationWorkflowsTest->testWorkflows()
The translation overview points to the edit form for editors when editing translations.OtherEntityTranslationWorkflowsTest.php86Drupal\translation_entity\Tests\EntityTranslationWorkflowsTest->testWorkflows()
edit link found.OtherEntityTranslationWorkflowsTest.php101Drupal\translation_entity\Tests\EntityTranslationWorkflowsTest->testWorkflows()
delete link found.OtherEntityTranslationWorkflowsTest.php101Drupal\translation_entity\Tests\EntityTranslationWorkflowsTest->testWorkflows()
LeafDrupal\translation_entity\Tests\Views\TranslationLinkTest1700
LeafDrupal\update\Tests\UpdateContribTest18700
LeafDrupal\update\Tests\UpdateCoreTest22600
LeafDrupal\update\Tests\UpdateCoreUnitTest400
LeafDrupal\update\Tests\UpdateUploadTest6400
LeafDrupal\user\Tests\TempStoreDatabaseTest3800
LeafDrupal\user\Tests\UserAccountLinksTests6100
LeafDrupal\user\Tests\UserAdminSettingsFormTest400
LeafDrupal\user\Tests\UserAdminTest6100
LeafDrupal\user\Tests\UserAutocompleteTest2900
LeafDrupal\user\Tests\UserBlocksTests6600
LeafDrupal\user\Tests\UserCancelTest25400
LeafDrupal\user\Tests\UserCreateTest3300
LeafDrupal\user\Tests\UserDeleteTest1500
LeafDrupal\user\Tests\UserEditedOwnAccountTest2200
LeafDrupal\user\Tests\UserEditTest7300
LeafDrupal\user\Tests\UserEntityCallbacksTest700
LeafDrupal\user\Tests\UserLanguageCreationTest6800
LeafDrupal\user\Tests\UserLanguageTest3900
LeafDrupal\user\Tests\UserLoginTest15900
LeafDrupal\user\Tests\UserPasswordResetTest4500
LeafDrupal\user\Tests\UserPermissionsTest5000
LeafDrupal\user\Tests\UserPictureTest4700
LeafDrupal\user\Tests\UserRegistrationTest12900
LeafDrupal\user\Tests\UserRoleAdminTest5700
LeafDrupal\user\Tests\UserRolesAssignmentTest5100
LeafDrupal\user\Tests\UserSaveTest200
LeafDrupal\user\Tests\UserSearchTest5800
LeafDrupal\user\Tests\UserSignatureTest4600
LeafDrupal\user\Tests\UserTimeZoneTest2900
LeafDrupal\user\Tests\UserTokenReplaceTest4700
LeafDrupal\user\Tests\UserTranslationUITest14300
LeafDrupal\user\Tests\UserValidateCurrentPassCustomFormTest1700
LeafDrupal\user\Tests\UserValidationTest1600
LeafDrupal\user\Tests\Views\AccessPermissionTest1400
LeafDrupal\user\Tests\Views\AccessRoleTest1400
LeafDrupal\user\Tests\Views\ArgumentDefaultTest900
LeafDrupal\user\Tests\Views\ArgumentValidateTest1900
LeafDrupal\user\Tests\Views\HandlerArgumentUserUidTest500
LeafDrupal\user\Tests\Views\HandlerFieldRoleTest1000
LeafDrupal\user\Tests\Views\HandlerFieldUserNameTest700
LeafDrupal\user\Tests\Views\HandlerFilterUserNameTest5000
LeafDrupal\user\Tests\Views\RelationshipRepresentativeNode300
LeafDrupal\views\Tests\AnalyzeTest2100
LeafDrupal\views\Tests\BasicTest800
ExpandDrupal\views\Tests\DefaultViewsTest72011
MessageGroupFilenameLineFunctionStatus
Undefined index: undDrupal\views\Tests\DefaultViewsTest->setUp() Drupal\simpletest\TestBase->run() simpletest_script_run_one_test('651', 'Drupal\views\Tests\DefaultViewsTest') NoticeDefaultViewsTest.php106Drupal\views\Tests\DefaultViewsTest->setUp()
Undefined index: undDrupal\views\Tests\DefaultViewsTest->setUp() Drupal\simpletest\TestBase->run() simpletest_script_run_one_test('651', 'Drupal\views\Tests\DefaultViewsTest') NoticeDefaultViewsTest.php106Drupal\views\Tests\DefaultViewsTest->setUp()
Undefined index: undDrupal\views\Tests\DefaultViewsTest->setUp() Drupal\simpletest\TestBase->run() simpletest_script_run_one_test('651', 'Drupal\views\Tests\DefaultViewsTest') NoticeDefaultViewsTest.php106Drupal\views\Tests\DefaultViewsTest->setUp()
Undefined index: undDrupal\views\Tests\DefaultViewsTest->setUp() Drupal\simpletest\TestBase->run() simpletest_script_run_one_test('651', 'Drupal\views\Tests\DefaultViewsTest') NoticeDefaultViewsTest.php106Drupal\views\Tests\DefaultViewsTest->setUp()
Undefined index: undDrupal\views\Tests\DefaultViewsTest->setUp() Drupal\simpletest\TestBase->run() simpletest_script_run_one_test('651', 'Drupal\views\Tests\DefaultViewsTest') NoticeDefaultViewsTest.php106Drupal\views\Tests\DefaultViewsTest->setUp()
Undefined index: undDrupal\views\Tests\DefaultViewsTest->setUp() Drupal\simpletest\TestBase->run() simpletest_script_run_one_test('651', 'Drupal\views\Tests\DefaultViewsTest') NoticeDefaultViewsTest.php106Drupal\views\Tests\DefaultViewsTest->setUp()
Undefined index: undDrupal\views\Tests\DefaultViewsTest->setUp() Drupal\simpletest\TestBase->run() simpletest_script_run_one_test('651', 'Drupal\views\Tests\DefaultViewsTest') NoticeDefaultViewsTest.php106Drupal\views\Tests\DefaultViewsTest->setUp()
Undefined index: undDrupal\views\Tests\DefaultViewsTest->setUp() Drupal\simpletest\TestBase->run() simpletest_script_run_one_test('651', 'Drupal\views\Tests\DefaultViewsTest') NoticeDefaultViewsTest.php106Drupal\views\Tests\DefaultViewsTest->setUp()
Undefined index: undDrupal\views\Tests\DefaultViewsTest->setUp() Drupal\simpletest\TestBase->run() simpletest_script_run_one_test('651', 'Drupal\views\Tests\DefaultViewsTest') NoticeDefaultViewsTest.php106Drupal\views\Tests\DefaultViewsTest->setUp()
Undefined index: undDrupal\views\Tests\DefaultViewsTest->setUp() Drupal\simpletest\TestBase->run() simpletest_script_run_one_test('651', 'Drupal\views\Tests\DefaultViewsTest') NoticeDefaultViewsTest.php106Drupal\views\Tests\DefaultViewsTest->setUp()
Undefined index: undDrupal\views\Tests\DefaultViewsTest->setUp() Drupal\simpletest\TestBase->run() simpletest_script_run_one_test('651', 'Drupal\views\Tests\DefaultViewsTest') NoticeDefaultViewsTest.php106Drupal\views\Tests\DefaultViewsTest->setUp()
'Missing handler: search_node_links_to nid argument'Debugviews.module926views_get_handler()
'Missing handler: search_node_links_to nid argument'Debugviews.module926views_get_handler()
'Missing handler: search_node_links_to nid argument'Debugviews.module926views_get_handler()
'Missing handler: field_data_comment_body comment_body field'Debugviews.module926views_get_handler()
'Missing handler: history timestamp field'Debugviews.module926views_get_handler()
'Missing handler: history timestamp field'Debugviews.module926views_get_handler()
LeafDrupal\views\Tests\Entity\FieldEntityTest400
LeafDrupal\views\Tests\Entity\FilterEntityBundleTest800
LeafDrupal\views\Tests\GlossaryTest800
LeafDrupal\views\Tests\Handler\AreaTest9000
LeafDrupal\views\Tests\Handler\AreaTextTest400
LeafDrupal\views\Tests\Handler\ArgumentNullTest400
LeafDrupal\views\Tests\Handler\ArgumentStringTest400
LeafDrupal\views\Tests\Handler\FieldBooleanTest1000
LeafDrupal\views\Tests\Handler\FieldCounterTest600
LeafDrupal\views\Tests\Handler\FieldCustomTest100
LeafDrupal\views\Tests\Handler\FieldDateTest1400
LeafDrupal\views\Tests\Handler\FieldDropButtonTest1300
LeafDrupal\views\Tests\Handler\FieldFileSizeTest800
LeafDrupal\views\Tests\Handler\FieldUnitTest10900
LeafDrupal\views\Tests\Handler\FieldUrlTest200
LeafDrupal\views\Tests\Handler\FieldWebTest10900
LeafDrupal\views\Tests\Handler\FieldXssTest300
LeafDrupal\views\Tests\Handler\FilterCombineTest100
LeafDrupal\views\Tests\Handler\FilterDateTest2200
LeafDrupal\views\Tests\Handler\FilterEqualityTest400
LeafDrupal\views\Tests\Handler\FilterInOperatorTest800
LeafDrupal\views\Tests\Handler\FilterNumericTest1400
LeafDrupal\views\Tests\Handler\FilterStringTest2600
LeafDrupal\views\Tests\Handler\HandlerAliasTest800
LeafDrupal\views\Tests\Handler\HandlerAllTest26000
ExpandDrupal\views\Tests\Handler\HandlerTest11600
MessageGroupFilenameLineFunctionStatus
'Missing handler: uwTFtQpm mtXz0WOR relationship'Debugviews.module926views_get_handler()
LeafDrupal\views\Tests\Handler\RelationshipTest500
LeafDrupal\views\Tests\Handler\SortDateTest2400
LeafDrupal\views\Tests\Handler\SortRandomTest600
LeafDrupal\views\Tests\Handler\SortTest800
ExpandDrupal\views\Tests\ModuleTest3200
MessageGroupFilenameLineFunctionStatus
'Missing handler: wJrqChAr gQQCrno2 field'Debugviews.module926views_get_handler()
'Missing handler: liQPKDr1 aMTGT0D4 area'Debugviews.module926views_get_handler()
'Missing handler: qBjxceoE jmbItaWz filter'Debugviews.module926views_get_handler()
LeafDrupal\views\Tests\PluginBaseUnitTest1200
LeafDrupal\views\Tests\PluginInstanceTest14500
LeafDrupal\views\Tests\PluginTypeListTest100
LeafDrupal\views\Tests\Plugin\AccessTest3900
LeafDrupal\views\Tests\Plugin\ArgumentDefaultTest2400
LeafDrupal\views\Tests\Plugin\ArgumentValidatorTest400
LeafDrupal\views\Tests\Plugin\CacheTest1200
LeafDrupal\views\Tests\Plugin\DisplayAttachmentTest600
LeafDrupal\views\Tests\Plugin\DisplayExtenderTest600
LeafDrupal\views\Tests\Plugin\DisplayFeedTest4300
LeafDrupal\views\Tests\Plugin\DisplayPageTest700
LeafDrupal\views\Tests\Plugin\DisplayTest5000
LeafDrupal\views\Tests\Plugin\ExposedFormTest13100
LeafDrupal\views\Tests\Plugin\FilterTest1300
LeafDrupal\views\Tests\Plugin\JoinTest1600
LeafDrupal\views\Tests\Plugin\MiniPagerTest1300
LeafDrupal\views\Tests\Plugin\PagerTest9200
LeafDrupal\views\Tests\Plugin\QueryTest200
LeafDrupal\views\Tests\Plugin\StyleMappingTest4200
LeafDrupal\views\Tests\Plugin\StyleTest2000
LeafDrupal\views\Tests\Plugin\StyleUnformattedTest1700
LeafDrupal\views\Tests\QueryGroupByTest4000
LeafDrupal\views\Tests\TokenReplaceTest1100
LeafDrupal\views\Tests\UI\CachedDataUITest4400
LeafDrupal\views\Tests\UI\CustomBooleanTest4200
LeafDrupal\views\Tests\UI\DefaultViewsTest11000
LeafDrupal\views\Tests\UI\DisplayAttachmentTest2400
LeafDrupal\views\Tests\UI\DisplayExtenderUITest2300
LeafDrupal\views\Tests\UI\DisplayPath2200
LeafDrupal\views\Tests\UI\DisplayTest27500
LeafDrupal\views\Tests\UI\GroupByTest2600
LeafDrupal\views\Tests\UI\HandlerTest18700
LeafDrupal\views\Tests\UI\OverrideDisplaysTest14700
LeafDrupal\views\Tests\UI\PreviewTest4200
LeafDrupal\views\Tests\UI\QueryTest1900
LeafDrupal\views\Tests\UI\RedirectTest2600
LeafDrupal\views\Tests\UI\RowUITest3000
LeafDrupal\views\Tests\UI\SettingsTest8800
LeafDrupal\views\Tests\UI\StorageTest2100
LeafDrupal\views\Tests\UI\StyleUITest3000
LeafDrupal\views\Tests\UI\TagTest1100
LeafDrupal\views\Tests\ViewElementTest1500
LeafDrupal\views\Tests\ViewExecutableTest11500
LeafDrupal\views\Tests\ViewRenderTest200
LeafDrupal\views\Tests\ViewsDataTest2200
LeafDrupal\views\Tests\ViewsHooksTest600
LeafDrupal\views\Tests\ViewStorageTest9700
LeafDrupal\views\Tests\Wizard\BasicTest9100
LeafDrupal\views\Tests\Wizard\ItemsPerPageTest3800
LeafDrupal\views\Tests\Wizard\MenuTest1900
LeafDrupal\views\Tests\Wizard\SortingTest3500
LeafDrupal\views\Tests\Wizard\TaggedWithTest7800
LeafDrupal\xmlrpc\Tests\XmlRpcBasicTest900
LeafDrupal\xmlrpc\Tests\XmlRpcMessagesTest700
LeafDrupal\xmlrpc\Tests\XmlRpcValidatorTest1000