drupal-1800998-14.patch

Test status
StatusResult
Last receivedSat, 02/02/2013 - 18:10:39
Last requestedSat, 02/02/2013 - 18:11:03
Last testedSat, 02/02/2013 - 18:57:26
Test count1
Environment status
MySQLfail
File information
Filedrupal-1800998-14.patch
BranchDrupal core - 8.x
LinkIssue Link
SummaryFAILED: [[SimpleTest]]: [MySQL] 48,879 pass(es), 157 fail(s), and 65 exception(s).
Details

MySQL

  1. Setup environment
  2. Detect an invalid patch URL
  3. Detect invalid repository information
  4. Detect invalid patch format
  5. Detect a non-applicable patch
  6. Detect invalid PHP syntax
  7. Detect a Drupal installation failure
  8. Detect a test run failure
  9. Detect a failing test
    Review the test failures below then if necessary run them locally until the problem has been fixed.
  10. Complete test suite with all tests passing
48,879 pass(es), 157 fail(s), and 65 exception(s)

Non-pass

Test namePassFailException
ExpandDrupal\action\Tests\BulkFormTest5410
MessageGroupFilenameLineFunctionStatus
The action select field appears.BrowserBulkFormTest.php45Drupal\action\Tests\BulkFormTest->testBulkForm()
The checkbox on row 0 appears.BrowserBulkFormTest.php50Drupal\action\Tests\BulkFormTest->testBulkForm()
The checkbox on row 1 appears.BrowserBulkFormTest.php50Drupal\action\Tests\BulkFormTest->testBulkForm()
The checkbox on row 2 appears.BrowserBulkFormTest.php50Drupal\action\Tests\BulkFormTest->testBulkForm()
The checkbox on row 3 appears.BrowserBulkFormTest.php50Drupal\action\Tests\BulkFormTest->testBulkForm()
The checkbox on row 4 appears.BrowserBulkFormTest.php50Drupal\action\Tests\BulkFormTest->testBulkForm()
The checkbox on row 5 appears.BrowserBulkFormTest.php50Drupal\action\Tests\BulkFormTest->testBulkForm()
The checkbox on row 6 appears.BrowserBulkFormTest.php50Drupal\action\Tests\BulkFormTest->testBulkForm()
The checkbox on row 7 appears.BrowserBulkFormTest.php50Drupal\action\Tests\BulkFormTest->testBulkForm()
The checkbox on row 8 appears.BrowserBulkFormTest.php50Drupal\action\Tests\BulkFormTest->testBulkForm()
The checkbox on row 9 appears.BrowserBulkFormTest.php50Drupal\action\Tests\BulkFormTest->testBulkForm()
Failed to set field bulk_form[0] to 1OtherBulkFormTest.php56Drupal\action\Tests\BulkFormTest->testBulkForm()
Failed to set field bulk_form[1] to 1OtherBulkFormTest.php56Drupal\action\Tests\BulkFormTest->testBulkForm()
Failed to set field bulk_form[2] to 1OtherBulkFormTest.php56Drupal\action\Tests\BulkFormTest->testBulkForm()
Failed to set field bulk_form[3] to 1OtherBulkFormTest.php56Drupal\action\Tests\BulkFormTest->testBulkForm()
Failed to set field bulk_form[4] to 1OtherBulkFormTest.php56Drupal\action\Tests\BulkFormTest->testBulkForm()
Failed to set field bulk_form[5] to 1OtherBulkFormTest.php56Drupal\action\Tests\BulkFormTest->testBulkForm()
Failed to set field bulk_form[6] to 1OtherBulkFormTest.php56Drupal\action\Tests\BulkFormTest->testBulkForm()
Failed to set field bulk_form[7] to 1OtherBulkFormTest.php56Drupal\action\Tests\BulkFormTest->testBulkForm()
Failed to set field bulk_form[8] to 1OtherBulkFormTest.php56Drupal\action\Tests\BulkFormTest->testBulkForm()
Failed to set field bulk_form[9] to 1OtherBulkFormTest.php56Drupal\action\Tests\BulkFormTest->testBulkForm()
Failed to set field action to node_make_sticky_actionOtherBulkFormTest.php56Drupal\action\Tests\BulkFormTest->testBulkForm()
Found the Apply buttonOtherBulkFormTest.php56Drupal\action\Tests\BulkFormTest->testBulkForm()
Found the requested form fields at OtherBulkFormTest.php56Drupal\action\Tests\BulkFormTest->testBulkForm()
Node 1 got marked as sticky.OtherBulkFormTest.php60Drupal\action\Tests\BulkFormTest->testBulkForm()
Node 2 got marked as sticky.OtherBulkFormTest.php60Drupal\action\Tests\BulkFormTest->testBulkForm()
Node 3 got marked as sticky.OtherBulkFormTest.php60Drupal\action\Tests\BulkFormTest->testBulkForm()
Node 4 got marked as sticky.OtherBulkFormTest.php60Drupal\action\Tests\BulkFormTest->testBulkForm()
Node 5 got marked as sticky.OtherBulkFormTest.php60Drupal\action\Tests\BulkFormTest->testBulkForm()
Node 6 got marked as sticky.OtherBulkFormTest.php60Drupal\action\Tests\BulkFormTest->testBulkForm()
Node 7 got marked as sticky.OtherBulkFormTest.php60Drupal\action\Tests\BulkFormTest->testBulkForm()
Node 8 got marked as sticky.OtherBulkFormTest.php60Drupal\action\Tests\BulkFormTest->testBulkForm()
Node 9 got marked as sticky.OtherBulkFormTest.php60Drupal\action\Tests\BulkFormTest->testBulkForm()
Node 10 got marked as sticky.OtherBulkFormTest.php60Drupal\action\Tests\BulkFormTest->testBulkForm()
"Make content sticky was applied to 10 items." foundOtherBulkFormTest.php63Drupal\action\Tests\BulkFormTest->testBulkForm()
Failed to set field bulk_form[0] to 1OtherBulkFormTest.php70Drupal\action\Tests\BulkFormTest->testBulkForm()
Failed to set field action to node_unpublish_actionOtherBulkFormTest.php70Drupal\action\Tests\BulkFormTest->testBulkForm()
Found the Apply buttonOtherBulkFormTest.php70Drupal\action\Tests\BulkFormTest->testBulkForm()
Found the requested form fields at OtherBulkFormTest.php70Drupal\action\Tests\BulkFormTest->testBulkForm()
"Unpublish content was applied to 1 item." foundOtherBulkFormTest.php72Drupal\action\Tests\BulkFormTest->testBulkForm()
A single node has been unpublished.OtherBulkFormTest.php76Drupal\action\Tests\BulkFormTest->testBulkForm()
ExpandDrupal\comment\Tests\Views\RowRssTest1022
MessageGroupFilenameLineFunctionStatus
Just one comment was found in the rss output.OtherRowRssTest.php39Drupal\comment\Tests\Views\RowRssTest->testRssRow()
Undefined offset: 0Drupal\comment\Tests\Views\RowRssTest->testRssRow() Drupal\simpletest\TestBase->run() simpletest_script_run_one_test('689', 'Drupal\comment\Tests\Views\RowRssTest') NoticeRowRssTest.php41Drupal\comment\Tests\Views\RowRssTest->testRssRow()
Trying to get property of non-objectDrupal\comment\Tests\Views\RowRssTest->testRssRow() Drupal\simpletest\TestBase->run() simpletest_script_run_one_test('689', 'Drupal\comment\Tests\Views\RowRssTest') NoticeRowRssTest.php41Drupal\comment\Tests\Views\RowRssTest->testRssRow()
The right pubDate appears in the rss output.OtherRowRssTest.php41Drupal\comment\Tests\Views\RowRssTest->testRssRow()
ExpandDrupal\comment\Tests\Views\WizardTest3303
MessageGroupFilenameLineFunctionStatus
Undefined index: page argumentsNoticeviews.module362views_menu_alter()
Undefined index: access argumentsNoticeviews.module364views_menu_alter()
Undefined index: load argumentsNoticeviews.module365views_menu_alter()
ExpandDrupal\node\Tests\Views\StatusExtraTest6080
MessageGroupFilenameLineFunctionStatus
"uyxaKgW4" foundOtherStatusExtraTest.php59Drupal\node\Tests\Views\StatusExtraTest->testStatusExtra()
"nmPkYBxx" foundOtherStatusExtraTest.php60Drupal\node\Tests\Views\StatusExtraTest->testStatusExtra()
"r3CvmpFM" foundOtherStatusExtraTest.php61Drupal\node\Tests\Views\StatusExtraTest->testStatusExtra()
"mIF0CBDS" foundOtherStatusExtraTest.php62Drupal\node\Tests\Views\StatusExtraTest->testStatusExtra()
"uyxaKgW4" foundOtherStatusExtraTest.php67Drupal\node\Tests\Views\StatusExtraTest->testStatusExtra()
"r3CvmpFM" foundOtherStatusExtraTest.php69Drupal\node\Tests\Views\StatusExtraTest->testStatusExtra()
"uyxaKgW4" foundOtherStatusExtraTest.php75Drupal\node\Tests\Views\StatusExtraTest->testStatusExtra()
"uyxaKgW4" foundOtherStatusExtraTest.php84Drupal\node\Tests\Views\StatusExtraTest->testStatusExtra()
ExpandDrupal\rest\Tests\Views\StyleSerializerTest42100
MessageGroupFilenameLineFunctionStatus
HTTP response expected 200, actual 404BrowserStyleSerializerTest.php75Drupal\rest\Tests\Views\StyleSerializerTest->testSerializerResponses()
The expected JSON output was found.OtherStyleSerializerTest.php95Drupal\rest\Tests\Views\StyleSerializerTest->testSerializerResponses()
The expected JSON preview output was found.OtherStyleSerializerTest.php103Drupal\rest\Tests\Views\StyleSerializerTest->testSerializerResponses()
HTTP response expected 403, actual 500BrowserStyleSerializerTest.php107Drupal\rest\Tests\Views\StyleSerializerTest->testSerializerResponses()
HTTP response expected 200, actual 404BrowserStyleSerializerTest.php126Drupal\rest\Tests\Views\StyleSerializerTest->testSerializerResponses()
The expected JSON output was found.OtherStyleSerializerTest.php128Drupal\rest\Tests\Views\StyleSerializerTest->testSerializerResponses()
The expected JSONLD output was found.OtherStyleSerializerTest.php132Drupal\rest\Tests\Views\StyleSerializerTest->testSerializerResponses()
The expected JSONLD output was found.OtherStyleSerializerTest.php136Drupal\rest\Tests\Views\StyleSerializerTest->testSerializerResponses()
Value NULL is identical to value array ( 0 => array ( 'name' => 'George', 'nothing' => 'TEST', ), 1 => array ( 'name' => 'Ringo', 'nothing' => 'TEST', ), 2 => array ( 'name' => 'Meredith', 'nothing' => 'TEST', ), 3 => array ( 'name' => 'Paul', 'nothing' => 'TEST', ), 4 => array ( 'name' => 'John', 'nothing' => 'TEST', ), ).OtherStyleSerializerTest.php175Drupal\rest\Tests\Views\StyleSerializerTest->testUIFieldAlias()
Value NULL is identical to value array ( 0 => array ( 'cGb7GuoB' => 'George', 'bOrfREQE' => 'TEST', ), 1 => array ( 'cGb7GuoB' => 'Ringo', 'bOrfREQE' => 'TEST', ), 2 => array ( 'cGb7GuoB' => 'Meredith', 'bOrfREQE' => 'TEST', ), 3 => array ( 'cGb7GuoB' => 'Paul', 'bOrfREQE' => 'TEST', ), 4 => array ( 'cGb7GuoB' => 'John', 'bOrfREQE' => 'TEST', ), ).OtherStyleSerializerTest.php211Drupal\rest\Tests\Views\StyleSerializerTest->testUIFieldAlias()
ExpandDrupal\system\Tests\Upgrade\BlockUpgradePathTest1723
MessageGroupFilenameLineFunctionStatus
simplexml_import_dom(): Invalid Nodetype to importsimplexml_import_dom(Object) Drupal\simpletest\WebTestBase->parse() Drupal\simpletest\WebTestBase->xpath('//li[@class=:class]', Array) Drupal\system\Tests\Upgrade\UpgradePathTestBase->performUpgrade() Drupal\system\Tests\Upgrade\BlockUpgradePathTest->testBlockUpgradeTitleLength() Drupal\simpletest\TestBase->run() simpletest_script_run_one_test('593', 'Drupal\system\Tests\Upgrade\BlockUpgradePathTest') WarningWebTestBase.php1113Drupal\simpletest\WebTestBase->parse()
Parsed page successfully.BrowserUpgradePathTestBase.php249Drupal\system\Tests\Upgrade\UpgradePathTestBase->performUpgrade()
Invalid argument supplied for foreach()Drupal\system\Tests\Upgrade\UpgradePathTestBase->performUpgrade() Drupal\system\Tests\Upgrade\BlockUpgradePathTest->testBlockUpgradeTitleLength() Drupal\simpletest\TestBase->run() simpletest_script_run_one_test('593', 'Drupal\system\Tests\Upgrade\BlockUpgradePathTest') WarningUpgradePathTestBase.php249Drupal\system\Tests\Upgrade\UpgradePathTestBase->performUpgrade()
No pending updates at the end of the update process.OtherUpgradePathTestBase.php265Drupal\system\Tests\Upgrade\UpgradePathTestBase->performUpgrade()
Exception: update.php still shows pending updates after execution. in Drupal\system\Tests\Upgrade\UpgradePathTestBase->performUpgrade() (line 266 of /var/lib/drupaltestbot/sites/default/files/checkout/core/modules/system/lib/Drupal/system/Tests/Upgrade/UpgradePathTestBase.php). Drupal\system\Tests\Upgrade\UpgradePathTestBase->performUpgrade() Drupal\system\Tests\Upgrade\BlockUpgradePathTest->testBlockUpgradeTitleLength() Drupal\simpletest\TestBase->run() simpletest_script_run_one_test('593', 'Drupal\system\Tests\Upgrade\BlockUpgradePathTest') Uncaught exceptionUpgradePathTestBase.php266Drupal\system\Tests\Upgrade\UpgradePathTestBase->performUpgrade()
ExpandDrupal\translation_entity\Tests\Views\TranslationLinkTest1610
MessageGroupFilenameLineFunctionStatus
Link containing href user/1/translations found.OtherTranslationLinkTest.php57Drupal\translation_entity\Tests\Views\TranslationLinkTest->testTranslationLink()
ExpandDrupal\user\Tests\Views\HandlerFilterUserNameTest4640
MessageGroupFilenameLineFunctionStatus
Raw "Unable to find user: onn8kobx" foundOtherHandlerFilterUserNameTest.php154Drupal\user\Tests\Views\HandlerFilterUserNameTest->testExposedFilter()
Raw "Unable to find user: hk796bs8" foundOtherHandlerFilterUserNameTest.php164Drupal\user\Tests\Views\HandlerFilterUserNameTest->testExposedFilter()
Raw "3" foundOtherHandlerFilterUserNameTest.php175Drupal\user\Tests\Views\HandlerFilterUserNameTest->testExposedFilter()
Raw "4" foundOtherHandlerFilterUserNameTest.php175Drupal\user\Tests\Views\HandlerFilterUserNameTest->testExposedFilter()
ExpandDrupal\views\Tests\Handler\AreaTest8910
MessageGroupFilenameLineFunctionStatus
Overridden title found.OtherAreaTest.php179Drupal\views\Tests\Handler\AreaTest->testTitleArea()
ExpandDrupal\views\Tests\Handler\FieldDropButtonTest3100
MessageGroupFilenameLineFunctionStatus
Just one node title link was found.OtherFieldDropButtonTest.php47Drupal\views\Tests\Handler\FieldDropButtonTest->testDropbutton()
Just one custom link was found.OtherFieldDropButtonTest.php49Drupal\views\Tests\Handler\FieldDropButtonTest->testDropbutton()
Just one node title link was found.OtherFieldDropButtonTest.php47Drupal\views\Tests\Handler\FieldDropButtonTest->testDropbutton()
Just one custom link was found.OtherFieldDropButtonTest.php49Drupal\views\Tests\Handler\FieldDropButtonTest->testDropbutton()
Just one node title link was found.OtherFieldDropButtonTest.php47Drupal\views\Tests\Handler\FieldDropButtonTest->testDropbutton()
Just one custom link was found.OtherFieldDropButtonTest.php49Drupal\views\Tests\Handler\FieldDropButtonTest->testDropbutton()
Just one node title link was found.OtherFieldDropButtonTest.php47Drupal\views\Tests\Handler\FieldDropButtonTest->testDropbutton()
Just one custom link was found.OtherFieldDropButtonTest.php49Drupal\views\Tests\Handler\FieldDropButtonTest->testDropbutton()
Just one node title link was found.OtherFieldDropButtonTest.php47Drupal\views\Tests\Handler\FieldDropButtonTest->testDropbutton()
Just one custom link was found.OtherFieldDropButtonTest.php49Drupal\views\Tests\Handler\FieldDropButtonTest->testDropbutton()
ExpandDrupal\views\Tests\Handler\FieldWebTest9872
MessageGroupFilenameLineFunctionStatus
Link containing href /checkout/test_click_sort?order=id&sort=asc found.OtherFieldWebTest.php58Drupal\views\Tests\Handler\FieldWebTest->testClickSorting()
Link containing href /checkout/test_click_sort?order=name&sort=desc found.OtherFieldWebTest.php59Drupal\views\Tests\Handler\FieldWebTest->testClickSorting()
Undefined variable: url_targetDrupal\simpletest\WebTestBase->clickLink('ID') Drupal\views\Tests\Handler\FieldWebTest->testClickSorting() Drupal\simpletest\TestBase->run() simpletest_script_run_one_test('671', 'Drupal\views\Tests\Handler\FieldWebTest') NoticeWebTestBase.php1929Drupal\simpletest\WebTestBase->clickLink()
Clicked link ID () from http://drupaltestbot659-mysql/checkout/test_click_sortBrowserFieldWebTest.php63Drupal\views\Tests\Handler\FieldWebTest->testClickSorting()
Link containing href /checkout/test_click_sort?order=id&sort=desc found.OtherFieldWebTest.php64Drupal\views\Tests\Handler\FieldWebTest->testClickSorting()
Value array ( ) is equal to value array ( 0 => 1, 1 => 2, 2 => 3, 3 => 4, 4 => 5, ).OtherFieldWebTest.php67Drupal\views\Tests\Handler\FieldWebTest->testClickSorting()
Undefined variable: url_targetDrupal\simpletest\WebTestBase->clickLink('ID') Drupal\views\Tests\Handler\FieldWebTest->testClickSorting() Drupal\simpletest\TestBase->run() simpletest_script_run_one_test('671', 'Drupal\views\Tests\Handler\FieldWebTest') NoticeWebTestBase.php1929Drupal\simpletest\WebTestBase->clickLink()
Clicked link ID () from http://drupaltestbot659-mysql/checkout/test_click_sortBrowserFieldWebTest.php69Drupal\views\Tests\Handler\FieldWebTest->testClickSorting()
Value array ( ) is equal to value array ( 0 => 5, 1 => 4, 2 => 3, 3 => 2, 4 => 1, ).OtherFieldWebTest.php72Drupal\views\Tests\Handler\FieldWebTest->testClickSorting()
ExpandDrupal\views\Tests\Plugin\AccessTest3722
MessageGroupFilenameLineFunctionStatus
Undefined index: access argumentsDrupal\views\Tests\Plugin\AccessTest->testStaticAccessPlugin() Drupal\simpletest\TestBase->run() simpletest_script_run_one_test('713', 'Drupal\views\Tests\Plugin\AccessTest') NoticeAccessTest.php86Drupal\views\Tests\Plugin\AccessTest->testStaticAccessPlugin()
Value array ( 0 => 'views_test_data_test_static_access_callback', 1 => array ( 0 => false, ), ) is equal to value NULL.OtherAccessTest.php86Drupal\views\Tests\Plugin\AccessTest->testStaticAccessPlugin()
Undefined index: access argumentsDrupal\views\Tests\Plugin\AccessTest->testDynamicAccessPlugin() Drupal\simpletest\TestBase->run() simpletest_script_run_one_test('713', 'Drupal\views\Tests\Plugin\AccessTest') NoticeAccessTest.php122Drupal\views\Tests\Plugin\AccessTest->testDynamicAccessPlugin()
Value array ( 0 => 'views_test_data_test_dynamic_access_callback', 1 => array ( 0 => false, 1 => 1, 2 => 2, ), ) is equal to value NULL.OtherAccessTest.php122Drupal\views\Tests\Plugin\AccessTest->testDynamicAccessPlugin()
ExpandDrupal\views\Tests\Plugin\DisplayAttachmentTest420
MessageGroupFilenameLineFunctionStatus
Both actual view and the attachment is rendered.OtherDisplayAttachmentTest.php49Drupal\views\Tests\Plugin\DisplayAttachmentTest->testAttachment()
The attachment is rendered before the actual view.OtherDisplayAttachmentTest.php55Drupal\views\Tests\Plugin\DisplayAttachmentTest->testAttachment()
ExpandDrupal\views\Tests\Plugin\ExposedFormTest12830
MessageGroupFilenameLineFunctionStatus
Article type filter set.BrowserExposedFormTest.php57Drupal\views\Tests\Plugin\ExposedFormTest->testResetButton()
Article type filter has been reset.BrowserExposedFormTest.php63Drupal\views\Tests\Plugin\ExposedFormTest->testResetButton()
Label has the expected value: jumEhwZm.BrowserViewTestBase.php208Drupal\views\Tests\ViewTestBase->helperButtonHasLabel()
ExpandDrupal\views\Tests\Plugin\MiniPagerTest940
MessageGroupFilenameLineFunctionStatus
Make sure the next link appears on the first page.OtherMiniPagerTest.php54Drupal\views\Tests\Plugin\MiniPagerTest->testMiniPagerRender()
Make sure the previous link appears.OtherMiniPagerTest.php58Drupal\views\Tests\Plugin\MiniPagerTest->testMiniPagerRender()
Make sure the next link appears.OtherMiniPagerTest.php59Drupal\views\Tests\Plugin\MiniPagerTest->testMiniPagerRender()
Make sure the previous link does not appear on the last page.OtherMiniPagerTest.php63Drupal\views\Tests\Plugin\MiniPagerTest->testMiniPagerRender()
ExpandDrupal\views\Tests\UI\DefaultViewsTest108228
MessageGroupFilenameLineFunctionStatus
HTTP response expected 200, actual 404BrowserDefaultViewsTest.php62Drupal\views\Tests\UI\DefaultViewsTest->testDefaultViews()
"vH5nTeuITS7iwH5R" foundOtherDefaultViewsTest.php63Drupal\views\Tests\UI\DefaultViewsTest->testDefaultViews()
Undefined index: page argumentsNoticeviews.module362views_menu_alter()
Undefined index: access argumentsNoticeviews.module364views_menu_alter()
Undefined index: load argumentsNoticeviews.module365views_menu_alter()
Undefined index: page argumentsNoticeviews.module362views_menu_alter()
Undefined index: access argumentsNoticeviews.module364views_menu_alter()
Undefined index: load argumentsNoticeviews.module365views_menu_alter()
Undefined index: page argumentsNoticeviews.module362views_menu_alter()
Undefined index: access argumentsNoticeviews.module364views_menu_alter()
Undefined index: load argumentsNoticeviews.module365views_menu_alter()
Undefined index: page argumentsNoticeviews.module362views_menu_alter()
Undefined index: access argumentsNoticeviews.module364views_menu_alter()
Undefined index: load argumentsNoticeviews.module365views_menu_alter()
Undefined index: access argumentsNoticeviews.module364views_menu_alter()
Undefined index: access argumentsNoticeviews.module364views_menu_alter()
Undefined index: page argumentsNoticeviews.module362views_menu_alter()
Undefined index: access argumentsNoticeviews.module364views_menu_alter()
Undefined index: load argumentsNoticeviews.module365views_menu_alter()
Undefined index: page argumentsNoticeviews.module362views_menu_alter()
Undefined index: access argumentsNoticeviews.module364views_menu_alter()
Undefined index: load argumentsNoticeviews.module365views_menu_alter()
Undefined index: page argumentsNoticeviews.module362views_menu_alter()
Undefined index: access argumentsNoticeviews.module364views_menu_alter()
Undefined index: load argumentsNoticeviews.module365views_menu_alter()
Undefined index: page argumentsNoticeviews.module362views_menu_alter()
Undefined index: access argumentsNoticeviews.module364views_menu_alter()
Undefined index: load argumentsNoticeviews.module365views_menu_alter()
Undefined index: access argumentsNoticeviews.module364views_menu_alter()
Undefined index: access argumentsNoticeviews.module364views_menu_alter()
ExpandDrupal\views\Tests\UI\DisplayTest27413
MessageGroupFilenameLineFunctionStatus
Undefined index: page argumentsNoticeviews.module362views_menu_alter()
Undefined index: access argumentsNoticeviews.module364views_menu_alter()
Undefined index: load argumentsNoticeviews.module365views_menu_alter()
Link containing href admin/structure/views/view/test_display/edit/page_1 found.OtherDisplayTest.php286Drupal\views\Tests\UI\DisplayTest->testPageContextualLinks()
ExpandDrupal\views\Tests\UI\OverrideDisplaysTest132180
MessageGroupFilenameLineFunctionStatus
HTTP response expected 200, actual 404BrowserOverrideDisplaysTest.php53Drupal\views\Tests\UI\OverrideDisplaysTest->testOverrideDisplays()
"sOV61bUIXXYpkQVj" foundOtherOverrideDisplaysTest.php54Drupal\views\Tests\UI\OverrideDisplaysTest->testOverrideDisplays()
HTTP response expected 200, actual 404BrowserOverrideDisplaysTest.php75Drupal\views\Tests\UI\OverrideDisplaysTest->testOverrideDisplays()
"puRL6RAAZOd9cTpb" foundOtherOverrideDisplaysTest.php76Drupal\views\Tests\UI\OverrideDisplaysTest->testOverrideDisplays()
HTTP response expected 200, actual 404BrowserOverrideDisplaysTest.php107Drupal\views\Tests\UI\OverrideDisplaysTest->testWizardMixedDefaultOverriddenDisplays()
"jnplSX15iKJUkTiK" foundOtherOverrideDisplaysTest.php108Drupal\views\Tests\UI\OverrideDisplaysTest->testWizardMixedDefaultOverriddenDisplays()
HTTP response expected 200, actual 404BrowserOverrideDisplaysTest.php111Drupal\views\Tests\UI\OverrideDisplaysTest->testWizardMixedDefaultOverriddenDisplays()
"jnplSX15iKJUkTiK" foundOtherOverrideDisplaysTest.php112Drupal\views\Tests\UI\OverrideDisplaysTest->testWizardMixedDefaultOverriddenDisplays()
HTTP response expected 200, actual 404BrowserOverrideDisplaysTest.php132Drupal\views\Tests\UI\OverrideDisplaysTest->testWizardMixedDefaultOverriddenDisplays()
"ex60idShEXC1P81Z" foundOtherOverrideDisplaysTest.php133Drupal\views\Tests\UI\OverrideDisplaysTest->testWizardMixedDefaultOverriddenDisplays()
HTTP response expected 200, actual 404BrowserOverrideDisplaysTest.php136Drupal\views\Tests\UI\OverrideDisplaysTest->testWizardMixedDefaultOverriddenDisplays()
"ex60idShEXC1P81Z" foundOtherOverrideDisplaysTest.php137Drupal\views\Tests\UI\OverrideDisplaysTest->testWizardMixedDefaultOverriddenDisplays()
"egG6GNp1BIsQ6tcm" not foundOtherOverrideDisplaysTest.php139Drupal\views\Tests\UI\OverrideDisplaysTest->testWizardMixedDefaultOverriddenDisplays()
HTTP response expected 200, actual 404BrowserOverrideDisplaysTest.php152Drupal\views\Tests\UI\OverrideDisplaysTest->testWizardMixedDefaultOverriddenDisplays()
"ex60idShEXC1P81Z" foundOtherOverrideDisplaysTest.php153Drupal\views\Tests\UI\OverrideDisplaysTest->testWizardMixedDefaultOverriddenDisplays()
HTTP response expected 200, actual 404BrowserOverrideDisplaysTest.php155Drupal\views\Tests\UI\OverrideDisplaysTest->testWizardMixedDefaultOverriddenDisplays()
"ex60idShEXC1P81Z" foundOtherOverrideDisplaysTest.php156Drupal\views\Tests\UI\OverrideDisplaysTest->testWizardMixedDefaultOverriddenDisplays()
"qqmDm5iqoSDXxuwM" not foundOtherOverrideDisplaysTest.php157Drupal\views\Tests\UI\OverrideDisplaysTest->testWizardMixedDefaultOverriddenDisplays()
ExpandDrupal\views\Tests\UI\SettingsTest88022
MessageGroupFilenameLineFunctionStatus
Undefined index: page argumentsNoticeviews.module362views_menu_alter()
Undefined index: access argumentsNoticeviews.module364views_menu_alter()
Undefined index: load argumentsNoticeviews.module365views_menu_alter()
Undefined index: page argumentsNoticeviews.module362views_menu_alter()
Undefined index: access argumentsNoticeviews.module364views_menu_alter()
Undefined index: load argumentsNoticeviews.module365views_menu_alter()
Undefined index: access argumentsNoticeviews.module364views_menu_alter()
Undefined index: page argumentsNoticeviews.module362views_menu_alter()
Undefined index: access argumentsNoticeviews.module364views_menu_alter()
Undefined index: load argumentsNoticeviews.module365views_menu_alter()
Undefined index: access argumentsNoticeviews.module364views_menu_alter()
Undefined index: page argumentsNoticeviews.module362views_menu_alter()
Undefined index: access argumentsNoticeviews.module364views_menu_alter()
Undefined index: load argumentsNoticeviews.module365views_menu_alter()
Undefined index: access argumentsNoticeviews.module364views_menu_alter()
Undefined index: access argumentsNoticeviews.module364views_menu_alter()
Undefined index: page argumentsNoticeviews.module362views_menu_alter()
Undefined index: access argumentsNoticeviews.module364views_menu_alter()
Undefined index: load argumentsNoticeviews.module365views_menu_alter()
Undefined index: access argumentsNoticeviews.module364views_menu_alter()
Undefined index: access argumentsNoticeviews.module364views_menu_alter()
Undefined index: access argumentsNoticeviews.module364views_menu_alter()
ExpandDrupal\views\Tests\Wizard\BasicTest78140
MessageGroupFilenameLineFunctionStatus
HTTP response expected 200, actual 404BrowserBasicTest.php67Drupal\views\Tests\Wizard\BasicTest->testViewsWizardAndListing()
"aqOeEUdmNWbI2r54" foundOtherBasicTest.php72Drupal\views\Tests\Wizard\BasicTest->testViewsWizardAndListing()
"jhGlcGdE" foundOtherBasicTest.php73Drupal\views\Tests\Wizard\BasicTest->testViewsWizardAndListing()
"xkOFMr1B" foundOtherBasicTest.php74Drupal\views\Tests\Wizard\BasicTest->testViewsWizardAndListing()
Link containing href /checkout/qdPq1Fe1zgkOpxga found.OtherBasicTest.php77Drupal\views\Tests\Wizard\BasicTest->testViewsWizardAndListing()
Raw "<rss version="2.0"" foundOtherBasicTest.php79Drupal\views\Tests\Wizard\BasicTest->testViewsWizardAndListing()
"aqOeEUdmNWbI2r54" foundOtherBasicTest.php81Drupal\views\Tests\Wizard\BasicTest->testViewsWizardAndListing()
Raw "http://drupaltestbot659-mysql/checkout/node/1" foundOtherBasicTest.php82Drupal\views\Tests\Wizard\BasicTest->testViewsWizardAndListing()
"jhGlcGdE" foundOtherBasicTest.php83Drupal\views\Tests\Wizard\BasicTest->testViewsWizardAndListing()
Raw "http://drupaltestbot659-mysql/checkout/node/2" foundOtherBasicTest.php84Drupal\views\Tests\Wizard\BasicTest->testViewsWizardAndListing()
"xkOFMr1B" foundOtherBasicTest.php85Drupal\views\Tests\Wizard\BasicTest->testViewsWizardAndListing()
HTTP response expected 200, actual 404BrowserBasicTest.php111Drupal\views\Tests\Wizard\BasicTest->testViewsWizardAndListing()
"cABKg3bQyi0Q5D0F" foundOtherBasicTest.php115Drupal\views\Tests\Wizard\BasicTest->testViewsWizardAndListing()
"jhGlcGdE" foundOtherBasicTest.php116Drupal\views\Tests\Wizard\BasicTest->testViewsWizardAndListing()
ExpandDrupal\views\Tests\Wizard\ItemsPerPageTest3170
MessageGroupFilenameLineFunctionStatus
HTTP response expected 200, actual 404BrowserItemsPerPageTest.php58Drupal\views\Tests\Wizard\ItemsPerPageTest->testItemsPerPage()
"th0AvKBwQEQoPPtr" foundOtherItemsPerPageTest.php63Drupal\views\Tests\Wizard\ItemsPerPageTest->testItemsPerPage()
"agutqwDD" foundOtherItemsPerPageTest.php65Drupal\views\Tests\Wizard\ItemsPerPageTest->testItemsPerPage()
"yOT8DE62" foundOtherItemsPerPageTest.php66Drupal\views\Tests\Wizard\ItemsPerPageTest->testItemsPerPage()
"mCWuHz30" foundOtherItemsPerPageTest.php67Drupal\views\Tests\Wizard\ItemsPerPageTest->testItemsPerPage()
"hvECJEq4" foundOtherItemsPerPageTest.php68Drupal\views\Tests\Wizard\ItemsPerPageTest->testItemsPerPage()
The nodes appear in the expected order in the page display.OtherItemsPerPageTest.php75Drupal\views\Tests\Wizard\ItemsPerPageTest->testItemsPerPage()
ExpandDrupal\views\Tests\Wizard\MenuTest1720
MessageGroupFilenameLineFunctionStatus
Link with label c5mAVCRynxIq2HOX found.OtherMenuTest.php44Drupal\views\Tests\Wizard\MenuTest->testMenus()
Link containing href /checkout/r0DTZ3v8ynz9DssI found.OtherMenuTest.php45Drupal\views\Tests\Wizard\MenuTest->testMenus()
ExpandDrupal\views\Tests\Wizard\SortingTest23120
MessageGroupFilenameLineFunctionStatus
HTTP response expected 200, actual 404BrowserSortingTest.php44Drupal\views\Tests\Wizard\SortingTest->testSorting()
"og4Hgm7ffmmYHGRe" foundOtherSortingTest.php48Drupal\views\Tests\Wizard\SortingTest->testSorting()
"lz1GRtPt" foundOtherSortingTest.php50Drupal\views\Tests\Wizard\SortingTest->testSorting()
"h0Ij46vo" foundOtherSortingTest.php51Drupal\views\Tests\Wizard\SortingTest->testSorting()
"nmRtW1eO" foundOtherSortingTest.php52Drupal\views\Tests\Wizard\SortingTest->testSorting()
The nodes appear in the expected order in a view that sorts by oldest first.OtherSortingTest.php56Drupal\views\Tests\Wizard\SortingTest->testSorting()
HTTP response expected 200, actual 404BrowserSortingTest.php69Drupal\views\Tests\Wizard\SortingTest->testSorting()
"taNwKyYsPlUyeKxz" foundOtherSortingTest.php73Drupal\views\Tests\Wizard\SortingTest->testSorting()
"nmRtW1eO" foundOtherSortingTest.php75Drupal\views\Tests\Wizard\SortingTest->testSorting()
"h0Ij46vo" foundOtherSortingTest.php76Drupal\views\Tests\Wizard\SortingTest->testSorting()
"lz1GRtPt" foundOtherSortingTest.php77Drupal\views\Tests\Wizard\SortingTest->testSorting()
The nodes appear in the expected order in a view that sorts by newest first.OtherSortingTest.php81Drupal\views\Tests\Wizard\SortingTest->testSorting()
ExpandDrupal\views\Tests\Wizard\TaggedWithTest7440
MessageGroupFilenameLineFunctionStatus
HTTP response expected 200, actual 404BrowserTaggedWithTest.php138Drupal\views\Tests\Wizard\TaggedWithTest->testTaggedWith()
"dMPvOHSm" foundOtherTaggedWithTest.php139Drupal\views\Tests\Wizard\TaggedWithTest->testTaggedWith()
"b9H3q4e5" foundOtherTaggedWithTest.php140Drupal\views\Tests\Wizard\TaggedWithTest->testTaggedWith()
"b9H3q4e5" foundOtherTaggedWithTest.php160Drupal\views\Tests\Wizard\TaggedWithTest->testTaggedWith()

All

Test namePassFailException
ExpandDrupal\action\Tests\BulkFormTest5410
MessageGroupFilenameLineFunctionStatus
The action select field appears.BrowserBulkFormTest.php45Drupal\action\Tests\BulkFormTest->testBulkForm()
The checkbox on row 0 appears.BrowserBulkFormTest.php50Drupal\action\Tests\BulkFormTest->testBulkForm()
The checkbox on row 1 appears.BrowserBulkFormTest.php50Drupal\action\Tests\BulkFormTest->testBulkForm()
The checkbox on row 2 appears.BrowserBulkFormTest.php50Drupal\action\Tests\BulkFormTest->testBulkForm()
The checkbox on row 3 appears.BrowserBulkFormTest.php50Drupal\action\Tests\BulkFormTest->testBulkForm()
The checkbox on row 4 appears.BrowserBulkFormTest.php50Drupal\action\Tests\BulkFormTest->testBulkForm()
The checkbox on row 5 appears.BrowserBulkFormTest.php50Drupal\action\Tests\BulkFormTest->testBulkForm()
The checkbox on row 6 appears.BrowserBulkFormTest.php50Drupal\action\Tests\BulkFormTest->testBulkForm()
The checkbox on row 7 appears.BrowserBulkFormTest.php50Drupal\action\Tests\BulkFormTest->testBulkForm()
The checkbox on row 8 appears.BrowserBulkFormTest.php50Drupal\action\Tests\BulkFormTest->testBulkForm()
The checkbox on row 9 appears.BrowserBulkFormTest.php50Drupal\action\Tests\BulkFormTest->testBulkForm()
Failed to set field bulk_form[0] to 1OtherBulkFormTest.php56Drupal\action\Tests\BulkFormTest->testBulkForm()
Failed to set field bulk_form[1] to 1OtherBulkFormTest.php56Drupal\action\Tests\BulkFormTest->testBulkForm()
Failed to set field bulk_form[2] to 1OtherBulkFormTest.php56Drupal\action\Tests\BulkFormTest->testBulkForm()
Failed to set field bulk_form[3] to 1OtherBulkFormTest.php56Drupal\action\Tests\BulkFormTest->testBulkForm()
Failed to set field bulk_form[4] to 1OtherBulkFormTest.php56Drupal\action\Tests\BulkFormTest->testBulkForm()
Failed to set field bulk_form[5] to 1OtherBulkFormTest.php56Drupal\action\Tests\BulkFormTest->testBulkForm()
Failed to set field bulk_form[6] to 1OtherBulkFormTest.php56Drupal\action\Tests\BulkFormTest->testBulkForm()
Failed to set field bulk_form[7] to 1OtherBulkFormTest.php56Drupal\action\Tests\BulkFormTest->testBulkForm()
Failed to set field bulk_form[8] to 1OtherBulkFormTest.php56Drupal\action\Tests\BulkFormTest->testBulkForm()
Failed to set field bulk_form[9] to 1OtherBulkFormTest.php56Drupal\action\Tests\BulkFormTest->testBulkForm()
Failed to set field action to node_make_sticky_actionOtherBulkFormTest.php56Drupal\action\Tests\BulkFormTest->testBulkForm()
Found the Apply buttonOtherBulkFormTest.php56Drupal\action\Tests\BulkFormTest->testBulkForm()
Found the requested form fields at OtherBulkFormTest.php56Drupal\action\Tests\BulkFormTest->testBulkForm()
Node 1 got marked as sticky.OtherBulkFormTest.php60Drupal\action\Tests\BulkFormTest->testBulkForm()
Node 2 got marked as sticky.OtherBulkFormTest.php60Drupal\action\Tests\BulkFormTest->testBulkForm()
Node 3 got marked as sticky.OtherBulkFormTest.php60Drupal\action\Tests\BulkFormTest->testBulkForm()
Node 4 got marked as sticky.OtherBulkFormTest.php60Drupal\action\Tests\BulkFormTest->testBulkForm()
Node 5 got marked as sticky.OtherBulkFormTest.php60Drupal\action\Tests\BulkFormTest->testBulkForm()
Node 6 got marked as sticky.OtherBulkFormTest.php60Drupal\action\Tests\BulkFormTest->testBulkForm()
Node 7 got marked as sticky.OtherBulkFormTest.php60Drupal\action\Tests\BulkFormTest->testBulkForm()
Node 8 got marked as sticky.OtherBulkFormTest.php60Drupal\action\Tests\BulkFormTest->testBulkForm()
Node 9 got marked as sticky.OtherBulkFormTest.php60Drupal\action\Tests\BulkFormTest->testBulkForm()
Node 10 got marked as sticky.OtherBulkFormTest.php60Drupal\action\Tests\BulkFormTest->testBulkForm()
"Make content sticky was applied to 10 items." foundOtherBulkFormTest.php63Drupal\action\Tests\BulkFormTest->testBulkForm()
Failed to set field bulk_form[0] to 1OtherBulkFormTest.php70Drupal\action\Tests\BulkFormTest->testBulkForm()
Failed to set field action to node_unpublish_actionOtherBulkFormTest.php70Drupal\action\Tests\BulkFormTest->testBulkForm()
Found the Apply buttonOtherBulkFormTest.php70Drupal\action\Tests\BulkFormTest->testBulkForm()
Found the requested form fields at OtherBulkFormTest.php70Drupal\action\Tests\BulkFormTest->testBulkForm()
"Unpublish content was applied to 1 item." foundOtherBulkFormTest.php72Drupal\action\Tests\BulkFormTest->testBulkForm()
A single node has been unpublished.OtherBulkFormTest.php76Drupal\action\Tests\BulkFormTest->testBulkForm()
LeafDrupal\action\Tests\ConfigurationTest3900
LeafDrupal\action\Tests\LoopTest2100
LeafDrupal\aggregator\Tests\AddFeedTest7300
LeafDrupal\aggregator\Tests\AggregatorConfigurationTest2000
LeafDrupal\aggregator\Tests\AggregatorCronTest5500
LeafDrupal\aggregator\Tests\AggregatorLanguageBlockTest8200
LeafDrupal\aggregator\Tests\AggregatorRenderingTest22000
LeafDrupal\aggregator\Tests\CategorizeFeedItemTest6100
LeafDrupal\aggregator\Tests\CategorizeFeedTest2100
LeafDrupal\aggregator\Tests\FeedParserTest7200
LeafDrupal\aggregator\Tests\ImportOpmlTest6800
LeafDrupal\aggregator\Tests\RemoveFeedItemTest27000
LeafDrupal\aggregator\Tests\RemoveFeedTest2500
LeafDrupal\aggregator\Tests\UpdateFeedItemTest6500
LeafDrupal\aggregator\Tests\UpdateFeedTest7600
LeafDrupal\ban\Tests\IpAddressBlockingTest4300
LeafDrupal\block\Tests\BlockAdminThemeTest1900
LeafDrupal\block\Tests\BlockCacheTest18500
LeafDrupal\block\Tests\BlockHiddenRegionTest1800
LeafDrupal\block\Tests\BlockHtmlIdTest1000
LeafDrupal\block\Tests\BlockInvalidRegionTest2400
LeafDrupal\block\Tests\BlockLanguageTest5100
LeafDrupal\block\Tests\BlockLibrarySearchTest1900
LeafDrupal\block\Tests\BlockStorageUnitTest1800
LeafDrupal\block\Tests\BlockTemplateSuggestionsUnitTest300
LeafDrupal\block\Tests\BlockTest33000
LeafDrupal\block\Tests\BlockTitleXSSTest1500
LeafDrupal\block\Tests\BlockUiTest900
LeafDrupal\block\Tests\NewDefaultThemeBlocksTest1700
LeafDrupal\block\Tests\NonDefaultBlockAdminTest1200
LeafDrupal\block\Tests\Views\DisplayBlockTest3500
LeafDrupal\book\Tests\BookTest50300
LeafDrupal\breakpoint\Tests\BreakpointAPITest600
LeafDrupal\breakpoint\Tests\BreakpointCRUDTest2100
LeafDrupal\breakpoint\Tests\BreakpointGroupAPITest400
LeafDrupal\breakpoint\Tests\BreakpointGroupCRUDTest1200
LeafDrupal\breakpoint\Tests\BreakpointMediaQueryTest6300
LeafDrupal\breakpoint\Tests\BreakpointThemeTest2300
LeafDrupal\color\Tests\ColorTest8700
LeafDrupal\comment\Tests\CommentActionsTest3000
LeafDrupal\comment\Tests\CommentAnonymousTest16300
LeafDrupal\comment\Tests\CommentApprovalTest15200
LeafDrupal\comment\Tests\CommentBlockTest9300
LeafDrupal\comment\Tests\CommentContentRebuildTest3300
LeafDrupal\comment\Tests\CommentCSSTest50100
LeafDrupal\comment\Tests\CommentFieldsTest9800
LeafDrupal\comment\Tests\CommentInterfaceTest25100
LeafDrupal\comment\Tests\CommentLanguageTest7300
ExpandDrupal\comment\Tests\CommentLinksTest109300
MessageGroupFilenameLineFunctionStatus
Changed environment:array ( 'authenticated' => false, 'comment count' => false, 'form' => 'below', 'user_register' => 'visitors', 'contact' => 'optional', 'comments' => 'open', 'access comments' => 0, 'post comments' => 0, 'skip comment approval' => 1, 'edit own comments' => 0, )DebugCommentLinksTest.php194Drupal\comment\Tests\CommentLinksTest->setEnvironment()
Changed environment:array ( 'authenticated' => true, 'comment count' => false, 'form' => 'below', 'user_register' => 'visitors', 'contact' => 'optional', 'comments' => 'open', 'access comments' => 0, 'post comments' => 0, 'skip comment approval' => 1, 'edit own comments' => 0, )DebugCommentLinksTest.php194Drupal\comment\Tests\CommentLinksTest->setEnvironment()
Changed environment:array ( 'authenticated' => false, 'comment count' => true, 'form' => 'below', 'user_register' => 'visitors', 'contact' => 'optional', 'comments' => 'open', 'access comments' => 0, 'post comments' => 0, 'skip comment approval' => 1, 'edit own comments' => 0, )DebugCommentLinksTest.php194Drupal\comment\Tests\CommentLinksTest->setEnvironment()
Changed environment:array ( 'authenticated' => true, 'comment count' => true, 'form' => 'below', 'user_register' => 'visitors', 'contact' => 'optional', 'comments' => 'open', 'access comments' => 0, 'post comments' => 0, 'skip comment approval' => 1, 'edit own comments' => 0, )DebugCommentLinksTest.php194Drupal\comment\Tests\CommentLinksTest->setEnvironment()
Changed environment:array ( 'authenticated' => false, 'comment count' => false, 'form' => 'below', 'user_register' => 'visitors', 'contact' => 'optional', 'comments' => 'open', 'access comments' => 1, 'post comments' => 0, 'skip comment approval' => 1, 'edit own comments' => 0, )DebugCommentLinksTest.php194Drupal\comment\Tests\CommentLinksTest->setEnvironment()
Changed environment:array ( 'authenticated' => true, 'comment count' => false, 'form' => 'below', 'user_register' => 'visitors', 'contact' => 'optional', 'comments' => 'open', 'access comments' => 1, 'post comments' => 0, 'skip comment approval' => 1, 'edit own comments' => 0, )DebugCommentLinksTest.php194Drupal\comment\Tests\CommentLinksTest->setEnvironment()
Changed environment:array ( 'authenticated' => false, 'comment count' => true, 'form' => 'below', 'user_register' => 'visitors', 'contact' => 'optional', 'comments' => 'open', 'access comments' => 1, 'post comments' => 0, 'skip comment approval' => 1, 'edit own comments' => 0, )DebugCommentLinksTest.php194Drupal\comment\Tests\CommentLinksTest->setEnvironment()
Changed environment:array ( 'authenticated' => true, 'comment count' => true, 'form' => 'below', 'user_register' => 'visitors', 'contact' => 'optional', 'comments' => 'open', 'access comments' => 1, 'post comments' => 0, 'skip comment approval' => 1, 'edit own comments' => 0, )DebugCommentLinksTest.php194Drupal\comment\Tests\CommentLinksTest->setEnvironment()
Changed environment:array ( 'authenticated' => false, 'comment count' => false, 'form' => 'below', 'user_register' => 'visitors', 'contact' => 'optional', 'comments' => 'open', 'access comments' => 0, 'post comments' => 1, 'skip comment approval' => 1, 'edit own comments' => 0, )DebugCommentLinksTest.php194Drupal\comment\Tests\CommentLinksTest->setEnvironment()
Changed environment:array ( 'authenticated' => true, 'comment count' => false, 'form' => 'below', 'user_register' => 'visitors', 'contact' => 'optional', 'comments' => 'open', 'access comments' => 0, 'post comments' => 1, 'skip comment approval' => 1, 'edit own comments' => 0, )DebugCommentLinksTest.php194Drupal\comment\Tests\CommentLinksTest->setEnvironment()
Changed environment:array ( 'authenticated' => false, 'comment count' => true, 'form' => 'below', 'user_register' => 'visitors', 'contact' => 'optional', 'comments' => 'open', 'access comments' => 0, 'post comments' => 1, 'skip comment approval' => 1, 'edit own comments' => 0, )DebugCommentLinksTest.php194Drupal\comment\Tests\CommentLinksTest->setEnvironment()
Changed environment:array ( 'authenticated' => true, 'comment count' => true, 'form' => 'below', 'user_register' => 'visitors', 'contact' => 'optional', 'comments' => 'open', 'access comments' => 0, 'post comments' => 1, 'skip comment approval' => 1, 'edit own comments' => 0, )DebugCommentLinksTest.php194Drupal\comment\Tests\CommentLinksTest->setEnvironment()
Changed environment:array ( 'authenticated' => false, 'comment count' => false, 'form' => 'below', 'user_register' => 'visitors', 'contact' => 'optional', 'comments' => 'open', 'access comments' => 1, 'post comments' => 1, 'skip comment approval' => 1, 'edit own comments' => 0, )DebugCommentLinksTest.php194Drupal\comment\Tests\CommentLinksTest->setEnvironment()
Changed environment:array ( 'authenticated' => true, 'comment count' => false, 'form' => 'below', 'user_register' => 'visitors', 'contact' => 'optional', 'comments' => 'open', 'access comments' => 1, 'post comments' => 1, 'skip comment approval' => 1, 'edit own comments' => 0, )DebugCommentLinksTest.php194Drupal\comment\Tests\CommentLinksTest->setEnvironment()
Changed environment:array ( 'authenticated' => false, 'comment count' => true, 'form' => 'below', 'user_register' => 'visitors', 'contact' => 'optional', 'comments' => 'open', 'access comments' => 1, 'post comments' => 1, 'skip comment approval' => 1, 'edit own comments' => 0, )DebugCommentLinksTest.php194Drupal\comment\Tests\CommentLinksTest->setEnvironment()
Changed environment:array ( 'authenticated' => true, 'comment count' => true, 'form' => 'below', 'user_register' => 'visitors', 'contact' => 'optional', 'comments' => 'open', 'access comments' => 1, 'post comments' => 1, 'skip comment approval' => 1, 'edit own comments' => 0, )DebugCommentLinksTest.php194Drupal\comment\Tests\CommentLinksTest->setEnvironment()
Changed environment:array ( 'authenticated' => false, 'comment count' => false, 'form' => 'separate page', 'user_register' => 'visitors', 'contact' => 'optional', 'comments' => 'open', 'access comments' => 0, 'post comments' => 0, 'skip comment approval' => 1, 'edit own comments' => 0, )DebugCommentLinksTest.php194Drupal\comment\Tests\CommentLinksTest->setEnvironment()
Changed environment:array ( 'authenticated' => true, 'comment count' => false, 'form' => 'separate page', 'user_register' => 'visitors', 'contact' => 'optional', 'comments' => 'open', 'access comments' => 0, 'post comments' => 0, 'skip comment approval' => 1, 'edit own comments' => 0, )DebugCommentLinksTest.php194Drupal\comment\Tests\CommentLinksTest->setEnvironment()
Changed environment:array ( 'authenticated' => false, 'comment count' => true, 'form' => 'separate page', 'user_register' => 'visitors', 'contact' => 'optional', 'comments' => 'open', 'access comments' => 0, 'post comments' => 0, 'skip comment approval' => 1, 'edit own comments' => 0, )DebugCommentLinksTest.php194Drupal\comment\Tests\CommentLinksTest->setEnvironment()
Changed environment:array ( 'authenticated' => true, 'comment count' => true, 'form' => 'separate page', 'user_register' => 'visitors', 'contact' => 'optional', 'comments' => 'open', 'access comments' => 0, 'post comments' => 0, 'skip comment approval' => 1, 'edit own comments' => 0, )DebugCommentLinksTest.php194Drupal\comment\Tests\CommentLinksTest->setEnvironment()
Changed environment:array ( 'authenticated' => false, 'comment count' => false, 'form' => 'separate page', 'user_register' => 'visitors', 'contact' => 'optional', 'comments' => 'open', 'access comments' => 1, 'post comments' => 0, 'skip comment approval' => 1, 'edit own comments' => 0, )DebugCommentLinksTest.php194Drupal\comment\Tests\CommentLinksTest->setEnvironment()
Changed environment:array ( 'authenticated' => true, 'comment count' => false, 'form' => 'separate page', 'user_register' => 'visitors', 'contact' => 'optional', 'comments' => 'open', 'access comments' => 1, 'post comments' => 0, 'skip comment approval' => 1, 'edit own comments' => 0, )DebugCommentLinksTest.php194Drupal\comment\Tests\CommentLinksTest->setEnvironment()
Changed environment:array ( 'authenticated' => false, 'comment count' => true, 'form' => 'separate page', 'user_register' => 'visitors', 'contact' => 'optional', 'comments' => 'open', 'access comments' => 1, 'post comments' => 0, 'skip comment approval' => 1, 'edit own comments' => 0, )DebugCommentLinksTest.php194Drupal\comment\Tests\CommentLinksTest->setEnvironment()
Changed environment:array ( 'authenticated' => true, 'comment count' => true, 'form' => 'separate page', 'user_register' => 'visitors', 'contact' => 'optional', 'comments' => 'open', 'access comments' => 1, 'post comments' => 0, 'skip comment approval' => 1, 'edit own comments' => 0, )DebugCommentLinksTest.php194Drupal\comment\Tests\CommentLinksTest->setEnvironment()
Changed environment:array ( 'authenticated' => false, 'comment count' => false, 'form' => 'separate page', 'user_register' => 'visitors', 'contact' => 'optional', 'comments' => 'open', 'access comments' => 0, 'post comments' => 1, 'skip comment approval' => 1, 'edit own comments' => 0, )DebugCommentLinksTest.php194Drupal\comment\Tests\CommentLinksTest->setEnvironment()
Changed environment:array ( 'authenticated' => true, 'comment count' => false, 'form' => 'separate page', 'user_register' => 'visitors', 'contact' => 'optional', 'comments' => 'open', 'access comments' => 0, 'post comments' => 1, 'skip comment approval' => 1, 'edit own comments' => 0, )DebugCommentLinksTest.php194Drupal\comment\Tests\CommentLinksTest->setEnvironment()
Changed environment:array ( 'authenticated' => false, 'comment count' => true, 'form' => 'separate page', 'user_register' => 'visitors', 'contact' => 'optional', 'comments' => 'open', 'access comments' => 0, 'post comments' => 1, 'skip comment approval' => 1, 'edit own comments' => 0, )DebugCommentLinksTest.php194Drupal\comment\Tests\CommentLinksTest->setEnvironment()
Changed environment:array ( 'authenticated' => true, 'comment count' => true, 'form' => 'separate page', 'user_register' => 'visitors', 'contact' => 'optional', 'comments' => 'open', 'access comments' => 0, 'post comments' => 1, 'skip comment approval' => 1, 'edit own comments' => 0, )DebugCommentLinksTest.php194Drupal\comment\Tests\CommentLinksTest->setEnvironment()
Changed environment:array ( 'authenticated' => false, 'comment count' => false, 'form' => 'separate page', 'user_register' => 'visitors', 'contact' => 'optional', 'comments' => 'open', 'access comments' => 1, 'post comments' => 1, 'skip comment approval' => 1, 'edit own comments' => 0, )DebugCommentLinksTest.php194Drupal\comment\Tests\CommentLinksTest->setEnvironment()
Changed environment:array ( 'authenticated' => true, 'comment count' => false, 'form' => 'separate page', 'user_register' => 'visitors', 'contact' => 'optional', 'comments' => 'open', 'access comments' => 1, 'post comments' => 1, 'skip comment approval' => 1, 'edit own comments' => 0, )DebugCommentLinksTest.php194Drupal\comment\Tests\CommentLinksTest->setEnvironment()
Changed environment:array ( 'authenticated' => false, 'comment count' => true, 'form' => 'separate page', 'user_register' => 'visitors', 'contact' => 'optional', 'comments' => 'open', 'access comments' => 1, 'post comments' => 1, 'skip comment approval' => 1, 'edit own comments' => 0, )DebugCommentLinksTest.php194Drupal\comment\Tests\CommentLinksTest->setEnvironment()
Changed environment:array ( 'authenticated' => true, 'comment count' => true, 'form' => 'separate page', 'user_register' => 'visitors', 'contact' => 'optional', 'comments' => 'open', 'access comments' => 1, 'post comments' => 1, 'skip comment approval' => 1, 'edit own comments' => 0, )DebugCommentLinksTest.php194Drupal\comment\Tests\CommentLinksTest->setEnvironment()
Changed environment:array ( 'authenticated' => false, 'comment count' => false, 'form' => 'below', 'user_register' => 'admin_only', 'contact' => 'optional', 'comments' => 'open', 'access comments' => 0, 'post comments' => 0, 'skip comment approval' => 1, 'edit own comments' => 0, )DebugCommentLinksTest.php194Drupal\comment\Tests\CommentLinksTest->setEnvironment()
Changed environment:array ( 'authenticated' => true, 'comment count' => false, 'form' => 'below', 'user_register' => 'admin_only', 'contact' => 'optional', 'comments' => 'open', 'access comments' => 0, 'post comments' => 0, 'skip comment approval' => 1, 'edit own comments' => 0, )DebugCommentLinksTest.php194Drupal\comment\Tests\CommentLinksTest->setEnvironment()
Changed environment:array ( 'authenticated' => false, 'comment count' => true, 'form' => 'below', 'user_register' => 'admin_only', 'contact' => 'optional', 'comments' => 'open', 'access comments' => 0, 'post comments' => 0, 'skip comment approval' => 1, 'edit own comments' => 0, )DebugCommentLinksTest.php194Drupal\comment\Tests\CommentLinksTest->setEnvironment()
Changed environment:array ( 'authenticated' => true, 'comment count' => true, 'form' => 'below', 'user_register' => 'admin_only', 'contact' => 'optional', 'comments' => 'open', 'access comments' => 0, 'post comments' => 0, 'skip comment approval' => 1, 'edit own comments' => 0, )DebugCommentLinksTest.php194Drupal\comment\Tests\CommentLinksTest->setEnvironment()
Changed environment:array ( 'authenticated' => false, 'comment count' => false, 'form' => 'below', 'user_register' => 'admin_only', 'contact' => 'optional', 'comments' => 'open', 'access comments' => 1, 'post comments' => 0, 'skip comment approval' => 1, 'edit own comments' => 0, )DebugCommentLinksTest.php194Drupal\comment\Tests\CommentLinksTest->setEnvironment()
Changed environment:array ( 'authenticated' => true, 'comment count' => false, 'form' => 'below', 'user_register' => 'admin_only', 'contact' => 'optional', 'comments' => 'open', 'access comments' => 1, 'post comments' => 0, 'skip comment approval' => 1, 'edit own comments' => 0, )DebugCommentLinksTest.php194Drupal\comment\Tests\CommentLinksTest->setEnvironment()
Changed environment:array ( 'authenticated' => false, 'comment count' => true, 'form' => 'below', 'user_register' => 'admin_only', 'contact' => 'optional', 'comments' => 'open', 'access comments' => 1, 'post comments' => 0, 'skip comment approval' => 1, 'edit own comments' => 0, )DebugCommentLinksTest.php194Drupal\comment\Tests\CommentLinksTest->setEnvironment()
Changed environment:array ( 'authenticated' => true, 'comment count' => true, 'form' => 'below', 'user_register' => 'admin_only', 'contact' => 'optional', 'comments' => 'open', 'access comments' => 1, 'post comments' => 0, 'skip comment approval' => 1, 'edit own comments' => 0, )DebugCommentLinksTest.php194Drupal\comment\Tests\CommentLinksTest->setEnvironment()
Changed environment:array ( 'authenticated' => false, 'comment count' => false, 'form' => 'below', 'user_register' => 'admin_only', 'contact' => 'optional', 'comments' => 'open', 'access comments' => 0, 'post comments' => 1, 'skip comment approval' => 1, 'edit own comments' => 0, )DebugCommentLinksTest.php194Drupal\comment\Tests\CommentLinksTest->setEnvironment()
Changed environment:array ( 'authenticated' => true, 'comment count' => false, 'form' => 'below', 'user_register' => 'admin_only', 'contact' => 'optional', 'comments' => 'open', 'access comments' => 0, 'post comments' => 1, 'skip comment approval' => 1, 'edit own comments' => 0, )DebugCommentLinksTest.php194Drupal\comment\Tests\CommentLinksTest->setEnvironment()
Changed environment:array ( 'authenticated' => false, 'comment count' => true, 'form' => 'below', 'user_register' => 'admin_only', 'contact' => 'optional', 'comments' => 'open', 'access comments' => 0, 'post comments' => 1, 'skip comment approval' => 1, 'edit own comments' => 0, )DebugCommentLinksTest.php194Drupal\comment\Tests\CommentLinksTest->setEnvironment()
Changed environment:array ( 'authenticated' => true, 'comment count' => true, 'form' => 'below', 'user_register' => 'admin_only', 'contact' => 'optional', 'comments' => 'open', 'access comments' => 0, 'post comments' => 1, 'skip comment approval' => 1, 'edit own comments' => 0, )DebugCommentLinksTest.php194Drupal\comment\Tests\CommentLinksTest->setEnvironment()
Changed environment:array ( 'authenticated' => false, 'comment count' => false, 'form' => 'below', 'user_register' => 'admin_only', 'contact' => 'optional', 'comments' => 'open', 'access comments' => 1, 'post comments' => 1, 'skip comment approval' => 1, 'edit own comments' => 0, )DebugCommentLinksTest.php194Drupal\comment\Tests\CommentLinksTest->setEnvironment()
Changed environment:array ( 'authenticated' => true, 'comment count' => false, 'form' => 'below', 'user_register' => 'admin_only', 'contact' => 'optional', 'comments' => 'open', 'access comments' => 1, 'post comments' => 1, 'skip comment approval' => 1, 'edit own comments' => 0, )DebugCommentLinksTest.php194Drupal\comment\Tests\CommentLinksTest->setEnvironment()
Changed environment:array ( 'authenticated' => false, 'comment count' => true, 'form' => 'below', 'user_register' => 'admin_only', 'contact' => 'optional', 'comments' => 'open', 'access comments' => 1, 'post comments' => 1, 'skip comment approval' => 1, 'edit own comments' => 0, )DebugCommentLinksTest.php194Drupal\comment\Tests\CommentLinksTest->setEnvironment()
Changed environment:array ( 'authenticated' => true, 'comment count' => true, 'form' => 'below', 'user_register' => 'admin_only', 'contact' => 'optional', 'comments' => 'open', 'access comments' => 1, 'post comments' => 1, 'skip comment approval' => 1, 'edit own comments' => 0, )DebugCommentLinksTest.php194Drupal\comment\Tests\CommentLinksTest->setEnvironment()
Changed environment:array ( 'authenticated' => false, 'comment count' => false, 'form' => 'separate page', 'user_register' => 'admin_only', 'contact' => 'optional', 'comments' => 'open', 'access comments' => 0, 'post comments' => 0, 'skip comment approval' => 1, 'edit own comments' => 0, )DebugCommentLinksTest.php194Drupal\comment\Tests\CommentLinksTest->setEnvironment()
Changed environment:array ( 'authenticated' => true, 'comment count' => false, 'form' => 'separate page', 'user_register' => 'admin_only', 'contact' => 'optional', 'comments' => 'open', 'access comments' => 0, 'post comments' => 0, 'skip comment approval' => 1, 'edit own comments' => 0, )DebugCommentLinksTest.php194Drupal\comment\Tests\CommentLinksTest->setEnvironment()
Changed environment:array ( 'authenticated' => false, 'comment count' => true, 'form' => 'separate page', 'user_register' => 'admin_only', 'contact' => 'optional', 'comments' => 'open', 'access comments' => 0, 'post comments' => 0, 'skip comment approval' => 1, 'edit own comments' => 0, )DebugCommentLinksTest.php194Drupal\comment\Tests\CommentLinksTest->setEnvironment()
Changed environment:array ( 'authenticated' => true, 'comment count' => true, 'form' => 'separate page', 'user_register' => 'admin_only', 'contact' => 'optional', 'comments' => 'open', 'access comments' => 0, 'post comments' => 0, 'skip comment approval' => 1, 'edit own comments' => 0, )DebugCommentLinksTest.php194Drupal\comment\Tests\CommentLinksTest->setEnvironment()
Changed environment:array ( 'authenticated' => false, 'comment count' => false, 'form' => 'separate page', 'user_register' => 'admin_only', 'contact' => 'optional', 'comments' => 'open', 'access comments' => 1, 'post comments' => 0, 'skip comment approval' => 1, 'edit own comments' => 0, )DebugCommentLinksTest.php194Drupal\comment\Tests\CommentLinksTest->setEnvironment()
Changed environment:array ( 'authenticated' => true, 'comment count' => false, 'form' => 'separate page', 'user_register' => 'admin_only', 'contact' => 'optional', 'comments' => 'open', 'access comments' => 1, 'post comments' => 0, 'skip comment approval' => 1, 'edit own comments' => 0, )DebugCommentLinksTest.php194Drupal\comment\Tests\CommentLinksTest->setEnvironment()
Changed environment:array ( 'authenticated' => false, 'comment count' => true, 'form' => 'separate page', 'user_register' => 'admin_only', 'contact' => 'optional', 'comments' => 'open', 'access comments' => 1, 'post comments' => 0, 'skip comment approval' => 1, 'edit own comments' => 0, )DebugCommentLinksTest.php194Drupal\comment\Tests\CommentLinksTest->setEnvironment()
Changed environment:array ( 'authenticated' => true, 'comment count' => true, 'form' => 'separate page', 'user_register' => 'admin_only', 'contact' => 'optional', 'comments' => 'open', 'access comments' => 1, 'post comments' => 0, 'skip comment approval' => 1, 'edit own comments' => 0, )DebugCommentLinksTest.php194Drupal\comment\Tests\CommentLinksTest->setEnvironment()
Changed environment:array ( 'authenticated' => false, 'comment count' => false, 'form' => 'separate page', 'user_register' => 'admin_only', 'contact' => 'optional', 'comments' => 'open', 'access comments' => 0, 'post comments' => 1, 'skip comment approval' => 1, 'edit own comments' => 0, )DebugCommentLinksTest.php194Drupal\comment\Tests\CommentLinksTest->setEnvironment()
Changed environment:array ( 'authenticated' => true, 'comment count' => false, 'form' => 'separate page', 'user_register' => 'admin_only', 'contact' => 'optional', 'comments' => 'open', 'access comments' => 0, 'post comments' => 1, 'skip comment approval' => 1, 'edit own comments' => 0, )DebugCommentLinksTest.php194Drupal\comment\Tests\CommentLinksTest->setEnvironment()
Changed environment:array ( 'authenticated' => false, 'comment count' => true, 'form' => 'separate page', 'user_register' => 'admin_only', 'contact' => 'optional', 'comments' => 'open', 'access comments' => 0, 'post comments' => 1, 'skip comment approval' => 1, 'edit own comments' => 0, )DebugCommentLinksTest.php194Drupal\comment\Tests\CommentLinksTest->setEnvironment()
Changed environment:array ( 'authenticated' => true, 'comment count' => true, 'form' => 'separate page', 'user_register' => 'admin_only', 'contact' => 'optional', 'comments' => 'open', 'access comments' => 0, 'post comments' => 1, 'skip comment approval' => 1, 'edit own comments' => 0, )DebugCommentLinksTest.php194Drupal\comment\Tests\CommentLinksTest->setEnvironment()
Changed environment:array ( 'authenticated' => false, 'comment count' => false, 'form' => 'separate page', 'user_register' => 'admin_only', 'contact' => 'optional', 'comments' => 'open', 'access comments' => 1, 'post comments' => 1, 'skip comment approval' => 1, 'edit own comments' => 0, )DebugCommentLinksTest.php194Drupal\comment\Tests\CommentLinksTest->setEnvironment()
Changed environment:array ( 'authenticated' => true, 'comment count' => false, 'form' => 'separate page', 'user_register' => 'admin_only', 'contact' => 'optional', 'comments' => 'open', 'access comments' => 1, 'post comments' => 1, 'skip comment approval' => 1, 'edit own comments' => 0, )DebugCommentLinksTest.php194Drupal\comment\Tests\CommentLinksTest->setEnvironment()
Changed environment:array ( 'authenticated' => false, 'comment count' => true, 'form' => 'separate page', 'user_register' => 'admin_only', 'contact' => 'optional', 'comments' => 'open', 'access comments' => 1, 'post comments' => 1, 'skip comment approval' => 1, 'edit own comments' => 0, )DebugCommentLinksTest.php194Drupal\comment\Tests\CommentLinksTest->setEnvironment()
Changed environment:array ( 'authenticated' => true, 'comment count' => true, 'form' => 'separate page', 'user_register' => 'admin_only', 'contact' => 'optional', 'comments' => 'open', 'access comments' => 1, 'post comments' => 1, 'skip comment approval' => 1, 'edit own comments' => 0, )DebugCommentLinksTest.php194Drupal\comment\Tests\CommentLinksTest->setEnvironment()
LeafDrupal\comment\Tests\CommentNewIndicatorTest4200
LeafDrupal\comment\Tests\CommentNodeAccessTest5700
LeafDrupal\comment\Tests\CommentNodeChangesTest2400
LeafDrupal\comment\Tests\CommentPagerTest21300
LeafDrupal\comment\Tests\CommentPreviewTest9800
LeafDrupal\comment\Tests\CommentRssTest2600
LeafDrupal\comment\Tests\CommentStatisticsTest9800
LeafDrupal\comment\Tests\CommentThreadingTest15900
LeafDrupal\comment\Tests\CommentTokenReplaceTest6600
LeafDrupal\comment\Tests\CommentTranslationUITest10600
LeafDrupal\comment\Tests\Views\ArgumentUserUIDTest900
LeafDrupal\comment\Tests\Views\DefaultViewRecentComments800
LeafDrupal\comment\Tests\Views\FilterUserUIDTest900
ExpandDrupal\comment\Tests\Views\RowRssTest1022
MessageGroupFilenameLineFunctionStatus
Just one comment was found in the rss output.OtherRowRssTest.php39Drupal\comment\Tests\Views\RowRssTest->testRssRow()
Undefined offset: 0Drupal\comment\Tests\Views\RowRssTest->testRssRow() Drupal\simpletest\TestBase->run() simpletest_script_run_one_test('689', 'Drupal\comment\Tests\Views\RowRssTest') NoticeRowRssTest.php41Drupal\comment\Tests\Views\RowRssTest->testRssRow()
Trying to get property of non-objectDrupal\comment\Tests\Views\RowRssTest->testRssRow() Drupal\simpletest\TestBase->run() simpletest_script_run_one_test('689', 'Drupal\comment\Tests\Views\RowRssTest') NoticeRowRssTest.php41Drupal\comment\Tests\Views\RowRssTest->testRssRow()
The right pubDate appears in the rss output.OtherRowRssTest.php41Drupal\comment\Tests\Views\RowRssTest->testRssRow()
ExpandDrupal\comment\Tests\Views\WizardTest3303
MessageGroupFilenameLineFunctionStatus
Undefined index: page argumentsNoticeviews.module362views_menu_alter()
Undefined index: access argumentsNoticeviews.module364views_menu_alter()
Undefined index: load argumentsNoticeviews.module365views_menu_alter()
LeafDrupal\config\Tests\ConfigCRUDTest2600
LeafDrupal\config\Tests\ConfigEntityListTest6800
LeafDrupal\config\Tests\ConfigEntityTest13800
LeafDrupal\config\Tests\ConfigEntityUnitTest100
LeafDrupal\config\Tests\ConfigFileContentTest3100
LeafDrupal\config\Tests\ConfigImportTest3800
LeafDrupal\config\Tests\ConfigImportUITest4600
LeafDrupal\config\Tests\ConfigInstallTest1500
LeafDrupal\config\Tests\ConfigOverrideTest1800
LeafDrupal\config\Tests\ConfigSchemaTest2000
LeafDrupal\config\Tests\ConfigUpgradeTest1200
LeafDrupal\config\Tests\LocaleConfigOverride200
LeafDrupal\config\Tests\Storage\DatabaseStorageTest2100
LeafDrupal\config\Tests\Storage\FileStorageTest2300
LeafDrupal\contact\Tests\ContactAuthenticatedUserTest1300
LeafDrupal\contact\Tests\ContactPersonalTest16200
LeafDrupal\contact\Tests\ContactSitewideTest24500
LeafDrupal\contact\Tests\ContactUpgradePathTest4400
LeafDrupal\contact\Tests\Views\ContactFieldsTest600
LeafDrupal\contextual\Tests\ContextualDynamicContextTest1600
LeafDrupal\dblog\Tests\DBLogTest37700
LeafDrupal\editor\Tests\EditorAdminTest4600
LeafDrupal\editor\Tests\EditorLoadingTest6800
LeafDrupal\editor\Tests\EditorManagerTest1200
LeafDrupal\edit\Tests\EditorSelectionTest1000
LeafDrupal\edit\Tests\MetadataGeneratorTest300
LeafDrupal\email\Tests\EmailFieldTest1900
LeafDrupal\email\Tests\EmailItemTest600
LeafDrupal\entity\Tests\EntityDisplayTest2900
LeafDrupal\entity_reference\Tests\EntityReferenceAdminTest2900
LeafDrupal\entity_reference\Tests\EntityReferenceAutocompleteTest1700
LeafDrupal\entity_reference\Tests\EntityReferenceAutoCreateTest1800
LeafDrupal\entity_reference\Tests\EntityReferenceItemTest1000
LeafDrupal\entity_reference\Tests\EntityReferenceSelectionAccessTest6900
LeafDrupal\entity_reference\Tests\EntityReferenceSelectionSortTest700
LeafDrupal\field\Tests\BulkDeleteTest7500
LeafDrupal\field\Tests\CrudTest7500
LeafDrupal\field\Tests\DisplayApiTest4600
LeafDrupal\field\Tests\EntityPropertiesTest400
LeafDrupal\field\Tests\FieldAccessTest2100
LeafDrupal\field\Tests\FieldAttachOtherTest10300
LeafDrupal\field\Tests\FieldAttachStorageTest9400
LeafDrupal\field\Tests\FieldInfoTest7300
LeafDrupal\field\Tests\FieldInstanceCrudTest2800
LeafDrupal\field\Tests\FormTest28100
LeafDrupal\field\Tests\ShapeItemTest1000
LeafDrupal\field\Tests\TestItemTest600
LeafDrupal\field\Tests\TranslationTest9900
LeafDrupal\field\Tests\Views\ApiDataTest1500
LeafDrupal\field\Tests\Views\FieldUITest2800
LeafDrupal\field\Tests\Views\HandlerFieldFieldTest2400
LeafDrupal\field_sql_storage\Tests\FieldSqlStorageTest9200
LeafDrupal\field_ui\Tests\AlterTest2100
LeafDrupal\field_ui\Tests\ManageDisplayTest14900
LeafDrupal\field_ui\Tests\ManageFieldsTest29400
LeafDrupal\file\Tests\CopyTest11000
LeafDrupal\file\Tests\DeleteTest2400
LeafDrupal\file\Tests\DownloadTest4500
LeafDrupal\file\Tests\FileFieldDisplayTest5100
LeafDrupal\file\Tests\FileFieldPathTest2800
LeafDrupal\file\Tests\FileFieldRevisionTest6800
LeafDrupal\file\Tests\FileFieldRSSContentTest2400
LeafDrupal\file\Tests\FileFieldValidateTest12100
LeafDrupal\file\Tests\FileFieldWidgetTest29900
LeafDrupal\file\Tests\FileManagedFileElementTest26900
LeafDrupal\file\Tests\FilePrivateTest3800
LeafDrupal\file\Tests\FileTokenReplaceTest3600
LeafDrupal\file\Tests\LoadTest3400
LeafDrupal\file\Tests\MoveTest11000
LeafDrupal\file\Tests\RemoteFileSaveUploadTest27000
LeafDrupal\file\Tests\SaveDataTest9300
LeafDrupal\file\Tests\SaveTest1600
LeafDrupal\file\Tests\SaveUploadTest27000
LeafDrupal\file\Tests\SpaceUsedTest1200
LeafDrupal\file\Tests\UsageTest3400
LeafDrupal\file\Tests\ValidateTest1200
LeafDrupal\file\Tests\ValidatorTest2900
LeafDrupal\filter\Tests\FilterAdminTest24200
LeafDrupal\filter\Tests\FilterAPITest500
LeafDrupal\filter\Tests\FilterCrudTest12200
LeafDrupal\filter\Tests\FilterDefaultConfigTest2800
LeafDrupal\filter\Tests\FilterDefaultFormatTest3300
LeafDrupal\filter\Tests\FilterFormatAccessTest27200
LeafDrupal\filter\Tests\FilterHooksTest3300
LeafDrupal\filter\Tests\FilterHtmlImageSecureTest4600
LeafDrupal\filter\Tests\FilterNoFormatTest100
LeafDrupal\filter\Tests\FilterSecurityTest4000
LeafDrupal\filter\Tests\FilterSettingsTest1200
LeafDrupal\filter\Tests\FilterUnitTest21500
LeafDrupal\forum\Tests\ForumBlockTest16700
LeafDrupal\forum\Tests\ForumIndexTest4800
LeafDrupal\forum\Tests\ForumNodeAccessTest5200
LeafDrupal\forum\Tests\ForumTest64700
LeafDrupal\help\Tests\HelpTest29600
LeafDrupal\help\Tests\NoHelpTest1200
LeafDrupal\history\Tests\Views\HistoryTimestampTest1200
LeafDrupal\image\Tests\ImageAdminStylesTest20500
LeafDrupal\image\Tests\ImageDimensionsScaleUnitTest1500
LeafDrupal\image\Tests\ImageDimensionsTest5600
LeafDrupal\image\Tests\ImageEffectsTest4300
LeafDrupal\image\Tests\ImageFieldDefaultImagesTest4000
LeafDrupal\image\Tests\ImageFieldDisplayTest15900
LeafDrupal\image\Tests\ImageFieldValidateTest3800
LeafDrupal\image\Tests\ImageStylesPathAndUrlTest7100
LeafDrupal\image\Tests\ImageThemeFunctionTest500
LeafDrupal\jsonld\Tests\NormalizeDenormalizeTest1400
LeafDrupal\jsonld\Tests\RdfSchemaSerializationTest400
LeafDrupal\jsonld\Tests\SupportsSerializationTest1000
LeafDrupal\language\Tests\LanguageBrowserDetectionUnitTest10700
LeafDrupal\language\Tests\LanguageConfigurationElementTest5400
LeafDrupal\language\Tests\LanguageConfigurationTest7500
LeafDrupal\language\Tests\LanguageCustomLanguageConfigurationTest3600
LeafDrupal\language\Tests\LanguageDependencyInjectionTest1700
LeafDrupal\language\Tests\LanguageListTest10000
LeafDrupal\language\Tests\LanguageNegotiationInfoTest4900
LeafDrupal\language\Tests\LanguagePathMonolingualTest3500
LeafDrupal\language\Tests\LanguageSwitchingTest2200
LeafDrupal\language\Tests\LanguageUILanguageNegotiationTest14500
LeafDrupal\language\Tests\LanguageUrlRewritingTest4400
LeafDrupal\language\Tests\Views\ArgumentLanguageTest200
LeafDrupal\language\Tests\Views\FieldLanguageTest200
LeafDrupal\language\Tests\Views\FilterLanguageTest200
LeafDrupal\layout\Tests\DisplayInternalLogicTest1200
LeafDrupal\layout\Tests\LayoutDerivativesTest2400
LeafDrupal\link\Tests\LinkFieldTest14000
LeafDrupal\link\Tests\LinkFieldUITest2100
LeafDrupal\locale\Tests\LocaleContentTest17000
LeafDrupal\locale\Tests\LocaleExportTest5700
LeafDrupal\locale\Tests\LocaleImportFunctionalTest16600
LeafDrupal\locale\Tests\LocaleInstallTest200
LeafDrupal\locale\Tests\LocaleJavascriptTranslation6600
LeafDrupal\locale\Tests\LocaleLibraryInfoAlterTest200
LeafDrupal\locale\Tests\LocalePathTest5100
LeafDrupal\locale\Tests\LocalePluralFormatTest16000
LeafDrupal\locale\Tests\LocaleStringTest2600
LeafDrupal\locale\Tests\LocaleTranslationTest35800
LeafDrupal\locale\Tests\LocaleUninstallFrenchTest3600
LeafDrupal\locale\Tests\LocaleUninstallTest3600
LeafDrupal\locale\Tests\LocaleUpdateInterfaceTest4600
LeafDrupal\locale\Tests\LocaleUpdateTest46300
LeafDrupal\menu\Tests\MenuNodeTest6100
LeafDrupal\menu\Tests\MenuTest161900
LeafDrupal\minimal\Tests\MinimalTest1600
LeafDrupal\node\Tests\MultiStepNodeFormBasicOptionsTest1700
LeafDrupal\node\Tests\NodeAccessBaseTableTest15900
LeafDrupal\node\Tests\NodeAccessFieldTest5000
LeafDrupal\node\Tests\NodeAccessLanguageTest2500
LeafDrupal\node\Tests\NodeAccessPagerTest3000
LeafDrupal\node\Tests\NodeAccessRebuildTest1900
LeafDrupal\node\Tests\NodeAccessRecordsTest2600
LeafDrupal\node\Tests\NodeAccessTest3400
LeafDrupal\node\Tests\NodeAdminTest14500
LeafDrupal\node\Tests\NodeBlockFunctionalTest6300
LeafDrupal\node\Tests\NodeBuildContentTest400
LeafDrupal\node\Tests\NodeCreationTest4900
LeafDrupal\node\Tests\NodeEntityFieldQueryAlterTest3200
LeafDrupal\node\Tests\NodeEntityViewModeAlterTest2000
LeafDrupal\node\Tests\NodeFeedTest100
LeafDrupal\node\Tests\NodeFieldMultilingualTestCase6400
LeafDrupal\node\Tests\NodeFormButtonsTest12500
LeafDrupal\node\Tests\NodeLoadHooksTest700
LeafDrupal\node\Tests\NodeLoadMultipleTest2700
LeafDrupal\node\Tests\NodePostSettingsTest5900
LeafDrupal\node\Tests\NodeQueryAlterTest12600
LeafDrupal\node\Tests\NodeRevisionPermissionsTest6800
LeafDrupal\node\Tests\NodeRevisionsAllTestCase4900
LeafDrupal\node\Tests\NodeRevisionsTest11000
LeafDrupal\node\Tests\NodeRSSContentTest4200
LeafDrupal\node\Tests\NodeSaveTest6100
LeafDrupal\node\Tests\NodeSyndicateBlockTest1400
LeafDrupal\node\Tests\NodeTitleTest2300
LeafDrupal\node\Tests\NodeTitleXSSTest2300
LeafDrupal\node\Tests\NodeTokenReplaceTest4000
LeafDrupal\node\Tests\NodeTranslationUITest15200
LeafDrupal\node\Tests\NodeTypeInitialLanguageTest8000
LeafDrupal\node\Tests\NodeTypePersistenceTest6500
LeafDrupal\node\Tests\NodeTypeTest13000
LeafDrupal\node\Tests\PageEditTest9700
LeafDrupal\node\Tests\PagePreviewTest4100
LeafDrupal\node\Tests\PageViewTest3400
LeafDrupal\node\Tests\SummaryLengthTest1200
LeafDrupal\node\Tests\Views\FieldTypeTest200
LeafDrupal\node\Tests\Views\FilterUidRevisionTest400
LeafDrupal\node\Tests\Views\RevisionRelationships300
ExpandDrupal\node\Tests\Views\StatusExtraTest6080
MessageGroupFilenameLineFunctionStatus
"uyxaKgW4" foundOtherStatusExtraTest.php59Drupal\node\Tests\Views\StatusExtraTest->testStatusExtra()
"nmPkYBxx" foundOtherStatusExtraTest.php60Drupal\node\Tests\Views\StatusExtraTest->testStatusExtra()
"r3CvmpFM" foundOtherStatusExtraTest.php61Drupal\node\Tests\Views\StatusExtraTest->testStatusExtra()
"mIF0CBDS" foundOtherStatusExtraTest.php62Drupal\node\Tests\Views\StatusExtraTest->testStatusExtra()
"uyxaKgW4" foundOtherStatusExtraTest.php67Drupal\node\Tests\Views\StatusExtraTest->testStatusExtra()
"r3CvmpFM" foundOtherStatusExtraTest.php69Drupal\node\Tests\Views\StatusExtraTest->testStatusExtra()
"uyxaKgW4" foundOtherStatusExtraTest.php75Drupal\node\Tests\Views\StatusExtraTest->testStatusExtra()
"uyxaKgW4" foundOtherStatusExtraTest.php84Drupal\node\Tests\Views\StatusExtraTest->testStatusExtra()
LeafDrupal\number\Tests\NumberFieldTest8800
LeafDrupal\number\Tests\NumberItemTest1800
LeafDrupal\openid\Tests\OpenIDFunctionalTest38400
LeafDrupal\openid\Tests\OpenIDRegistrationTest19900
LeafDrupal\openid\Tests\OpenIDTest3800
LeafDrupal\openid\Tests\Upgrade\OpenIDAuthmapUpgradePathTest2600
LeafDrupal\options\Tests\OptionsDynamicValuesValidationTest900
LeafDrupal\options\Tests\OptionsFieldTest1600
LeafDrupal\options\Tests\OptionsFieldUITest22200
LeafDrupal\options\Tests\OptionsSelectDynamicValuesTest1600
LeafDrupal\options\Tests\OptionsWidgetsTest26100
LeafDrupal\path\Tests\PathAliasTest13800
LeafDrupal\path\Tests\PathLanguageTest7500
LeafDrupal\path\Tests\PathLanguageUiTest9000
LeafDrupal\path\Tests\PathTaxonomyTermTest3700
LeafDrupal\php\Tests\PhpAccessTest3800
LeafDrupal\php\Tests\PhpFilterTest4200
LeafDrupal\picture\Tests\PictureAdminUITest5400
LeafDrupal\picture\Tests\PictureFieldDisplayTest11500
LeafDrupal\rdf\Tests\CommentAttributesTest11800
LeafDrupal\rdf\Tests\CrudTest1000
LeafDrupal\rdf\Tests\GetNamespacesTest700
LeafDrupal\rdf\Tests\GetRdfNamespacesTest500
LeafDrupal\rdf\Tests\MappingDefinitionTest5900
LeafDrupal\rdf\Tests\MappingHookTest600
LeafDrupal\rdf\Tests\RdfaMarkupTest3700
LeafDrupal\rdf\Tests\RdfMappingEventTest300
LeafDrupal\rdf\Tests\SiteSchemaTest300
LeafDrupal\rdf\Tests\TrackerAttributesTest3000
LeafDrupal\rest\Tests\CreateTest3700
LeafDrupal\rest\Tests\DBLogTest1800
LeafDrupal\rest\Tests\DeleteTest8900
LeafDrupal\rest\Tests\ReadTest3500
LeafDrupal\rest\Tests\UpdateTest7500
ExpandDrupal\rest\Tests\Views\StyleSerializerTest42100
MessageGroupFilenameLineFunctionStatus
HTTP response expected 200, actual 404BrowserStyleSerializerTest.php75Drupal\rest\Tests\Views\StyleSerializerTest->testSerializerResponses()
The expected JSON output was found.OtherStyleSerializerTest.php95Drupal\rest\Tests\Views\StyleSerializerTest->testSerializerResponses()
The expected JSON preview output was found.OtherStyleSerializerTest.php103Drupal\rest\Tests\Views\StyleSerializerTest->testSerializerResponses()
HTTP response expected 403, actual 500BrowserStyleSerializerTest.php107Drupal\rest\Tests\Views\StyleSerializerTest->testSerializerResponses()
HTTP response expected 200, actual 404BrowserStyleSerializerTest.php126Drupal\rest\Tests\Views\StyleSerializerTest->testSerializerResponses()
The expected JSON output was found.OtherStyleSerializerTest.php128Drupal\rest\Tests\Views\StyleSerializerTest->testSerializerResponses()
The expected JSONLD output was found.OtherStyleSerializerTest.php132Drupal\rest\Tests\Views\StyleSerializerTest->testSerializerResponses()
The expected JSONLD output was found.OtherStyleSerializerTest.php136Drupal\rest\Tests\Views\StyleSerializerTest->testSerializerResponses()
Value NULL is identical to value array ( 0 => array ( 'name' => 'George', 'nothing' => 'TEST', ), 1 => array ( 'name' => 'Ringo', 'nothing' => 'TEST', ), 2 => array ( 'name' => 'Meredith', 'nothing' => 'TEST', ), 3 => array ( 'name' => 'Paul', 'nothing' => 'TEST', ), 4 => array ( 'name' => 'John', 'nothing' => 'TEST', ), ).OtherStyleSerializerTest.php175Drupal\rest\Tests\Views\StyleSerializerTest->testUIFieldAlias()
Value NULL is identical to value array ( 0 => array ( 'cGb7GuoB' => 'George', 'bOrfREQE' => 'TEST', ), 1 => array ( 'cGb7GuoB' => 'Ringo', 'bOrfREQE' => 'TEST', ), 2 => array ( 'cGb7GuoB' => 'Meredith', 'bOrfREQE' => 'TEST', ), 3 => array ( 'cGb7GuoB' => 'Paul', 'bOrfREQE' => 'TEST', ), 4 => array ( 'cGb7GuoB' => 'John', 'bOrfREQE' => 'TEST', ), ).OtherStyleSerializerTest.php211Drupal\rest\Tests\Views\StyleSerializerTest->testUIFieldAlias()
LeafDrupal\search\Tests\SearchAdvancedSearchFormTest3400
LeafDrupal\search\Tests\SearchBlockTest3800
LeafDrupal\search\Tests\SearchCommentCountToggleTest3100
LeafDrupal\search\Tests\SearchCommentTest19300
LeafDrupal\search\Tests\SearchConfigSettingsFormTest15900
LeafDrupal\search\Tests\SearchEmbedFormTest3200
LeafDrupal\search\Tests\SearchExactTest2500
LeafDrupal\search\Tests\SearchExcerptTest1800
LeafDrupal\search\Tests\SearchExpressionInsertExtractTest2400
LeafDrupal\search\Tests\SearchKeywordsConditionsTest2800
LeafDrupal\search\Tests\SearchLanguageTest4100
LeafDrupal\search\Tests\SearchMatchTest14700
LeafDrupal\search\Tests\SearchMultilingualEntityTest1000
LeafDrupal\search\Tests\SearchNodeAccessTest1600
LeafDrupal\search\Tests\SearchNumberMatchingTest29500
LeafDrupal\search\Tests\SearchNumbersTest17500
LeafDrupal\search\Tests\SearchPageOverrideTest1500
LeafDrupal\search\Tests\SearchPageTextTest3700
LeafDrupal\search\Tests\SearchPreprocessLangcodeTest3900
LeafDrupal\search\Tests\SearchRankingTest5900
LeafDrupal\search\Tests\SearchSimplifyTest65700
LeafDrupal\search\Tests\SearchTokenizerTest800
LeafDrupal\shortcut\Tests\ShortcutLinksTest14800
LeafDrupal\shortcut\Tests\ShortcutSetsTest21600
LeafDrupal\simpletest\Tests\BrokenSetUpTest2100
LeafDrupal\simpletest\Tests\BrowserTest1600
LeafDrupal\simpletest\Tests\DrupalUnitTestBaseTest4000
LeafDrupal\simpletest\Tests\FolderTest200
LeafDrupal\simpletest\Tests\InstallationProfileModuleTestsTest1900
LeafDrupal\simpletest\Tests\MailCaptureTest1200
LeafDrupal\simpletest\Tests\MissingCheckedRequirementsTest1900
LeafDrupal\simpletest\Tests\OtherInstallationProfileModuleTestsTest1200
LeafDrupal\simpletest\Tests\SimpleTestTest11400
LeafDrupal\simpletest\Tests\UserHelpersTest4600
LeafDrupal\standard\Tests\StandardTest700
LeafDrupal\statistics\Tests\StatisticsAdminTest5800
LeafDrupal\statistics\Tests\StatisticsLoggingTest2100
LeafDrupal\statistics\Tests\StatisticsReportsTest1900
LeafDrupal\statistics\Tests\StatisticsTokenReplaceTest3000
LeafDrupal\syslog\Tests\SyslogTest1700
LeafDrupal\system\Tests\Ajax\AjaxCommandsUnitTest1600
LeafDrupal\system\Tests\Ajax\CommandsTest7700
LeafDrupal\system\Tests\Ajax\DialogTest300
LeafDrupal\system\Tests\Ajax\ElementValidationTest700
LeafDrupal\system\Tests\Ajax\FormValuesTest2900
LeafDrupal\system\Tests\Ajax\FrameworkTest3400
LeafDrupal\system\Tests\Ajax\MultiFormTest3700
LeafDrupal\system\Tests\Batch\PageTest1600
LeafDrupal\system\Tests\Batch\PercentagesUnitTest1800
LeafDrupal\system\Tests\Batch\ProcessingTest16100
LeafDrupal\system\Tests\Bootstrap\GetFilenameUnitTest600
LeafDrupal\system\Tests\Bootstrap\HookBootExitTest1900
LeafDrupal\system\Tests\Bootstrap\IpAddressTest1100
LeafDrupal\system\Tests\Bootstrap\MiscUnitTest400
LeafDrupal\system\Tests\Bootstrap\OverrideServerVariablesUnitTest600
LeafDrupal\system\Tests\Bootstrap\PageCacheTest7900
LeafDrupal\system\Tests\Bootstrap\ResettableStaticUnitTest500
LeafDrupal\system\Tests\Bootstrap\TimerUnitTest500
LeafDrupal\system\Tests\Bootstrap\VariableTest900
LeafDrupal\system\Tests\Bundle\BundleTest900
LeafDrupal\system\Tests\Cache\BackendChainImplementationUnitTest4800
LeafDrupal\system\Tests\Cache\BackendChainUnitTest12600
LeafDrupal\system\Tests\Cache\ClearTest900
LeafDrupal\system\Tests\Cache\DatabaseBackendUnitTest12600
LeafDrupal\system\Tests\Cache\MemoryBackendUnitTest12600
LeafDrupal\system\Tests\Cache\NullBackendTest200
LeafDrupal\system\Tests\Common\AddFeedTest700
LeafDrupal\system\Tests\Common\AlterTest700
LeafDrupal\system\Tests\Common\AttributesUnitTest700
LeafDrupal\system\Tests\Common\AutocompleteTagsUnitTest800
LeafDrupal\system\Tests\Common\CascadingStylesheetsTest4200
LeafDrupal\system\Tests\Common\CascadingStylesheetsUnitTest1200
LeafDrupal\system\Tests\Common\ColorTest8500
LeafDrupal\system\Tests\Common\FormatDateTest7300
LeafDrupal\system\Tests\Common\GotoTest2700
LeafDrupal\system\Tests\Common\HtmlIdentifierUnitTest1000
LeafDrupal\system\Tests\Common\HttpRequestTest3600
LeafDrupal\system\Tests\Common\InstallerLanguageTest800
LeafDrupal\system\Tests\Common\JavaScriptTest9100
LeafDrupal\system\Tests\Common\JsonUnitTest2100
LeafDrupal\system\Tests\Common\NestedArrayUnitTest1400
LeafDrupal\system\Tests\Common\ParseInfoFileUnitTest300
LeafDrupal\system\Tests\Common\RegionContentTest1800
LeafDrupal\system\Tests\Common\RenderTest5400
LeafDrupal\system\Tests\Common\SimpleTestErrorCollectorTest1600
LeafDrupal\system\Tests\Common\SizeUnitTest3500
LeafDrupal\system\Tests\Common\SystemListingTest600
LeafDrupal\system\Tests\Common\TableSortExtenderUnitTest600
LeafDrupal\system\Tests\Common\UrlTest7000
LeafDrupal\system\Tests\Common\ValidNumberStepUnitTest2400
LeafDrupal\system\Tests\Common\ValidUrlUnitTest7900
LeafDrupal\system\Tests\Common\WriteRecordTest3400
LeafDrupal\system\Tests\Common\XssUnitTest1700
LeafDrupal\system\Tests\Database\AlterTest2000
LeafDrupal\system\Tests\Database\BasicSyntaxTest600
LeafDrupal\system\Tests\Database\CaseSensitivityTest200
LeafDrupal\system\Tests\Database\ConnectionTest1400
LeafDrupal\system\Tests\Database\ConnectionUnitTest1200
LeafDrupal\system\Tests\Database\DatabaseExceptionWrapperTest100
LeafDrupal\system\Tests\Database\DeleteTruncateTest500
LeafDrupal\system\Tests\Database\EmptyStatementTest400
LeafDrupal\system\Tests\Database\FetchTest2400
LeafDrupal\system\Tests\Database\InsertDefaultsTest400
LeafDrupal\system\Tests\Database\InsertLobTest300
LeafDrupal\system\Tests\Database\InsertTest1500
LeafDrupal\system\Tests\Database\InvalidDataTest200
LeafDrupal\system\Tests\Database\LoggingTest1400
LeafDrupal\system\Tests\Database\MergeTest3500
LeafDrupal\system\Tests\Database\NextIdTest200
LeafDrupal\system\Tests\Database\QueryTest100
LeafDrupal\system\Tests\Database\RangeQueryTest200
LeafDrupal\system\Tests\Database\RegressionTest700
LeafDrupal\system\Tests\Database\SchemaTest67700
LeafDrupal\system\Tests\Database\SelectCloneTest200
LeafDrupal\system\Tests\Database\SelectComplexTest6700
LeafDrupal\system\Tests\Database\SelectOrderedTest1100
LeafDrupal\system\Tests\Database\SelectPagerDefaultTest3600
LeafDrupal\system\Tests\Database\SelectSubqueryTest1400
LeafDrupal\system\Tests\Database\SelectTableSortDefaultTest5600
LeafDrupal\system\Tests\Database\SelectTest10800
LeafDrupal\system\Tests\Database\SerializeQueryTest200
LeafDrupal\system\Tests\Database\TaggingTest1600
LeafDrupal\system\Tests\Database\TemporaryQueryTest1200
LeafDrupal\system\Tests\Database\TransactionTest8800
LeafDrupal\system\Tests\Database\UpdateComplexTest3800
LeafDrupal\system\Tests\Database\UpdateLobTest600
LeafDrupal\system\Tests\Database\UpdateTest3000
LeafDrupal\system\Tests\Datetime\DateTimePlusTest10800
LeafDrupal\system\Tests\Datetime\DrupalDateTimeTest2800
LeafDrupal\system\Tests\DrupalKernel\ContentNegotiationTest4000
LeafDrupal\system\Tests\DrupalKernel\DrupalKernelTest1500
LeafDrupal\system\Tests\Entity\ConfigEntityQueryTest9900
LeafDrupal\system\Tests\Entity\EntityAccessTest3400
LeafDrupal\system\Tests\Entity\EntityApiInfoTest600
LeafDrupal\system\Tests\Entity\EntityApiTest2600
LeafDrupal\system\Tests\Entity\EntityCrudHookTest15700
LeafDrupal\system\Tests\Entity\EntityFieldTest68800
LeafDrupal\system\Tests\Entity\EntityFormTest7700
LeafDrupal\system\Tests\Entity\EntityQueryRelationshipTest2000
LeafDrupal\system\Tests\Entity\EntityQueryTest6200
LeafDrupal\system\Tests\Entity\EntityRevisionsTest5300
LeafDrupal\system\Tests\Entity\EntityTranslationFormTest3600
LeafDrupal\system\Tests\Entity\EntityTranslationTest13800
LeafDrupal\system\Tests\Entity\EntityUUIDTest7700
LeafDrupal\system\Tests\FileTransfer\FileTransferTest200
LeafDrupal\system\Tests\File\DirectoryTest2000
LeafDrupal\system\Tests\File\MimeTypeTest4200
LeafDrupal\system\Tests\File\NameMungingTest600
LeafDrupal\system\Tests\File\ReadOnlyStreamWrapperTest1600
LeafDrupal\system\Tests\File\RemoteFileDirectoryTest2400
LeafDrupal\system\Tests\File\RemoteFileScanDirectoryTest2900
LeafDrupal\system\Tests\File\RemoteFileUnmanagedCopyTest3200
LeafDrupal\system\Tests\File\RemoteFileUnmanagedDeleteRecursiveTest2100
LeafDrupal\system\Tests\File\RemoteFileUnmanagedDeleteTest1000
LeafDrupal\system\Tests\File\RemoteFileUnmanagedMoveTest2300
LeafDrupal\system\Tests\File\RemoteFileUnmanagedSaveDataTest800
LeafDrupal\system\Tests\File\ScanDirectoryTest2900
LeafDrupal\system\Tests\File\StreamWrapperTest1900
LeafDrupal\system\Tests\File\UnmanagedCopyTest2900
LeafDrupal\system\Tests\File\UnmanagedDeleteRecursiveTest1700
LeafDrupal\system\Tests\File\UnmanagedDeleteTest700
LeafDrupal\system\Tests\File\UnmanagedMoveTest2000
LeafDrupal\system\Tests\File\UnmanagedSaveDataTest700
LeafDrupal\system\Tests\File\UrlRewritingTest1400
LeafDrupal\system\Tests\Form\AlterTest400
LeafDrupal\system\Tests\Form\ArbitraryRebuildTest1600
LeafDrupal\system\Tests\Form\CheckboxTest9700
LeafDrupal\system\Tests\Form\ElementsLabelsTest2000
LeafDrupal\system\Tests\Form\ElementsTableSelectTest9100
LeafDrupal\system\Tests\Form\ElementsVerticalTabsTest3900
LeafDrupal\system\Tests\Form\ElementTest5700
LeafDrupal\system\Tests\Form\EmailTest1700
LeafDrupal\system\Tests\Form\FileInclusionTest1100
LeafDrupal\system\Tests\Form\FormTest71300
LeafDrupal\system\Tests\Form\HTMLIdTest700
LeafDrupal\system\Tests\Form\LanguageSelectElementTest4400
LeafDrupal\system\Tests\Form\ProgrammaticTest2400
LeafDrupal\system\Tests\Form\RebuildTest8500
LeafDrupal\system\Tests\Form\RedirectTest3100
LeafDrupal\system\Tests\Form\StateValuesCleanAdvancedTest700
LeafDrupal\system\Tests\Form\StateValuesCleanTest1400
LeafDrupal\system\Tests\Form\StorageTest15700
LeafDrupal\system\Tests\Form\TriggeringElementTest9900
LeafDrupal\system\Tests\Form\UrlTest3400
LeafDrupal\system\Tests\Form\ValidationTest20100
LeafDrupal\system\Tests\Form\WrapperTest1000
LeafDrupal\system\Tests\Graph\GraphUnitTest2800
LeafDrupal\system\Tests\Image\FileMoveTest400
LeafDrupal\system\Tests\Image\ToolkitGdTest20400
LeafDrupal\system\Tests\Image\ToolkitTest5300
LeafDrupal\system\Tests\KeyValueStore\DatabaseStorageExpirableTest6800
LeafDrupal\system\Tests\KeyValueStore\DatabaseStorageTest3600
LeafDrupal\system\Tests\KeyValueStore\GarbageCollectionTest200
LeafDrupal\system\Tests\KeyValueStore\MemoryStorageTest3600
LeafDrupal\system\Tests\Lock\LockFunctionalTest2900
LeafDrupal\system\Tests\Mail\HtmlToTextTest8600
LeafDrupal\system\Tests\Mail\MailTest700
LeafDrupal\system\Tests\Mail\WrapMailUnitTest200
LeafDrupal\system\Tests\Menu\BreadcrumbTest40900
LeafDrupal\system\Tests\Menu\LinksTest5000
LeafDrupal\system\Tests\Menu\MenuRouterTest23600
LeafDrupal\system\Tests\Menu\RebuildTest500
LeafDrupal\system\Tests\Menu\TrailTest6800
LeafDrupal\system\Tests\Menu\TreeDataUnitTest400
LeafDrupal\system\Tests\Menu\TreeOutputTest700
LeafDrupal\system\Tests\Module\ClassLoaderTest1000
LeafDrupal\system\Tests\Module\DependencyTest16000
LeafDrupal\system\Tests\Module\EnableDisableTest223200
LeafDrupal\system\Tests\Module\HookRequirementsTest1600
LeafDrupal\system\Tests\Module\InstallTest300
LeafDrupal\system\Tests\Module\ModuleApiTest6600
LeafDrupal\system\Tests\Module\ModuleEnable300
LeafDrupal\system\Tests\Module\RequiredTest1900
LeafDrupal\system\Tests\Module\UninstallTest200
LeafDrupal\system\Tests\Module\VersionTest5100
LeafDrupal\system\Tests\Pager\PagerTest12300
LeafDrupal\system\Tests\Path\AliasTest2700
LeafDrupal\system\Tests\Path\MatchPathTest4100
LeafDrupal\system\Tests\Path\UrlAlterFunctionalTest3700
LeafDrupal\system\Tests\PhpStorage\FileStorageTest1200
LeafDrupal\system\Tests\PhpStorage\MTimeProtectedFastFileStorageTest1900
LeafDrupal\system\Tests\PhpStorage\MTimeProtectedFileStorageTest1900
LeafDrupal\system\Tests\Plugin\AlterDecoratorTest300
LeafDrupal\system\Tests\Plugin\CacheDecoratorLanguageTest3800
LeafDrupal\system\Tests\Plugin\CacheDecoratorTest1400
LeafDrupal\system\Tests\Plugin\DerivativeTest900
LeafDrupal\system\Tests\Plugin\Discovery\AnnotatedClassDiscoveryTest700
LeafDrupal\system\Tests\Plugin\Discovery\StaticDiscoveryTest600
LeafDrupal\system\Tests\Plugin\FactoryTest900
LeafDrupal\system\Tests\Plugin\InspectionTest1000
LeafDrupal\system\Tests\Plugin\PluginBagTest1900
LeafDrupal\system\Tests\Queue\QueueTest1400
LeafDrupal\system\Tests\Routing\ControllerResolverTest100
LeafDrupal\system\Tests\Routing\MatcherDumperTest800
LeafDrupal\system\Tests\Routing\MimeTypeMatcherTest1000
LeafDrupal\system\Tests\Routing\RouteProviderTest2900
LeafDrupal\system\Tests\Routing\RouterPermissionTest2300
LeafDrupal\system\Tests\Routing\RouterTest3000
LeafDrupal\system\Tests\Routing\RouteTest600
LeafDrupal\system\Tests\Routing\UrlGeneratorTest200
LeafDrupal\system\Tests\Serialization\EntitySerializationTest1700
LeafDrupal\system\Tests\Serialization\SerializationTest200
LeafDrupal\system\Tests\Session\SessionHttpsTest8300
LeafDrupal\system\Tests\Session\SessionTest19000
LeafDrupal\system\Tests\System\AccessDeniedTest6400
LeafDrupal\system\Tests\System\AdminMetaTagTest300
LeafDrupal\system\Tests\System\AdminTest18100
LeafDrupal\system\Tests\System\CronRunTest5200
LeafDrupal\system\Tests\System\DateFormatsLanguageTest5600
LeafDrupal\system\Tests\System\DateTimeTest8800
LeafDrupal\system\Tests\System\DefaultMobileMetaTagsTest1200
LeafDrupal\system\Tests\System\ErrorHandlerTest4000
LeafDrupal\system\Tests\System\ExceptionControllerTest200
LeafDrupal\system\Tests\System\FloodTest1000
LeafDrupal\system\Tests\System\FrontPageTest3700
LeafDrupal\system\Tests\System\IndexPhpTest600
LeafDrupal\system\Tests\System\InfoAlterTest1000
LeafDrupal\system\Tests\System\InfoFileParserUnitTest900
LeafDrupal\system\Tests\System\MainContentFallbackTest6000
LeafDrupal\system\Tests\System\PageNotFoundTest1800
LeafDrupal\system\Tests\System\PageTitleFilteringTest4400
LeafDrupal\system\Tests\System\PasswordHashingTest1000
LeafDrupal\system\Tests\System\RetrieveFileTest700
LeafDrupal\system\Tests\System\ShutdownFunctionsTest500
LeafDrupal\system\Tests\System\SiteMaintenanceTest7700
LeafDrupal\system\Tests\System\SystemAuthorizeTest1600
LeafDrupal\system\Tests\System\ThemeTest21900
LeafDrupal\system\Tests\System\TokenReplaceTest3600
LeafDrupal\system\Tests\System\TokenScanTest400
LeafDrupal\system\Tests\System\UnicodeUnitTest18200
LeafDrupal\system\Tests\Theme\EntityFilteringThemeTest5600
LeafDrupal\system\Tests\Theme\FastTest1200
LeafDrupal\system\Tests\Theme\FunctionsTest2600
LeafDrupal\system\Tests\Theme\HookInitTest500
LeafDrupal\system\Tests\Theme\HtmlTagUnitTest200
LeafDrupal\system\Tests\Theme\HtmlTplPhpAttributesTest500
LeafDrupal\system\Tests\Theme\RegistryTest600
LeafDrupal\system\Tests\Theme\TableTest600
LeafDrupal\system\Tests\Theme\ThemeInfoStylesTest1300
LeafDrupal\system\Tests\Theme\ThemeTest4800
LeafDrupal\system\Tests\Theme\ThemeTestTwig1000
LeafDrupal\system\Tests\Theme\TwigReferenceUnitTest1500
LeafDrupal\system\Tests\Transliteration\TransliterationTest2600
LeafDrupal\system\Tests\TypedData\TypedDataTest13000
LeafDrupal\system\Tests\Update\DependencyHookInvocationTest400
LeafDrupal\system\Tests\Update\DependencyMissingTest400
LeafDrupal\system\Tests\Update\DependencyOrderingTest500
LeafDrupal\system\Tests\Update\UpdateScriptTest20100
LeafDrupal\system\Tests\Upgrade\BareMinimalUpgradePathTest6400
LeafDrupal\system\Tests\Upgrade\BareStandardUpgradePathTest6700
ExpandDrupal\system\Tests\Upgrade\BlockUpgradePathTest1723
MessageGroupFilenameLineFunctionStatus
simplexml_import_dom(): Invalid Nodetype to importsimplexml_import_dom(Object) Drupal\simpletest\WebTestBase->parse() Drupal\simpletest\WebTestBase->xpath('//li[@class=:class]', Array) Drupal\system\Tests\Upgrade\UpgradePathTestBase->performUpgrade() Drupal\system\Tests\Upgrade\BlockUpgradePathTest->testBlockUpgradeTitleLength() Drupal\simpletest\TestBase->run() simpletest_script_run_one_test('593', 'Drupal\system\Tests\Upgrade\BlockUpgradePathTest') WarningWebTestBase.php1113Drupal\simpletest\WebTestBase->parse()
Parsed page successfully.BrowserUpgradePathTestBase.php249Drupal\system\Tests\Upgrade\UpgradePathTestBase->performUpgrade()
Invalid argument supplied for foreach()Drupal\system\Tests\Upgrade\UpgradePathTestBase->performUpgrade() Drupal\system\Tests\Upgrade\BlockUpgradePathTest->testBlockUpgradeTitleLength() Drupal\simpletest\TestBase->run() simpletest_script_run_one_test('593', 'Drupal\system\Tests\Upgrade\BlockUpgradePathTest') WarningUpgradePathTestBase.php249Drupal\system\Tests\Upgrade\UpgradePathTestBase->performUpgrade()
No pending updates at the end of the update process.OtherUpgradePathTestBase.php265Drupal\system\Tests\Upgrade\UpgradePathTestBase->performUpgrade()
Exception: update.php still shows pending updates after execution. in Drupal\system\Tests\Upgrade\UpgradePathTestBase->performUpgrade() (line 266 of /var/lib/drupaltestbot/sites/default/files/checkout/core/modules/system/lib/Drupal/system/Tests/Upgrade/UpgradePathTestBase.php). Drupal\system\Tests\Upgrade\UpgradePathTestBase->performUpgrade() Drupal\system\Tests\Upgrade\BlockUpgradePathTest->testBlockUpgradeTitleLength() Drupal\simpletest\TestBase->run() simpletest_script_run_one_test('593', 'Drupal\system\Tests\Upgrade\BlockUpgradePathTest') Uncaught exceptionUpgradePathTestBase.php266Drupal\system\Tests\Upgrade\UpgradePathTestBase->performUpgrade()
LeafDrupal\system\Tests\Upgrade\DateUpgradePathTest4600
LeafDrupal\system\Tests\Upgrade\FieldUIUpgradePathTest5100
LeafDrupal\system\Tests\Upgrade\FieldUpgradePathTest3800
LeafDrupal\system\Tests\Upgrade\FilledMinimalUpgradePathTest6300
LeafDrupal\system\Tests\Upgrade\FilledStandardUpgradePathTest8300
LeafDrupal\system\Tests\Upgrade\FilterFormatUpgradePathTest4200
LeafDrupal\system\Tests\Upgrade\ImageUpgradePathTest3700
LeafDrupal\system\Tests\Upgrade\LanguageUpgradePathTest16200
LeafDrupal\system\Tests\Upgrade\ModulesDisabledUpgradePathTest3300
LeafDrupal\system\Tests\Upgrade\ShortcutUpgradePathTest3700
LeafDrupal\system\Tests\Upgrade\StateSystemUpgradePathTest4700
LeafDrupal\system\Tests\Upgrade\SystemUpgradePathTest8400
LeafDrupal\system\Tests\Upgrade\UserPictureUpgradePathTest4400
LeafDrupal\system\Tests\Upgrade\UserRoleUpgradePathTest7600
LeafDrupal\system\Tests\Upgrade\UuidUpgradePathTest3200
LeafDrupal\system\Tests\Uuid\UuidUnitTest700
LeafDrupal\taxonomy\Tests\EfqTest1400
LeafDrupal\taxonomy\Tests\HooksTest2300
LeafDrupal\taxonomy\Tests\LegacyTest1400
LeafDrupal\taxonomy\Tests\LoadMultipleTest1800
LeafDrupal\taxonomy\Tests\RssTest2600
LeafDrupal\taxonomy\Tests\TaxonomyTermReferenceItemTest900
LeafDrupal\taxonomy\Tests\TermFieldMultipleVocabularyTest2600
LeafDrupal\taxonomy\Tests\TermFieldTest5800
LeafDrupal\taxonomy\Tests\TermIndexTest4600
LeafDrupal\taxonomy\Tests\TermLanguageTest7500
LeafDrupal\taxonomy\Tests\TermTest31000
LeafDrupal\taxonomy\Tests\TermTranslationUITest14400
LeafDrupal\taxonomy\Tests\TermUnitTest2200
LeafDrupal\taxonomy\Tests\ThemeTest3800
LeafDrupal\taxonomy\Tests\TokenReplaceTest11000
ExpandDrupal\taxonomy\Tests\Views\RelationshipNodeTermDataTest200
MessageGroupFilenameLineFunctionStatus
'Missing handler: nid nid sort'Debugviews.module945views_get_handler()
LeafDrupal\taxonomy\Tests\Views\RelationshipRepresentativeNode200
LeafDrupal\taxonomy\Tests\VocabularyLanguageTest8300
LeafDrupal\taxonomy\Tests\VocabularyTest15500
LeafDrupal\taxonomy\Tests\VocabularyUnitTest7900
LeafDrupal\telephone\Tests\TelephoneFieldTest2000
LeafDrupal\text\Tests\TextFieldTest18600
LeafDrupal\text\Tests\TextSummaryTest13800
LeafDrupal\text\Tests\TextTranslationTest10400
LeafDrupal\toolbar\Tests\ToolbarHookToolbarTest1500
LeafDrupal\toolbar\Tests\ToolbarMenuTranslationTest3800
LeafDrupal\tracker\Tests\TrackerNodeAccessTest2800
LeafDrupal\tracker\Tests\TrackerTest22800
LeafDrupal\translation\Tests\TranslationTest57800
LeafDrupal\translation_entity\Tests\ConfigTestTranslationUITest1700
LeafDrupal\translation_entity\Tests\EntityTestTranslationUITest7300
LeafDrupal\translation_entity\Tests\EntityTranslationSettingsTest4900
LeafDrupal\translation_entity\Tests\EntityTranslationWorkflowsTest16300
ExpandDrupal\translation_entity\Tests\Views\TranslationLinkTest1610
MessageGroupFilenameLineFunctionStatus
Link containing href user/1/translations found.OtherTranslationLinkTest.php57Drupal\translation_entity\Tests\Views\TranslationLinkTest->testTranslationLink()
LeafDrupal\update\Tests\UpdateContribTest18700
LeafDrupal\update\Tests\UpdateCoreTest22600
LeafDrupal\update\Tests\UpdateCoreUnitTest400
LeafDrupal\update\Tests\UpdateUploadTest6400
LeafDrupal\user\Tests\TempStoreDatabaseTest3800
LeafDrupal\user\Tests\UserAccountLinksTests6100
LeafDrupal\user\Tests\UserAdminSettingsFormTest400
LeafDrupal\user\Tests\UserAdminTest6100
LeafDrupal\user\Tests\UserAutocompleteTest2900
LeafDrupal\user\Tests\UserBlocksTests6600
LeafDrupal\user\Tests\UserCancelTest25400
LeafDrupal\user\Tests\UserCreateTest3300
LeafDrupal\user\Tests\UserDeleteTest1500
LeafDrupal\user\Tests\UserEditedOwnAccountTest2200
LeafDrupal\user\Tests\UserEditTest7300
LeafDrupal\user\Tests\UserEntityCallbacksTest700
LeafDrupal\user\Tests\UserLanguageCreationTest6800
LeafDrupal\user\Tests\UserLanguageTest3900
LeafDrupal\user\Tests\UserLoginTest15900
LeafDrupal\user\Tests\UserPasswordResetTest3000
LeafDrupal\user\Tests\UserPermissionsTest5000
LeafDrupal\user\Tests\UserPictureTest4700
LeafDrupal\user\Tests\UserRegistrationTest12900
LeafDrupal\user\Tests\UserRoleAdminTest5700
LeafDrupal\user\Tests\UserRolesAssignmentTest5100
LeafDrupal\user\Tests\UserSaveTest200
LeafDrupal\user\Tests\UserSearchTest5800
LeafDrupal\user\Tests\UserSignatureTest4600
LeafDrupal\user\Tests\UserTimeZoneTest2900
LeafDrupal\user\Tests\UserTokenReplaceTest4700
LeafDrupal\user\Tests\UserTranslationUITest9800
LeafDrupal\user\Tests\UserValidateCurrentPassCustomFormTest1700
LeafDrupal\user\Tests\UserValidationTest1600
LeafDrupal\user\Tests\Views\AccessPermissionTest1400
LeafDrupal\user\Tests\Views\AccessRoleTest1400
LeafDrupal\user\Tests\Views\ArgumentDefaultTest900
LeafDrupal\user\Tests\Views\ArgumentValidateTest1900
LeafDrupal\user\Tests\Views\HandlerArgumentUserUidTest500
LeafDrupal\user\Tests\Views\HandlerFieldRoleTest1000
LeafDrupal\user\Tests\Views\HandlerFieldUserNameTest700
ExpandDrupal\user\Tests\Views\HandlerFilterUserNameTest4640
MessageGroupFilenameLineFunctionStatus
Raw "Unable to find user: onn8kobx" foundOtherHandlerFilterUserNameTest.php154Drupal\user\Tests\Views\HandlerFilterUserNameTest->testExposedFilter()
Raw "Unable to find user: hk796bs8" foundOtherHandlerFilterUserNameTest.php164Drupal\user\Tests\Views\HandlerFilterUserNameTest->testExposedFilter()
Raw "3" foundOtherHandlerFilterUserNameTest.php175Drupal\user\Tests\Views\HandlerFilterUserNameTest->testExposedFilter()
Raw "4" foundOtherHandlerFilterUserNameTest.php175Drupal\user\Tests\Views\HandlerFilterUserNameTest->testExposedFilter()
LeafDrupal\user\Tests\Views\RelationshipRepresentativeNode300
LeafDrupal\views\Tests\AnalyzeTest2100
LeafDrupal\views\Tests\BasicTest800
ExpandDrupal\views\Tests\DefaultViewsTest7200
MessageGroupFilenameLineFunctionStatus
'Missing handler: search_node_links_to nid argument'Debugviews.module945views_get_handler()
'Missing handler: search_node_links_to nid argument'Debugviews.module945views_get_handler()
'Missing handler: search_node_links_to nid argument'Debugviews.module945views_get_handler()
'Missing handler: field_data_comment_body comment_body field'Debugviews.module945views_get_handler()
'Missing handler: history timestamp field'Debugviews.module945views_get_handler()
'Missing handler: history timestamp field'Debugviews.module945views_get_handler()
LeafDrupal\views\Tests\EntityReference\SelectionTest300
LeafDrupal\views\Tests\Entity\FieldEntityTest400
LeafDrupal\views\Tests\GlossaryTest800
ExpandDrupal\views\Tests\Handler\AreaTest8910
MessageGroupFilenameLineFunctionStatus
Overridden title found.OtherAreaTest.php179Drupal\views\Tests\Handler\AreaTest->testTitleArea()
LeafDrupal\views\Tests\Handler\AreaTextTest400
LeafDrupal\views\Tests\Handler\ArgumentNullTest400
LeafDrupal\views\Tests\Handler\ArgumentStringTest400
LeafDrupal\views\Tests\Handler\FieldBooleanTest1000
LeafDrupal\views\Tests\Handler\FieldCounterTest600
LeafDrupal\views\Tests\Handler\FieldCustomTest100
LeafDrupal\views\Tests\Handler\FieldDateTest1400
ExpandDrupal\views\Tests\Handler\FieldDropButtonTest3100
MessageGroupFilenameLineFunctionStatus
Just one node title link was found.OtherFieldDropButtonTest.php47Drupal\views\Tests\Handler\FieldDropButtonTest->testDropbutton()
Just one custom link was found.OtherFieldDropButtonTest.php49Drupal\views\Tests\Handler\FieldDropButtonTest->testDropbutton()
Just one node title link was found.OtherFieldDropButtonTest.php47Drupal\views\Tests\Handler\FieldDropButtonTest->testDropbutton()
Just one custom link was found.OtherFieldDropButtonTest.php49Drupal\views\Tests\Handler\FieldDropButtonTest->testDropbutton()
Just one node title link was found.OtherFieldDropButtonTest.php47Drupal\views\Tests\Handler\FieldDropButtonTest->testDropbutton()
Just one custom link was found.OtherFieldDropButtonTest.php49Drupal\views\Tests\Handler\FieldDropButtonTest->testDropbutton()
Just one node title link was found.OtherFieldDropButtonTest.php47Drupal\views\Tests\Handler\FieldDropButtonTest->testDropbutton()
Just one custom link was found.OtherFieldDropButtonTest.php49Drupal\views\Tests\Handler\FieldDropButtonTest->testDropbutton()
Just one node title link was found.OtherFieldDropButtonTest.php47Drupal\views\Tests\Handler\FieldDropButtonTest->testDropbutton()
Just one custom link was found.OtherFieldDropButtonTest.php49Drupal\views\Tests\Handler\FieldDropButtonTest->testDropbutton()
LeafDrupal\views\Tests\Handler\FieldFileSizeTest800
LeafDrupal\views\Tests\Handler\FieldUnitTest9300
LeafDrupal\views\Tests\Handler\FieldUrlTest200
ExpandDrupal\views\Tests\Handler\FieldWebTest9872
MessageGroupFilenameLineFunctionStatus
Link containing href /checkout/test_click_sort?order=id&sort=asc found.OtherFieldWebTest.php58Drupal\views\Tests\Handler\FieldWebTest->testClickSorting()
Link containing href /checkout/test_click_sort?order=name&sort=desc found.OtherFieldWebTest.php59Drupal\views\Tests\Handler\FieldWebTest->testClickSorting()
Undefined variable: url_targetDrupal\simpletest\WebTestBase->clickLink('ID') Drupal\views\Tests\Handler\FieldWebTest->testClickSorting() Drupal\simpletest\TestBase->run() simpletest_script_run_one_test('671', 'Drupal\views\Tests\Handler\FieldWebTest') NoticeWebTestBase.php1929Drupal\simpletest\WebTestBase->clickLink()
Clicked link ID () from http://drupaltestbot659-mysql/checkout/test_click_sortBrowserFieldWebTest.php63Drupal\views\Tests\Handler\FieldWebTest->testClickSorting()
Link containing href /checkout/test_click_sort?order=id&sort=desc found.OtherFieldWebTest.php64Drupal\views\Tests\Handler\FieldWebTest->testClickSorting()
Value array ( ) is equal to value array ( 0 => 1, 1 => 2, 2 => 3, 3 => 4, 4 => 5, ).OtherFieldWebTest.php67Drupal\views\Tests\Handler\FieldWebTest->testClickSorting()
Undefined variable: url_targetDrupal\simpletest\WebTestBase->clickLink('ID') Drupal\views\Tests\Handler\FieldWebTest->testClickSorting() Drupal\simpletest\TestBase->run() simpletest_script_run_one_test('671', 'Drupal\views\Tests\Handler\FieldWebTest') NoticeWebTestBase.php1929Drupal\simpletest\WebTestBase->clickLink()
Clicked link ID () from http://drupaltestbot659-mysql/checkout/test_click_sortBrowserFieldWebTest.php69Drupal\views\Tests\Handler\FieldWebTest->testClickSorting()
Value array ( ) is equal to value array ( 0 => 5, 1 => 4, 2 => 3, 3 => 2, 4 => 1, ).OtherFieldWebTest.php72Drupal\views\Tests\Handler\FieldWebTest->testClickSorting()
LeafDrupal\views\Tests\Handler\FieldXssTest300
LeafDrupal\views\Tests\Handler\FilterCombineTest100
LeafDrupal\views\Tests\Handler\FilterDateTest2200
LeafDrupal\views\Tests\Handler\FilterEqualityTest400
LeafDrupal\views\Tests\Handler\FilterInOperatorTest800
LeafDrupal\views\Tests\Handler\FilterNumericTest1400
LeafDrupal\views\Tests\Handler\FilterStringTest2600
LeafDrupal\views\Tests\Handler\HandlerAliasTest800
LeafDrupal\views\Tests\Handler\HandlerAllTest26000
ExpandDrupal\views\Tests\Handler\HandlerTest11600
MessageGroupFilenameLineFunctionStatus
'Missing handler: aa08YLWp dlIf56mz relationship'Debugviews.module945views_get_handler()
LeafDrupal\views\Tests\Handler\RelationshipTest500
LeafDrupal\views\Tests\Handler\SortDateTest2400
LeafDrupal\views\Tests\Handler\SortRandomTest600
LeafDrupal\views\Tests\Handler\SortTest800
ExpandDrupal\views\Tests\ModuleTest4800
MessageGroupFilenameLineFunctionStatus
'Missing handler: bzATMw6n pknPy1EP field'Debugviews.module945views_get_handler()
'Missing handler: pBotTbA1 z2ItKsYs area'Debugviews.module945views_get_handler()
'Missing handler: soUEytPD sNL44F3h filter'Debugviews.module945views_get_handler()
LeafDrupal\views\Tests\PluginBaseUnitTest1200
LeafDrupal\views\Tests\PluginInstanceTest14400
LeafDrupal\views\Tests\PluginTypeListTest100
ExpandDrupal\views\Tests\Plugin\AccessTest3722
MessageGroupFilenameLineFunctionStatus
Undefined index: access argumentsDrupal\views\Tests\Plugin\AccessTest->testStaticAccessPlugin() Drupal\simpletest\TestBase->run() simpletest_script_run_one_test('713', 'Drupal\views\Tests\Plugin\AccessTest') NoticeAccessTest.php86Drupal\views\Tests\Plugin\AccessTest->testStaticAccessPlugin()
Value array ( 0 => 'views_test_data_test_static_access_callback', 1 => array ( 0 => false, ), ) is equal to value NULL.OtherAccessTest.php86Drupal\views\Tests\Plugin\AccessTest->testStaticAccessPlugin()
Undefined index: access argumentsDrupal\views\Tests\Plugin\AccessTest->testDynamicAccessPlugin() Drupal\simpletest\TestBase->run() simpletest_script_run_one_test('713', 'Drupal\views\Tests\Plugin\AccessTest') NoticeAccessTest.php122Drupal\views\Tests\Plugin\AccessTest->testDynamicAccessPlugin()
Value array ( 0 => 'views_test_data_test_dynamic_access_callback', 1 => array ( 0 => false, 1 => 1, 2 => 2, ), ) is equal to value NULL.OtherAccessTest.php122Drupal\views\Tests\Plugin\AccessTest->testDynamicAccessPlugin()
LeafDrupal\views\Tests\Plugin\ArgumentDefaultTest2400
LeafDrupal\views\Tests\Plugin\ArgumentValidatorTest400
LeafDrupal\views\Tests\Plugin\CacheTest1200
ExpandDrupal\views\Tests\Plugin\DisplayAttachmentTest420
MessageGroupFilenameLineFunctionStatus
Both actual view and the attachment is rendered.OtherDisplayAttachmentTest.php49Drupal\views\Tests\Plugin\DisplayAttachmentTest->testAttachment()
The attachment is rendered before the actual view.OtherDisplayAttachmentTest.php55Drupal\views\Tests\Plugin\DisplayAttachmentTest->testAttachment()
LeafDrupal\views\Tests\Plugin\DisplayExtenderTest600
LeafDrupal\views\Tests\Plugin\DisplayFeedTest2800
LeafDrupal\views\Tests\Plugin\DisplayPageTest300
LeafDrupal\views\Tests\Plugin\DisplayTest5000
ExpandDrupal\views\Tests\Plugin\ExposedFormTest12830
MessageGroupFilenameLineFunctionStatus
Article type filter set.BrowserExposedFormTest.php57Drupal\views\Tests\Plugin\ExposedFormTest->testResetButton()
Article type filter has been reset.BrowserExposedFormTest.php63Drupal\views\Tests\Plugin\ExposedFormTest->testResetButton()
Label has the expected value: jumEhwZm.BrowserViewTestBase.php208Drupal\views\Tests\ViewTestBase->helperButtonHasLabel()
LeafDrupal\views\Tests\Plugin\FilterTest1300
LeafDrupal\views\Tests\Plugin\JoinTest1600
ExpandDrupal\views\Tests\Plugin\MiniPagerTest940
MessageGroupFilenameLineFunctionStatus
Make sure the next link appears on the first page.OtherMiniPagerTest.php54Drupal\views\Tests\Plugin\MiniPagerTest->testMiniPagerRender()
Make sure the previous link appears.OtherMiniPagerTest.php58Drupal\views\Tests\Plugin\MiniPagerTest->testMiniPagerRender()
Make sure the next link appears.OtherMiniPagerTest.php59Drupal\views\Tests\Plugin\MiniPagerTest->testMiniPagerRender()
Make sure the previous link does not appear on the last page.OtherMiniPagerTest.php63Drupal\views\Tests\Plugin\MiniPagerTest->testMiniPagerRender()
LeafDrupal\views\Tests\Plugin\PagerTest9200
LeafDrupal\views\Tests\Plugin\QueryTest200
LeafDrupal\views\Tests\Plugin\StyleMappingTest4200
LeafDrupal\views\Tests\Plugin\StyleTest2400
LeafDrupal\views\Tests\Plugin\StyleUnformattedTest1700
LeafDrupal\views\Tests\QueryGroupByTest4000
LeafDrupal\views\Tests\TokenReplaceTest1100
ExpandDrupal\views\Tests\UI\DefaultViewsTest108228
MessageGroupFilenameLineFunctionStatus
HTTP response expected 200, actual 404BrowserDefaultViewsTest.php62Drupal\views\Tests\UI\DefaultViewsTest->testDefaultViews()
"vH5nTeuITS7iwH5R" foundOtherDefaultViewsTest.php63Drupal\views\Tests\UI\DefaultViewsTest->testDefaultViews()
Undefined index: page argumentsNoticeviews.module362views_menu_alter()
Undefined index: access argumentsNoticeviews.module364views_menu_alter()
Undefined index: load argumentsNoticeviews.module365views_menu_alter()
Undefined index: page argumentsNoticeviews.module362views_menu_alter()
Undefined index: access argumentsNoticeviews.module364views_menu_alter()
Undefined index: load argumentsNoticeviews.module365views_menu_alter()
Undefined index: page argumentsNoticeviews.module362views_menu_alter()
Undefined index: access argumentsNoticeviews.module364views_menu_alter()
Undefined index: load argumentsNoticeviews.module365views_menu_alter()
Undefined index: page argumentsNoticeviews.module362views_menu_alter()
Undefined index: access argumentsNoticeviews.module364views_menu_alter()
Undefined index: load argumentsNoticeviews.module365views_menu_alter()
Undefined index: access argumentsNoticeviews.module364views_menu_alter()
Undefined index: access argumentsNoticeviews.module364views_menu_alter()
Undefined index: page argumentsNoticeviews.module362views_menu_alter()
Undefined index: access argumentsNoticeviews.module364views_menu_alter()
Undefined index: load argumentsNoticeviews.module365views_menu_alter()
Undefined index: page argumentsNoticeviews.module362views_menu_alter()
Undefined index: access argumentsNoticeviews.module364views_menu_alter()
Undefined index: load argumentsNoticeviews.module365views_menu_alter()
Undefined index: page argumentsNoticeviews.module362views_menu_alter()
Undefined index: access argumentsNoticeviews.module364views_menu_alter()
Undefined index: load argumentsNoticeviews.module365views_menu_alter()
Undefined index: page argumentsNoticeviews.module362views_menu_alter()
Undefined index: access argumentsNoticeviews.module364views_menu_alter()
Undefined index: load argumentsNoticeviews.module365views_menu_alter()
Undefined index: access argumentsNoticeviews.module364views_menu_alter()
Undefined index: access argumentsNoticeviews.module364views_menu_alter()
LeafDrupal\views\Tests\UI\DisplayAttachmentTest2400
LeafDrupal\views\Tests\UI\DisplayExtenderUITest2300
LeafDrupal\views\Tests\UI\DisplayPath2200
ExpandDrupal\views\Tests\UI\DisplayTest27413
MessageGroupFilenameLineFunctionStatus
Undefined index: page argumentsNoticeviews.module362views_menu_alter()
Undefined index: access argumentsNoticeviews.module364views_menu_alter()
Undefined index: load argumentsNoticeviews.module365views_menu_alter()
Link containing href admin/structure/views/view/test_display/edit/page_1 found.OtherDisplayTest.php286Drupal\views\Tests\UI\DisplayTest->testPageContextualLinks()
LeafDrupal\views\Tests\UI\GroupByTest2600
LeafDrupal\views\Tests\UI\HandlerTest11000
ExpandDrupal\views\Tests\UI\OverrideDisplaysTest132180
MessageGroupFilenameLineFunctionStatus
HTTP response expected 200, actual 404BrowserOverrideDisplaysTest.php53Drupal\views\Tests\UI\OverrideDisplaysTest->testOverrideDisplays()
"sOV61bUIXXYpkQVj" foundOtherOverrideDisplaysTest.php54Drupal\views\Tests\UI\OverrideDisplaysTest->testOverrideDisplays()
HTTP response expected 200, actual 404BrowserOverrideDisplaysTest.php75Drupal\views\Tests\UI\OverrideDisplaysTest->testOverrideDisplays()
"puRL6RAAZOd9cTpb" foundOtherOverrideDisplaysTest.php76Drupal\views\Tests\UI\OverrideDisplaysTest->testOverrideDisplays()
HTTP response expected 200, actual 404BrowserOverrideDisplaysTest.php107Drupal\views\Tests\UI\OverrideDisplaysTest->testWizardMixedDefaultOverriddenDisplays()
"jnplSX15iKJUkTiK" foundOtherOverrideDisplaysTest.php108Drupal\views\Tests\UI\OverrideDisplaysTest->testWizardMixedDefaultOverriddenDisplays()
HTTP response expected 200, actual 404BrowserOverrideDisplaysTest.php111Drupal\views\Tests\UI\OverrideDisplaysTest->testWizardMixedDefaultOverriddenDisplays()
"jnplSX15iKJUkTiK" foundOtherOverrideDisplaysTest.php112Drupal\views\Tests\UI\OverrideDisplaysTest->testWizardMixedDefaultOverriddenDisplays()
HTTP response expected 200, actual 404BrowserOverrideDisplaysTest.php132Drupal\views\Tests\UI\OverrideDisplaysTest->testWizardMixedDefaultOverriddenDisplays()
"ex60idShEXC1P81Z" foundOtherOverrideDisplaysTest.php133Drupal\views\Tests\UI\OverrideDisplaysTest->testWizardMixedDefaultOverriddenDisplays()
HTTP response expected 200, actual 404BrowserOverrideDisplaysTest.php136Drupal\views\Tests\UI\OverrideDisplaysTest->testWizardMixedDefaultOverriddenDisplays()
"ex60idShEXC1P81Z" foundOtherOverrideDisplaysTest.php137Drupal\views\Tests\UI\OverrideDisplaysTest->testWizardMixedDefaultOverriddenDisplays()
"egG6GNp1BIsQ6tcm" not foundOtherOverrideDisplaysTest.php139Drupal\views\Tests\UI\OverrideDisplaysTest->testWizardMixedDefaultOverriddenDisplays()
HTTP response expected 200, actual 404BrowserOverrideDisplaysTest.php152Drupal\views\Tests\UI\OverrideDisplaysTest->testWizardMixedDefaultOverriddenDisplays()
"ex60idShEXC1P81Z" foundOtherOverrideDisplaysTest.php153Drupal\views\Tests\UI\OverrideDisplaysTest->testWizardMixedDefaultOverriddenDisplays()
HTTP response expected 200, actual 404BrowserOverrideDisplaysTest.php155Drupal\views\Tests\UI\OverrideDisplaysTest->testWizardMixedDefaultOverriddenDisplays()
"ex60idShEXC1P81Z" foundOtherOverrideDisplaysTest.php156Drupal\views\Tests\UI\OverrideDisplaysTest->testWizardMixedDefaultOverriddenDisplays()
"qqmDm5iqoSDXxuwM" not foundOtherOverrideDisplaysTest.php157Drupal\views\Tests\UI\OverrideDisplaysTest->testWizardMixedDefaultOverriddenDisplays()
LeafDrupal\views\Tests\UI\PreviewTest4200
LeafDrupal\views\Tests\UI\QueryTest1900
LeafDrupal\views\Tests\UI\RedirectTest2600
LeafDrupal\views\Tests\UI\RowUITest3000
ExpandDrupal\views\Tests\UI\SettingsTest88022
MessageGroupFilenameLineFunctionStatus
Undefined index: page argumentsNoticeviews.module362views_menu_alter()
Undefined index: access argumentsNoticeviews.module364views_menu_alter()
Undefined index: load argumentsNoticeviews.module365views_menu_alter()
Undefined index: page argumentsNoticeviews.module362views_menu_alter()
Undefined index: access argumentsNoticeviews.module364views_menu_alter()
Undefined index: load argumentsNoticeviews.module365views_menu_alter()
Undefined index: access argumentsNoticeviews.module364views_menu_alter()
Undefined index: page argumentsNoticeviews.module362views_menu_alter()
Undefined index: access argumentsNoticeviews.module364views_menu_alter()
Undefined index: load argumentsNoticeviews.module365views_menu_alter()
Undefined index: access argumentsNoticeviews.module364views_menu_alter()
Undefined index: page argumentsNoticeviews.module362views_menu_alter()
Undefined index: access argumentsNoticeviews.module364views_menu_alter()
Undefined index: load argumentsNoticeviews.module365views_menu_alter()
Undefined index: access argumentsNoticeviews.module364views_menu_alter()
Undefined index: access argumentsNoticeviews.module364views_menu_alter()
Undefined index: page argumentsNoticeviews.module362views_menu_alter()
Undefined index: access argumentsNoticeviews.module364views_menu_alter()
Undefined index: load argumentsNoticeviews.module365views_menu_alter()
Undefined index: access argumentsNoticeviews.module364views_menu_alter()
Undefined index: access argumentsNoticeviews.module364views_menu_alter()
Undefined index: access argumentsNoticeviews.module364views_menu_alter()
LeafDrupal\views\Tests\UI\StorageTest2100
LeafDrupal\views\Tests\UI\StyleUITest3000
LeafDrupal\views\Tests\UI\TagTest1100
LeafDrupal\views\Tests\ViewElementTest1500
LeafDrupal\views\Tests\ViewExecutableTest11600
LeafDrupal\views\Tests\ViewPageControllerTest500
LeafDrupal\views\Tests\ViewRenderTest200
LeafDrupal\views\Tests\ViewsDataTest1100
LeafDrupal\views\Tests\ViewsHooksTest600
LeafDrupal\views\Tests\ViewStorageTest10100
ExpandDrupal\views\Tests\Wizard\BasicTest78140
MessageGroupFilenameLineFunctionStatus
HTTP response expected 200, actual 404BrowserBasicTest.php67Drupal\views\Tests\Wizard\BasicTest->testViewsWizardAndListing()
"aqOeEUdmNWbI2r54" foundOtherBasicTest.php72Drupal\views\Tests\Wizard\BasicTest->testViewsWizardAndListing()
"jhGlcGdE" foundOtherBasicTest.php73Drupal\views\Tests\Wizard\BasicTest->testViewsWizardAndListing()
"xkOFMr1B" foundOtherBasicTest.php74Drupal\views\Tests\Wizard\BasicTest->testViewsWizardAndListing()
Link containing href /checkout/qdPq1Fe1zgkOpxga found.OtherBasicTest.php77Drupal\views\Tests\Wizard\BasicTest->testViewsWizardAndListing()
Raw "<rss version="2.0"" foundOtherBasicTest.php79Drupal\views\Tests\Wizard\BasicTest->testViewsWizardAndListing()
"aqOeEUdmNWbI2r54" foundOtherBasicTest.php81Drupal\views\Tests\Wizard\BasicTest->testViewsWizardAndListing()
Raw "http://drupaltestbot659-mysql/checkout/node/1" foundOtherBasicTest.php82Drupal\views\Tests\Wizard\BasicTest->testViewsWizardAndListing()
"jhGlcGdE" foundOtherBasicTest.php83Drupal\views\Tests\Wizard\BasicTest->testViewsWizardAndListing()
Raw "http://drupaltestbot659-mysql/checkout/node/2" foundOtherBasicTest.php84Drupal\views\Tests\Wizard\BasicTest->testViewsWizardAndListing()
"xkOFMr1B" foundOtherBasicTest.php85Drupal\views\Tests\Wizard\BasicTest->testViewsWizardAndListing()
HTTP response expected 200, actual 404BrowserBasicTest.php111Drupal\views\Tests\Wizard\BasicTest->testViewsWizardAndListing()
"cABKg3bQyi0Q5D0F" foundOtherBasicTest.php115Drupal\views\Tests\Wizard\BasicTest->testViewsWizardAndListing()
"jhGlcGdE" foundOtherBasicTest.php116Drupal\views\Tests\Wizard\BasicTest->testViewsWizardAndListing()
ExpandDrupal\views\Tests\Wizard\ItemsPerPageTest3170
MessageGroupFilenameLineFunctionStatus
HTTP response expected 200, actual 404BrowserItemsPerPageTest.php58Drupal\views\Tests\Wizard\ItemsPerPageTest->testItemsPerPage()
"th0AvKBwQEQoPPtr" foundOtherItemsPerPageTest.php63Drupal\views\Tests\Wizard\ItemsPerPageTest->testItemsPerPage()
"agutqwDD" foundOtherItemsPerPageTest.php65Drupal\views\Tests\Wizard\ItemsPerPageTest->testItemsPerPage()
"yOT8DE62" foundOtherItemsPerPageTest.php66Drupal\views\Tests\Wizard\ItemsPerPageTest->testItemsPerPage()
"mCWuHz30" foundOtherItemsPerPageTest.php67Drupal\views\Tests\Wizard\ItemsPerPageTest->testItemsPerPage()
"hvECJEq4" foundOtherItemsPerPageTest.php68Drupal\views\Tests\Wizard\ItemsPerPageTest->testItemsPerPage()
The nodes appear in the expected order in the page display.OtherItemsPerPageTest.php75Drupal\views\Tests\Wizard\ItemsPerPageTest->testItemsPerPage()
ExpandDrupal\views\Tests\Wizard\MenuTest1720
MessageGroupFilenameLineFunctionStatus
Link with label c5mAVCRynxIq2HOX found.OtherMenuTest.php44Drupal\views\Tests\Wizard\MenuTest->testMenus()
Link containing href /checkout/r0DTZ3v8ynz9DssI found.OtherMenuTest.php45Drupal\views\Tests\Wizard\MenuTest->testMenus()
ExpandDrupal\views\Tests\Wizard\SortingTest23120
MessageGroupFilenameLineFunctionStatus
HTTP response expected 200, actual 404BrowserSortingTest.php44Drupal\views\Tests\Wizard\SortingTest->testSorting()
"og4Hgm7ffmmYHGRe" foundOtherSortingTest.php48Drupal\views\Tests\Wizard\SortingTest->testSorting()
"lz1GRtPt" foundOtherSortingTest.php50Drupal\views\Tests\Wizard\SortingTest->testSorting()
"h0Ij46vo" foundOtherSortingTest.php51Drupal\views\Tests\Wizard\SortingTest->testSorting()
"nmRtW1eO" foundOtherSortingTest.php52Drupal\views\Tests\Wizard\SortingTest->testSorting()
The nodes appear in the expected order in a view that sorts by oldest first.OtherSortingTest.php56Drupal\views\Tests\Wizard\SortingTest->testSorting()
HTTP response expected 200, actual 404BrowserSortingTest.php69Drupal\views\Tests\Wizard\SortingTest->testSorting()
"taNwKyYsPlUyeKxz" foundOtherSortingTest.php73Drupal\views\Tests\Wizard\SortingTest->testSorting()
"nmRtW1eO" foundOtherSortingTest.php75Drupal\views\Tests\Wizard\SortingTest->testSorting()
"h0Ij46vo" foundOtherSortingTest.php76Drupal\views\Tests\Wizard\SortingTest->testSorting()
"lz1GRtPt" foundOtherSortingTest.php77Drupal\views\Tests\Wizard\SortingTest->testSorting()
The nodes appear in the expected order in a view that sorts by newest first.OtherSortingTest.php81Drupal\views\Tests\Wizard\SortingTest->testSorting()
ExpandDrupal\views\Tests\Wizard\TaggedWithTest7440
MessageGroupFilenameLineFunctionStatus
HTTP response expected 200, actual 404BrowserTaggedWithTest.php138Drupal\views\Tests\Wizard\TaggedWithTest->testTaggedWith()
"dMPvOHSm" foundOtherTaggedWithTest.php139Drupal\views\Tests\Wizard\TaggedWithTest->testTaggedWith()
"b9H3q4e5" foundOtherTaggedWithTest.php140Drupal\views\Tests\Wizard\TaggedWithTest->testTaggedWith()
"b9H3q4e5" foundOtherTaggedWithTest.php160Drupal\views\Tests\Wizard\TaggedWithTest->testTaggedWith()
LeafDrupal\xmlrpc\Tests\XmlRpcBasicTest900
LeafDrupal\xmlrpc\Tests\XmlRpcMessagesTest700
LeafDrupal\xmlrpc\Tests\XmlRpcValidatorTest1000