entity-1862600-20.patch

Test status
StatusResult
Last receivedTue, 01/29/2013 - 19:30:43
Last requestedTue, 01/29/2013 - 21:30:11
Last testedTue, 01/29/2013 - 22:13:12
Test count1
Environment status
MySQLfail
File information
Fileentity-1862600-20.patch
BranchDrupal core - 8.x
LinkIssue Link
SummaryFAILED: [[SimpleTest]]: [MySQL] 49,645 pass(es), 212 fail(s), and 9 exception(s).
Details

MySQL

  1. Setup environment
  2. Detect an invalid patch URL
  3. Detect invalid repository information
  4. Detect invalid patch format
  5. Detect a non-applicable patch
  6. Detect invalid PHP syntax
  7. Detect a Drupal installation failure
  8. Detect a test run failure
  9. Detect a failing test
    Review the test failures below then if necessary run them locally until the problem has been fixed.
  10. Complete test suite with all tests passing
49,645 pass(es), 212 fail(s), and 9 exception(s)

Non-pass

Test namePassFailException
ExpandDrupal\contact\Tests\ContactSitewideTest1492106
MessageGroupFilenameLineFunctionStatus
Failed to set field label to rB1xTcbQY4nL200XOtherContactSitewideTest.php250Drupal\contact\Tests\ContactSitewideTest->addCategory()
Failed to set field id to gvUtMVqVC372UIC2OtherContactSitewideTest.php250Drupal\contact\Tests\ContactSitewideTest->addCategory()
Failed to set field recipients to invalidOtherContactSitewideTest.php250Drupal\contact\Tests\ContactSitewideTest->addCategory()
Failed to set field reply to OtherContactSitewideTest.php250Drupal\contact\Tests\ContactSitewideTest->addCategory()
Failed to set field selected to OtherContactSitewideTest.php250Drupal\contact\Tests\ContactSitewideTest->addCategory()
Found the Save buttonOtherContactSitewideTest.php250Drupal\contact\Tests\ContactSitewideTest->addCategory()
Found the requested form fields at admin/structure/contact/addOtherContactSitewideTest.php250Drupal\contact\Tests\ContactSitewideTest->addCategory()
Raw "<em class="placeholder">invalid</em> is an invalid e-mail address." foundOtherContactSitewideTest.php71Drupal\contact\Tests\ContactSitewideTest->testSiteWideContact()
Failed to set field label to if5Qk6cUkhOtsDeUOtherContactSitewideTest.php250Drupal\contact\Tests\ContactSitewideTest->addCategory()
Failed to set field id to r4uE1ESyrRVecHmTOtherContactSitewideTest.php250Drupal\contact\Tests\ContactSitewideTest->addCategory()
Failed to set field recipients to invalid@OtherContactSitewideTest.php250Drupal\contact\Tests\ContactSitewideTest->addCategory()
Failed to set field reply to OtherContactSitewideTest.php250Drupal\contact\Tests\ContactSitewideTest->addCategory()
Failed to set field selected to OtherContactSitewideTest.php250Drupal\contact\Tests\ContactSitewideTest->addCategory()
Found the Save buttonOtherContactSitewideTest.php250Drupal\contact\Tests\ContactSitewideTest->addCategory()
Found the requested form fields at admin/structure/contact/addOtherContactSitewideTest.php250Drupal\contact\Tests\ContactSitewideTest->addCategory()
Raw "<em class="placeholder">invalid@</em> is an invalid e-mail address." foundOtherContactSitewideTest.php71Drupal\contact\Tests\ContactSitewideTest->testSiteWideContact()
Failed to set field label to sFSqhFM2ToxZDRbmOtherContactSitewideTest.php250Drupal\contact\Tests\ContactSitewideTest->addCategory()
Failed to set field id to x4TlGjZarxpqSpCCOtherContactSitewideTest.php250Drupal\contact\Tests\ContactSitewideTest->addCategory()
Failed to set field recipients to invalid@site.OtherContactSitewideTest.php250Drupal\contact\Tests\ContactSitewideTest->addCategory()
Failed to set field reply to OtherContactSitewideTest.php250Drupal\contact\Tests\ContactSitewideTest->addCategory()
Failed to set field selected to OtherContactSitewideTest.php250Drupal\contact\Tests\ContactSitewideTest->addCategory()
Found the Save buttonOtherContactSitewideTest.php250Drupal\contact\Tests\ContactSitewideTest->addCategory()
Found the requested form fields at admin/structure/contact/addOtherContactSitewideTest.php250Drupal\contact\Tests\ContactSitewideTest->addCategory()
Raw "<em class="placeholder">invalid@site.</em> is an invalid e-mail address." foundOtherContactSitewideTest.php71Drupal\contact\Tests\ContactSitewideTest->testSiteWideContact()
Failed to set field label to tSufbhDQhCVu4fL5OtherContactSitewideTest.php250Drupal\contact\Tests\ContactSitewideTest->addCategory()
Failed to set field id to kuuMU9ySQdSalsO1OtherContactSitewideTest.php250Drupal\contact\Tests\ContactSitewideTest->addCategory()
Failed to set field recipients to @site.OtherContactSitewideTest.php250Drupal\contact\Tests\ContactSitewideTest->addCategory()
Failed to set field reply to OtherContactSitewideTest.php250Drupal\contact\Tests\ContactSitewideTest->addCategory()
Failed to set field selected to OtherContactSitewideTest.php250Drupal\contact\Tests\ContactSitewideTest->addCategory()
Found the Save buttonOtherContactSitewideTest.php250Drupal\contact\Tests\ContactSitewideTest->addCategory()
Found the requested form fields at admin/structure/contact/addOtherContactSitewideTest.php250Drupal\contact\Tests\ContactSitewideTest->addCategory()
Raw "<em class="placeholder">@site.</em> is an invalid e-mail address." foundOtherContactSitewideTest.php71Drupal\contact\Tests\ContactSitewideTest->testSiteWideContact()
Failed to set field label to u2DCEuXXmTX17G7UOtherContactSitewideTest.php250Drupal\contact\Tests\ContactSitewideTest->addCategory()
Failed to set field id to cuzmvbKYjd6QvPfyOtherContactSitewideTest.php250Drupal\contact\Tests\ContactSitewideTest->addCategory()
Failed to set field recipients to @site.comOtherContactSitewideTest.php250Drupal\contact\Tests\ContactSitewideTest->addCategory()
Failed to set field reply to OtherContactSitewideTest.php250Drupal\contact\Tests\ContactSitewideTest->addCategory()
Failed to set field selected to OtherContactSitewideTest.php250Drupal\contact\Tests\ContactSitewideTest->addCategory()
Found the Save buttonOtherContactSitewideTest.php250Drupal\contact\Tests\ContactSitewideTest->addCategory()
Found the requested form fields at admin/structure/contact/addOtherContactSitewideTest.php250Drupal\contact\Tests\ContactSitewideTest->addCategory()
Raw "<em class="placeholder">@site.com</em> is an invalid e-mail address." foundOtherContactSitewideTest.php71Drupal\contact\Tests\ContactSitewideTest->testSiteWideContact()
Failed to set field label to OtherContactSitewideTest.php250Drupal\contact\Tests\ContactSitewideTest->addCategory()
Failed to set field id to OtherContactSitewideTest.php250Drupal\contact\Tests\ContactSitewideTest->addCategory()
Failed to set field recipients to OtherContactSitewideTest.php250Drupal\contact\Tests\ContactSitewideTest->addCategory()
Failed to set field reply to OtherContactSitewideTest.php250Drupal\contact\Tests\ContactSitewideTest->addCategory()
Failed to set field selected to 1OtherContactSitewideTest.php250Drupal\contact\Tests\ContactSitewideTest->addCategory()
Found the Save buttonOtherContactSitewideTest.php250Drupal\contact\Tests\ContactSitewideTest->addCategory()
Found the requested form fields at admin/structure/contact/addOtherContactSitewideTest.php250Drupal\contact\Tests\ContactSitewideTest->addCategory()
"Label field is required." foundOtherContactSitewideTest.php76Drupal\contact\Tests\ContactSitewideTest->testSiteWideContact()
"Machine-readable name field is required." foundOtherContactSitewideTest.php77Drupal\contact\Tests\ContactSitewideTest->testSiteWideContact()
"Recipients field is required." foundOtherContactSitewideTest.php78Drupal\contact\Tests\ContactSitewideTest->testSiteWideContact()
Failed to set field label to vPO1a00WLCV1j8RlOtherContactSitewideTest.php250Drupal\contact\Tests\ContactSitewideTest->addCategory()
Failed to set field id to zdumpnwdar9cvqsxOtherContactSitewideTest.php250Drupal\contact\Tests\ContactSitewideTest->addCategory()
Failed to set field recipients to simpletest@example.comOtherContactSitewideTest.php250Drupal\contact\Tests\ContactSitewideTest->addCategory()
Failed to set field reply to OtherContactSitewideTest.php250Drupal\contact\Tests\ContactSitewideTest->addCategory()
Failed to set field selected to 1OtherContactSitewideTest.php250Drupal\contact\Tests\ContactSitewideTest->addCategory()
Found the Save buttonOtherContactSitewideTest.php250Drupal\contact\Tests\ContactSitewideTest->addCategory()
Found the requested form fields at admin/structure/contact/addOtherContactSitewideTest.php250Drupal\contact\Tests\ContactSitewideTest->addCategory()
Raw "Category <em class="placeholder">vPO1a00WLCV1j8Rl</em> has been added." foundOtherContactSitewideTest.php83Drupal\contact\Tests\ContactSitewideTest->testSiteWideContact()
New category included in categories list.OtherContactSitewideTest.php86Drupal\contact\Tests\ContactSitewideTest->testSiteWideContact()
Failed to set field label to wXp1ee2xU3Y02dHXOtherContactSitewideTest.php274Drupal\contact\Tests\ContactSitewideTest->updateCategory()
Failed to set field recipients to simpletest@example.com,simpletest2@example.comOtherContactSitewideTest.php274Drupal\contact\Tests\ContactSitewideTest->updateCategory()
Failed to set field reply to nSCSOlFY4BDfYeUZYwV9SFlxqLiJMgOtherContactSitewideTest.php274Drupal\contact\Tests\ContactSitewideTest->updateCategory()
Failed to set field selected to OtherContactSitewideTest.php274Drupal\contact\Tests\ContactSitewideTest->updateCategory()
Found the Save buttonOtherContactSitewideTest.php274Drupal\contact\Tests\ContactSitewideTest->updateCategory()
Found the requested form fields at admin/structure/contact/manage/zdumpnwdar9cvqsx/editOtherContactSitewideTest.php274Drupal\contact\Tests\ContactSitewideTest->updateCategory()
Undefined index: labelDrupal\contact\Tests\ContactSitewideTest->testSiteWideContact() Drupal\simpletest\TestBase->run() simpletest_script_run_one_test('125', 'Drupal\contact\Tests\ContactSitewideTest') NoticeContactSitewideTest.php91Drupal\contact\Tests\ContactSitewideTest->testSiteWideContact()
Value NULL is equal to value 'wXp1ee2xU3Y02dHX'.OtherContactSitewideTest.php91Drupal\contact\Tests\ContactSitewideTest->testSiteWideContact()
Undefined index: recipientsDrupal\contact\Tests\ContactSitewideTest->testSiteWideContact() Drupal\simpletest\TestBase->run() simpletest_script_run_one_test('125', 'Drupal\contact\Tests\ContactSitewideTest') NoticeContactSitewideTest.php92Drupal\contact\Tests\ContactSitewideTest->testSiteWideContact()
Value NULL is equal to value array ( 0 => 'simpletest@example.com', 1 => 'simpletest2@example.com', ).OtherContactSitewideTest.php92Drupal\contact\Tests\ContactSitewideTest->testSiteWideContact()
Undefined index: replyDrupal\contact\Tests\ContactSitewideTest->testSiteWideContact() Drupal\simpletest\TestBase->run() simpletest_script_run_one_test('125', 'Drupal\contact\Tests\ContactSitewideTest') NoticeContactSitewideTest.php93Drupal\contact\Tests\ContactSitewideTest->testSiteWideContact()
Value NULL is equal to value 'nSCSOlFY4BDfYeUZYwV9SFlxqLiJMg'.OtherContactSitewideTest.php93Drupal\contact\Tests\ContactSitewideTest->testSiteWideContact()
Raw "Category <em class="placeholder">wXp1ee2xU3Y02dHX</em> has been updated." foundOtherContactSitewideTest.php95Drupal\contact\Tests\ContactSitewideTest->testSiteWideContact()
"Your e-mail address" foundOtherContactSitewideTest.php104Drupal\contact\Tests\ContactSitewideTest->testSiteWideContact()
Failed to set field label to a3asQRTOF5Mvs4oZOtherContactSitewideTest.php250Drupal\contact\Tests\ContactSitewideTest->addCategory()
Failed to set field id to esyzizwjdzqk0y4uOtherContactSitewideTest.php250Drupal\contact\Tests\ContactSitewideTest->addCategory()
Failed to set field recipients to simpletest@example.com,simpletest2@example.comOtherContactSitewideTest.php250Drupal\contact\Tests\ContactSitewideTest->addCategory()
Failed to set field reply to OtherContactSitewideTest.php250Drupal\contact\Tests\ContactSitewideTest->addCategory()
Failed to set field selected to OtherContactSitewideTest.php250Drupal\contact\Tests\ContactSitewideTest->addCategory()
Found the Save buttonOtherContactSitewideTest.php250Drupal\contact\Tests\ContactSitewideTest->addCategory()
Found the requested form fields at admin/structure/contact/addOtherContactSitewideTest.php250Drupal\contact\Tests\ContactSitewideTest->addCategory()
Raw "Category <em class="placeholder">a3asQRTOF5Mvs4oZ</em> has been added." foundOtherContactSitewideTest.php110Drupal\contact\Tests\ContactSitewideTest->testSiteWideContact()
Failed to set field label to lCZ73A4jLwlKsUJrOtherContactSitewideTest.php250Drupal\contact\Tests\ContactSitewideTest->addCategory()
Failed to set field id to x9y8nhugk3g1jsf3OtherContactSitewideTest.php250Drupal\contact\Tests\ContactSitewideTest->addCategory()
Failed to set field recipients to simpletest@example.com,simpletest2@example.com,simpletest3@example.comOtherContactSitewideTest.php250Drupal\contact\Tests\ContactSitewideTest->addCategory()
Failed to set field reply to OtherContactSitewideTest.php250Drupal\contact\Tests\ContactSitewideTest->addCategory()
Failed to set field selected to OtherContactSitewideTest.php250Drupal\contact\Tests\ContactSitewideTest->addCategory()
Found the Save buttonOtherContactSitewideTest.php250Drupal\contact\Tests\ContactSitewideTest->addCategory()
Found the requested form fields at admin/structure/contact/addOtherContactSitewideTest.php250Drupal\contact\Tests\ContactSitewideTest->addCategory()
Raw "Category <em class="placeholder">lCZ73A4jLwlKsUJr</em> has been added." foundOtherContactSitewideTest.php113Drupal\contact\Tests\ContactSitewideTest->testSiteWideContact()
Failed to set field label to lCZ73A4jLwlKsUJrOtherContactSitewideTest.php250Drupal\contact\Tests\ContactSitewideTest->addCategory()
Failed to set field id to x9y8nhugk3g1jsf3OtherContactSitewideTest.php250Drupal\contact\Tests\ContactSitewideTest->addCategory()
Failed to set field recipients to OtherContactSitewideTest.php250Drupal\contact\Tests\ContactSitewideTest->addCategory()
Failed to set field reply to OtherContactSitewideTest.php250Drupal\contact\Tests\ContactSitewideTest->addCategory()
Failed to set field selected to OtherContactSitewideTest.php250Drupal\contact\Tests\ContactSitewideTest->addCategory()
Found the Save buttonOtherContactSitewideTest.php250Drupal\contact\Tests\ContactSitewideTest->addCategory()
Found the requested form fields at admin/structure/contact/addOtherContactSitewideTest.php250Drupal\contact\Tests\ContactSitewideTest->addCategory()
Raw "The machine-readable name is already in use. It must be unique." foundOtherContactSitewideTest.php118Drupal\contact\Tests\ContactSitewideTest->testSiteWideContact()
HTTP response expected 200, actual 404BrowserContactSitewideTest.php134Drupal\contact\Tests\ContactSitewideTest->testSiteWideContact()
Failed to set field name to OtherContactSitewideTest.php301Drupal\contact\Tests\ContactSitewideTest->submitContact()
Failed to set field mail to simpletest@example.comOtherContactSitewideTest.php301Drupal\contact\Tests\ContactSitewideTest->submitContact()
Failed to set field subject to vBO0ojmdCgSkIYeuOtherContactSitewideTest.php301Drupal\contact\Tests\ContactSitewideTest->submitContact()
Failed to set field message to eqlDpukqCZTRhGUmfJpIxlsOCnCbTAv6uMNUqGbnKlxpgBh1FEKgoBlzfqTIWNvyOtherContactSitewideTest.php301Drupal\contact\Tests\ContactSitewideTest->submitContact()
Found the Send message buttonOtherContactSitewideTest.php301Drupal\contact\Tests\ContactSitewideTest->submitContact()
Found the requested form fields at contact/OtherContactSitewideTest.php301Drupal\contact\Tests\ContactSitewideTest->submitContact()
"Your name field is required." foundOtherContactSitewideTest.php141Drupal\contact\Tests\ContactSitewideTest->testSiteWideContact()
Failed to set field name to fMefCMZ1dOJMis00OtherContactSitewideTest.php301Drupal\contact\Tests\ContactSitewideTest->submitContact()
Failed to set field mail to OtherContactSitewideTest.php301Drupal\contact\Tests\ContactSitewideTest->submitContact()
Failed to set field subject to bTxDVgTSXRg7qWUVOtherContactSitewideTest.php301Drupal\contact\Tests\ContactSitewideTest->submitContact()
Failed to set field message to mY1cpTGAxly63DyCUkULuIAiM9LLmmhgYhC4zOJzcchEsyIpiz6BII7V1rT4DWdEOtherContactSitewideTest.php301Drupal\contact\Tests\ContactSitewideTest->submitContact()
Found the Send message buttonOtherContactSitewideTest.php301Drupal\contact\Tests\ContactSitewideTest->submitContact()
Found the requested form fields at contact/OtherContactSitewideTest.php301Drupal\contact\Tests\ContactSitewideTest->submitContact()
"Your e-mail address field is required." foundOtherContactSitewideTest.php144Drupal\contact\Tests\ContactSitewideTest->testSiteWideContact()
Failed to set field name to vpNTIHBtobcr8amnOtherContactSitewideTest.php301Drupal\contact\Tests\ContactSitewideTest->submitContact()
Failed to set field mail to invalidOtherContactSitewideTest.php301Drupal\contact\Tests\ContactSitewideTest->submitContact()
Failed to set field subject to c8iBTYBCOwrNoC2EOtherContactSitewideTest.php301Drupal\contact\Tests\ContactSitewideTest->submitContact()
Failed to set field message to pAKwJHyOdFFWPSgZxyBflJMSO5LxSoczikc4B03vdwmH5UH43hfaapvc45oGvw0KOtherContactSitewideTest.php301Drupal\contact\Tests\ContactSitewideTest->submitContact()
Found the Send message buttonOtherContactSitewideTest.php301Drupal\contact\Tests\ContactSitewideTest->submitContact()
Found the requested form fields at contact/OtherContactSitewideTest.php301Drupal\contact\Tests\ContactSitewideTest->submitContact()
Raw "The e-mail address <em class="placeholder">invalid</em> is not valid." foundOtherContactSitewideTest.php147Drupal\contact\Tests\ContactSitewideTest->testSiteWideContact()
Failed to set field name to rGdHx18Vhnwm9agOOtherContactSitewideTest.php301Drupal\contact\Tests\ContactSitewideTest->submitContact()
Failed to set field mail to simpletest@example.comOtherContactSitewideTest.php301Drupal\contact\Tests\ContactSitewideTest->submitContact()
Failed to set field subject to OtherContactSitewideTest.php301Drupal\contact\Tests\ContactSitewideTest->submitContact()
Failed to set field message to rvxUgGKN3Xrz3x0NoStf5rPS0PaOsccWsjxCk59PCCWwUNC0D7suvxJfsZOypr81OtherContactSitewideTest.php301Drupal\contact\Tests\ContactSitewideTest->submitContact()
Found the Send message buttonOtherContactSitewideTest.php301Drupal\contact\Tests\ContactSitewideTest->submitContact()
Found the requested form fields at contact/OtherContactSitewideTest.php301Drupal\contact\Tests\ContactSitewideTest->submitContact()
"Subject field is required." foundOtherContactSitewideTest.php150Drupal\contact\Tests\ContactSitewideTest->testSiteWideContact()
Failed to set field name to w7fnrwgpwUy7T8tAOtherContactSitewideTest.php301Drupal\contact\Tests\ContactSitewideTest->submitContact()
Failed to set field mail to simpletest@example.comOtherContactSitewideTest.php301Drupal\contact\Tests\ContactSitewideTest->submitContact()
Failed to set field subject to tGr8CLKZLVKlrwEZOtherContactSitewideTest.php301Drupal\contact\Tests\ContactSitewideTest->submitContact()
Failed to set field message to OtherContactSitewideTest.php301Drupal\contact\Tests\ContactSitewideTest->submitContact()
Found the Send message buttonOtherContactSitewideTest.php301Drupal\contact\Tests\ContactSitewideTest->submitContact()
Found the requested form fields at contact/OtherContactSitewideTest.php301Drupal\contact\Tests\ContactSitewideTest->submitContact()
"Message field is required." foundOtherContactSitewideTest.php153Drupal\contact\Tests\ContactSitewideTest->testSiteWideContact()
Failed to set field name to rQvLe4L8EPEh5TihOtherContactSitewideTest.php298Drupal\contact\Tests\ContactSitewideTest->submitContact()
Failed to set field mail to simpletest@example.comOtherContactSitewideTest.php298Drupal\contact\Tests\ContactSitewideTest->submitContact()
Failed to set field subject to okyJYSgIxLzLpOgoOtherContactSitewideTest.php298Drupal\contact\Tests\ContactSitewideTest->submitContact()
Failed to set field message to siEk9YtPoOC9n3QjeoA0g5JkJlNmS1dOmx6kOPSPkmBenDg9PkAvH5bv1kqdABuWOtherContactSitewideTest.php298Drupal\contact\Tests\ContactSitewideTest->submitContact()
Found the Send message buttonOtherContactSitewideTest.php298Drupal\contact\Tests\ContactSitewideTest->submitContact()
Found the requested form fields at contactOtherContactSitewideTest.php298Drupal\contact\Tests\ContactSitewideTest->submitContact()
"Your message has been sent." foundOtherContactSitewideTest.php171Drupal\contact\Tests\ContactSitewideTest->testSiteWideContact()
Failed to set field name to rWF49a1q06vaL2fgOtherContactSitewideTest.php298Drupal\contact\Tests\ContactSitewideTest->submitContact()
Failed to set field mail to simpletest@example.comOtherContactSitewideTest.php298Drupal\contact\Tests\ContactSitewideTest->submitContact()
Failed to set field subject to oBO85D6zdaKsMERKOtherContactSitewideTest.php298Drupal\contact\Tests\ContactSitewideTest->submitContact()
Failed to set field message to wStVUJXnfhjko8NA0ZOTJaq3niZedGWClQceHbYwFZhQSeCcBPestjCgWhWoPRwoOtherContactSitewideTest.php298Drupal\contact\Tests\ContactSitewideTest->submitContact()
Found the Send message buttonOtherContactSitewideTest.php298Drupal\contact\Tests\ContactSitewideTest->submitContact()
Found the requested form fields at contactOtherContactSitewideTest.php298Drupal\contact\Tests\ContactSitewideTest->submitContact()
"Your message has been sent." foundOtherContactSitewideTest.php171Drupal\contact\Tests\ContactSitewideTest->testSiteWideContact()
Failed to set field name to gfQ8RW5dkClzLM2NOtherContactSitewideTest.php298Drupal\contact\Tests\ContactSitewideTest->submitContact()
Failed to set field mail to simpletest@example.comOtherContactSitewideTest.php298Drupal\contact\Tests\ContactSitewideTest->submitContact()
Failed to set field subject to tUpb50Q7fUJbgG9NOtherContactSitewideTest.php298Drupal\contact\Tests\ContactSitewideTest->submitContact()
Failed to set field message to yL2qlvwT8JhafnMGCY0bBfMkS7WrnCVGwG3AGxobevCXyEERYanFWmzJswBPXNMXOtherContactSitewideTest.php298Drupal\contact\Tests\ContactSitewideTest->submitContact()
Found the Send message buttonOtherContactSitewideTest.php298Drupal\contact\Tests\ContactSitewideTest->submitContact()
Found the requested form fields at contactOtherContactSitewideTest.php298Drupal\contact\Tests\ContactSitewideTest->submitContact()
"Your message has been sent." foundOtherContactSitewideTest.php171Drupal\contact\Tests\ContactSitewideTest->testSiteWideContact()
HTTP response expected 403, actual 404BrowserContactSitewideTest.php175Drupal\contact\Tests\ContactSitewideTest->testSiteWideContact()
Raw "You cannot send more than <em class="placeholder">3</em> messages in 10 min. Try again later." foundOtherContactSitewideTest.php176Drupal\contact\Tests\ContactSitewideTest->testSiteWideContact()
Failed to set field label to fooOtherContactSitewideTest.php250Drupal\contact\Tests\ContactSitewideTest->addCategory()
Failed to set field id to fooOtherContactSitewideTest.php250Drupal\contact\Tests\ContactSitewideTest->addCategory()
Failed to set field recipients to foo@example.comOtherContactSitewideTest.php250Drupal\contact\Tests\ContactSitewideTest->addCategory()
Failed to set field reply to dBtwow98TYmJ5XdwRfyP0TjAwiCeY389Yv2OqNmPOtherContactSitewideTest.php250Drupal\contact\Tests\ContactSitewideTest->addCategory()
Failed to set field selected to OtherContactSitewideTest.php250Drupal\contact\Tests\ContactSitewideTest->addCategory()
Found the Save buttonOtherContactSitewideTest.php250Drupal\contact\Tests\ContactSitewideTest->addCategory()
Found the requested form fields at admin/structure/contact/addOtherContactSitewideTest.php250Drupal\contact\Tests\ContactSitewideTest->addCategory()
Failed to set field label to barOtherContactSitewideTest.php250Drupal\contact\Tests\ContactSitewideTest->addCategory()
Failed to set field id to barOtherContactSitewideTest.php250Drupal\contact\Tests\ContactSitewideTest->addCategory()
Failed to set field recipients to bar@example.comOtherContactSitewideTest.php250Drupal\contact\Tests\ContactSitewideTest->addCategory()
Failed to set field reply to wluOaQ91gjd6t7zndq7vJSkhrf1gviFLQ3qhLBHiOtherContactSitewideTest.php250Drupal\contact\Tests\ContactSitewideTest->addCategory()
Failed to set field selected to OtherContactSitewideTest.php250Drupal\contact\Tests\ContactSitewideTest->addCategory()
Found the Save buttonOtherContactSitewideTest.php250Drupal\contact\Tests\ContactSitewideTest->addCategory()
Found the requested form fields at admin/structure/contact/addOtherContactSitewideTest.php250Drupal\contact\Tests\ContactSitewideTest->addCategory()
Failed to set field label to no_autoreplyOtherContactSitewideTest.php250Drupal\contact\Tests\ContactSitewideTest->addCategory()
Failed to set field id to no_autoreplyOtherContactSitewideTest.php250Drupal\contact\Tests\ContactSitewideTest->addCategory()
Failed to set field recipients to bar@example.comOtherContactSitewideTest.php250Drupal\contact\Tests\ContactSitewideTest->addCategory()
Failed to set field reply to OtherContactSitewideTest.php250Drupal\contact\Tests\ContactSitewideTest->addCategory()
Failed to set field selected to OtherContactSitewideTest.php250Drupal\contact\Tests\ContactSitewideTest->addCategory()
Found the Save buttonOtherContactSitewideTest.php250Drupal\contact\Tests\ContactSitewideTest->addCategory()
Found the requested form fields at admin/structure/contact/addOtherContactSitewideTest.php250Drupal\contact\Tests\ContactSitewideTest->addCategory()
Failed to set field name to j1eNjpankDS3Dc50OtherContactSitewideTest.php301Drupal\contact\Tests\ContactSitewideTest->submitContact()
Failed to set field mail to kap7UJQuX694zutkZtPQUFlK4oeoexfW@example.comOtherContactSitewideTest.php301Drupal\contact\Tests\ContactSitewideTest->submitContact()
Failed to set field subject to nhsWZJPvecHyoddLTYgbb51Cl2edNu71ZQ2SjSEGE7CbKGhw29RvZbm0nmmhXI4yOtherContactSitewideTest.php301Drupal\contact\Tests\ContactSitewideTest->submitContact()
Failed to set field message to z'T27/^K7}0DvlE=~&))SG<.Ao`0(1)OoQVfa/Ow?AR.i>@f!@mb]bQADkS{X{Hh:P`-Ny?bUu/__@zHug#-o}7m6eMF=WrV4~L*]Ot9La9kGt *Ie<;2Y-`&I00L#UOtherContactSitewideTest.php301Drupal\contact\Tests\ContactSitewideTest->submitContact()
Found the Send message buttonOtherContactSitewideTest.php301Drupal\contact\Tests\ContactSitewideTest->submitContact()
Found the requested form fields at contact/fooOtherContactSitewideTest.php301Drupal\contact\Tests\ContactSitewideTest->submitContact()
Value 0 is equal to value 1.OtherContactSitewideTest.php209Drupal\contact\Tests\ContactSitewideTest->testAutoReply()
Undefined offset: 0Drupal\contact\Tests\ContactSitewideTest->testAutoReply() Drupal\simpletest\TestBase->run() simpletest_script_run_one_test('125', 'Drupal\contact\Tests\ContactSitewideTest') NoticeContactSitewideTest.php210Drupal\contact\Tests\ContactSitewideTest->testAutoReply()
Value NULL is equal to value 'dBtwow98TYmJ5XdwRfyP0TjAwiCeY389Yv2OqNmP '.OtherContactSitewideTest.php210Drupal\contact\Tests\ContactSitewideTest->testAutoReply()
Failed to set field name to yWqsYqz47K82dlhSOtherContactSitewideTest.php301Drupal\contact\Tests\ContactSitewideTest->submitContact()
Failed to set field mail to blboPs7vDHUsXBa3KICfErrH70jbSe8l@example.comOtherContactSitewideTest.php301Drupal\contact\Tests\ContactSitewideTest->submitContact()
Failed to set field subject to sk9:8Ptx65y1%2T{6m<@J"%+ooFb^"qEihA4*+_:SiR:%)@0O];B."7sZb$/~,/hOtherContactSitewideTest.php301Drupal\contact\Tests\ContactSitewideTest->submitContact()
Failed to set field message to +LLBE99Af/_R_19qFV!#:yTql_s+Cf(+<^nFB&ricmk1{.!8DY;K+_C(S(S"nLh9>F&p2!?Vi39u7&IxpNOZbi]%,Nr9{}Z"A+="Glq9A<q&,DO) rJcyWd`RA2nh}OFOtherContactSitewideTest.php301Drupal\contact\Tests\ContactSitewideTest->submitContact()
Found the Send message buttonOtherContactSitewideTest.php301Drupal\contact\Tests\ContactSitewideTest->submitContact()
Found the requested form fields at contact/barOtherContactSitewideTest.php301Drupal\contact\Tests\ContactSitewideTest->submitContact()
Value 0 is equal to value 1.OtherContactSitewideTest.php218Drupal\contact\Tests\ContactSitewideTest->testAutoReply()
Undefined offset: 0Drupal\contact\Tests\ContactSitewideTest->testAutoReply() Drupal\simpletest\TestBase->run() simpletest_script_run_one_test('125', 'Drupal\contact\Tests\ContactSitewideTest') NoticeContactSitewideTest.php219Drupal\contact\Tests\ContactSitewideTest->testAutoReply()
Value NULL is equal to value 'wluOaQ91gjd6t7zndq7vJSkhrf1gviFLQ3qhLBHi '.OtherContactSitewideTest.php219Drupal\contact\Tests\ContactSitewideTest->testAutoReply()
Failed to set field name to pZ1H0eutGvILxxuWOtherContactSitewideTest.php301Drupal\contact\Tests\ContactSitewideTest->submitContact()
Failed to set field mail to w583KkhS2VfJ8QNHfraSVt25chBOe0LY@example.comOtherContactSitewideTest.php301Drupal\contact\Tests\ContactSitewideTest->submitContact()
Failed to set field subject to `2~f_<D-B"FdfV09Pz;k4O5c#Zxg :K3M(g]]Om_u/9A>{8dVNKTF#su)'<!X|r+OtherContactSitewideTest.php301Drupal\contact\Tests\ContactSitewideTest->submitContact()
Failed to set field message to }X3r3U}6FNW]e94|)fQhl;?W,/?}mst4SMu:Tk+\VA`l&C91 @T_Gm9--/+,wRa9 ZB?{uW=q.b8Fm-w=e@Kc-'*zsQ>5d"G@,B?I_25G?(\]P>F^yo! c#jb=SOJ6abOtherContactSitewideTest.php301Drupal\contact\Tests\ContactSitewideTest->submitContact()
Found the Send message buttonOtherContactSitewideTest.php301Drupal\contact\Tests\ContactSitewideTest->submitContact()
Found the requested form fields at contact/no_autoreplyOtherContactSitewideTest.php301Drupal\contact\Tests\ContactSitewideTest->submitContact()
Failed to set field name to yWqsYqz47K82dlhSOtherContactSitewideTest.php301Drupal\contact\Tests\ContactSitewideTest->submitContact()
Failed to set field mail to blboPs7vDHUsXBa3KICfErrH70jbSe8l@example.comOtherContactSitewideTest.php301Drupal\contact\Tests\ContactSitewideTest->submitContact()
Failed to set field subject to sk9:8Ptx65y1%2T{6m<@J"%+ooFb^"qEihA4*+_:SiR:%)@0O];B."7sZb$/~,/hOtherContactSitewideTest.php301Drupal\contact\Tests\ContactSitewideTest->submitContact()
Failed to set field message to +LLBE99Af/_R_19qFV!#:yTql_s+Cf(+<^nFB&ricmk1{.!8DY;K+_C(S(S"nLh9>F&p2!?Vi39u7&IxpNOZbi]%,Nr9{}Z"A+="Glq9A<q&,DO) rJcyWd`RA2nh}OFOtherContactSitewideTest.php301Drupal\contact\Tests\ContactSitewideTest->submitContact()
Found the Send message buttonOtherContactSitewideTest.php301Drupal\contact\Tests\ContactSitewideTest->submitContact()
Found the requested form fields at contact/barOtherContactSitewideTest.php301Drupal\contact\Tests\ContactSitewideTest->submitContact()
Value 0 is equal to value 1.OtherContactSitewideTest.php218Drupal\contact\Tests\ContactSitewideTest->testAutoReply()
Undefined offset: 0Drupal\contact\Tests\ContactSitewideTest->testAutoReply() Drupal\simpletest\TestBase->run() simpletest_script_run_one_test('125', 'Drupal\contact\Tests\ContactSitewideTest') NoticeContactSitewideTest.php219Drupal\contact\Tests\ContactSitewideTest->testAutoReply()
Value NULL is equal to value 'wluOaQ91gjd6t7zndq7vJSkhrf1gviFLQ3qhLBHi '.OtherContactSitewideTest.php219Drupal\contact\Tests\ContactSitewideTest->testAutoReply()
Failed to set field name to pZ1H0eutGvILxxuWOtherContactSitewideTest.php301Drupal\contact\Tests\ContactSitewideTest->submitContact()
Failed to set field mail to w583KkhS2VfJ8QNHfraSVt25chBOe0LY@example.comOtherContactSitewideTest.php301Drupal\contact\Tests\ContactSitewideTest->submitContact()
Failed to set field subject to `2~f_<D-B"FdfV09Pz;k4O5c#Zxg :K3M(g]]Om_u/9A>{8dVNKTF#su)'<!X|r+OtherContactSitewideTest.php301Drupal\contact\Tests\ContactSitewideTest->submitContact()
Failed to set field message to }X3r3U}6FNW]e94|)fQhl;?W,/?}mst4SMu:Tk+\VA`l&C91 @T_Gm9--/+,wRa9 ZB?{uW=q.b8Fm-w=e@Kc-'*zsQ>5d"G@,B?I_25G?(\]P>F^yo! c#jb=SOJ6abOtherContactSitewideTest.php301Drupal\contact\Tests\ContactSitewideTest->submitContact()
Found the Send message buttonOtherContactSitewideTest.php301Drupal\contact\Tests\ContactSitewideTest->submitContact()
Found the requested form fields at contact/no_autoreplyOtherContactSitewideTest.php301Drupal\contact\Tests\ContactSitewideTest->submitContact()
ExpandDrupal\system\Tests\Upgrade\FilledMinimalUpgradePathTest1923
MessageGroupFilenameLineFunctionStatus
simplexml_import_dom(): Invalid Nodetype to importsimplexml_import_dom(Object) Drupal\simpletest\WebTestBase->parse() Drupal\simpletest\WebTestBase->xpath('//li[@class=:class]', Array) Drupal\system\Tests\Upgrade\UpgradePathTestBase->performUpgrade() Drupal\system\Tests\Upgrade\FilledMinimalUpgradePathTest->testFilledMinimalUpgrade() Drupal\simpletest\TestBase->run() simpletest_script_run_one_test('582', 'Drupal\system\Tests\Upgrade\FilledMinimalUpgradePathTest') WarningWebTestBase.php1109Drupal\simpletest\WebTestBase->parse()
Parsed page successfully.BrowserUpgradePathTestBase.php242Drupal\system\Tests\Upgrade\UpgradePathTestBase->performUpgrade()
Invalid argument supplied for foreach()Drupal\system\Tests\Upgrade\UpgradePathTestBase->performUpgrade() Drupal\system\Tests\Upgrade\FilledMinimalUpgradePathTest->testFilledMinimalUpgrade() Drupal\simpletest\TestBase->run() simpletest_script_run_one_test('582', 'Drupal\system\Tests\Upgrade\FilledMinimalUpgradePathTest') WarningUpgradePathTestBase.php242Drupal\system\Tests\Upgrade\UpgradePathTestBase->performUpgrade()
No pending updates at the end of the update process.OtherUpgradePathTestBase.php258Drupal\system\Tests\Upgrade\UpgradePathTestBase->performUpgrade()
Exception: update.php still shows pending updates after execution. in Drupal\system\Tests\Upgrade\UpgradePathTestBase->performUpgrade() (line 259 of /var/lib/drupaltestbot/sites/default/files/checkout/core/modules/system/lib/Drupal/system/Tests/Upgrade/UpgradePathTestBase.php). Drupal\system\Tests\Upgrade\UpgradePathTestBase->performUpgrade() Drupal\system\Tests\Upgrade\FilledMinimalUpgradePathTest->testFilledMinimalUpgrade() Drupal\simpletest\TestBase->run() simpletest_script_run_one_test('582', 'Drupal\system\Tests\Upgrade\FilledMinimalUpgradePathTest') Uncaught exceptionUpgradePathTestBase.php259Drupal\system\Tests\Upgrade\UpgradePathTestBase->performUpgrade()

All

Test namePassFailException
LeafDrupal\action\Tests\BulkFormTest3300
LeafDrupal\action\Tests\ConfigurationTest3900
LeafDrupal\action\Tests\LoopTest2100
LeafDrupal\aggregator\Tests\AddFeedTest7100
LeafDrupal\aggregator\Tests\AggregatorConfigurationTest2000
LeafDrupal\aggregator\Tests\AggregatorCronTest5500
LeafDrupal\aggregator\Tests\AggregatorRenderingTest22000
LeafDrupal\aggregator\Tests\CategorizeFeedItemTest6100
LeafDrupal\aggregator\Tests\CategorizeFeedTest2100
LeafDrupal\aggregator\Tests\FeedParserTest7200
LeafDrupal\aggregator\Tests\ImportOpmlTest6800
LeafDrupal\aggregator\Tests\RemoveFeedItemTest27000
LeafDrupal\aggregator\Tests\RemoveFeedTest2500
LeafDrupal\aggregator\Tests\UpdateFeedItemTest6500
LeafDrupal\aggregator\Tests\UpdateFeedTest7600
LeafDrupal\ban\Tests\IpAddressBlockingTest4300
LeafDrupal\block\Tests\BlockAdminThemeTest1900
LeafDrupal\block\Tests\BlockCacheTest18500
LeafDrupal\block\Tests\BlockHiddenRegionTest1800
LeafDrupal\block\Tests\BlockHtmlIdTest1000
LeafDrupal\block\Tests\BlockInvalidRegionTest2400
LeafDrupal\block\Tests\BlockLanguageTest5100
LeafDrupal\block\Tests\BlockLibrarySearchTest1900
LeafDrupal\block\Tests\BlockStorageUnitTest1800
LeafDrupal\block\Tests\BlockTemplateSuggestionsUnitTest300
LeafDrupal\block\Tests\BlockTest33000
LeafDrupal\block\Tests\BlockTitleXSSTest1500
LeafDrupal\block\Tests\BlockUiTest900
LeafDrupal\block\Tests\NewDefaultThemeBlocksTest1700
LeafDrupal\block\Tests\NonDefaultBlockAdminTest1200
LeafDrupal\block\Tests\Views\DisplayBlockTest2300
LeafDrupal\book\Tests\BookTest50000
LeafDrupal\breakpoint\Tests\BreakpointAPITest600
LeafDrupal\breakpoint\Tests\BreakpointCRUDTest2100
LeafDrupal\breakpoint\Tests\BreakpointGroupAPITest400
LeafDrupal\breakpoint\Tests\BreakpointGroupCRUDTest1200
LeafDrupal\breakpoint\Tests\BreakpointMediaQueryTest6300
LeafDrupal\breakpoint\Tests\BreakpointThemeTest2300
LeafDrupal\color\Tests\ColorTest8700
LeafDrupal\comment\Tests\CommentActionsTest3000
LeafDrupal\comment\Tests\CommentAnonymousTest16300
LeafDrupal\comment\Tests\CommentApprovalTest15200
LeafDrupal\comment\Tests\CommentBlockTest9300
LeafDrupal\comment\Tests\CommentContentRebuildTest3300
LeafDrupal\comment\Tests\CommentCSSTest50100
LeafDrupal\comment\Tests\CommentFieldsTest9800
LeafDrupal\comment\Tests\CommentInterfaceTest25100
LeafDrupal\comment\Tests\CommentLanguageTest7200
ExpandDrupal\comment\Tests\CommentLinksTest109300
MessageGroupFilenameLineFunctionStatus
Changed environment:array ( 'authenticated' => false, 'comment count' => false, 'form' => 'below', 'user_register' => 'visitors', 'contact' => 'optional', 'comments' => 'open', 'access comments' => 0, 'post comments' => 0, 'skip comment approval' => 1, 'edit own comments' => 0, )DebugCommentLinksTest.php194Drupal\comment\Tests\CommentLinksTest->setEnvironment()
Changed environment:array ( 'authenticated' => true, 'comment count' => false, 'form' => 'below', 'user_register' => 'visitors', 'contact' => 'optional', 'comments' => 'open', 'access comments' => 0, 'post comments' => 0, 'skip comment approval' => 1, 'edit own comments' => 0, )DebugCommentLinksTest.php194Drupal\comment\Tests\CommentLinksTest->setEnvironment()
Changed environment:array ( 'authenticated' => false, 'comment count' => true, 'form' => 'below', 'user_register' => 'visitors', 'contact' => 'optional', 'comments' => 'open', 'access comments' => 0, 'post comments' => 0, 'skip comment approval' => 1, 'edit own comments' => 0, )DebugCommentLinksTest.php194Drupal\comment\Tests\CommentLinksTest->setEnvironment()
Changed environment:array ( 'authenticated' => true, 'comment count' => true, 'form' => 'below', 'user_register' => 'visitors', 'contact' => 'optional', 'comments' => 'open', 'access comments' => 0, 'post comments' => 0, 'skip comment approval' => 1, 'edit own comments' => 0, )DebugCommentLinksTest.php194Drupal\comment\Tests\CommentLinksTest->setEnvironment()
Changed environment:array ( 'authenticated' => false, 'comment count' => false, 'form' => 'below', 'user_register' => 'visitors', 'contact' => 'optional', 'comments' => 'open', 'access comments' => 1, 'post comments' => 0, 'skip comment approval' => 1, 'edit own comments' => 0, )DebugCommentLinksTest.php194Drupal\comment\Tests\CommentLinksTest->setEnvironment()
Changed environment:array ( 'authenticated' => true, 'comment count' => false, 'form' => 'below', 'user_register' => 'visitors', 'contact' => 'optional', 'comments' => 'open', 'access comments' => 1, 'post comments' => 0, 'skip comment approval' => 1, 'edit own comments' => 0, )DebugCommentLinksTest.php194Drupal\comment\Tests\CommentLinksTest->setEnvironment()
Changed environment:array ( 'authenticated' => false, 'comment count' => true, 'form' => 'below', 'user_register' => 'visitors', 'contact' => 'optional', 'comments' => 'open', 'access comments' => 1, 'post comments' => 0, 'skip comment approval' => 1, 'edit own comments' => 0, )DebugCommentLinksTest.php194Drupal\comment\Tests\CommentLinksTest->setEnvironment()
Changed environment:array ( 'authenticated' => true, 'comment count' => true, 'form' => 'below', 'user_register' => 'visitors', 'contact' => 'optional', 'comments' => 'open', 'access comments' => 1, 'post comments' => 0, 'skip comment approval' => 1, 'edit own comments' => 0, )DebugCommentLinksTest.php194Drupal\comment\Tests\CommentLinksTest->setEnvironment()
Changed environment:array ( 'authenticated' => false, 'comment count' => false, 'form' => 'below', 'user_register' => 'visitors', 'contact' => 'optional', 'comments' => 'open', 'access comments' => 0, 'post comments' => 1, 'skip comment approval' => 1, 'edit own comments' => 0, )DebugCommentLinksTest.php194Drupal\comment\Tests\CommentLinksTest->setEnvironment()
Changed environment:array ( 'authenticated' => true, 'comment count' => false, 'form' => 'below', 'user_register' => 'visitors', 'contact' => 'optional', 'comments' => 'open', 'access comments' => 0, 'post comments' => 1, 'skip comment approval' => 1, 'edit own comments' => 0, )DebugCommentLinksTest.php194Drupal\comment\Tests\CommentLinksTest->setEnvironment()
Changed environment:array ( 'authenticated' => false, 'comment count' => true, 'form' => 'below', 'user_register' => 'visitors', 'contact' => 'optional', 'comments' => 'open', 'access comments' => 0, 'post comments' => 1, 'skip comment approval' => 1, 'edit own comments' => 0, )DebugCommentLinksTest.php194Drupal\comment\Tests\CommentLinksTest->setEnvironment()
Changed environment:array ( 'authenticated' => true, 'comment count' => true, 'form' => 'below', 'user_register' => 'visitors', 'contact' => 'optional', 'comments' => 'open', 'access comments' => 0, 'post comments' => 1, 'skip comment approval' => 1, 'edit own comments' => 0, )DebugCommentLinksTest.php194Drupal\comment\Tests\CommentLinksTest->setEnvironment()
Changed environment:array ( 'authenticated' => false, 'comment count' => false, 'form' => 'below', 'user_register' => 'visitors', 'contact' => 'optional', 'comments' => 'open', 'access comments' => 1, 'post comments' => 1, 'skip comment approval' => 1, 'edit own comments' => 0, )DebugCommentLinksTest.php194Drupal\comment\Tests\CommentLinksTest->setEnvironment()
Changed environment:array ( 'authenticated' => true, 'comment count' => false, 'form' => 'below', 'user_register' => 'visitors', 'contact' => 'optional', 'comments' => 'open', 'access comments' => 1, 'post comments' => 1, 'skip comment approval' => 1, 'edit own comments' => 0, )DebugCommentLinksTest.php194Drupal\comment\Tests\CommentLinksTest->setEnvironment()
Changed environment:array ( 'authenticated' => false, 'comment count' => true, 'form' => 'below', 'user_register' => 'visitors', 'contact' => 'optional', 'comments' => 'open', 'access comments' => 1, 'post comments' => 1, 'skip comment approval' => 1, 'edit own comments' => 0, )DebugCommentLinksTest.php194Drupal\comment\Tests\CommentLinksTest->setEnvironment()
Changed environment:array ( 'authenticated' => true, 'comment count' => true, 'form' => 'below', 'user_register' => 'visitors', 'contact' => 'optional', 'comments' => 'open', 'access comments' => 1, 'post comments' => 1, 'skip comment approval' => 1, 'edit own comments' => 0, )DebugCommentLinksTest.php194Drupal\comment\Tests\CommentLinksTest->setEnvironment()
Changed environment:array ( 'authenticated' => false, 'comment count' => false, 'form' => 'separate page', 'user_register' => 'visitors', 'contact' => 'optional', 'comments' => 'open', 'access comments' => 0, 'post comments' => 0, 'skip comment approval' => 1, 'edit own comments' => 0, )DebugCommentLinksTest.php194Drupal\comment\Tests\CommentLinksTest->setEnvironment()
Changed environment:array ( 'authenticated' => true, 'comment count' => false, 'form' => 'separate page', 'user_register' => 'visitors', 'contact' => 'optional', 'comments' => 'open', 'access comments' => 0, 'post comments' => 0, 'skip comment approval' => 1, 'edit own comments' => 0, )DebugCommentLinksTest.php194Drupal\comment\Tests\CommentLinksTest->setEnvironment()
Changed environment:array ( 'authenticated' => false, 'comment count' => true, 'form' => 'separate page', 'user_register' => 'visitors', 'contact' => 'optional', 'comments' => 'open', 'access comments' => 0, 'post comments' => 0, 'skip comment approval' => 1, 'edit own comments' => 0, )DebugCommentLinksTest.php194Drupal\comment\Tests\CommentLinksTest->setEnvironment()
Changed environment:array ( 'authenticated' => true, 'comment count' => true, 'form' => 'separate page', 'user_register' => 'visitors', 'contact' => 'optional', 'comments' => 'open', 'access comments' => 0, 'post comments' => 0, 'skip comment approval' => 1, 'edit own comments' => 0, )DebugCommentLinksTest.php194Drupal\comment\Tests\CommentLinksTest->setEnvironment()
Changed environment:array ( 'authenticated' => false, 'comment count' => false, 'form' => 'separate page', 'user_register' => 'visitors', 'contact' => 'optional', 'comments' => 'open', 'access comments' => 1, 'post comments' => 0, 'skip comment approval' => 1, 'edit own comments' => 0, )DebugCommentLinksTest.php194Drupal\comment\Tests\CommentLinksTest->setEnvironment()
Changed environment:array ( 'authenticated' => true, 'comment count' => false, 'form' => 'separate page', 'user_register' => 'visitors', 'contact' => 'optional', 'comments' => 'open', 'access comments' => 1, 'post comments' => 0, 'skip comment approval' => 1, 'edit own comments' => 0, )DebugCommentLinksTest.php194Drupal\comment\Tests\CommentLinksTest->setEnvironment()
Changed environment:array ( 'authenticated' => false, 'comment count' => true, 'form' => 'separate page', 'user_register' => 'visitors', 'contact' => 'optional', 'comments' => 'open', 'access comments' => 1, 'post comments' => 0, 'skip comment approval' => 1, 'edit own comments' => 0, )DebugCommentLinksTest.php194Drupal\comment\Tests\CommentLinksTest->setEnvironment()
Changed environment:array ( 'authenticated' => true, 'comment count' => true, 'form' => 'separate page', 'user_register' => 'visitors', 'contact' => 'optional', 'comments' => 'open', 'access comments' => 1, 'post comments' => 0, 'skip comment approval' => 1, 'edit own comments' => 0, )DebugCommentLinksTest.php194Drupal\comment\Tests\CommentLinksTest->setEnvironment()
Changed environment:array ( 'authenticated' => false, 'comment count' => false, 'form' => 'separate page', 'user_register' => 'visitors', 'contact' => 'optional', 'comments' => 'open', 'access comments' => 0, 'post comments' => 1, 'skip comment approval' => 1, 'edit own comments' => 0, )DebugCommentLinksTest.php194Drupal\comment\Tests\CommentLinksTest->setEnvironment()
Changed environment:array ( 'authenticated' => true, 'comment count' => false, 'form' => 'separate page', 'user_register' => 'visitors', 'contact' => 'optional', 'comments' => 'open', 'access comments' => 0, 'post comments' => 1, 'skip comment approval' => 1, 'edit own comments' => 0, )DebugCommentLinksTest.php194Drupal\comment\Tests\CommentLinksTest->setEnvironment()
Changed environment:array ( 'authenticated' => false, 'comment count' => true, 'form' => 'separate page', 'user_register' => 'visitors', 'contact' => 'optional', 'comments' => 'open', 'access comments' => 0, 'post comments' => 1, 'skip comment approval' => 1, 'edit own comments' => 0, )DebugCommentLinksTest.php194Drupal\comment\Tests\CommentLinksTest->setEnvironment()
Changed environment:array ( 'authenticated' => true, 'comment count' => true, 'form' => 'separate page', 'user_register' => 'visitors', 'contact' => 'optional', 'comments' => 'open', 'access comments' => 0, 'post comments' => 1, 'skip comment approval' => 1, 'edit own comments' => 0, )DebugCommentLinksTest.php194Drupal\comment\Tests\CommentLinksTest->setEnvironment()
Changed environment:array ( 'authenticated' => false, 'comment count' => false, 'form' => 'separate page', 'user_register' => 'visitors', 'contact' => 'optional', 'comments' => 'open', 'access comments' => 1, 'post comments' => 1, 'skip comment approval' => 1, 'edit own comments' => 0, )DebugCommentLinksTest.php194Drupal\comment\Tests\CommentLinksTest->setEnvironment()
Changed environment:array ( 'authenticated' => true, 'comment count' => false, 'form' => 'separate page', 'user_register' => 'visitors', 'contact' => 'optional', 'comments' => 'open', 'access comments' => 1, 'post comments' => 1, 'skip comment approval' => 1, 'edit own comments' => 0, )DebugCommentLinksTest.php194Drupal\comment\Tests\CommentLinksTest->setEnvironment()
Changed environment:array ( 'authenticated' => false, 'comment count' => true, 'form' => 'separate page', 'user_register' => 'visitors', 'contact' => 'optional', 'comments' => 'open', 'access comments' => 1, 'post comments' => 1, 'skip comment approval' => 1, 'edit own comments' => 0, )DebugCommentLinksTest.php194Drupal\comment\Tests\CommentLinksTest->setEnvironment()
Changed environment:array ( 'authenticated' => true, 'comment count' => true, 'form' => 'separate page', 'user_register' => 'visitors', 'contact' => 'optional', 'comments' => 'open', 'access comments' => 1, 'post comments' => 1, 'skip comment approval' => 1, 'edit own comments' => 0, )DebugCommentLinksTest.php194Drupal\comment\Tests\CommentLinksTest->setEnvironment()
Changed environment:array ( 'authenticated' => false, 'comment count' => false, 'form' => 'below', 'user_register' => 'admin_only', 'contact' => 'optional', 'comments' => 'open', 'access comments' => 0, 'post comments' => 0, 'skip comment approval' => 1, 'edit own comments' => 0, )DebugCommentLinksTest.php194Drupal\comment\Tests\CommentLinksTest->setEnvironment()
Changed environment:array ( 'authenticated' => true, 'comment count' => false, 'form' => 'below', 'user_register' => 'admin_only', 'contact' => 'optional', 'comments' => 'open', 'access comments' => 0, 'post comments' => 0, 'skip comment approval' => 1, 'edit own comments' => 0, )DebugCommentLinksTest.php194Drupal\comment\Tests\CommentLinksTest->setEnvironment()
Changed environment:array ( 'authenticated' => false, 'comment count' => true, 'form' => 'below', 'user_register' => 'admin_only', 'contact' => 'optional', 'comments' => 'open', 'access comments' => 0, 'post comments' => 0, 'skip comment approval' => 1, 'edit own comments' => 0, )DebugCommentLinksTest.php194Drupal\comment\Tests\CommentLinksTest->setEnvironment()
Changed environment:array ( 'authenticated' => true, 'comment count' => true, 'form' => 'below', 'user_register' => 'admin_only', 'contact' => 'optional', 'comments' => 'open', 'access comments' => 0, 'post comments' => 0, 'skip comment approval' => 1, 'edit own comments' => 0, )DebugCommentLinksTest.php194Drupal\comment\Tests\CommentLinksTest->setEnvironment()
Changed environment:array ( 'authenticated' => false, 'comment count' => false, 'form' => 'below', 'user_register' => 'admin_only', 'contact' => 'optional', 'comments' => 'open', 'access comments' => 1, 'post comments' => 0, 'skip comment approval' => 1, 'edit own comments' => 0, )DebugCommentLinksTest.php194Drupal\comment\Tests\CommentLinksTest->setEnvironment()
Changed environment:array ( 'authenticated' => true, 'comment count' => false, 'form' => 'below', 'user_register' => 'admin_only', 'contact' => 'optional', 'comments' => 'open', 'access comments' => 1, 'post comments' => 0, 'skip comment approval' => 1, 'edit own comments' => 0, )DebugCommentLinksTest.php194Drupal\comment\Tests\CommentLinksTest->setEnvironment()
Changed environment:array ( 'authenticated' => false, 'comment count' => true, 'form' => 'below', 'user_register' => 'admin_only', 'contact' => 'optional', 'comments' => 'open', 'access comments' => 1, 'post comments' => 0, 'skip comment approval' => 1, 'edit own comments' => 0, )DebugCommentLinksTest.php194Drupal\comment\Tests\CommentLinksTest->setEnvironment()
Changed environment:array ( 'authenticated' => true, 'comment count' => true, 'form' => 'below', 'user_register' => 'admin_only', 'contact' => 'optional', 'comments' => 'open', 'access comments' => 1, 'post comments' => 0, 'skip comment approval' => 1, 'edit own comments' => 0, )DebugCommentLinksTest.php194Drupal\comment\Tests\CommentLinksTest->setEnvironment()
Changed environment:array ( 'authenticated' => false, 'comment count' => false, 'form' => 'below', 'user_register' => 'admin_only', 'contact' => 'optional', 'comments' => 'open', 'access comments' => 0, 'post comments' => 1, 'skip comment approval' => 1, 'edit own comments' => 0, )DebugCommentLinksTest.php194Drupal\comment\Tests\CommentLinksTest->setEnvironment()
Changed environment:array ( 'authenticated' => true, 'comment count' => false, 'form' => 'below', 'user_register' => 'admin_only', 'contact' => 'optional', 'comments' => 'open', 'access comments' => 0, 'post comments' => 1, 'skip comment approval' => 1, 'edit own comments' => 0, )DebugCommentLinksTest.php194Drupal\comment\Tests\CommentLinksTest->setEnvironment()
Changed environment:array ( 'authenticated' => false, 'comment count' => true, 'form' => 'below', 'user_register' => 'admin_only', 'contact' => 'optional', 'comments' => 'open', 'access comments' => 0, 'post comments' => 1, 'skip comment approval' => 1, 'edit own comments' => 0, )DebugCommentLinksTest.php194Drupal\comment\Tests\CommentLinksTest->setEnvironment()
Changed environment:array ( 'authenticated' => true, 'comment count' => true, 'form' => 'below', 'user_register' => 'admin_only', 'contact' => 'optional', 'comments' => 'open', 'access comments' => 0, 'post comments' => 1, 'skip comment approval' => 1, 'edit own comments' => 0, )DebugCommentLinksTest.php194Drupal\comment\Tests\CommentLinksTest->setEnvironment()
Changed environment:array ( 'authenticated' => false, 'comment count' => false, 'form' => 'below', 'user_register' => 'admin_only', 'contact' => 'optional', 'comments' => 'open', 'access comments' => 1, 'post comments' => 1, 'skip comment approval' => 1, 'edit own comments' => 0, )DebugCommentLinksTest.php194Drupal\comment\Tests\CommentLinksTest->setEnvironment()
Changed environment:array ( 'authenticated' => true, 'comment count' => false, 'form' => 'below', 'user_register' => 'admin_only', 'contact' => 'optional', 'comments' => 'open', 'access comments' => 1, 'post comments' => 1, 'skip comment approval' => 1, 'edit own comments' => 0, )DebugCommentLinksTest.php194Drupal\comment\Tests\CommentLinksTest->setEnvironment()
Changed environment:array ( 'authenticated' => false, 'comment count' => true, 'form' => 'below', 'user_register' => 'admin_only', 'contact' => 'optional', 'comments' => 'open', 'access comments' => 1, 'post comments' => 1, 'skip comment approval' => 1, 'edit own comments' => 0, )DebugCommentLinksTest.php194Drupal\comment\Tests\CommentLinksTest->setEnvironment()
Changed environment:array ( 'authenticated' => true, 'comment count' => true, 'form' => 'below', 'user_register' => 'admin_only', 'contact' => 'optional', 'comments' => 'open', 'access comments' => 1, 'post comments' => 1, 'skip comment approval' => 1, 'edit own comments' => 0, )DebugCommentLinksTest.php194Drupal\comment\Tests\CommentLinksTest->setEnvironment()
Changed environment:array ( 'authenticated' => false, 'comment count' => false, 'form' => 'separate page', 'user_register' => 'admin_only', 'contact' => 'optional', 'comments' => 'open', 'access comments' => 0, 'post comments' => 0, 'skip comment approval' => 1, 'edit own comments' => 0, )DebugCommentLinksTest.php194Drupal\comment\Tests\CommentLinksTest->setEnvironment()
Changed environment:array ( 'authenticated' => true, 'comment count' => false, 'form' => 'separate page', 'user_register' => 'admin_only', 'contact' => 'optional', 'comments' => 'open', 'access comments' => 0, 'post comments' => 0, 'skip comment approval' => 1, 'edit own comments' => 0, )DebugCommentLinksTest.php194Drupal\comment\Tests\CommentLinksTest->setEnvironment()
Changed environment:array ( 'authenticated' => false, 'comment count' => true, 'form' => 'separate page', 'user_register' => 'admin_only', 'contact' => 'optional', 'comments' => 'open', 'access comments' => 0, 'post comments' => 0, 'skip comment approval' => 1, 'edit own comments' => 0, )DebugCommentLinksTest.php194Drupal\comment\Tests\CommentLinksTest->setEnvironment()
Changed environment:array ( 'authenticated' => true, 'comment count' => true, 'form' => 'separate page', 'user_register' => 'admin_only', 'contact' => 'optional', 'comments' => 'open', 'access comments' => 0, 'post comments' => 0, 'skip comment approval' => 1, 'edit own comments' => 0, )DebugCommentLinksTest.php194Drupal\comment\Tests\CommentLinksTest->setEnvironment()
Changed environment:array ( 'authenticated' => false, 'comment count' => false, 'form' => 'separate page', 'user_register' => 'admin_only', 'contact' => 'optional', 'comments' => 'open', 'access comments' => 1, 'post comments' => 0, 'skip comment approval' => 1, 'edit own comments' => 0, )DebugCommentLinksTest.php194Drupal\comment\Tests\CommentLinksTest->setEnvironment()
Changed environment:array ( 'authenticated' => true, 'comment count' => false, 'form' => 'separate page', 'user_register' => 'admin_only', 'contact' => 'optional', 'comments' => 'open', 'access comments' => 1, 'post comments' => 0, 'skip comment approval' => 1, 'edit own comments' => 0, )DebugCommentLinksTest.php194Drupal\comment\Tests\CommentLinksTest->setEnvironment()
Changed environment:array ( 'authenticated' => false, 'comment count' => true, 'form' => 'separate page', 'user_register' => 'admin_only', 'contact' => 'optional', 'comments' => 'open', 'access comments' => 1, 'post comments' => 0, 'skip comment approval' => 1, 'edit own comments' => 0, )DebugCommentLinksTest.php194Drupal\comment\Tests\CommentLinksTest->setEnvironment()
Changed environment:array ( 'authenticated' => true, 'comment count' => true, 'form' => 'separate page', 'user_register' => 'admin_only', 'contact' => 'optional', 'comments' => 'open', 'access comments' => 1, 'post comments' => 0, 'skip comment approval' => 1, 'edit own comments' => 0, )DebugCommentLinksTest.php194Drupal\comment\Tests\CommentLinksTest->setEnvironment()
Changed environment:array ( 'authenticated' => false, 'comment count' => false, 'form' => 'separate page', 'user_register' => 'admin_only', 'contact' => 'optional', 'comments' => 'open', 'access comments' => 0, 'post comments' => 1, 'skip comment approval' => 1, 'edit own comments' => 0, )DebugCommentLinksTest.php194Drupal\comment\Tests\CommentLinksTest->setEnvironment()
Changed environment:array ( 'authenticated' => true, 'comment count' => false, 'form' => 'separate page', 'user_register' => 'admin_only', 'contact' => 'optional', 'comments' => 'open', 'access comments' => 0, 'post comments' => 1, 'skip comment approval' => 1, 'edit own comments' => 0, )DebugCommentLinksTest.php194Drupal\comment\Tests\CommentLinksTest->setEnvironment()
Changed environment:array ( 'authenticated' => false, 'comment count' => true, 'form' => 'separate page', 'user_register' => 'admin_only', 'contact' => 'optional', 'comments' => 'open', 'access comments' => 0, 'post comments' => 1, 'skip comment approval' => 1, 'edit own comments' => 0, )DebugCommentLinksTest.php194Drupal\comment\Tests\CommentLinksTest->setEnvironment()
Changed environment:array ( 'authenticated' => true, 'comment count' => true, 'form' => 'separate page', 'user_register' => 'admin_only', 'contact' => 'optional', 'comments' => 'open', 'access comments' => 0, 'post comments' => 1, 'skip comment approval' => 1, 'edit own comments' => 0, )DebugCommentLinksTest.php194Drupal\comment\Tests\CommentLinksTest->setEnvironment()
Changed environment:array ( 'authenticated' => false, 'comment count' => false, 'form' => 'separate page', 'user_register' => 'admin_only', 'contact' => 'optional', 'comments' => 'open', 'access comments' => 1, 'post comments' => 1, 'skip comment approval' => 1, 'edit own comments' => 0, )DebugCommentLinksTest.php194Drupal\comment\Tests\CommentLinksTest->setEnvironment()
Changed environment:array ( 'authenticated' => true, 'comment count' => false, 'form' => 'separate page', 'user_register' => 'admin_only', 'contact' => 'optional', 'comments' => 'open', 'access comments' => 1, 'post comments' => 1, 'skip comment approval' => 1, 'edit own comments' => 0, )DebugCommentLinksTest.php194Drupal\comment\Tests\CommentLinksTest->setEnvironment()
Changed environment:array ( 'authenticated' => false, 'comment count' => true, 'form' => 'separate page', 'user_register' => 'admin_only', 'contact' => 'optional', 'comments' => 'open', 'access comments' => 1, 'post comments' => 1, 'skip comment approval' => 1, 'edit own comments' => 0, )DebugCommentLinksTest.php194Drupal\comment\Tests\CommentLinksTest->setEnvironment()
Changed environment:array ( 'authenticated' => true, 'comment count' => true, 'form' => 'separate page', 'user_register' => 'admin_only', 'contact' => 'optional', 'comments' => 'open', 'access comments' => 1, 'post comments' => 1, 'skip comment approval' => 1, 'edit own comments' => 0, )DebugCommentLinksTest.php194Drupal\comment\Tests\CommentLinksTest->setEnvironment()
LeafDrupal\comment\Tests\CommentNewIndicatorTest4200
LeafDrupal\comment\Tests\CommentNodeAccessTest5700
LeafDrupal\comment\Tests\CommentNodeChangesTest2400
LeafDrupal\comment\Tests\CommentPagerTest21300
LeafDrupal\comment\Tests\CommentPreviewTest9800
LeafDrupal\comment\Tests\CommentRssTest2600
LeafDrupal\comment\Tests\CommentStatisticsTest9800
LeafDrupal\comment\Tests\CommentThreadingTest15900
LeafDrupal\comment\Tests\CommentTokenReplaceTest6600
LeafDrupal\comment\Tests\CommentTranslationUITest9800
LeafDrupal\comment\Tests\Views\ArgumentUserUIDTest900
LeafDrupal\comment\Tests\Views\DefaultViewRecentComments800
LeafDrupal\comment\Tests\Views\FilterUserUIDTest900
LeafDrupal\comment\Tests\Views\RowRssTest1200
LeafDrupal\comment\Tests\Views\WizardTest3300
LeafDrupal\config\Tests\ConfigCRUDTest2600
LeafDrupal\config\Tests\ConfigEntityListTest6800
LeafDrupal\config\Tests\ConfigEntityTest13800
LeafDrupal\config\Tests\ConfigEntityUnitTest100
LeafDrupal\config\Tests\ConfigFileContentTest3100
LeafDrupal\config\Tests\ConfigImportTest3800
LeafDrupal\config\Tests\ConfigImportUITest4600
LeafDrupal\config\Tests\ConfigInstallTest1100
LeafDrupal\config\Tests\ConfigOverrideTest1800
LeafDrupal\config\Tests\ConfigUpgradeTest1200
LeafDrupal\config\Tests\LocaleConfigOverride300
LeafDrupal\config\Tests\Storage\DatabaseStorageTest2100
LeafDrupal\config\Tests\Storage\FileStorageTest2300
LeafDrupal\contact\Tests\ContactAuthenticatedUserTest1300
LeafDrupal\contact\Tests\ContactPersonalTest16200
ExpandDrupal\contact\Tests\ContactSitewideTest1492106
MessageGroupFilenameLineFunctionStatus
Failed to set field label to rB1xTcbQY4nL200XOtherContactSitewideTest.php250Drupal\contact\Tests\ContactSitewideTest->addCategory()
Failed to set field id to gvUtMVqVC372UIC2OtherContactSitewideTest.php250Drupal\contact\Tests\ContactSitewideTest->addCategory()
Failed to set field recipients to invalidOtherContactSitewideTest.php250Drupal\contact\Tests\ContactSitewideTest->addCategory()
Failed to set field reply to OtherContactSitewideTest.php250Drupal\contact\Tests\ContactSitewideTest->addCategory()
Failed to set field selected to OtherContactSitewideTest.php250Drupal\contact\Tests\ContactSitewideTest->addCategory()
Found the Save buttonOtherContactSitewideTest.php250Drupal\contact\Tests\ContactSitewideTest->addCategory()
Found the requested form fields at admin/structure/contact/addOtherContactSitewideTest.php250Drupal\contact\Tests\ContactSitewideTest->addCategory()
Raw "<em class="placeholder">invalid</em> is an invalid e-mail address." foundOtherContactSitewideTest.php71Drupal\contact\Tests\ContactSitewideTest->testSiteWideContact()
Failed to set field label to if5Qk6cUkhOtsDeUOtherContactSitewideTest.php250Drupal\contact\Tests\ContactSitewideTest->addCategory()
Failed to set field id to r4uE1ESyrRVecHmTOtherContactSitewideTest.php250Drupal\contact\Tests\ContactSitewideTest->addCategory()
Failed to set field recipients to invalid@OtherContactSitewideTest.php250Drupal\contact\Tests\ContactSitewideTest->addCategory()
Failed to set field reply to OtherContactSitewideTest.php250Drupal\contact\Tests\ContactSitewideTest->addCategory()
Failed to set field selected to OtherContactSitewideTest.php250Drupal\contact\Tests\ContactSitewideTest->addCategory()
Found the Save buttonOtherContactSitewideTest.php250Drupal\contact\Tests\ContactSitewideTest->addCategory()
Found the requested form fields at admin/structure/contact/addOtherContactSitewideTest.php250Drupal\contact\Tests\ContactSitewideTest->addCategory()
Raw "<em class="placeholder">invalid@</em> is an invalid e-mail address." foundOtherContactSitewideTest.php71Drupal\contact\Tests\ContactSitewideTest->testSiteWideContact()
Failed to set field label to sFSqhFM2ToxZDRbmOtherContactSitewideTest.php250Drupal\contact\Tests\ContactSitewideTest->addCategory()
Failed to set field id to x4TlGjZarxpqSpCCOtherContactSitewideTest.php250Drupal\contact\Tests\ContactSitewideTest->addCategory()
Failed to set field recipients to invalid@site.OtherContactSitewideTest.php250Drupal\contact\Tests\ContactSitewideTest->addCategory()
Failed to set field reply to OtherContactSitewideTest.php250Drupal\contact\Tests\ContactSitewideTest->addCategory()
Failed to set field selected to OtherContactSitewideTest.php250Drupal\contact\Tests\ContactSitewideTest->addCategory()
Found the Save buttonOtherContactSitewideTest.php250Drupal\contact\Tests\ContactSitewideTest->addCategory()
Found the requested form fields at admin/structure/contact/addOtherContactSitewideTest.php250Drupal\contact\Tests\ContactSitewideTest->addCategory()
Raw "<em class="placeholder">invalid@site.</em> is an invalid e-mail address." foundOtherContactSitewideTest.php71Drupal\contact\Tests\ContactSitewideTest->testSiteWideContact()
Failed to set field label to tSufbhDQhCVu4fL5OtherContactSitewideTest.php250Drupal\contact\Tests\ContactSitewideTest->addCategory()
Failed to set field id to kuuMU9ySQdSalsO1OtherContactSitewideTest.php250Drupal\contact\Tests\ContactSitewideTest->addCategory()
Failed to set field recipients to @site.OtherContactSitewideTest.php250Drupal\contact\Tests\ContactSitewideTest->addCategory()
Failed to set field reply to OtherContactSitewideTest.php250Drupal\contact\Tests\ContactSitewideTest->addCategory()
Failed to set field selected to OtherContactSitewideTest.php250Drupal\contact\Tests\ContactSitewideTest->addCategory()
Found the Save buttonOtherContactSitewideTest.php250Drupal\contact\Tests\ContactSitewideTest->addCategory()
Found the requested form fields at admin/structure/contact/addOtherContactSitewideTest.php250Drupal\contact\Tests\ContactSitewideTest->addCategory()
Raw "<em class="placeholder">@site.</em> is an invalid e-mail address." foundOtherContactSitewideTest.php71Drupal\contact\Tests\ContactSitewideTest->testSiteWideContact()
Failed to set field label to u2DCEuXXmTX17G7UOtherContactSitewideTest.php250Drupal\contact\Tests\ContactSitewideTest->addCategory()
Failed to set field id to cuzmvbKYjd6QvPfyOtherContactSitewideTest.php250Drupal\contact\Tests\ContactSitewideTest->addCategory()
Failed to set field recipients to @site.comOtherContactSitewideTest.php250Drupal\contact\Tests\ContactSitewideTest->addCategory()
Failed to set field reply to OtherContactSitewideTest.php250Drupal\contact\Tests\ContactSitewideTest->addCategory()
Failed to set field selected to OtherContactSitewideTest.php250Drupal\contact\Tests\ContactSitewideTest->addCategory()
Found the Save buttonOtherContactSitewideTest.php250Drupal\contact\Tests\ContactSitewideTest->addCategory()
Found the requested form fields at admin/structure/contact/addOtherContactSitewideTest.php250Drupal\contact\Tests\ContactSitewideTest->addCategory()
Raw "<em class="placeholder">@site.com</em> is an invalid e-mail address." foundOtherContactSitewideTest.php71Drupal\contact\Tests\ContactSitewideTest->testSiteWideContact()
Failed to set field label to OtherContactSitewideTest.php250Drupal\contact\Tests\ContactSitewideTest->addCategory()
Failed to set field id to OtherContactSitewideTest.php250Drupal\contact\Tests\ContactSitewideTest->addCategory()
Failed to set field recipients to OtherContactSitewideTest.php250Drupal\contact\Tests\ContactSitewideTest->addCategory()
Failed to set field reply to OtherContactSitewideTest.php250Drupal\contact\Tests\ContactSitewideTest->addCategory()
Failed to set field selected to 1OtherContactSitewideTest.php250Drupal\contact\Tests\ContactSitewideTest->addCategory()
Found the Save buttonOtherContactSitewideTest.php250Drupal\contact\Tests\ContactSitewideTest->addCategory()
Found the requested form fields at admin/structure/contact/addOtherContactSitewideTest.php250Drupal\contact\Tests\ContactSitewideTest->addCategory()
"Label field is required." foundOtherContactSitewideTest.php76Drupal\contact\Tests\ContactSitewideTest->testSiteWideContact()
"Machine-readable name field is required." foundOtherContactSitewideTest.php77Drupal\contact\Tests\ContactSitewideTest->testSiteWideContact()
"Recipients field is required." foundOtherContactSitewideTest.php78Drupal\contact\Tests\ContactSitewideTest->testSiteWideContact()
Failed to set field label to vPO1a00WLCV1j8RlOtherContactSitewideTest.php250Drupal\contact\Tests\ContactSitewideTest->addCategory()
Failed to set field id to zdumpnwdar9cvqsxOtherContactSitewideTest.php250Drupal\contact\Tests\ContactSitewideTest->addCategory()
Failed to set field recipients to simpletest@example.comOtherContactSitewideTest.php250Drupal\contact\Tests\ContactSitewideTest->addCategory()
Failed to set field reply to OtherContactSitewideTest.php250Drupal\contact\Tests\ContactSitewideTest->addCategory()
Failed to set field selected to 1OtherContactSitewideTest.php250Drupal\contact\Tests\ContactSitewideTest->addCategory()
Found the Save buttonOtherContactSitewideTest.php250Drupal\contact\Tests\ContactSitewideTest->addCategory()
Found the requested form fields at admin/structure/contact/addOtherContactSitewideTest.php250Drupal\contact\Tests\ContactSitewideTest->addCategory()
Raw "Category <em class="placeholder">vPO1a00WLCV1j8Rl</em> has been added." foundOtherContactSitewideTest.php83Drupal\contact\Tests\ContactSitewideTest->testSiteWideContact()
New category included in categories list.OtherContactSitewideTest.php86Drupal\contact\Tests\ContactSitewideTest->testSiteWideContact()
Failed to set field label to wXp1ee2xU3Y02dHXOtherContactSitewideTest.php274Drupal\contact\Tests\ContactSitewideTest->updateCategory()
Failed to set field recipients to simpletest@example.com,simpletest2@example.comOtherContactSitewideTest.php274Drupal\contact\Tests\ContactSitewideTest->updateCategory()
Failed to set field reply to nSCSOlFY4BDfYeUZYwV9SFlxqLiJMgOtherContactSitewideTest.php274Drupal\contact\Tests\ContactSitewideTest->updateCategory()
Failed to set field selected to OtherContactSitewideTest.php274Drupal\contact\Tests\ContactSitewideTest->updateCategory()
Found the Save buttonOtherContactSitewideTest.php274Drupal\contact\Tests\ContactSitewideTest->updateCategory()
Found the requested form fields at admin/structure/contact/manage/zdumpnwdar9cvqsx/editOtherContactSitewideTest.php274Drupal\contact\Tests\ContactSitewideTest->updateCategory()
Undefined index: labelDrupal\contact\Tests\ContactSitewideTest->testSiteWideContact() Drupal\simpletest\TestBase->run() simpletest_script_run_one_test('125', 'Drupal\contact\Tests\ContactSitewideTest') NoticeContactSitewideTest.php91Drupal\contact\Tests\ContactSitewideTest->testSiteWideContact()
Value NULL is equal to value 'wXp1ee2xU3Y02dHX'.OtherContactSitewideTest.php91Drupal\contact\Tests\ContactSitewideTest->testSiteWideContact()
Undefined index: recipientsDrupal\contact\Tests\ContactSitewideTest->testSiteWideContact() Drupal\simpletest\TestBase->run() simpletest_script_run_one_test('125', 'Drupal\contact\Tests\ContactSitewideTest') NoticeContactSitewideTest.php92Drupal\contact\Tests\ContactSitewideTest->testSiteWideContact()
Value NULL is equal to value array ( 0 => 'simpletest@example.com', 1 => 'simpletest2@example.com', ).OtherContactSitewideTest.php92Drupal\contact\Tests\ContactSitewideTest->testSiteWideContact()
Undefined index: replyDrupal\contact\Tests\ContactSitewideTest->testSiteWideContact() Drupal\simpletest\TestBase->run() simpletest_script_run_one_test('125', 'Drupal\contact\Tests\ContactSitewideTest') NoticeContactSitewideTest.php93Drupal\contact\Tests\ContactSitewideTest->testSiteWideContact()
Value NULL is equal to value 'nSCSOlFY4BDfYeUZYwV9SFlxqLiJMg'.OtherContactSitewideTest.php93Drupal\contact\Tests\ContactSitewideTest->testSiteWideContact()
Raw "Category <em class="placeholder">wXp1ee2xU3Y02dHX</em> has been updated." foundOtherContactSitewideTest.php95Drupal\contact\Tests\ContactSitewideTest->testSiteWideContact()
"Your e-mail address" foundOtherContactSitewideTest.php104Drupal\contact\Tests\ContactSitewideTest->testSiteWideContact()
Failed to set field label to a3asQRTOF5Mvs4oZOtherContactSitewideTest.php250Drupal\contact\Tests\ContactSitewideTest->addCategory()
Failed to set field id to esyzizwjdzqk0y4uOtherContactSitewideTest.php250Drupal\contact\Tests\ContactSitewideTest->addCategory()
Failed to set field recipients to simpletest@example.com,simpletest2@example.comOtherContactSitewideTest.php250Drupal\contact\Tests\ContactSitewideTest->addCategory()
Failed to set field reply to OtherContactSitewideTest.php250Drupal\contact\Tests\ContactSitewideTest->addCategory()
Failed to set field selected to OtherContactSitewideTest.php250Drupal\contact\Tests\ContactSitewideTest->addCategory()
Found the Save buttonOtherContactSitewideTest.php250Drupal\contact\Tests\ContactSitewideTest->addCategory()
Found the requested form fields at admin/structure/contact/addOtherContactSitewideTest.php250Drupal\contact\Tests\ContactSitewideTest->addCategory()
Raw "Category <em class="placeholder">a3asQRTOF5Mvs4oZ</em> has been added." foundOtherContactSitewideTest.php110Drupal\contact\Tests\ContactSitewideTest->testSiteWideContact()
Failed to set field label to lCZ73A4jLwlKsUJrOtherContactSitewideTest.php250Drupal\contact\Tests\ContactSitewideTest->addCategory()
Failed to set field id to x9y8nhugk3g1jsf3OtherContactSitewideTest.php250Drupal\contact\Tests\ContactSitewideTest->addCategory()
Failed to set field recipients to simpletest@example.com,simpletest2@example.com,simpletest3@example.comOtherContactSitewideTest.php250Drupal\contact\Tests\ContactSitewideTest->addCategory()
Failed to set field reply to OtherContactSitewideTest.php250Drupal\contact\Tests\ContactSitewideTest->addCategory()
Failed to set field selected to OtherContactSitewideTest.php250Drupal\contact\Tests\ContactSitewideTest->addCategory()
Found the Save buttonOtherContactSitewideTest.php250Drupal\contact\Tests\ContactSitewideTest->addCategory()
Found the requested form fields at admin/structure/contact/addOtherContactSitewideTest.php250Drupal\contact\Tests\ContactSitewideTest->addCategory()
Raw "Category <em class="placeholder">lCZ73A4jLwlKsUJr</em> has been added." foundOtherContactSitewideTest.php113Drupal\contact\Tests\ContactSitewideTest->testSiteWideContact()
Failed to set field label to lCZ73A4jLwlKsUJrOtherContactSitewideTest.php250Drupal\contact\Tests\ContactSitewideTest->addCategory()
Failed to set field id to x9y8nhugk3g1jsf3OtherContactSitewideTest.php250Drupal\contact\Tests\ContactSitewideTest->addCategory()
Failed to set field recipients to OtherContactSitewideTest.php250Drupal\contact\Tests\ContactSitewideTest->addCategory()
Failed to set field reply to OtherContactSitewideTest.php250Drupal\contact\Tests\ContactSitewideTest->addCategory()
Failed to set field selected to OtherContactSitewideTest.php250Drupal\contact\Tests\ContactSitewideTest->addCategory()
Found the Save buttonOtherContactSitewideTest.php250Drupal\contact\Tests\ContactSitewideTest->addCategory()
Found the requested form fields at admin/structure/contact/addOtherContactSitewideTest.php250Drupal\contact\Tests\ContactSitewideTest->addCategory()
Raw "The machine-readable name is already in use. It must be unique." foundOtherContactSitewideTest.php118Drupal\contact\Tests\ContactSitewideTest->testSiteWideContact()
HTTP response expected 200, actual 404BrowserContactSitewideTest.php134Drupal\contact\Tests\ContactSitewideTest->testSiteWideContact()
Failed to set field name to OtherContactSitewideTest.php301Drupal\contact\Tests\ContactSitewideTest->submitContact()
Failed to set field mail to simpletest@example.comOtherContactSitewideTest.php301Drupal\contact\Tests\ContactSitewideTest->submitContact()
Failed to set field subject to vBO0ojmdCgSkIYeuOtherContactSitewideTest.php301Drupal\contact\Tests\ContactSitewideTest->submitContact()
Failed to set field message to eqlDpukqCZTRhGUmfJpIxlsOCnCbTAv6uMNUqGbnKlxpgBh1FEKgoBlzfqTIWNvyOtherContactSitewideTest.php301Drupal\contact\Tests\ContactSitewideTest->submitContact()
Found the Send message buttonOtherContactSitewideTest.php301Drupal\contact\Tests\ContactSitewideTest->submitContact()
Found the requested form fields at contact/OtherContactSitewideTest.php301Drupal\contact\Tests\ContactSitewideTest->submitContact()
"Your name field is required." foundOtherContactSitewideTest.php141Drupal\contact\Tests\ContactSitewideTest->testSiteWideContact()
Failed to set field name to fMefCMZ1dOJMis00OtherContactSitewideTest.php301Drupal\contact\Tests\ContactSitewideTest->submitContact()
Failed to set field mail to OtherContactSitewideTest.php301Drupal\contact\Tests\ContactSitewideTest->submitContact()
Failed to set field subject to bTxDVgTSXRg7qWUVOtherContactSitewideTest.php301Drupal\contact\Tests\ContactSitewideTest->submitContact()
Failed to set field message to mY1cpTGAxly63DyCUkULuIAiM9LLmmhgYhC4zOJzcchEsyIpiz6BII7V1rT4DWdEOtherContactSitewideTest.php301Drupal\contact\Tests\ContactSitewideTest->submitContact()
Found the Send message buttonOtherContactSitewideTest.php301Drupal\contact\Tests\ContactSitewideTest->submitContact()
Found the requested form fields at contact/OtherContactSitewideTest.php301Drupal\contact\Tests\ContactSitewideTest->submitContact()
"Your e-mail address field is required." foundOtherContactSitewideTest.php144Drupal\contact\Tests\ContactSitewideTest->testSiteWideContact()
Failed to set field name to vpNTIHBtobcr8amnOtherContactSitewideTest.php301Drupal\contact\Tests\ContactSitewideTest->submitContact()
Failed to set field mail to invalidOtherContactSitewideTest.php301Drupal\contact\Tests\ContactSitewideTest->submitContact()
Failed to set field subject to c8iBTYBCOwrNoC2EOtherContactSitewideTest.php301Drupal\contact\Tests\ContactSitewideTest->submitContact()
Failed to set field message to pAKwJHyOdFFWPSgZxyBflJMSO5LxSoczikc4B03vdwmH5UH43hfaapvc45oGvw0KOtherContactSitewideTest.php301Drupal\contact\Tests\ContactSitewideTest->submitContact()
Found the Send message buttonOtherContactSitewideTest.php301Drupal\contact\Tests\ContactSitewideTest->submitContact()
Found the requested form fields at contact/OtherContactSitewideTest.php301Drupal\contact\Tests\ContactSitewideTest->submitContact()
Raw "The e-mail address <em class="placeholder">invalid</em> is not valid." foundOtherContactSitewideTest.php147Drupal\contact\Tests\ContactSitewideTest->testSiteWideContact()
Failed to set field name to rGdHx18Vhnwm9agOOtherContactSitewideTest.php301Drupal\contact\Tests\ContactSitewideTest->submitContact()
Failed to set field mail to simpletest@example.comOtherContactSitewideTest.php301Drupal\contact\Tests\ContactSitewideTest->submitContact()
Failed to set field subject to OtherContactSitewideTest.php301Drupal\contact\Tests\ContactSitewideTest->submitContact()
Failed to set field message to rvxUgGKN3Xrz3x0NoStf5rPS0PaOsccWsjxCk59PCCWwUNC0D7suvxJfsZOypr81OtherContactSitewideTest.php301Drupal\contact\Tests\ContactSitewideTest->submitContact()
Found the Send message buttonOtherContactSitewideTest.php301Drupal\contact\Tests\ContactSitewideTest->submitContact()
Found the requested form fields at contact/OtherContactSitewideTest.php301Drupal\contact\Tests\ContactSitewideTest->submitContact()
"Subject field is required." foundOtherContactSitewideTest.php150Drupal\contact\Tests\ContactSitewideTest->testSiteWideContact()
Failed to set field name to w7fnrwgpwUy7T8tAOtherContactSitewideTest.php301Drupal\contact\Tests\ContactSitewideTest->submitContact()
Failed to set field mail to simpletest@example.comOtherContactSitewideTest.php301Drupal\contact\Tests\ContactSitewideTest->submitContact()
Failed to set field subject to tGr8CLKZLVKlrwEZOtherContactSitewideTest.php301Drupal\contact\Tests\ContactSitewideTest->submitContact()
Failed to set field message to OtherContactSitewideTest.php301Drupal\contact\Tests\ContactSitewideTest->submitContact()
Found the Send message buttonOtherContactSitewideTest.php301Drupal\contact\Tests\ContactSitewideTest->submitContact()
Found the requested form fields at contact/OtherContactSitewideTest.php301Drupal\contact\Tests\ContactSitewideTest->submitContact()
"Message field is required." foundOtherContactSitewideTest.php153Drupal\contact\Tests\ContactSitewideTest->testSiteWideContact()
Failed to set field name to rQvLe4L8EPEh5TihOtherContactSitewideTest.php298Drupal\contact\Tests\ContactSitewideTest->submitContact()
Failed to set field mail to simpletest@example.comOtherContactSitewideTest.php298Drupal\contact\Tests\ContactSitewideTest->submitContact()
Failed to set field subject to okyJYSgIxLzLpOgoOtherContactSitewideTest.php298Drupal\contact\Tests\ContactSitewideTest->submitContact()
Failed to set field message to siEk9YtPoOC9n3QjeoA0g5JkJlNmS1dOmx6kOPSPkmBenDg9PkAvH5bv1kqdABuWOtherContactSitewideTest.php298Drupal\contact\Tests\ContactSitewideTest->submitContact()
Found the Send message buttonOtherContactSitewideTest.php298Drupal\contact\Tests\ContactSitewideTest->submitContact()
Found the requested form fields at contactOtherContactSitewideTest.php298Drupal\contact\Tests\ContactSitewideTest->submitContact()
"Your message has been sent." foundOtherContactSitewideTest.php171Drupal\contact\Tests\ContactSitewideTest->testSiteWideContact()
Failed to set field name to rWF49a1q06vaL2fgOtherContactSitewideTest.php298Drupal\contact\Tests\ContactSitewideTest->submitContact()
Failed to set field mail to simpletest@example.comOtherContactSitewideTest.php298Drupal\contact\Tests\ContactSitewideTest->submitContact()
Failed to set field subject to oBO85D6zdaKsMERKOtherContactSitewideTest.php298Drupal\contact\Tests\ContactSitewideTest->submitContact()
Failed to set field message to wStVUJXnfhjko8NA0ZOTJaq3niZedGWClQceHbYwFZhQSeCcBPestjCgWhWoPRwoOtherContactSitewideTest.php298Drupal\contact\Tests\ContactSitewideTest->submitContact()
Found the Send message buttonOtherContactSitewideTest.php298Drupal\contact\Tests\ContactSitewideTest->submitContact()
Found the requested form fields at contactOtherContactSitewideTest.php298Drupal\contact\Tests\ContactSitewideTest->submitContact()
"Your message has been sent." foundOtherContactSitewideTest.php171Drupal\contact\Tests\ContactSitewideTest->testSiteWideContact()
Failed to set field name to gfQ8RW5dkClzLM2NOtherContactSitewideTest.php298Drupal\contact\Tests\ContactSitewideTest->submitContact()
Failed to set field mail to simpletest@example.comOtherContactSitewideTest.php298Drupal\contact\Tests\ContactSitewideTest->submitContact()
Failed to set field subject to tUpb50Q7fUJbgG9NOtherContactSitewideTest.php298Drupal\contact\Tests\ContactSitewideTest->submitContact()
Failed to set field message to yL2qlvwT8JhafnMGCY0bBfMkS7WrnCVGwG3AGxobevCXyEERYanFWmzJswBPXNMXOtherContactSitewideTest.php298Drupal\contact\Tests\ContactSitewideTest->submitContact()
Found the Send message buttonOtherContactSitewideTest.php298Drupal\contact\Tests\ContactSitewideTest->submitContact()
Found the requested form fields at contactOtherContactSitewideTest.php298Drupal\contact\Tests\ContactSitewideTest->submitContact()
"Your message has been sent." foundOtherContactSitewideTest.php171Drupal\contact\Tests\ContactSitewideTest->testSiteWideContact()
HTTP response expected 403, actual 404BrowserContactSitewideTest.php175Drupal\contact\Tests\ContactSitewideTest->testSiteWideContact()
Raw "You cannot send more than <em class="placeholder">3</em> messages in 10 min. Try again later." foundOtherContactSitewideTest.php176Drupal\contact\Tests\ContactSitewideTest->testSiteWideContact()
Failed to set field label to fooOtherContactSitewideTest.php250Drupal\contact\Tests\ContactSitewideTest->addCategory()
Failed to set field id to fooOtherContactSitewideTest.php250Drupal\contact\Tests\ContactSitewideTest->addCategory()
Failed to set field recipients to foo@example.comOtherContactSitewideTest.php250Drupal\contact\Tests\ContactSitewideTest->addCategory()
Failed to set field reply to dBtwow98TYmJ5XdwRfyP0TjAwiCeY389Yv2OqNmPOtherContactSitewideTest.php250Drupal\contact\Tests\ContactSitewideTest->addCategory()
Failed to set field selected to OtherContactSitewideTest.php250Drupal\contact\Tests\ContactSitewideTest->addCategory()
Found the Save buttonOtherContactSitewideTest.php250Drupal\contact\Tests\ContactSitewideTest->addCategory()
Found the requested form fields at admin/structure/contact/addOtherContactSitewideTest.php250Drupal\contact\Tests\ContactSitewideTest->addCategory()
Failed to set field label to barOtherContactSitewideTest.php250Drupal\contact\Tests\ContactSitewideTest->addCategory()
Failed to set field id to barOtherContactSitewideTest.php250Drupal\contact\Tests\ContactSitewideTest->addCategory()
Failed to set field recipients to bar@example.comOtherContactSitewideTest.php250Drupal\contact\Tests\ContactSitewideTest->addCategory()
Failed to set field reply to wluOaQ91gjd6t7zndq7vJSkhrf1gviFLQ3qhLBHiOtherContactSitewideTest.php250Drupal\contact\Tests\ContactSitewideTest->addCategory()
Failed to set field selected to OtherContactSitewideTest.php250Drupal\contact\Tests\ContactSitewideTest->addCategory()
Found the Save buttonOtherContactSitewideTest.php250Drupal\contact\Tests\ContactSitewideTest->addCategory()
Found the requested form fields at admin/structure/contact/addOtherContactSitewideTest.php250Drupal\contact\Tests\ContactSitewideTest->addCategory()
Failed to set field label to no_autoreplyOtherContactSitewideTest.php250Drupal\contact\Tests\ContactSitewideTest->addCategory()
Failed to set field id to no_autoreplyOtherContactSitewideTest.php250Drupal\contact\Tests\ContactSitewideTest->addCategory()
Failed to set field recipients to bar@example.comOtherContactSitewideTest.php250Drupal\contact\Tests\ContactSitewideTest->addCategory()
Failed to set field reply to OtherContactSitewideTest.php250Drupal\contact\Tests\ContactSitewideTest->addCategory()
Failed to set field selected to OtherContactSitewideTest.php250Drupal\contact\Tests\ContactSitewideTest->addCategory()
Found the Save buttonOtherContactSitewideTest.php250Drupal\contact\Tests\ContactSitewideTest->addCategory()
Found the requested form fields at admin/structure/contact/addOtherContactSitewideTest.php250Drupal\contact\Tests\ContactSitewideTest->addCategory()
Failed to set field name to j1eNjpankDS3Dc50OtherContactSitewideTest.php301Drupal\contact\Tests\ContactSitewideTest->submitContact()
Failed to set field mail to kap7UJQuX694zutkZtPQUFlK4oeoexfW@example.comOtherContactSitewideTest.php301Drupal\contact\Tests\ContactSitewideTest->submitContact()
Failed to set field subject to nhsWZJPvecHyoddLTYgbb51Cl2edNu71ZQ2SjSEGE7CbKGhw29RvZbm0nmmhXI4yOtherContactSitewideTest.php301Drupal\contact\Tests\ContactSitewideTest->submitContact()
Failed to set field message to z'T27/^K7}0DvlE=~&))SG<.Ao`0(1)OoQVfa/Ow?AR.i>@f!@mb]bQADkS{X{Hh:P`-Ny?bUu/__@zHug#-o}7m6eMF=WrV4~L*]Ot9La9kGt *Ie<;2Y-`&I00L#UOtherContactSitewideTest.php301Drupal\contact\Tests\ContactSitewideTest->submitContact()
Found the Send message buttonOtherContactSitewideTest.php301Drupal\contact\Tests\ContactSitewideTest->submitContact()
Found the requested form fields at contact/fooOtherContactSitewideTest.php301Drupal\contact\Tests\ContactSitewideTest->submitContact()
Value 0 is equal to value 1.OtherContactSitewideTest.php209Drupal\contact\Tests\ContactSitewideTest->testAutoReply()
Undefined offset: 0Drupal\contact\Tests\ContactSitewideTest->testAutoReply() Drupal\simpletest\TestBase->run() simpletest_script_run_one_test('125', 'Drupal\contact\Tests\ContactSitewideTest') NoticeContactSitewideTest.php210Drupal\contact\Tests\ContactSitewideTest->testAutoReply()
Value NULL is equal to value 'dBtwow98TYmJ5XdwRfyP0TjAwiCeY389Yv2OqNmP '.OtherContactSitewideTest.php210Drupal\contact\Tests\ContactSitewideTest->testAutoReply()
Failed to set field name to yWqsYqz47K82dlhSOtherContactSitewideTest.php301Drupal\contact\Tests\ContactSitewideTest->submitContact()
Failed to set field mail to blboPs7vDHUsXBa3KICfErrH70jbSe8l@example.comOtherContactSitewideTest.php301Drupal\contact\Tests\ContactSitewideTest->submitContact()
Failed to set field subject to sk9:8Ptx65y1%2T{6m<@J"%+ooFb^"qEihA4*+_:SiR:%)@0O];B."7sZb$/~,/hOtherContactSitewideTest.php301Drupal\contact\Tests\ContactSitewideTest->submitContact()
Failed to set field message to +LLBE99Af/_R_19qFV!#:yTql_s+Cf(+<^nFB&ricmk1{.!8DY;K+_C(S(S"nLh9>F&p2!?Vi39u7&IxpNOZbi]%,Nr9{}Z"A+="Glq9A<q&,DO) rJcyWd`RA2nh}OFOtherContactSitewideTest.php301Drupal\contact\Tests\ContactSitewideTest->submitContact()
Found the Send message buttonOtherContactSitewideTest.php301Drupal\contact\Tests\ContactSitewideTest->submitContact()
Found the requested form fields at contact/barOtherContactSitewideTest.php301Drupal\contact\Tests\ContactSitewideTest->submitContact()
Value 0 is equal to value 1.OtherContactSitewideTest.php218Drupal\contact\Tests\ContactSitewideTest->testAutoReply()
Undefined offset: 0Drupal\contact\Tests\ContactSitewideTest->testAutoReply() Drupal\simpletest\TestBase->run() simpletest_script_run_one_test('125', 'Drupal\contact\Tests\ContactSitewideTest') NoticeContactSitewideTest.php219Drupal\contact\Tests\ContactSitewideTest->testAutoReply()
Value NULL is equal to value 'wluOaQ91gjd6t7zndq7vJSkhrf1gviFLQ3qhLBHi '.OtherContactSitewideTest.php219Drupal\contact\Tests\ContactSitewideTest->testAutoReply()
Failed to set field name to pZ1H0eutGvILxxuWOtherContactSitewideTest.php301Drupal\contact\Tests\ContactSitewideTest->submitContact()
Failed to set field mail to w583KkhS2VfJ8QNHfraSVt25chBOe0LY@example.comOtherContactSitewideTest.php301Drupal\contact\Tests\ContactSitewideTest->submitContact()
Failed to set field subject to `2~f_<D-B"FdfV09Pz;k4O5c#Zxg :K3M(g]]Om_u/9A>{8dVNKTF#su)'<!X|r+OtherContactSitewideTest.php301Drupal\contact\Tests\ContactSitewideTest->submitContact()
Failed to set field message to }X3r3U}6FNW]e94|)fQhl;?W,/?}mst4SMu:Tk+\VA`l&C91 @T_Gm9--/+,wRa9 ZB?{uW=q.b8Fm-w=e@Kc-'*zsQ>5d"G@,B?I_25G?(\]P>F^yo! c#jb=SOJ6abOtherContactSitewideTest.php301Drupal\contact\Tests\ContactSitewideTest->submitContact()
Found the Send message buttonOtherContactSitewideTest.php301Drupal\contact\Tests\ContactSitewideTest->submitContact()
Found the requested form fields at contact/no_autoreplyOtherContactSitewideTest.php301Drupal\contact\Tests\ContactSitewideTest->submitContact()
Failed to set field name to yWqsYqz47K82dlhSOtherContactSitewideTest.php301Drupal\contact\Tests\ContactSitewideTest->submitContact()
Failed to set field mail to blboPs7vDHUsXBa3KICfErrH70jbSe8l@example.comOtherContactSitewideTest.php301Drupal\contact\Tests\ContactSitewideTest->submitContact()
Failed to set field subject to sk9:8Ptx65y1%2T{6m<@J"%+ooFb^"qEihA4*+_:SiR:%)@0O];B."7sZb$/~,/hOtherContactSitewideTest.php301Drupal\contact\Tests\ContactSitewideTest->submitContact()
Failed to set field message to +LLBE99Af/_R_19qFV!#:yTql_s+Cf(+<^nFB&ricmk1{.!8DY;K+_C(S(S"nLh9>F&p2!?Vi39u7&IxpNOZbi]%,Nr9{}Z"A+="Glq9A<q&,DO) rJcyWd`RA2nh}OFOtherContactSitewideTest.php301Drupal\contact\Tests\ContactSitewideTest->submitContact()
Found the Send message buttonOtherContactSitewideTest.php301Drupal\contact\Tests\ContactSitewideTest->submitContact()
Found the requested form fields at contact/barOtherContactSitewideTest.php301Drupal\contact\Tests\ContactSitewideTest->submitContact()
Value 0 is equal to value 1.OtherContactSitewideTest.php218Drupal\contact\Tests\ContactSitewideTest->testAutoReply()
Undefined offset: 0Drupal\contact\Tests\ContactSitewideTest->testAutoReply() Drupal\simpletest\TestBase->run() simpletest_script_run_one_test('125', 'Drupal\contact\Tests\ContactSitewideTest') NoticeContactSitewideTest.php219Drupal\contact\Tests\ContactSitewideTest->testAutoReply()
Value NULL is equal to value 'wluOaQ91gjd6t7zndq7vJSkhrf1gviFLQ3qhLBHi '.OtherContactSitewideTest.php219Drupal\contact\Tests\ContactSitewideTest->testAutoReply()
Failed to set field name to pZ1H0eutGvILxxuWOtherContactSitewideTest.php301Drupal\contact\Tests\ContactSitewideTest->submitContact()
Failed to set field mail to w583KkhS2VfJ8QNHfraSVt25chBOe0LY@example.comOtherContactSitewideTest.php301Drupal\contact\Tests\ContactSitewideTest->submitContact()
Failed to set field subject to `2~f_<D-B"FdfV09Pz;k4O5c#Zxg :K3M(g]]Om_u/9A>{8dVNKTF#su)'<!X|r+OtherContactSitewideTest.php301Drupal\contact\Tests\ContactSitewideTest->submitContact()
Failed to set field message to }X3r3U}6FNW]e94|)fQhl;?W,/?}mst4SMu:Tk+\VA`l&C91 @T_Gm9--/+,wRa9 ZB?{uW=q.b8Fm-w=e@Kc-'*zsQ>5d"G@,B?I_25G?(\]P>F^yo! c#jb=SOJ6abOtherContactSitewideTest.php301Drupal\contact\Tests\ContactSitewideTest->submitContact()
Found the Send message buttonOtherContactSitewideTest.php301Drupal\contact\Tests\ContactSitewideTest->submitContact()
Found the requested form fields at contact/no_autoreplyOtherContactSitewideTest.php301Drupal\contact\Tests\ContactSitewideTest->submitContact()
LeafDrupal\contact\Tests\ContactUpgradePathTest6600
LeafDrupal\contact\Tests\Views\ContactFieldsTest600
LeafDrupal\contextual\Tests\ContextualDynamicContextTest1600
LeafDrupal\dblog\Tests\DBLogTest38000
LeafDrupal\editor\Tests\EditorAdminTest4200
LeafDrupal\editor\Tests\EditorLoadingTest6700
LeafDrupal\editor\Tests\EditorManagerTest600
LeafDrupal\edit\Tests\EditorSelectionTest1500
LeafDrupal\edit\Tests\MetadataGeneratorTest300
LeafDrupal\email\Tests\EmailFieldTest1900
LeafDrupal\email\Tests\EmailItemTest600
LeafDrupal\entity\Tests\EntityDisplayTest2900
LeafDrupal\field\Tests\BulkDeleteTest7500
LeafDrupal\field\Tests\CrudTest7500
LeafDrupal\field\Tests\DisplayApiTest4600
LeafDrupal\field\Tests\EntityPropertiesTest400
LeafDrupal\field\Tests\FieldAccessTest2100
LeafDrupal\field\Tests\FieldAttachOtherTest10300
LeafDrupal\field\Tests\FieldAttachStorageTest9400
LeafDrupal\field\Tests\FieldInfoTest7000
LeafDrupal\field\Tests\FieldInstanceCrudTest2800
LeafDrupal\field\Tests\FormTest28100
LeafDrupal\field\Tests\TranslationTest9900
LeafDrupal\field\Tests\Views\ApiDataTest1500
LeafDrupal\field\Tests\Views\FieldUITest2800
LeafDrupal\field\Tests\Views\HandlerFieldFieldTest2400
LeafDrupal\field_sql_storage\Tests\FieldSqlStorageTest9200
LeafDrupal\field_ui\Tests\AlterTest2100
LeafDrupal\field_ui\Tests\ManageDisplayTest14900
LeafDrupal\field_ui\Tests\ManageFieldsTest29400
LeafDrupal\file\Tests\CopyTest11000
LeafDrupal\file\Tests\DeleteTest2400
LeafDrupal\file\Tests\DownloadTest4500
LeafDrupal\file\Tests\FileFieldDisplayTest5000
LeafDrupal\file\Tests\FileFieldPathTest2700
LeafDrupal\file\Tests\FileFieldRevisionTest6700
LeafDrupal\file\Tests\FileFieldRSSContentTest2300
LeafDrupal\file\Tests\FileFieldValidateTest11800
LeafDrupal\file\Tests\FileFieldWidgetTest29900
LeafDrupal\file\Tests\FileManagedFileElementTest26800
LeafDrupal\file\Tests\FilePrivateTest3700
LeafDrupal\file\Tests\FileTokenReplaceTest3500
LeafDrupal\file\Tests\LoadTest3400
LeafDrupal\file\Tests\MoveTest11000
LeafDrupal\file\Tests\RemoteFileSaveUploadTest27000
LeafDrupal\file\Tests\SaveDataTest9300
LeafDrupal\file\Tests\SaveTest1600
LeafDrupal\file\Tests\SaveUploadTest27000
LeafDrupal\file\Tests\SpaceUsedTest1200
LeafDrupal\file\Tests\UsageTest3400
LeafDrupal\file\Tests\ValidateTest1200
LeafDrupal\file\Tests\ValidatorTest2900
LeafDrupal\filter\Tests\FilterAdminTest19400
LeafDrupal\filter\Tests\FilterAPITest500
LeafDrupal\filter\Tests\FilterCrudTest12200
LeafDrupal\filter\Tests\FilterDefaultConfigTest2800
LeafDrupal\filter\Tests\FilterDefaultFormatTest3300
LeafDrupal\filter\Tests\FilterFormatAccessTest27200
LeafDrupal\filter\Tests\FilterHooksTest3300
LeafDrupal\filter\Tests\FilterHtmlImageSecureTest4600
LeafDrupal\filter\Tests\FilterNoFormatTest100
LeafDrupal\filter\Tests\FilterSecurityTest4000
LeafDrupal\filter\Tests\FilterSettingsTest1200
LeafDrupal\filter\Tests\FilterUnitTest21500
LeafDrupal\forum\Tests\ForumBlockTest17100
LeafDrupal\forum\Tests\ForumIndexTest3700
LeafDrupal\forum\Tests\ForumNodeAccessTest9800
LeafDrupal\forum\Tests\ForumTest65700
LeafDrupal\help\Tests\HelpTest29600
LeafDrupal\help\Tests\NoHelpTest2400
LeafDrupal\history\Tests\Views\HistoryTimestampTest1200
LeafDrupal\image\Tests\ImageAdminStylesTest20500
LeafDrupal\image\Tests\ImageDimensionsScaleUnitTest3000
LeafDrupal\image\Tests\ImageDimensionsTest5600
LeafDrupal\image\Tests\ImageEffectsTest4300
LeafDrupal\image\Tests\ImageFieldDefaultImagesTest4000
LeafDrupal\image\Tests\ImageFieldDisplayTest15900
LeafDrupal\image\Tests\ImageFieldValidateTest3800
LeafDrupal\image\Tests\ImageStylesPathAndUrlTest6500
LeafDrupal\image\Tests\ImageThemeFunctionTest500
LeafDrupal\jsonld\Tests\NormalizeDenormalizeTest1400
LeafDrupal\jsonld\Tests\RdfSchemaSerializationTest400
LeafDrupal\jsonld\Tests\SupportsSerializationTest1000
LeafDrupal\language\Tests\LanguageBrowserDetectionUnitTest10700
LeafDrupal\language\Tests\LanguageConfigurationElementTest5400
LeafDrupal\language\Tests\LanguageConfigurationTest7500
LeafDrupal\language\Tests\LanguageCustomLanguageConfigurationTest3600
LeafDrupal\language\Tests\LanguageDependencyInjectionTest1700
LeafDrupal\language\Tests\LanguageListTest10000
LeafDrupal\language\Tests\LanguageNegotiationInfoTest4900
LeafDrupal\language\Tests\LanguagePathMonolingualTest3500
LeafDrupal\language\Tests\LanguageSwitchingTest2200
LeafDrupal\language\Tests\LanguageUILanguageNegotiationTest14500
LeafDrupal\language\Tests\LanguageUrlRewritingTest4400
LeafDrupal\language\Tests\Views\ArgumentLanguageTest200
LeafDrupal\language\Tests\Views\FieldLanguageTest200
LeafDrupal\language\Tests\Views\FilterLanguageTest200
LeafDrupal\layout\Tests\DisplayInternalLogicTest1500
LeafDrupal\layout\Tests\LayoutDerivativesTest2400
LeafDrupal\link\Tests\LinkFieldTest14000
LeafDrupal\link\Tests\LinkFieldUITest2100
LeafDrupal\locale\Tests\LocaleContentTest17000
LeafDrupal\locale\Tests\LocaleExportTest5700
LeafDrupal\locale\Tests\LocaleImportFunctionalTest16600
LeafDrupal\locale\Tests\LocaleInstallTest200
LeafDrupal\locale\Tests\LocaleJavascriptTranslation6600
LeafDrupal\locale\Tests\LocaleLibraryInfoAlterTest200
LeafDrupal\locale\Tests\LocalePathTest5100
LeafDrupal\locale\Tests\LocalePluralFormatTest16000
LeafDrupal\locale\Tests\LocaleStringTest2600
LeafDrupal\locale\Tests\LocaleTranslationTest35800
LeafDrupal\locale\Tests\LocaleUninstallFrenchTest3600
LeafDrupal\locale\Tests\LocaleUninstallTest3600
LeafDrupal\locale\Tests\LocaleUpdateInterfaceTest4600
LeafDrupal\locale\Tests\LocaleUpdateTest46300
LeafDrupal\menu\Tests\MenuNodeTest6100
LeafDrupal\menu\Tests\MenuTest319000
LeafDrupal\minimal\Tests\MinimalTest1600
LeafDrupal\node\Tests\MultiStepNodeFormBasicOptionsTest1700
LeafDrupal\node\Tests\NodeAccessBaseTableTest15900
LeafDrupal\node\Tests\NodeAccessFieldTest5000
LeafDrupal\node\Tests\NodeAccessLanguageTest2500
LeafDrupal\node\Tests\NodeAccessPagerTest3000
LeafDrupal\node\Tests\NodeAccessRebuildTest1900
LeafDrupal\node\Tests\NodeAccessRecordsTest2600
LeafDrupal\node\Tests\NodeAccessTest3400
LeafDrupal\node\Tests\NodeAdminTest14500
LeafDrupal\node\Tests\NodeBlockFunctionalTest6300
LeafDrupal\node\Tests\NodeBuildContentTest400
LeafDrupal\node\Tests\NodeCreationTest6500
LeafDrupal\node\Tests\NodeEntityFieldQueryAlterTest3200
LeafDrupal\node\Tests\NodeEntityViewModeAlterTest2000
LeafDrupal\node\Tests\NodeFeedTest100
LeafDrupal\node\Tests\NodeFieldMultilingualTestCase6400
LeafDrupal\node\Tests\NodeLoadHooksTest700
LeafDrupal\node\Tests\NodeLoadMultipleTest2700
LeafDrupal\node\Tests\NodePostSettingsTest4800
LeafDrupal\node\Tests\NodeQueryAlterTest13900
LeafDrupal\node\Tests\NodeRevisionPermissionsTest5500
LeafDrupal\node\Tests\NodeRevisionsAllTestCase4900
LeafDrupal\node\Tests\NodeRevisionsTest6400
LeafDrupal\node\Tests\NodeRSSContentTest2100
LeafDrupal\node\Tests\NodeSaveTest6000
LeafDrupal\node\Tests\NodeSyndicateBlockTest1400
LeafDrupal\node\Tests\NodeTitleTest2300
LeafDrupal\node\Tests\NodeTitleXSSTest2300
LeafDrupal\node\Tests\NodeTokenReplaceTest4000
LeafDrupal\node\Tests\NodeTranslationUITest13600
LeafDrupal\node\Tests\NodeTypeInitialLanguageTest8000
LeafDrupal\node\Tests\NodeTypePersistenceTest6500
LeafDrupal\node\Tests\NodeTypeTest13000
LeafDrupal\node\Tests\PageEditTest9700
LeafDrupal\node\Tests\PagePreviewTest4100
LeafDrupal\node\Tests\PageViewTest3400
LeafDrupal\node\Tests\SummaryLengthTest1200
LeafDrupal\node\Tests\Views\FieldTypeTest200
LeafDrupal\node\Tests\Views\FilterUidRevisionTest400
LeafDrupal\node\Tests\Views\RevisionRelationships300
LeafDrupal\node\Tests\Views\StatusExtraTest6800
LeafDrupal\number\Tests\NumberFieldTest8800
LeafDrupal\openid\Tests\OpenIDFunctionalTest38400
LeafDrupal\openid\Tests\OpenIDRegistrationTest19900
LeafDrupal\openid\Tests\OpenIDTest3800
LeafDrupal\openid\Tests\Upgrade\OpenIDAuthmapUpgradePathTest2600
LeafDrupal\options\Tests\OptionsDynamicValuesValidationTest900
LeafDrupal\options\Tests\OptionsFieldTest1600
LeafDrupal\options\Tests\OptionsFieldUITest22200
LeafDrupal\options\Tests\OptionsSelectDynamicValuesTest1600
LeafDrupal\options\Tests\OptionsWidgetsTest26100
LeafDrupal\path\Tests\PathAliasTest13800
LeafDrupal\path\Tests\PathLanguageTest7500
LeafDrupal\path\Tests\PathLanguageUiTest9000
LeafDrupal\path\Tests\PathTaxonomyTermTest3700
LeafDrupal\php\Tests\PhpAccessTest3800
LeafDrupal\php\Tests\PhpFilterTest4200
LeafDrupal\picture\Tests\PictureAdminUITest5400
LeafDrupal\picture\Tests\PictureFieldDisplayTest11500
LeafDrupal\rdf\Tests\CommentAttributesTest11800
LeafDrupal\rdf\Tests\CrudTest1000
LeafDrupal\rdf\Tests\GetNamespacesTest700
LeafDrupal\rdf\Tests\GetRdfNamespacesTest500
LeafDrupal\rdf\Tests\MappingDefinitionTest5900
LeafDrupal\rdf\Tests\MappingHookTest600
LeafDrupal\rdf\Tests\RdfaMarkupTest3700
LeafDrupal\rdf\Tests\RdfMappingEventTest300
LeafDrupal\rdf\Tests\SiteSchemaTest300
LeafDrupal\rdf\Tests\TrackerAttributesTest3000
LeafDrupal\rest\Tests\CreateTest2900
LeafDrupal\rest\Tests\DBLogTest1800
LeafDrupal\rest\Tests\DeleteTest7900
LeafDrupal\rest\Tests\ReadTest3500
LeafDrupal\rest\Tests\UpdateTest6500
LeafDrupal\rest\Tests\Views\StyleSerializerTest5200
LeafDrupal\search\Tests\SearchAdvancedSearchFormTest3400
LeafDrupal\search\Tests\SearchBlockTest3800
LeafDrupal\search\Tests\SearchCommentCountToggleTest3100
LeafDrupal\search\Tests\SearchCommentTest19300
LeafDrupal\search\Tests\SearchConfigSettingsFormTest15900
LeafDrupal\search\Tests\SearchEmbedFormTest3200
LeafDrupal\search\Tests\SearchExactTest2500
LeafDrupal\search\Tests\SearchExcerptTest1800
LeafDrupal\search\Tests\SearchExpressionInsertExtractTest2400
LeafDrupal\search\Tests\SearchKeywordsConditionsTest2800
LeafDrupal\search\Tests\SearchLanguageTest4100
LeafDrupal\search\Tests\SearchMatchTest14700
LeafDrupal\search\Tests\SearchMultilingualEntityTest1000
LeafDrupal\search\Tests\SearchNodeAccessTest1600
LeafDrupal\search\Tests\SearchNumberMatchingTest29500
LeafDrupal\search\Tests\SearchNumbersTest17500
LeafDrupal\search\Tests\SearchPageOverrideTest1500
LeafDrupal\search\Tests\SearchPageTextTest3700
LeafDrupal\search\Tests\SearchPreprocessLangcodeTest3900
LeafDrupal\search\Tests\SearchRankingTest5900
LeafDrupal\search\Tests\SearchSimplifyTest65700
LeafDrupal\search\Tests\SearchTokenizerTest800
LeafDrupal\shortcut\Tests\ShortcutLinksTest14800
LeafDrupal\shortcut\Tests\ShortcutSetsTest23000
LeafDrupal\simpletest\Tests\BrokenSetUpTest2100
LeafDrupal\simpletest\Tests\BrowserTest1600
LeafDrupal\simpletest\Tests\DrupalUnitTestBaseTest4000
LeafDrupal\simpletest\Tests\FolderTest200
LeafDrupal\simpletest\Tests\InstallationProfileModuleTestsTest1900
LeafDrupal\simpletest\Tests\MailCaptureTest1200
LeafDrupal\simpletest\Tests\MissingCheckedRequirementsTest1900
LeafDrupal\simpletest\Tests\OtherInstallationProfileModuleTestsTest1200
LeafDrupal\simpletest\Tests\SimpleTestTest11400
LeafDrupal\simpletest\Tests\UserHelpersTest4600
LeafDrupal\standard\Tests\StandardTest700
LeafDrupal\statistics\Tests\StatisticsAdminTest5800
LeafDrupal\statistics\Tests\StatisticsLoggingTest2100
LeafDrupal\statistics\Tests\StatisticsReportsTest1900
LeafDrupal\statistics\Tests\StatisticsTokenReplaceTest3000
LeafDrupal\syslog\Tests\SyslogTest1700
LeafDrupal\system\Tests\Ajax\AjaxCommandsUnitTest1600
LeafDrupal\system\Tests\Ajax\CommandsTest7700
LeafDrupal\system\Tests\Ajax\DialogTest300
LeafDrupal\system\Tests\Ajax\ElementValidationTest700
LeafDrupal\system\Tests\Ajax\FormValuesTest2900
LeafDrupal\system\Tests\Ajax\FrameworkTest3400
LeafDrupal\system\Tests\Ajax\MultiFormTest3600
LeafDrupal\system\Tests\Batch\PageTest1600
LeafDrupal\system\Tests\Batch\PercentagesUnitTest1800
LeafDrupal\system\Tests\Batch\ProcessingTest16100
LeafDrupal\system\Tests\Bootstrap\GetFilenameUnitTest600
LeafDrupal\system\Tests\Bootstrap\HookBootExitTest1900
LeafDrupal\system\Tests\Bootstrap\IpAddressTest1100
LeafDrupal\system\Tests\Bootstrap\MiscUnitTest400
LeafDrupal\system\Tests\Bootstrap\OverrideServerVariablesUnitTest600
LeafDrupal\system\Tests\Bootstrap\PageCacheTest7900
LeafDrupal\system\Tests\Bootstrap\ResettableStaticUnitTest500
LeafDrupal\system\Tests\Bootstrap\TimerUnitTest500
LeafDrupal\system\Tests\Bootstrap\VariableTest900
LeafDrupal\system\Tests\Bundle\BundleTest900
LeafDrupal\system\Tests\Cache\BackendChainImplementationUnitTest4800
LeafDrupal\system\Tests\Cache\BackendChainUnitTest12600
LeafDrupal\system\Tests\Cache\ClearTest900
LeafDrupal\system\Tests\Cache\DatabaseBackendUnitTest12600
LeafDrupal\system\Tests\Cache\MemoryBackendUnitTest12600
LeafDrupal\system\Tests\Cache\NullBackendTest200
LeafDrupal\system\Tests\Common\AddFeedTest700
LeafDrupal\system\Tests\Common\AlterTest700
LeafDrupal\system\Tests\Common\AttributesUnitTest700
LeafDrupal\system\Tests\Common\AutocompleteTagsUnitTest800
LeafDrupal\system\Tests\Common\CascadingStylesheetsTest4300
LeafDrupal\system\Tests\Common\CascadingStylesheetsUnitTest1200
LeafDrupal\system\Tests\Common\ColorTest8500
LeafDrupal\system\Tests\Common\FormatDateTest7300
LeafDrupal\system\Tests\Common\GotoTest2700
LeafDrupal\system\Tests\Common\HtmlIdentifierUnitTest1000
LeafDrupal\system\Tests\Common\HttpRequestTest3600
LeafDrupal\system\Tests\Common\InstallerLanguageTest800
LeafDrupal\system\Tests\Common\JavaScriptTest9400
LeafDrupal\system\Tests\Common\JsonUnitTest2100
LeafDrupal\system\Tests\Common\NestedArrayUnitTest1400
LeafDrupal\system\Tests\Common\ParseInfoFileUnitTest300
LeafDrupal\system\Tests\Common\RegionContentTest1800
LeafDrupal\system\Tests\Common\RenderTest5400
LeafDrupal\system\Tests\Common\SimpleTestErrorCollectorTest1600
LeafDrupal\system\Tests\Common\SizeUnitTest3500
LeafDrupal\system\Tests\Common\SystemListingTest600
LeafDrupal\system\Tests\Common\TableSortExtenderUnitTest600
LeafDrupal\system\Tests\Common\UrlTest7600
LeafDrupal\system\Tests\Common\ValidNumberStepUnitTest2400
LeafDrupal\system\Tests\Common\ValidUrlUnitTest7900
LeafDrupal\system\Tests\Common\WriteRecordTest3400
LeafDrupal\system\Tests\Common\XssUnitTest1700
LeafDrupal\system\Tests\Database\AlterTest2000
LeafDrupal\system\Tests\Database\BasicSyntaxTest600
LeafDrupal\system\Tests\Database\CaseSensitivityTest200
LeafDrupal\system\Tests\Database\ConnectionTest1400
LeafDrupal\system\Tests\Database\ConnectionUnitTest1200
LeafDrupal\system\Tests\Database\DatabaseExceptionWrapperTest100
LeafDrupal\system\Tests\Database\DeleteTruncateTest500
LeafDrupal\system\Tests\Database\EmptyStatementTest400
LeafDrupal\system\Tests\Database\FetchTest2400
LeafDrupal\system\Tests\Database\InsertDefaultsTest400
LeafDrupal\system\Tests\Database\InsertLobTest300
LeafDrupal\system\Tests\Database\InsertTest1500
LeafDrupal\system\Tests\Database\InvalidDataTest200
LeafDrupal\system\Tests\Database\LoggingTest1400
LeafDrupal\system\Tests\Database\MergeTest3500
LeafDrupal\system\Tests\Database\NextIdTest200
LeafDrupal\system\Tests\Database\QueryTest100
LeafDrupal\system\Tests\Database\RangeQueryTest200
LeafDrupal\system\Tests\Database\RegressionTest700
LeafDrupal\system\Tests\Database\SchemaTest58800
LeafDrupal\system\Tests\Database\SelectCloneTest200
LeafDrupal\system\Tests\Database\SelectComplexTest6000
LeafDrupal\system\Tests\Database\SelectOrderedTest1700
LeafDrupal\system\Tests\Database\SelectPagerDefaultTest3600
LeafDrupal\system\Tests\Database\SelectSubqueryTest1400
LeafDrupal\system\Tests\Database\SelectTableSortDefaultTest5600
LeafDrupal\system\Tests\Database\SelectTest10800
LeafDrupal\system\Tests\Database\SerializeQueryTest200
LeafDrupal\system\Tests\Database\TaggingTest1600
LeafDrupal\system\Tests\Database\TemporaryQueryTest1200
LeafDrupal\system\Tests\Database\TransactionTest8800
LeafDrupal\system\Tests\Database\UpdateComplexTest3800
LeafDrupal\system\Tests\Database\UpdateLobTest600
LeafDrupal\system\Tests\Database\UpdateTest3000
LeafDrupal\system\Tests\Datetime\DateTimePlusTest10800
LeafDrupal\system\Tests\Datetime\DrupalDateTimeTest2800
LeafDrupal\system\Tests\DrupalKernel\ContentNegotiationTest6200
LeafDrupal\system\Tests\DrupalKernel\DrupalKernelTest1600
LeafDrupal\system\Tests\Entity\ConfigEntityQueryTest9800
LeafDrupal\system\Tests\Entity\EntityAccessTest3400
LeafDrupal\system\Tests\Entity\EntityApiInfoTest600
LeafDrupal\system\Tests\Entity\EntityApiTest2600
LeafDrupal\system\Tests\Entity\EntityCrudHookTest15700
LeafDrupal\system\Tests\Entity\EntityFieldTest68200
LeafDrupal\system\Tests\Entity\EntityFormTest7700
LeafDrupal\system\Tests\Entity\EntityQueryRelationshipTest2000
LeafDrupal\system\Tests\Entity\EntityQueryTest6200
LeafDrupal\system\Tests\Entity\EntityRevisionsTest5300
LeafDrupal\system\Tests\Entity\EntityTranslationFormTest3600
LeafDrupal\system\Tests\Entity\EntityTranslationTest13800
LeafDrupal\system\Tests\Entity\EntityUUIDTest7700
LeafDrupal\system\Tests\FileTransfer\FileTransferTest200
LeafDrupal\system\Tests\File\DirectoryTest2000
LeafDrupal\system\Tests\File\MimeTypeTest4200
LeafDrupal\system\Tests\File\NameMungingTest600
LeafDrupal\system\Tests\File\ReadOnlyStreamWrapperTest1600
LeafDrupal\system\Tests\File\RemoteFileDirectoryTest2400
LeafDrupal\system\Tests\File\RemoteFileScanDirectoryTest2900
LeafDrupal\system\Tests\File\RemoteFileUnmanagedCopyTest3200
LeafDrupal\system\Tests\File\RemoteFileUnmanagedDeleteRecursiveTest2100
LeafDrupal\system\Tests\File\RemoteFileUnmanagedDeleteTest1000
LeafDrupal\system\Tests\File\RemoteFileUnmanagedMoveTest2300
LeafDrupal\system\Tests\File\RemoteFileUnmanagedSaveDataTest800
LeafDrupal\system\Tests\File\ScanDirectoryTest2900
LeafDrupal\system\Tests\File\StreamWrapperTest1900
LeafDrupal\system\Tests\File\UnmanagedCopyTest2900
LeafDrupal\system\Tests\File\UnmanagedDeleteRecursiveTest1700
LeafDrupal\system\Tests\File\UnmanagedDeleteTest700
LeafDrupal\system\Tests\File\UnmanagedMoveTest2000
LeafDrupal\system\Tests\File\UnmanagedSaveDataTest700
LeafDrupal\system\Tests\File\UrlRewritingTest1400
LeafDrupal\system\Tests\Form\AlterTest400
LeafDrupal\system\Tests\Form\ArbitraryRebuildTest1600
LeafDrupal\system\Tests\Form\CheckboxTest9700
LeafDrupal\system\Tests\Form\ElementsLabelsTest2000
LeafDrupal\system\Tests\Form\ElementsTableSelectTest7200
LeafDrupal\system\Tests\Form\ElementsVerticalTabsTest3900
LeafDrupal\system\Tests\Form\ElementTest5700
LeafDrupal\system\Tests\Form\EmailTest1700
LeafDrupal\system\Tests\Form\FileInclusionTest1100
LeafDrupal\system\Tests\Form\FormTest80100
LeafDrupal\system\Tests\Form\HTMLIdTest700
LeafDrupal\system\Tests\Form\LanguageSelectElementTest4400
LeafDrupal\system\Tests\Form\ProgrammaticTest2400
LeafDrupal\system\Tests\Form\RebuildTest5300
LeafDrupal\system\Tests\Form\RedirectTest3100
LeafDrupal\system\Tests\Form\StateValuesCleanAdvancedTest700
LeafDrupal\system\Tests\Form\StateValuesCleanTest1400
LeafDrupal\system\Tests\Form\StorageTest16700
LeafDrupal\system\Tests\Form\TriggeringElementTest5000
LeafDrupal\system\Tests\Form\UrlTest1700
LeafDrupal\system\Tests\Form\ValidationTest16800
LeafDrupal\system\Tests\Form\WrapperTest500
LeafDrupal\system\Tests\Graph\GraphUnitTest5600
LeafDrupal\system\Tests\Image\FileMoveTest400
LeafDrupal\system\Tests\Image\ToolkitGdTest20400
LeafDrupal\system\Tests\Image\ToolkitTest5300
LeafDrupal\system\Tests\KeyValueStore\DatabaseStorageExpirableTest6800
LeafDrupal\system\Tests\KeyValueStore\DatabaseStorageTest3600
LeafDrupal\system\Tests\KeyValueStore\GarbageCollectionTest200
LeafDrupal\system\Tests\KeyValueStore\MemoryStorageTest3600
LeafDrupal\system\Tests\Lock\LockFunctionalTest2900
LeafDrupal\system\Tests\Mail\HtmlToTextTest8600
LeafDrupal\system\Tests\Mail\MailTest700
LeafDrupal\system\Tests\Mail\WrapMailUnitTest200
LeafDrupal\system\Tests\Menu\BreadcrumbTest40900
LeafDrupal\system\Tests\Menu\LinksTest5000
LeafDrupal\system\Tests\Menu\MenuRouterTest22700
LeafDrupal\system\Tests\Menu\RebuildTest500
LeafDrupal\system\Tests\Menu\TrailTest6800
LeafDrupal\system\Tests\Menu\TreeDataUnitTest400
LeafDrupal\system\Tests\Menu\TreeOutputTest700
LeafDrupal\system\Tests\Module\ClassLoaderTest1000
LeafDrupal\system\Tests\Module\DependencyTest16000
LeafDrupal\system\Tests\Module\EnableDisableTest215400
LeafDrupal\system\Tests\Module\HookRequirementsTest1600
LeafDrupal\system\Tests\Module\InstallTest300
LeafDrupal\system\Tests\Module\ModuleApiTest6900
LeafDrupal\system\Tests\Module\ModuleEnable300
LeafDrupal\system\Tests\Module\RequiredTest1900
LeafDrupal\system\Tests\Module\UninstallTest200
LeafDrupal\system\Tests\Module\VersionTest5100
LeafDrupal\system\Tests\Pager\PagerTest12300
LeafDrupal\system\Tests\Path\AliasTest2700
LeafDrupal\system\Tests\Path\MatchPathTest4100
LeafDrupal\system\Tests\Path\UrlAlterFunctionalTest3700
LeafDrupal\system\Tests\PhpStorage\FileStorageTest1200
LeafDrupal\system\Tests\PhpStorage\MTimeProtectedFastFileStorageTest1900
LeafDrupal\system\Tests\PhpStorage\MTimeProtectedFileStorageTest1900
LeafDrupal\system\Tests\Plugin\AlterDecoratorTest300
LeafDrupal\system\Tests\Plugin\CacheDecoratorLanguageTest3800
LeafDrupal\system\Tests\Plugin\CacheDecoratorTest1400
LeafDrupal\system\Tests\Plugin\DerivativeTest900
LeafDrupal\system\Tests\Plugin\Discovery\AnnotatedClassDiscoveryTest700
LeafDrupal\system\Tests\Plugin\Discovery\StaticDiscoveryTest600
LeafDrupal\system\Tests\Plugin\FactoryTest900
LeafDrupal\system\Tests\Plugin\InspectionTest1000
LeafDrupal\system\Tests\Plugin\PluginBagTest1900
LeafDrupal\system\Tests\Queue\QueueTest1400
LeafDrupal\system\Tests\Routing\ControllerResolverTest100
LeafDrupal\system\Tests\Routing\MatcherDumperTest800
LeafDrupal\system\Tests\Routing\MimeTypeMatcherTest1000
LeafDrupal\system\Tests\Routing\RouteProviderTest2900
LeafDrupal\system\Tests\Routing\RouterPermissionTest2300
LeafDrupal\system\Tests\Routing\RouterTest3000
LeafDrupal\system\Tests\Routing\RouteTest600
LeafDrupal\system\Tests\Routing\UrlGeneratorTest200
LeafDrupal\system\Tests\Serialization\EntitySerializationTest1700
LeafDrupal\system\Tests\Serialization\SerializationTest200
LeafDrupal\system\Tests\Session\SessionHttpsTest8300
LeafDrupal\system\Tests\Session\SessionTest19000
LeafDrupal\system\Tests\System\AccessDeniedTest6400
LeafDrupal\system\Tests\System\AdminMetaTagTest300
LeafDrupal\system\Tests\System\AdminTest18100
LeafDrupal\system\Tests\System\CronRunTest5200
LeafDrupal\system\Tests\System\DateFormatsLanguageTest5600
LeafDrupal\system\Tests\System\DateTimeTest8800
LeafDrupal\system\Tests\System\DefaultMobileMetaTagsTest1200
LeafDrupal\system\Tests\System\ErrorHandlerTest4000
LeafDrupal\system\Tests\System\ExceptionControllerTest200
LeafDrupal\system\Tests\System\FloodTest1000
LeafDrupal\system\Tests\System\FrontPageTest3700
LeafDrupal\system\Tests\System\IndexPhpTest600
LeafDrupal\system\Tests\System\InfoAlterTest1000
LeafDrupal\system\Tests\System\InfoFileParserUnitTest900
LeafDrupal\system\Tests\System\MainContentFallbackTest6000
LeafDrupal\system\Tests\System\PageNotFoundTest1800
LeafDrupal\system\Tests\System\PageTitleFilteringTest6800
LeafDrupal\system\Tests\System\PasswordHashingTest1000
LeafDrupal\system\Tests\System\RetrieveFileTest700
LeafDrupal\system\Tests\System\ShutdownFunctionsTest500
LeafDrupal\system\Tests\System\SiteMaintenanceTest14500
LeafDrupal\system\Tests\System\SystemAuthorizeTest3100
LeafDrupal\system\Tests\System\ThemeTest28300
LeafDrupal\system\Tests\System\TokenReplaceTest5200
LeafDrupal\system\Tests\System\UnicodeUnitTest23100
LeafDrupal\system\Tests\Theme\EntityFilteringThemeTest5600
LeafDrupal\system\Tests\Theme\FastTest1200
LeafDrupal\system\Tests\Theme\FunctionsTest2500
LeafDrupal\system\Tests\Theme\HookInitTest500
LeafDrupal\system\Tests\Theme\HtmlTagUnitTest200
LeafDrupal\system\Tests\Theme\HtmlTplPhpAttributesTest500
LeafDrupal\system\Tests\Theme\RegistryTest600
LeafDrupal\system\Tests\Theme\TableTest600
LeafDrupal\system\Tests\Theme\ThemeInfoStylesTest1300
LeafDrupal\system\Tests\Theme\ThemeTest4800
LeafDrupal\system\Tests\Theme\ThemeTestTwig1000
LeafDrupal\system\Tests\Theme\TwigReferenceUnitTest1500
LeafDrupal\system\Tests\Transliteration\TransliterationTest2600
LeafDrupal\system\Tests\TypedData\TypedDataTest6800
LeafDrupal\system\Tests\Update\DependencyHookInvocationTest400
LeafDrupal\system\Tests\Update\DependencyMissingTest400
LeafDrupal\system\Tests\Update\DependencyOrderingTest500
LeafDrupal\system\Tests\Update\UpdateScriptTest20100
LeafDrupal\system\Tests\Upgrade\BareMinimalUpgradePathTest6400
LeafDrupal\system\Tests\Upgrade\BareStandardUpgradePathTest6700
LeafDrupal\system\Tests\Upgrade\BlockUpgradePathTest3500
LeafDrupal\system\Tests\Upgrade\DateUpgradePathTest4900
LeafDrupal\system\Tests\Upgrade\FieldUIUpgradePathTest5100
LeafDrupal\system\Tests\Upgrade\FieldUpgradePathTest3600
ExpandDrupal\system\Tests\Upgrade\FilledMinimalUpgradePathTest1923
MessageGroupFilenameLineFunctionStatus
simplexml_import_dom(): Invalid Nodetype to importsimplexml_import_dom(Object) Drupal\simpletest\WebTestBase->parse() Drupal\simpletest\WebTestBase->xpath('//li[@class=:class]', Array) Drupal\system\Tests\Upgrade\UpgradePathTestBase->performUpgrade() Drupal\system\Tests\Upgrade\FilledMinimalUpgradePathTest->testFilledMinimalUpgrade() Drupal\simpletest\TestBase->run() simpletest_script_run_one_test('582', 'Drupal\system\Tests\Upgrade\FilledMinimalUpgradePathTest') WarningWebTestBase.php1109Drupal\simpletest\WebTestBase->parse()
Parsed page successfully.BrowserUpgradePathTestBase.php242Drupal\system\Tests\Upgrade\UpgradePathTestBase->performUpgrade()
Invalid argument supplied for foreach()Drupal\system\Tests\Upgrade\UpgradePathTestBase->performUpgrade() Drupal\system\Tests\Upgrade\FilledMinimalUpgradePathTest->testFilledMinimalUpgrade() Drupal\simpletest\TestBase->run() simpletest_script_run_one_test('582', 'Drupal\system\Tests\Upgrade\FilledMinimalUpgradePathTest') WarningUpgradePathTestBase.php242Drupal\system\Tests\Upgrade\UpgradePathTestBase->performUpgrade()
No pending updates at the end of the update process.OtherUpgradePathTestBase.php258Drupal\system\Tests\Upgrade\UpgradePathTestBase->performUpgrade()
Exception: update.php still shows pending updates after execution. in Drupal\system\Tests\Upgrade\UpgradePathTestBase->performUpgrade() (line 259 of /var/lib/drupaltestbot/sites/default/files/checkout/core/modules/system/lib/Drupal/system/Tests/Upgrade/UpgradePathTestBase.php). Drupal\system\Tests\Upgrade\UpgradePathTestBase->performUpgrade() Drupal\system\Tests\Upgrade\FilledMinimalUpgradePathTest->testFilledMinimalUpgrade() Drupal\simpletest\TestBase->run() simpletest_script_run_one_test('582', 'Drupal\system\Tests\Upgrade\FilledMinimalUpgradePathTest') Uncaught exceptionUpgradePathTestBase.php259Drupal\system\Tests\Upgrade\UpgradePathTestBase->performUpgrade()
LeafDrupal\system\Tests\Upgrade\FilledStandardUpgradePathTest8100
LeafDrupal\system\Tests\Upgrade\FilterFormatUpgradePathTest4200
LeafDrupal\system\Tests\Upgrade\ImageUpgradePathTest3100
LeafDrupal\system\Tests\Upgrade\LanguageUpgradePathTest15800
LeafDrupal\system\Tests\Upgrade\ModulesDisabledUpgradePathTest3100
LeafDrupal\system\Tests\Upgrade\ShortcutUpgradePathTest3700
LeafDrupal\system\Tests\Upgrade\StateSystemUpgradePathTest4700
LeafDrupal\system\Tests\Upgrade\SystemUpgradePathTest8600
LeafDrupal\system\Tests\Upgrade\UserPictureUpgradePathTest4400
LeafDrupal\system\Tests\Upgrade\UserRoleUpgradePathTest7600
LeafDrupal\system\Tests\Upgrade\UuidUpgradePathTest3600
LeafDrupal\system\Tests\Uuid\UuidUnitTest700
LeafDrupal\taxonomy\Tests\EfqTest2400
LeafDrupal\taxonomy\Tests\HooksTest3300
LeafDrupal\taxonomy\Tests\LegacyTest1400
LeafDrupal\taxonomy\Tests\LoadMultipleTest1900
LeafDrupal\taxonomy\Tests\RssTest2600
LeafDrupal\taxonomy\Tests\TaxonomyTermReferenceItemTest1000
LeafDrupal\taxonomy\Tests\TermFieldMultipleVocabularyTest2600
LeafDrupal\taxonomy\Tests\TermFieldTest4500
LeafDrupal\taxonomy\Tests\TermIndexTest4600
LeafDrupal\taxonomy\Tests\TermLanguageTest6400
LeafDrupal\taxonomy\Tests\TermTest26400
LeafDrupal\taxonomy\Tests\TermTranslationUITest10000
LeafDrupal\taxonomy\Tests\TermUnitTest1100
LeafDrupal\taxonomy\Tests\ThemeTest1900
LeafDrupal\taxonomy\Tests\TokenReplaceTest5500
ExpandDrupal\taxonomy\Tests\Views\RelationshipNodeTermDataTest200
MessageGroupFilenameLineFunctionStatus
'Missing handler: nid nid sort'Debugviews.module975views_get_handler()
LeafDrupal\taxonomy\Tests\Views\RelationshipRepresentativeNode200
LeafDrupal\taxonomy\Tests\VocabularyLanguageTest6000
LeafDrupal\taxonomy\Tests\VocabularyTest11000
LeafDrupal\taxonomy\Tests\VocabularyUnitTest6800
LeafDrupal\telephone\Tests\TelephoneFieldTest2000
LeafDrupal\text\Tests\TextFieldTest18600
LeafDrupal\text\Tests\TextSummaryTest13800
LeafDrupal\text\Tests\TextTranslationTest10400
LeafDrupal\toolbar\Tests\ToolbarHookToolbarTest1500
LeafDrupal\tracker\Tests\TrackerNodeAccessTest2800
LeafDrupal\tracker\Tests\TrackerTest22800
LeafDrupal\translation\Tests\TranslationTest57400
LeafDrupal\translation_entity\Tests\ConfigTestTranslationUITest1300
LeafDrupal\translation_entity\Tests\EntityTestTranslationUITest6900
LeafDrupal\translation_entity\Tests\EntityTranslationSettingsTest4900
LeafDrupal\translation_entity\Tests\Views\TranslationLinkTest2200
LeafDrupal\update\Tests\UpdateContribTest18700
LeafDrupal\update\Tests\UpdateCoreTest22600
LeafDrupal\update\Tests\UpdateCoreUnitTest400
LeafDrupal\update\Tests\UpdateUploadTest6400
LeafDrupal\user\Tests\TempStoreDatabaseTest1900
LeafDrupal\user\Tests\UserAccountLinksTests6100
LeafDrupal\user\Tests\UserAdminSettingsFormTest400
LeafDrupal\user\Tests\UserAdminTest6100
LeafDrupal\user\Tests\UserAutocompleteTest2900
LeafDrupal\user\Tests\UserBlocksTests6600
LeafDrupal\user\Tests\UserCancelTest25400
LeafDrupal\user\Tests\UserCreateTest3300
LeafDrupal\user\Tests\UserDeleteTest1500
LeafDrupal\user\Tests\UserEditedOwnAccountTest2200
LeafDrupal\user\Tests\UserEditTest7300
LeafDrupal\user\Tests\UserEntityCallbacksTest700
LeafDrupal\user\Tests\UserLanguageCreationTest6800
LeafDrupal\user\Tests\UserLanguageTest3900
LeafDrupal\user\Tests\UserLoginTest15900
LeafDrupal\user\Tests\UserPasswordResetTest3000
LeafDrupal\user\Tests\UserPermissionsTest5000
LeafDrupal\user\Tests\UserPictureTest4700
LeafDrupal\user\Tests\UserRegistrationTest12900
LeafDrupal\user\Tests\UserRoleAdminTest5700
LeafDrupal\user\Tests\UserRolesAssignmentTest5100
LeafDrupal\user\Tests\UserSaveTest200
LeafDrupal\user\Tests\UserSearchTest5800
LeafDrupal\user\Tests\UserSignatureTest4600
LeafDrupal\user\Tests\UserTimeZoneTest2900
LeafDrupal\user\Tests\UserTokenReplaceTest4700
LeafDrupal\user\Tests\UserTranslationUITest9000
LeafDrupal\user\Tests\UserValidateCurrentPassCustomFormTest1700
LeafDrupal\user\Tests\UserValidationTest1600
LeafDrupal\user\Tests\Views\AccessPermissionTest1400
LeafDrupal\user\Tests\Views\AccessRoleTest1400
LeafDrupal\user\Tests\Views\ArgumentDefaultTest900
LeafDrupal\user\Tests\Views\ArgumentValidateTest1900
LeafDrupal\user\Tests\Views\HandlerArgumentUserUidTest500
LeafDrupal\user\Tests\Views\HandlerFieldRoleTest1000
LeafDrupal\user\Tests\Views\HandlerFieldUserNameTest700
LeafDrupal\user\Tests\Views\HandlerFilterUserNameTest5000
LeafDrupal\user\Tests\Views\RelationshipRepresentativeNode300
LeafDrupal\views\Tests\AnalyzeTest2100
LeafDrupal\views\Tests\BasicTest800
ExpandDrupal\views\Tests\DefaultViewsTest7200
MessageGroupFilenameLineFunctionStatus
'Missing handler: search_node_links_to nid argument'Debugviews.module975views_get_handler()
'Missing handler: search_node_links_to nid argument'Debugviews.module975views_get_handler()
'Missing handler: search_node_links_to nid argument'Debugviews.module975views_get_handler()
'Missing handler: field_data_comment_body comment_body field'Debugviews.module975views_get_handler()
'Missing handler: history timestamp field'Debugviews.module975views_get_handler()
'Missing handler: history timestamp field'Debugviews.module975views_get_handler()
LeafDrupal\views\Tests\Entity\FieldEntityTest400
LeafDrupal\views\Tests\GlossaryTest800
LeafDrupal\views\Tests\Handler\AreaTest9000
LeafDrupal\views\Tests\Handler\AreaTextTest400
LeafDrupal\views\Tests\Handler\ArgumentNullTest400
LeafDrupal\views\Tests\Handler\ArgumentStringTest400
LeafDrupal\views\Tests\Handler\FieldBooleanTest1000
LeafDrupal\views\Tests\Handler\FieldCounterTest600
LeafDrupal\views\Tests\Handler\FieldCustomTest100
LeafDrupal\views\Tests\Handler\FieldDateTest1400
LeafDrupal\views\Tests\Handler\FieldDropButtonTest1300
LeafDrupal\views\Tests\Handler\FieldFileSizeTest800
LeafDrupal\views\Tests\Handler\FieldUnitTest9300
LeafDrupal\views\Tests\Handler\FieldUrlTest200
LeafDrupal\views\Tests\Handler\FieldWebTest10900
LeafDrupal\views\Tests\Handler\FieldXssTest300
LeafDrupal\views\Tests\Handler\FilterCombineTest100
LeafDrupal\views\Tests\Handler\FilterDateTest2200
LeafDrupal\views\Tests\Handler\FilterEqualityTest400
LeafDrupal\views\Tests\Handler\FilterInOperatorTest800
LeafDrupal\views\Tests\Handler\FilterNumericTest1400
LeafDrupal\views\Tests\Handler\FilterStringTest2600
LeafDrupal\views\Tests\Handler\HandlerAliasTest800
LeafDrupal\views\Tests\Handler\HandlerAllTest26000
ExpandDrupal\views\Tests\Handler\HandlerTest11600
MessageGroupFilenameLineFunctionStatus
'Missing handler: hqwFMXJD tfIqGdPu relationship'Debugviews.module975views_get_handler()
'Missing handler: hqwFMXJD tfIqGdPu relationship'Debugviews.module975views_get_handler()
LeafDrupal\views\Tests\Handler\RelationshipTest500
LeafDrupal\views\Tests\Handler\SortDateTest2400
LeafDrupal\views\Tests\Handler\SortRandomTest600
LeafDrupal\views\Tests\Handler\SortTest800
ExpandDrupal\views\Tests\ModuleTest4800
MessageGroupFilenameLineFunctionStatus
'Missing handler: wu3OE72x v2ObZSJk field'Debugviews.module975views_get_handler()
'Missing handler: wuqEwbhZ b8DXcK2O area'Debugviews.module975views_get_handler()
'Missing handler: bGPv53Dz yiQrVc69 filter'Debugviews.module975views_get_handler()
LeafDrupal\views\Tests\PluginBaseUnitTest1200
LeafDrupal\views\Tests\PluginInstanceTest14100
LeafDrupal\views\Tests\PluginTypeListTest100
LeafDrupal\views\Tests\Plugin\AccessTest3900
LeafDrupal\views\Tests\Plugin\ArgumentDefaultTest2400
LeafDrupal\views\Tests\Plugin\ArgumentValidatorTest400
LeafDrupal\views\Tests\Plugin\CacheTest1200
LeafDrupal\views\Tests\Plugin\DisplayAttachmentTest600
LeafDrupal\views\Tests\Plugin\DisplayExtenderTest600
LeafDrupal\views\Tests\Plugin\DisplayFeedTest2800
LeafDrupal\views\Tests\Plugin\DisplayPageTest700
LeafDrupal\views\Tests\Plugin\DisplayTest5000
LeafDrupal\views\Tests\Plugin\ExposedFormTest13100
LeafDrupal\views\Tests\Plugin\FilterTest1300
LeafDrupal\views\Tests\Plugin\JoinTest1600
LeafDrupal\views\Tests\Plugin\MiniPagerTest1300
LeafDrupal\views\Tests\Plugin\PagerTest9200
LeafDrupal\views\Tests\Plugin\QueryTest200
LeafDrupal\views\Tests\Plugin\StyleMappingTest4200
LeafDrupal\views\Tests\Plugin\StyleTest2400
LeafDrupal\views\Tests\Plugin\StyleUnformattedTest1700
LeafDrupal\views\Tests\QueryGroupByTest4000
LeafDrupal\views\Tests\TokenReplaceTest1100
LeafDrupal\views\Tests\UI\DefaultViewsTest11000
LeafDrupal\views\Tests\UI\DisplayAttachmentTest2400
LeafDrupal\views\Tests\UI\DisplayExtenderUITest2300
LeafDrupal\views\Tests\UI\DisplayPath2200
LeafDrupal\views\Tests\UI\DisplayTest40900
LeafDrupal\views\Tests\UI\GroupByTest2600
LeafDrupal\views\Tests\UI\HandlerTest11000
LeafDrupal\views\Tests\UI\OverrideDisplaysTest14700
LeafDrupal\views\Tests\UI\PreviewTest4200
LeafDrupal\views\Tests\UI\QueryTest1900
LeafDrupal\views\Tests\UI\RedirectTest2600
LeafDrupal\views\Tests\UI\RowUITest3000
LeafDrupal\views\Tests\UI\SettingsTest8800
LeafDrupal\views\Tests\UI\StorageTest2100
LeafDrupal\views\Tests\UI\StyleUITest3000
LeafDrupal\views\Tests\UI\TagTest1100
LeafDrupal\views\Tests\ViewElementTest1500
LeafDrupal\views\Tests\ViewExecutableTest11400
LeafDrupal\views\Tests\ViewRenderTest200
LeafDrupal\views\Tests\ViewsDataTest1100
LeafDrupal\views\Tests\ViewsHooksTest600
LeafDrupal\views\Tests\ViewStorageTest10100
LeafDrupal\views\Tests\Wizard\BasicTest9200
LeafDrupal\views\Tests\Wizard\ItemsPerPageTest3800
LeafDrupal\views\Tests\Wizard\MenuTest1900
LeafDrupal\views\Tests\Wizard\SortingTest3500
LeafDrupal\views\Tests\Wizard\TaggedWithTest12900
LeafDrupal\xmlrpc\Tests\XmlRpcBasicTest1400
LeafDrupal\xmlrpc\Tests\XmlRpcMessagesTest900
LeafDrupal\xmlrpc\Tests\XmlRpcValidatorTest1000