entityreference-1801304-247.patch

Test status
StatusResult
Last receivedWed, 01/16/2013 - 19:45:18
Last requestedWed, 01/16/2013 - 20:06:53
Last testedWed, 01/16/2013 - 21:14:31
Test count1
Environment status
MySQLfail
File information
Fileentityreference-1801304-247.patch
BranchDrupal core - 8.x
LinkIssue Link
SummaryFAILED: [[SimpleTest]]: [MySQL] 50,588 pass(es), 101 fail(s), and 91 exception(s).
Details

MySQL

  1. Setup environment
  2. Detect an invalid patch URL
  3. Detect invalid repository information
  4. Detect invalid patch format
  5. Detect a non-applicable patch
  6. Detect invalid PHP syntax
  7. Detect a Drupal installation failure
  8. Detect a test run failure
  9. Detect a failing test
    Review the test failures below then if necessary run them locally until the problem has been fixed.
  10. Complete test suite with all tests passing
50,588 pass(es), 101 fail(s), and 91 exception(s)

Non-pass

Test namePassFailException
ExpandDrupal\comment\Tests\CommentLanguageTest601228
MessageGroupFilenameLineFunctionStatus
array_flip(): Can only flip STRING and INTEGER values!array_flip(Array) Drupal\Core\Entity\DatabaseStorageController->load(Array) entity_load_multiple('comment', Array, ) entity_load('comment', ) comment_load() Drupal\comment\Tests\CommentLanguageTest->testCommentLanguage() Drupal\simpletest\TestBase->run() simpletest_script_run_one_test('71', 'Drupal\comment\Tests\CommentLanguageTest') WarningDatabaseStorageController.php182Drupal\Core\Entity\DatabaseStorageController->load()
Trying to get property of non-objectDrupal\comment\Tests\CommentLanguageTest->testCommentLanguage() Drupal\simpletest\TestBase->run() simpletest_script_run_one_test('71', 'Drupal\comment\Tests\CommentLanguageTest') NoticeCommentLanguageTest.php130Drupal\comment\Tests\CommentLanguageTest->testCommentLanguage()
Trying to get property of non-objectDrupal\comment\Tests\CommentLanguageTest->testCommentLanguage() Drupal\simpletest\TestBase->run() simpletest_script_run_one_test('71', 'Drupal\comment\Tests\CommentLanguageTest') NoticeCommentLanguageTest.php130Drupal\comment\Tests\CommentLanguageTest->testCommentLanguage()
Trying to get property of non-objectDrupal\comment\Tests\CommentLanguageTest->testCommentLanguage() Drupal\simpletest\TestBase->run() simpletest_script_run_one_test('71', 'Drupal\comment\Tests\CommentLanguageTest') NoticeCommentLanguageTest.php131Drupal\comment\Tests\CommentLanguageTest->testCommentLanguage()
Trying to get property of non-objectDrupal\comment\Tests\CommentLanguageTest->testCommentLanguage() Drupal\simpletest\TestBase->run() simpletest_script_run_one_test('71', 'Drupal\comment\Tests\CommentLanguageTest') NoticeCommentLanguageTest.php131Drupal\comment\Tests\CommentLanguageTest->testCommentLanguage()
The comment posted with content language en and belonging to the node with language en has language OtherCommentLanguageTest.php131Drupal\comment\Tests\CommentLanguageTest->testCommentLanguage()
Trying to get property of non-objectDrupal\comment\Tests\CommentLanguageTest->testCommentLanguage() Drupal\simpletest\TestBase->run() simpletest_script_run_one_test('71', 'Drupal\comment\Tests\CommentLanguageTest') NoticeCommentLanguageTest.php132Drupal\comment\Tests\CommentLanguageTest->testCommentLanguage()
Trying to get property of non-objectDrupal\comment\Tests\CommentLanguageTest->testCommentLanguage() Drupal\simpletest\TestBase->run() simpletest_script_run_one_test('71', 'Drupal\comment\Tests\CommentLanguageTest') NoticeCommentLanguageTest.php132Drupal\comment\Tests\CommentLanguageTest->testCommentLanguage()
Comment body correctly stored.OtherCommentLanguageTest.php132Drupal\comment\Tests\CommentLanguageTest->testCommentLanguage()
array_flip(): Can only flip STRING and INTEGER values!array_flip(Array) Drupal\Core\Entity\DatabaseStorageController->load(Array) entity_load_multiple('comment', Array, ) entity_load('comment', ) comment_load() Drupal\comment\Tests\CommentLanguageTest->testCommentLanguage() Drupal\simpletest\TestBase->run() simpletest_script_run_one_test('71', 'Drupal\comment\Tests\CommentLanguageTest') WarningDatabaseStorageController.php182Drupal\Core\Entity\DatabaseStorageController->load()
Trying to get property of non-objectDrupal\comment\Tests\CommentLanguageTest->testCommentLanguage() Drupal\simpletest\TestBase->run() simpletest_script_run_one_test('71', 'Drupal\comment\Tests\CommentLanguageTest') NoticeCommentLanguageTest.php130Drupal\comment\Tests\CommentLanguageTest->testCommentLanguage()
Trying to get property of non-objectDrupal\comment\Tests\CommentLanguageTest->testCommentLanguage() Drupal\simpletest\TestBase->run() simpletest_script_run_one_test('71', 'Drupal\comment\Tests\CommentLanguageTest') NoticeCommentLanguageTest.php130Drupal\comment\Tests\CommentLanguageTest->testCommentLanguage()
Trying to get property of non-objectDrupal\comment\Tests\CommentLanguageTest->testCommentLanguage() Drupal\simpletest\TestBase->run() simpletest_script_run_one_test('71', 'Drupal\comment\Tests\CommentLanguageTest') NoticeCommentLanguageTest.php131Drupal\comment\Tests\CommentLanguageTest->testCommentLanguage()
Trying to get property of non-objectDrupal\comment\Tests\CommentLanguageTest->testCommentLanguage() Drupal\simpletest\TestBase->run() simpletest_script_run_one_test('71', 'Drupal\comment\Tests\CommentLanguageTest') NoticeCommentLanguageTest.php131Drupal\comment\Tests\CommentLanguageTest->testCommentLanguage()
The comment posted with content language fr and belonging to the node with language en has language OtherCommentLanguageTest.php131Drupal\comment\Tests\CommentLanguageTest->testCommentLanguage()
Trying to get property of non-objectDrupal\comment\Tests\CommentLanguageTest->testCommentLanguage() Drupal\simpletest\TestBase->run() simpletest_script_run_one_test('71', 'Drupal\comment\Tests\CommentLanguageTest') NoticeCommentLanguageTest.php132Drupal\comment\Tests\CommentLanguageTest->testCommentLanguage()
Trying to get property of non-objectDrupal\comment\Tests\CommentLanguageTest->testCommentLanguage() Drupal\simpletest\TestBase->run() simpletest_script_run_one_test('71', 'Drupal\comment\Tests\CommentLanguageTest') NoticeCommentLanguageTest.php132Drupal\comment\Tests\CommentLanguageTest->testCommentLanguage()
Comment body correctly stored.OtherCommentLanguageTest.php132Drupal\comment\Tests\CommentLanguageTest->testCommentLanguage()
array_flip(): Can only flip STRING and INTEGER values!array_flip(Array) Drupal\Core\Entity\DatabaseStorageController->load(Array) entity_load_multiple('comment', Array, ) entity_load('comment', ) comment_load() Drupal\comment\Tests\CommentLanguageTest->testCommentLanguage() Drupal\simpletest\TestBase->run() simpletest_script_run_one_test('71', 'Drupal\comment\Tests\CommentLanguageTest') WarningDatabaseStorageController.php182Drupal\Core\Entity\DatabaseStorageController->load()
Trying to get property of non-objectDrupal\comment\Tests\CommentLanguageTest->testCommentLanguage() Drupal\simpletest\TestBase->run() simpletest_script_run_one_test('71', 'Drupal\comment\Tests\CommentLanguageTest') NoticeCommentLanguageTest.php130Drupal\comment\Tests\CommentLanguageTest->testCommentLanguage()
Trying to get property of non-objectDrupal\comment\Tests\CommentLanguageTest->testCommentLanguage() Drupal\simpletest\TestBase->run() simpletest_script_run_one_test('71', 'Drupal\comment\Tests\CommentLanguageTest') NoticeCommentLanguageTest.php130Drupal\comment\Tests\CommentLanguageTest->testCommentLanguage()
Trying to get property of non-objectDrupal\comment\Tests\CommentLanguageTest->testCommentLanguage() Drupal\simpletest\TestBase->run() simpletest_script_run_one_test('71', 'Drupal\comment\Tests\CommentLanguageTest') NoticeCommentLanguageTest.php131Drupal\comment\Tests\CommentLanguageTest->testCommentLanguage()
Trying to get property of non-objectDrupal\comment\Tests\CommentLanguageTest->testCommentLanguage() Drupal\simpletest\TestBase->run() simpletest_script_run_one_test('71', 'Drupal\comment\Tests\CommentLanguageTest') NoticeCommentLanguageTest.php131Drupal\comment\Tests\CommentLanguageTest->testCommentLanguage()
The comment posted with content language en and belonging to the node with language fr has language OtherCommentLanguageTest.php131Drupal\comment\Tests\CommentLanguageTest->testCommentLanguage()
Trying to get property of non-objectDrupal\comment\Tests\CommentLanguageTest->testCommentLanguage() Drupal\simpletest\TestBase->run() simpletest_script_run_one_test('71', 'Drupal\comment\Tests\CommentLanguageTest') NoticeCommentLanguageTest.php132Drupal\comment\Tests\CommentLanguageTest->testCommentLanguage()
Trying to get property of non-objectDrupal\comment\Tests\CommentLanguageTest->testCommentLanguage() Drupal\simpletest\TestBase->run() simpletest_script_run_one_test('71', 'Drupal\comment\Tests\CommentLanguageTest') NoticeCommentLanguageTest.php132Drupal\comment\Tests\CommentLanguageTest->testCommentLanguage()
Comment body correctly stored.OtherCommentLanguageTest.php132Drupal\comment\Tests\CommentLanguageTest->testCommentLanguage()
array_flip(): Can only flip STRING and INTEGER values!array_flip(Array) Drupal\Core\Entity\DatabaseStorageController->load(Array) entity_load_multiple('comment', Array, ) entity_load('comment', ) comment_load() Drupal\comment\Tests\CommentLanguageTest->testCommentLanguage() Drupal\simpletest\TestBase->run() simpletest_script_run_one_test('71', 'Drupal\comment\Tests\CommentLanguageTest') WarningDatabaseStorageController.php182Drupal\Core\Entity\DatabaseStorageController->load()
Trying to get property of non-objectDrupal\comment\Tests\CommentLanguageTest->testCommentLanguage() Drupal\simpletest\TestBase->run() simpletest_script_run_one_test('71', 'Drupal\comment\Tests\CommentLanguageTest') NoticeCommentLanguageTest.php130Drupal\comment\Tests\CommentLanguageTest->testCommentLanguage()
Trying to get property of non-objectDrupal\comment\Tests\CommentLanguageTest->testCommentLanguage() Drupal\simpletest\TestBase->run() simpletest_script_run_one_test('71', 'Drupal\comment\Tests\CommentLanguageTest') NoticeCommentLanguageTest.php130Drupal\comment\Tests\CommentLanguageTest->testCommentLanguage()
Trying to get property of non-objectDrupal\comment\Tests\CommentLanguageTest->testCommentLanguage() Drupal\simpletest\TestBase->run() simpletest_script_run_one_test('71', 'Drupal\comment\Tests\CommentLanguageTest') NoticeCommentLanguageTest.php131Drupal\comment\Tests\CommentLanguageTest->testCommentLanguage()
Trying to get property of non-objectDrupal\comment\Tests\CommentLanguageTest->testCommentLanguage() Drupal\simpletest\TestBase->run() simpletest_script_run_one_test('71', 'Drupal\comment\Tests\CommentLanguageTest') NoticeCommentLanguageTest.php131Drupal\comment\Tests\CommentLanguageTest->testCommentLanguage()
The comment posted with content language fr and belonging to the node with language fr has language OtherCommentLanguageTest.php131Drupal\comment\Tests\CommentLanguageTest->testCommentLanguage()
Trying to get property of non-objectDrupal\comment\Tests\CommentLanguageTest->testCommentLanguage() Drupal\simpletest\TestBase->run() simpletest_script_run_one_test('71', 'Drupal\comment\Tests\CommentLanguageTest') NoticeCommentLanguageTest.php132Drupal\comment\Tests\CommentLanguageTest->testCommentLanguage()
Trying to get property of non-objectDrupal\comment\Tests\CommentLanguageTest->testCommentLanguage() Drupal\simpletest\TestBase->run() simpletest_script_run_one_test('71', 'Drupal\comment\Tests\CommentLanguageTest') NoticeCommentLanguageTest.php132Drupal\comment\Tests\CommentLanguageTest->testCommentLanguage()
Comment body correctly stored.OtherCommentLanguageTest.php132Drupal\comment\Tests\CommentLanguageTest->testCommentLanguage()
Raw "cZzfiMtS" foundOtherCommentLanguageTest.php140Drupal\comment\Tests\CommentLanguageTest->testCommentLanguage()
Raw "zI79fpfq" foundOtherCommentLanguageTest.php140Drupal\comment\Tests\CommentLanguageTest->testCommentLanguage()
Raw "pzs00SvQ" foundOtherCommentLanguageTest.php140Drupal\comment\Tests\CommentLanguageTest->testCommentLanguage()
Raw "s88loEcF" foundOtherCommentLanguageTest.php140Drupal\comment\Tests\CommentLanguageTest->testCommentLanguage()
ExpandDrupal\comment\Tests\CommentPreviewTest6610
MessageGroupFilenameLineFunctionStatus
The test did not complete due to a fatal error.Completion checkCommentPreviewTest.php79Drupal\comment\Tests\CommentPreviewTest->testCommentEditPreviewSave()
ExpandDrupal\entity_reference\Tests\EntityReferenceSelectionAccessTest6187
MessageGroupFilenameLineFunctionStatus
Illegal offset typeDrupal\entity_reference\Tests\EntityReferenceSelectionAccessTest->testCommentHandler() Drupal\simpletest\TestBase->run() simpletest_script_run_one_test('185', 'Drupal\entity_reference\Tests\EntityReferenceSelectionAccessTest') WarningEntityReferenceSelectionAccessTest.php429Drupal\entity_reference\Tests\EntityReferenceSelectionAccessTest->testCommentHandler()
Illegal offset typeDrupal\entity_reference\Tests\EntityReferenceSelectionAccessTest->testCommentHandler() Drupal\simpletest\TestBase->run() simpletest_script_run_one_test('185', 'Drupal\entity_reference\Tests\EntityReferenceSelectionAccessTest') WarningEntityReferenceSelectionAccessTest.php439Drupal\entity_reference\Tests\EntityReferenceSelectionAccessTest->testCommentHandler()
Valid result set returned by Comment handler.OtherEntityReferenceSelectionAccessTest.php456Drupal\entity_reference\Tests\EntityReferenceSelectionAccessTest->testCommentHandler()
Valid count returned by Comment handler.OtherEntityReferenceSelectionAccessTest.php456Drupal\entity_reference\Tests\EntityReferenceSelectionAccessTest->testCommentHandler()
Valid result set returned by Comment handler.OtherEntityReferenceSelectionAccessTest.php456Drupal\entity_reference\Tests\EntityReferenceSelectionAccessTest->testCommentHandler()
Valid count returned by Comment handler.OtherEntityReferenceSelectionAccessTest.php456Drupal\entity_reference\Tests\EntityReferenceSelectionAccessTest->testCommentHandler()
Illegal offset typeDrupal\entity_reference\Tests\EntityReferenceSelectionAccessTest->testCommentHandler() Drupal\simpletest\TestBase->run() simpletest_script_run_one_test('185', 'Drupal\entity_reference\Tests\EntityReferenceSelectionAccessTest') WarningEntityReferenceSelectionAccessTest.php468Drupal\entity_reference\Tests\EntityReferenceSelectionAccessTest->testCommentHandler()
Illegal offset typeDrupal\entity_reference\Tests\EntityReferenceSelectionAccessTest->testCommentHandler() Drupal\simpletest\TestBase->run() simpletest_script_run_one_test('185', 'Drupal\entity_reference\Tests\EntityReferenceSelectionAccessTest') WarningEntityReferenceSelectionAccessTest.php469Drupal\entity_reference\Tests\EntityReferenceSelectionAccessTest->testCommentHandler()
Valid result set returned by Comment handler (comment admin).OtherEntityReferenceSelectionAccessTest.php474Drupal\entity_reference\Tests\EntityReferenceSelectionAccessTest->testCommentHandler()
Valid count returned by Comment handler (comment admin).OtherEntityReferenceSelectionAccessTest.php474Drupal\entity_reference\Tests\EntityReferenceSelectionAccessTest->testCommentHandler()
Illegal offset typeDrupal\entity_reference\Tests\EntityReferenceSelectionAccessTest->testCommentHandler() Drupal\simpletest\TestBase->run() simpletest_script_run_one_test('185', 'Drupal\entity_reference\Tests\EntityReferenceSelectionAccessTest') WarningEntityReferenceSelectionAccessTest.php486Drupal\entity_reference\Tests\EntityReferenceSelectionAccessTest->testCommentHandler()
Illegal offset typeDrupal\entity_reference\Tests\EntityReferenceSelectionAccessTest->testCommentHandler() Drupal\simpletest\TestBase->run() simpletest_script_run_one_test('185', 'Drupal\entity_reference\Tests\EntityReferenceSelectionAccessTest') WarningEntityReferenceSelectionAccessTest.php487Drupal\entity_reference\Tests\EntityReferenceSelectionAccessTest->testCommentHandler()
Illegal offset typeDrupal\entity_reference\Tests\EntityReferenceSelectionAccessTest->testCommentHandler() Drupal\simpletest\TestBase->run() simpletest_script_run_one_test('185', 'Drupal\entity_reference\Tests\EntityReferenceSelectionAccessTest') WarningEntityReferenceSelectionAccessTest.php488Drupal\entity_reference\Tests\EntityReferenceSelectionAccessTest->testCommentHandler()
Valid result set returned by Comment handler (comment + node admin).OtherEntityReferenceSelectionAccessTest.php493Drupal\entity_reference\Tests\EntityReferenceSelectionAccessTest->testCommentHandler()
Valid count returned by Comment handler (comment + node admin).OtherEntityReferenceSelectionAccessTest.php493Drupal\entity_reference\Tests\EntityReferenceSelectionAccessTest->testCommentHandler()
ExpandDrupal\file\Tests\FileFieldWidgetTest29739
MessageGroupFilenameLineFunctionStatus
Undefined offset: 1Drupal\file\Tests\FileFieldWidgetTest->testPrivateFileComment() Drupal\simpletest\TestBase->run() simpletest_script_run_one_test('223', 'Drupal\file\Tests\FileFieldWidgetTest') NoticeFileFieldWidgetTest.php284Drupal\file\Tests\FileFieldWidgetTest->testPrivateFileComment()
array_flip(): Can only flip STRING and INTEGER values!array_flip(Array) Drupal\Core\Entity\DatabaseStorageController->load(Array) entity_load_multiple('comment', Array, ) entity_load('comment', NULL) comment_load(NULL) Drupal\file\Tests\FileFieldWidgetTest->testPrivateFileComment() Drupal\simpletest\TestBase->run() simpletest_script_run_one_test('223', 'Drupal\file\Tests\FileFieldWidgetTest') WarningDatabaseStorageController.php182Drupal\Core\Entity\DatabaseStorageController->load()
Trying to get property of non-objectDrupal\file\Tests\FileFieldWidgetTest->testPrivateFileComment() Drupal\simpletest\TestBase->run() simpletest_script_run_one_test('223', 'Drupal\file\Tests\FileFieldWidgetTest') NoticeFileFieldWidgetTest.php290Drupal\file\Tests\FileFieldWidgetTest->testPrivateFileComment()
array_flip(): Can only flip STRING and INTEGER values!array_flip(Array) Drupal\Core\Entity\DatabaseStorageController->load(Array) entity_load_multiple('file', Array) file_load_multiple(Array) file_load(NULL) Drupal\file\Tests\FileFieldWidgetTest->testPrivateFileComment() Drupal\simpletest\TestBase->run() simpletest_script_run_one_test('223', 'Drupal\file\Tests\FileFieldWidgetTest') WarningDatabaseStorageController.php182Drupal\Core\Entity\DatabaseStorageController->load()
Trying to get property of non-objectDrupal\file\Tests\FileFieldTestBase->assertFileExists(, 'New file saved to disk on node creation.') Drupal\file\Tests\FileFieldWidgetTest->testPrivateFileComment() Drupal\simpletest\TestBase->run() simpletest_script_run_one_test('223', 'Drupal\file\Tests\FileFieldWidgetTest') NoticeFileFieldTestBase.php189Drupal\file\Tests\FileFieldTestBase->assertFileExists()
New file saved to disk on node creation.OtherFileFieldWidgetTest.php291Drupal\file\Tests\FileFieldWidgetTest->testPrivateFileComment()
Trying to get property of non-objectDrupal\file\Tests\FileFieldWidgetTest->testPrivateFileComment() Drupal\simpletest\TestBase->run() simpletest_script_run_one_test('223', 'Drupal\file\Tests\FileFieldWidgetTest') NoticeFileFieldWidgetTest.php293Drupal\file\Tests\FileFieldWidgetTest->testPrivateFileComment()
Trying to get property of non-objectDrupal\file\Tests\FileFieldWidgetTest->testPrivateFileComment() Drupal\simpletest\TestBase->run() simpletest_script_run_one_test('223', 'Drupal\file\Tests\FileFieldWidgetTest') NoticeFileFieldWidgetTest.php295Drupal\file\Tests\FileFieldWidgetTest->testPrivateFileComment()
Trying to get property of non-objectDrupal\file\Tests\FileFieldWidgetTest->testPrivateFileComment() Drupal\simpletest\TestBase->run() simpletest_script_run_one_test('223', 'Drupal\file\Tests\FileFieldWidgetTest') NoticeFileFieldWidgetTest.php300Drupal\file\Tests\FileFieldWidgetTest->testPrivateFileComment()
Confirmed that access is denied for the file without the needed permission.BrowserFileFieldWidgetTest.php301Drupal\file\Tests\FileFieldWidgetTest->testPrivateFileComment()
Trying to get property of non-objectDrupal\file\Tests\FileFieldWidgetTest->testPrivateFileComment() Drupal\simpletest\TestBase->run() simpletest_script_run_one_test('223', 'Drupal\file\Tests\FileFieldWidgetTest') NoticeFileFieldWidgetTest.php312Drupal\file\Tests\FileFieldWidgetTest->testPrivateFileComment()
Confirmed that access is denied for the file without the needed permission.BrowserFileFieldWidgetTest.php313Drupal\file\Tests\FileFieldWidgetTest->testPrivateFileComment()
ExpandDrupal\forum\Tests\ForumBlockTest14702
MessageGroupFilenameLineFunctionStatus
Drupal\Core\Entity\EntityStorageException: Field value is unknown. in Drupal\Core\Entity\DatabaseStorageControllerNG->save() (line 321 of /var/lib/drupaltestbot/sites/default/files/checkout/core/lib/Drupal/Core/Entity/DatabaseStorageControllerNG.php). Drupal\Core\Entity\DatabaseStorageControllerNG->save(Object) Drupal\Core\Entity\Entity->save() comment_save(Object) Drupal\forum\Tests\ForumBlockTest->testActiveForumTopicsBlock() Drupal\simpletest\TestBase->run() simpletest_script_run_one_test('292', 'Drupal\forum\Tests\ForumBlockTest') Uncaught exceptionDatabaseStorageControllerNG.php321Drupal\Core\Entity\DatabaseStorageControllerNG->save()
Drupal\Core\Entity\EntityStorageException: Field value is unknown. in Drupal\Core\Entity\DatabaseStorageControllerNG->save() (line 321 of /var/lib/drupaltestbot/sites/default/files/checkout/core/lib/Drupal/Core/Entity/DatabaseStorageControllerNG.php). Drupal\Core\Entity\DatabaseStorageControllerNG->save(Object) Drupal\Core\Entity\Entity->save() comment_save(Object) Drupal\forum\Tests\ForumBlockTest->testActiveForumTopicsBlock() Drupal\simpletest\TestBase->run() simpletest_script_run_one_test('292', 'Drupal\forum\Tests\ForumBlockTest') Uncaught exceptionDatabaseStorageControllerNG.php321Drupal\Core\Entity\DatabaseStorageControllerNG->save()
ExpandDrupal\node\Tests\NodeAccessPagerTest1901
MessageGroupFilenameLineFunctionStatus
Drupal\Core\Entity\EntityStorageException: Field value is unknown. in Drupal\Core\Entity\DatabaseStorageControllerNG->save() (line 321 of /var/lib/drupaltestbot/sites/default/files/checkout/core/lib/Drupal/Core/Entity/DatabaseStorageControllerNG.php). Drupal\Core\Entity\DatabaseStorageControllerNG->save(Object) Drupal\Core\Entity\Entity->save() Drupal\node\Tests\NodeAccessPagerTest->testCommentPager() Drupal\simpletest\TestBase->run() simpletest_script_run_one_test('372', 'Drupal\node\Tests\NodeAccessPagerTest') Uncaught exceptionDatabaseStorageControllerNG.php321Drupal\Core\Entity\DatabaseStorageControllerNG->save()
ExpandDrupal\rdf\Tests\CommentAttributesTest1623436
MessageGroupFilenameLineFunctionStatus
Comment subject posted.OtherCommentTestBase.php141Drupal\comment\Tests\CommentTestBase->postComment()
Comment body posted.OtherCommentTestBase.php143Drupal\comment\Tests\CommentTestBase->postComment()
Comment id found.OtherCommentTestBase.php144Drupal\comment\Tests\CommentTestBase->postComment()
Comment subject posted.OtherCommentTestBase.php141Drupal\comment\Tests\CommentTestBase->postComment()
Comment body posted.OtherCommentTestBase.php143Drupal\comment\Tests\CommentTestBase->postComment()
Comment id found.OtherCommentTestBase.php144Drupal\comment\Tests\CommentTestBase->postComment()
RDFa markup for the number of comments found on teaser view.OtherCommentAttributesTest.php79Drupal\rdf\Tests\CommentAttributesTest->testNumberOfCommentsRdfaMarkup()
Empty rel attribute found in comment count link.OtherCommentAttributesTest.php81Drupal\rdf\Tests\CommentAttributesTest->testNumberOfCommentsRdfaMarkup()
RDFa markup for the number of comments found on full node view.OtherCommentAttributesTest.php87Drupal\rdf\Tests\CommentAttributesTest->testNumberOfCommentsRdfaMarkup()
Comment subject posted.OtherCommentTestBase.php141Drupal\comment\Tests\CommentTestBase->postComment()
Comment body posted.OtherCommentTestBase.php143Drupal\comment\Tests\CommentTestBase->postComment()
Comment id found.OtherCommentTestBase.php144Drupal\comment\Tests\CommentTestBase->postComment()
Comment RDF type for comment found.OtherCommentAttributesTest.php182Drupal\rdf\Tests\CommentAttributesTest->_testBasicCommentRdfaMarkup()
Undefined offset: 0Drupal\rdf\Tests\CommentAttributesTest->_testBasicCommentRdfaMarkup(NULL) Drupal\rdf\Tests\CommentAttributesTest->testCommentRdfaMarkup() Drupal\simpletest\TestBase->run() simpletest_script_run_one_test('441', 'Drupal\rdf\Tests\CommentAttributesTest') NoticeCommentAttributesTest.php184Drupal\rdf\Tests\CommentAttributesTest->_testBasicCommentRdfaMarkup()
Trying to get property of non-objectDrupal\rdf\Tests\CommentAttributesTest->_testBasicCommentRdfaMarkup(NULL) Drupal\rdf\Tests\CommentAttributesTest->testCommentRdfaMarkup() Drupal\simpletest\TestBase->run() simpletest_script_run_one_test('441', 'Drupal\rdf\Tests\CommentAttributesTest') NoticeCommentAttributesTest.php184Drupal\rdf\Tests\CommentAttributesTest->_testBasicCommentRdfaMarkup()
Trying to get property of non-objectDrupal\rdf\Tests\CommentAttributesTest->_testBasicCommentRdfaMarkup(NULL) Drupal\rdf\Tests\CommentAttributesTest->testCommentRdfaMarkup() Drupal\simpletest\TestBase->run() simpletest_script_run_one_test('441', 'Drupal\rdf\Tests\CommentAttributesTest') NoticeCommentAttributesTest.php184Drupal\rdf\Tests\CommentAttributesTest->_testBasicCommentRdfaMarkup()
Trying to get property of non-objectDrupal\rdf\Tests\CommentAttributesTest->_testBasicCommentRdfaMarkup(NULL) Drupal\rdf\Tests\CommentAttributesTest->testCommentRdfaMarkup() Drupal\simpletest\TestBase->run() simpletest_script_run_one_test('441', 'Drupal\rdf\Tests\CommentAttributesTest') NoticeCommentAttributesTest.php184Drupal\rdf\Tests\CommentAttributesTest->_testBasicCommentRdfaMarkup()
RDFa markup for the date of the comment found.OtherCommentAttributesTest.php186Drupal\rdf\Tests\CommentAttributesTest->_testBasicCommentRdfaMarkup()
Undefined offset: 0Drupal\rdf\Tests\CommentAttributesTest->_testBasicCommentRdfaMarkup(NULL) Drupal\rdf\Tests\CommentAttributesTest->testCommentRdfaMarkup() Drupal\simpletest\TestBase->run() simpletest_script_run_one_test('441', 'Drupal\rdf\Tests\CommentAttributesTest') NoticeCommentAttributesTest.php190Drupal\rdf\Tests\CommentAttributesTest->_testBasicCommentRdfaMarkup()
RDFa markup for the comment author found.OtherCommentAttributesTest.php190Drupal\rdf\Tests\CommentAttributesTest->_testBasicCommentRdfaMarkup()
Undefined offset: 0Drupal\rdf\Tests\CommentAttributesTest->_testBasicCommentRdfaMarkup(NULL) Drupal\rdf\Tests\CommentAttributesTest->testCommentRdfaMarkup() Drupal\simpletest\TestBase->run() simpletest_script_run_one_test('441', 'Drupal\rdf\Tests\CommentAttributesTest') NoticeCommentAttributesTest.php192Drupal\rdf\Tests\CommentAttributesTest->_testBasicCommentRdfaMarkup()
Trying to get property of non-objectDrupal\rdf\Tests\CommentAttributesTest->_testBasicCommentRdfaMarkup(NULL) Drupal\rdf\Tests\CommentAttributesTest->testCommentRdfaMarkup() Drupal\simpletest\TestBase->run() simpletest_script_run_one_test('441', 'Drupal\rdf\Tests\CommentAttributesTest') NoticeCommentAttributesTest.php192Drupal\rdf\Tests\CommentAttributesTest->_testBasicCommentRdfaMarkup()
Trying to get property of non-objectDrupal\rdf\Tests\CommentAttributesTest->_testBasicCommentRdfaMarkup(NULL) Drupal\rdf\Tests\CommentAttributesTest->testCommentRdfaMarkup() Drupal\simpletest\TestBase->run() simpletest_script_run_one_test('441', 'Drupal\rdf\Tests\CommentAttributesTest') NoticeCommentAttributesTest.php192Drupal\rdf\Tests\CommentAttributesTest->_testBasicCommentRdfaMarkup()
Trying to get property of non-objectDrupal\rdf\Tests\CommentAttributesTest->_testBasicCommentRdfaMarkup(NULL) Drupal\rdf\Tests\CommentAttributesTest->testCommentRdfaMarkup() Drupal\simpletest\TestBase->run() simpletest_script_run_one_test('441', 'Drupal\rdf\Tests\CommentAttributesTest') NoticeCommentAttributesTest.php192Drupal\rdf\Tests\CommentAttributesTest->_testBasicCommentRdfaMarkup()
Comment RDF type for comment found.OtherCommentAttributesTest.php182Drupal\rdf\Tests\CommentAttributesTest->_testBasicCommentRdfaMarkup()
Undefined offset: 0Drupal\rdf\Tests\CommentAttributesTest->_testBasicCommentRdfaMarkup(NULL) Drupal\rdf\Tests\CommentAttributesTest->testCommentRdfaMarkup() Drupal\simpletest\TestBase->run() simpletest_script_run_one_test('441', 'Drupal\rdf\Tests\CommentAttributesTest') NoticeCommentAttributesTest.php184Drupal\rdf\Tests\CommentAttributesTest->_testBasicCommentRdfaMarkup()
Trying to get property of non-objectDrupal\rdf\Tests\CommentAttributesTest->_testBasicCommentRdfaMarkup(NULL) Drupal\rdf\Tests\CommentAttributesTest->testCommentRdfaMarkup() Drupal\simpletest\TestBase->run() simpletest_script_run_one_test('441', 'Drupal\rdf\Tests\CommentAttributesTest') NoticeCommentAttributesTest.php184Drupal\rdf\Tests\CommentAttributesTest->_testBasicCommentRdfaMarkup()
Trying to get property of non-objectDrupal\rdf\Tests\CommentAttributesTest->_testBasicCommentRdfaMarkup(NULL) Drupal\rdf\Tests\CommentAttributesTest->testCommentRdfaMarkup() Drupal\simpletest\TestBase->run() simpletest_script_run_one_test('441', 'Drupal\rdf\Tests\CommentAttributesTest') NoticeCommentAttributesTest.php184Drupal\rdf\Tests\CommentAttributesTest->_testBasicCommentRdfaMarkup()
Trying to get property of non-objectDrupal\rdf\Tests\CommentAttributesTest->_testBasicCommentRdfaMarkup(NULL) Drupal\rdf\Tests\CommentAttributesTest->testCommentRdfaMarkup() Drupal\simpletest\TestBase->run() simpletest_script_run_one_test('441', 'Drupal\rdf\Tests\CommentAttributesTest') NoticeCommentAttributesTest.php184Drupal\rdf\Tests\CommentAttributesTest->_testBasicCommentRdfaMarkup()
RDFa markup for the date of the comment found.OtherCommentAttributesTest.php186Drupal\rdf\Tests\CommentAttributesTest->_testBasicCommentRdfaMarkup()
Undefined offset: 0Drupal\rdf\Tests\CommentAttributesTest->_testBasicCommentRdfaMarkup(NULL) Drupal\rdf\Tests\CommentAttributesTest->testCommentRdfaMarkup() Drupal\simpletest\TestBase->run() simpletest_script_run_one_test('441', 'Drupal\rdf\Tests\CommentAttributesTest') NoticeCommentAttributesTest.php190Drupal\rdf\Tests\CommentAttributesTest->_testBasicCommentRdfaMarkup()
RDFa markup for the comment author found.OtherCommentAttributesTest.php190Drupal\rdf\Tests\CommentAttributesTest->_testBasicCommentRdfaMarkup()
Undefined offset: 0Drupal\rdf\Tests\CommentAttributesTest->_testBasicCommentRdfaMarkup(NULL) Drupal\rdf\Tests\CommentAttributesTest->testCommentRdfaMarkup() Drupal\simpletest\TestBase->run() simpletest_script_run_one_test('441', 'Drupal\rdf\Tests\CommentAttributesTest') NoticeCommentAttributesTest.php192Drupal\rdf\Tests\CommentAttributesTest->_testBasicCommentRdfaMarkup()
Trying to get property of non-objectDrupal\rdf\Tests\CommentAttributesTest->_testBasicCommentRdfaMarkup(NULL) Drupal\rdf\Tests\CommentAttributesTest->testCommentRdfaMarkup() Drupal\simpletest\TestBase->run() simpletest_script_run_one_test('441', 'Drupal\rdf\Tests\CommentAttributesTest') NoticeCommentAttributesTest.php192Drupal\rdf\Tests\CommentAttributesTest->_testBasicCommentRdfaMarkup()
Trying to get property of non-objectDrupal\rdf\Tests\CommentAttributesTest->_testBasicCommentRdfaMarkup(NULL) Drupal\rdf\Tests\CommentAttributesTest->testCommentRdfaMarkup() Drupal\simpletest\TestBase->run() simpletest_script_run_one_test('441', 'Drupal\rdf\Tests\CommentAttributesTest') NoticeCommentAttributesTest.php192Drupal\rdf\Tests\CommentAttributesTest->_testBasicCommentRdfaMarkup()
Trying to get property of non-objectDrupal\rdf\Tests\CommentAttributesTest->_testBasicCommentRdfaMarkup(NULL) Drupal\rdf\Tests\CommentAttributesTest->testCommentRdfaMarkup() Drupal\simpletest\TestBase->run() simpletest_script_run_one_test('441', 'Drupal\rdf\Tests\CommentAttributesTest') NoticeCommentAttributesTest.php192Drupal\rdf\Tests\CommentAttributesTest->_testBasicCommentRdfaMarkup()
Comment subject posted.OtherCommentTestBase.php141Drupal\comment\Tests\CommentTestBase->postComment()
Comment body posted.OtherCommentTestBase.php143Drupal\comment\Tests\CommentTestBase->postComment()
Comment id found.OtherCommentTestBase.php144Drupal\comment\Tests\CommentTestBase->postComment()
Comment RDF type for comment found.OtherCommentAttributesTest.php182Drupal\rdf\Tests\CommentAttributesTest->_testBasicCommentRdfaMarkup()
Undefined offset: 0Drupal\rdf\Tests\CommentAttributesTest->_testBasicCommentRdfaMarkup(NULL, Array) Drupal\rdf\Tests\CommentAttributesTest->testCommentRdfaMarkup() Drupal\simpletest\TestBase->run() simpletest_script_run_one_test('441', 'Drupal\rdf\Tests\CommentAttributesTest') NoticeCommentAttributesTest.php184Drupal\rdf\Tests\CommentAttributesTest->_testBasicCommentRdfaMarkup()
Trying to get property of non-objectDrupal\rdf\Tests\CommentAttributesTest->_testBasicCommentRdfaMarkup(NULL, Array) Drupal\rdf\Tests\CommentAttributesTest->testCommentRdfaMarkup() Drupal\simpletest\TestBase->run() simpletest_script_run_one_test('441', 'Drupal\rdf\Tests\CommentAttributesTest') NoticeCommentAttributesTest.php184Drupal\rdf\Tests\CommentAttributesTest->_testBasicCommentRdfaMarkup()
Trying to get property of non-objectDrupal\rdf\Tests\CommentAttributesTest->_testBasicCommentRdfaMarkup(NULL, Array) Drupal\rdf\Tests\CommentAttributesTest->testCommentRdfaMarkup() Drupal\simpletest\TestBase->run() simpletest_script_run_one_test('441', 'Drupal\rdf\Tests\CommentAttributesTest') NoticeCommentAttributesTest.php184Drupal\rdf\Tests\CommentAttributesTest->_testBasicCommentRdfaMarkup()
Trying to get property of non-objectDrupal\rdf\Tests\CommentAttributesTest->_testBasicCommentRdfaMarkup(NULL, Array) Drupal\rdf\Tests\CommentAttributesTest->testCommentRdfaMarkup() Drupal\simpletest\TestBase->run() simpletest_script_run_one_test('441', 'Drupal\rdf\Tests\CommentAttributesTest') NoticeCommentAttributesTest.php184Drupal\rdf\Tests\CommentAttributesTest->_testBasicCommentRdfaMarkup()
RDFa markup for the date of the comment found.OtherCommentAttributesTest.php186Drupal\rdf\Tests\CommentAttributesTest->_testBasicCommentRdfaMarkup()
Undefined offset: 0Drupal\rdf\Tests\CommentAttributesTest->_testBasicCommentRdfaMarkup(NULL, Array) Drupal\rdf\Tests\CommentAttributesTest->testCommentRdfaMarkup() Drupal\simpletest\TestBase->run() simpletest_script_run_one_test('441', 'Drupal\rdf\Tests\CommentAttributesTest') NoticeCommentAttributesTest.php190Drupal\rdf\Tests\CommentAttributesTest->_testBasicCommentRdfaMarkup()
RDFa markup for the comment author found.OtherCommentAttributesTest.php190Drupal\rdf\Tests\CommentAttributesTest->_testBasicCommentRdfaMarkup()
Undefined offset: 0Drupal\rdf\Tests\CommentAttributesTest->_testBasicCommentRdfaMarkup(NULL, Array) Drupal\rdf\Tests\CommentAttributesTest->testCommentRdfaMarkup() Drupal\simpletest\TestBase->run() simpletest_script_run_one_test('441', 'Drupal\rdf\Tests\CommentAttributesTest') NoticeCommentAttributesTest.php192Drupal\rdf\Tests\CommentAttributesTest->_testBasicCommentRdfaMarkup()
Trying to get property of non-objectDrupal\rdf\Tests\CommentAttributesTest->_testBasicCommentRdfaMarkup(NULL, Array) Drupal\rdf\Tests\CommentAttributesTest->testCommentRdfaMarkup() Drupal\simpletest\TestBase->run() simpletest_script_run_one_test('441', 'Drupal\rdf\Tests\CommentAttributesTest') NoticeCommentAttributesTest.php192Drupal\rdf\Tests\CommentAttributesTest->_testBasicCommentRdfaMarkup()
Trying to get property of non-objectDrupal\rdf\Tests\CommentAttributesTest->_testBasicCommentRdfaMarkup(NULL, Array) Drupal\rdf\Tests\CommentAttributesTest->testCommentRdfaMarkup() Drupal\simpletest\TestBase->run() simpletest_script_run_one_test('441', 'Drupal\rdf\Tests\CommentAttributesTest') NoticeCommentAttributesTest.php192Drupal\rdf\Tests\CommentAttributesTest->_testBasicCommentRdfaMarkup()
Trying to get property of non-objectDrupal\rdf\Tests\CommentAttributesTest->_testBasicCommentRdfaMarkup(NULL, Array) Drupal\rdf\Tests\CommentAttributesTest->testCommentRdfaMarkup() Drupal\simpletest\TestBase->run() simpletest_script_run_one_test('441', 'Drupal\rdf\Tests\CommentAttributesTest') NoticeCommentAttributesTest.php192Drupal\rdf\Tests\CommentAttributesTest->_testBasicCommentRdfaMarkup()
RDFa markup for the homepage of anonymous user found.OtherCommentAttributesTest.php127Drupal\rdf\Tests\CommentAttributesTest->testCommentRdfaMarkup()
Comment RDF type for comment found.OtherCommentAttributesTest.php182Drupal\rdf\Tests\CommentAttributesTest->_testBasicCommentRdfaMarkup()
Undefined offset: 0Drupal\rdf\Tests\CommentAttributesTest->_testBasicCommentRdfaMarkup(NULL, Array) Drupal\rdf\Tests\CommentAttributesTest->testCommentRdfaMarkup() Drupal\simpletest\TestBase->run() simpletest_script_run_one_test('441', 'Drupal\rdf\Tests\CommentAttributesTest') NoticeCommentAttributesTest.php184Drupal\rdf\Tests\CommentAttributesTest->_testBasicCommentRdfaMarkup()
Trying to get property of non-objectDrupal\rdf\Tests\CommentAttributesTest->_testBasicCommentRdfaMarkup(NULL, Array) Drupal\rdf\Tests\CommentAttributesTest->testCommentRdfaMarkup() Drupal\simpletest\TestBase->run() simpletest_script_run_one_test('441', 'Drupal\rdf\Tests\CommentAttributesTest') NoticeCommentAttributesTest.php184Drupal\rdf\Tests\CommentAttributesTest->_testBasicCommentRdfaMarkup()
Trying to get property of non-objectDrupal\rdf\Tests\CommentAttributesTest->_testBasicCommentRdfaMarkup(NULL, Array) Drupal\rdf\Tests\CommentAttributesTest->testCommentRdfaMarkup() Drupal\simpletest\TestBase->run() simpletest_script_run_one_test('441', 'Drupal\rdf\Tests\CommentAttributesTest') NoticeCommentAttributesTest.php184Drupal\rdf\Tests\CommentAttributesTest->_testBasicCommentRdfaMarkup()
Trying to get property of non-objectDrupal\rdf\Tests\CommentAttributesTest->_testBasicCommentRdfaMarkup(NULL, Array) Drupal\rdf\Tests\CommentAttributesTest->testCommentRdfaMarkup() Drupal\simpletest\TestBase->run() simpletest_script_run_one_test('441', 'Drupal\rdf\Tests\CommentAttributesTest') NoticeCommentAttributesTest.php184Drupal\rdf\Tests\CommentAttributesTest->_testBasicCommentRdfaMarkup()
RDFa markup for the date of the comment found.OtherCommentAttributesTest.php186Drupal\rdf\Tests\CommentAttributesTest->_testBasicCommentRdfaMarkup()
Undefined offset: 0Drupal\rdf\Tests\CommentAttributesTest->_testBasicCommentRdfaMarkup(NULL, Array) Drupal\rdf\Tests\CommentAttributesTest->testCommentRdfaMarkup() Drupal\simpletest\TestBase->run() simpletest_script_run_one_test('441', 'Drupal\rdf\Tests\CommentAttributesTest') NoticeCommentAttributesTest.php190Drupal\rdf\Tests\CommentAttributesTest->_testBasicCommentRdfaMarkup()
RDFa markup for the comment author found.OtherCommentAttributesTest.php190Drupal\rdf\Tests\CommentAttributesTest->_testBasicCommentRdfaMarkup()
Undefined offset: 0Drupal\rdf\Tests\CommentAttributesTest->_testBasicCommentRdfaMarkup(NULL, Array) Drupal\rdf\Tests\CommentAttributesTest->testCommentRdfaMarkup() Drupal\simpletest\TestBase->run() simpletest_script_run_one_test('441', 'Drupal\rdf\Tests\CommentAttributesTest') NoticeCommentAttributesTest.php192Drupal\rdf\Tests\CommentAttributesTest->_testBasicCommentRdfaMarkup()
Trying to get property of non-objectDrupal\rdf\Tests\CommentAttributesTest->_testBasicCommentRdfaMarkup(NULL, Array) Drupal\rdf\Tests\CommentAttributesTest->testCommentRdfaMarkup() Drupal\simpletest\TestBase->run() simpletest_script_run_one_test('441', 'Drupal\rdf\Tests\CommentAttributesTest') NoticeCommentAttributesTest.php192Drupal\rdf\Tests\CommentAttributesTest->_testBasicCommentRdfaMarkup()
Trying to get property of non-objectDrupal\rdf\Tests\CommentAttributesTest->_testBasicCommentRdfaMarkup(NULL, Array) Drupal\rdf\Tests\CommentAttributesTest->testCommentRdfaMarkup() Drupal\simpletest\TestBase->run() simpletest_script_run_one_test('441', 'Drupal\rdf\Tests\CommentAttributesTest') NoticeCommentAttributesTest.php192Drupal\rdf\Tests\CommentAttributesTest->_testBasicCommentRdfaMarkup()
Trying to get property of non-objectDrupal\rdf\Tests\CommentAttributesTest->_testBasicCommentRdfaMarkup(NULL, Array) Drupal\rdf\Tests\CommentAttributesTest->testCommentRdfaMarkup() Drupal\simpletest\TestBase->run() simpletest_script_run_one_test('441', 'Drupal\rdf\Tests\CommentAttributesTest') NoticeCommentAttributesTest.php192Drupal\rdf\Tests\CommentAttributesTest->_testBasicCommentRdfaMarkup()
RDFa markup for the homepage of anonymous user found.OtherCommentAttributesTest.php138Drupal\rdf\Tests\CommentAttributesTest->testCommentRdfaMarkup()
The test did not complete due to a fatal error.Completion checkCommentAttributesTest.php147Drupal\rdf\Tests\CommentAttributesTest->testCommentReplyOfRdfaMarkup()
Comment subject posted.OtherCommentTestBase.php141Drupal\comment\Tests\CommentTestBase->postComment()
Comment body posted.OtherCommentTestBase.php143Drupal\comment\Tests\CommentTestBase->postComment()
Comment id found.OtherCommentTestBase.php144Drupal\comment\Tests\CommentTestBase->postComment()
RDFa markup referring to the node is present.OtherCommentAttributesTest.php154Drupal\rdf\Tests\CommentAttributesTest->testCommentReplyOfRdfaMarkup()
ExpandDrupal\rdf\Tests\TrackerAttributesTest2940
MessageGroupFilenameLineFunctionStatus
Num replies property and content attributes found on Anonymous user content.OtherTrackerAttributesTest.php127Drupal\rdf\Tests\TrackerAttributesTest->_testBasicTrackerRdfaMarkup()
Latest activity date found when there are comments on Anonymous user content. Latest activity date content is correct.OtherTrackerAttributesTest.php137Drupal\rdf\Tests\TrackerAttributesTest->_testBasicTrackerRdfaMarkup()
Num replies property and content attributes found on Registered user content.OtherTrackerAttributesTest.php127Drupal\rdf\Tests\TrackerAttributesTest->_testBasicTrackerRdfaMarkup()
Latest activity date found when there are comments on Registered user content. Latest activity date content is correct.OtherTrackerAttributesTest.php137Drupal\rdf\Tests\TrackerAttributesTest->_testBasicTrackerRdfaMarkup()
ExpandDrupal\search\Tests\SearchCommentCountToggleTest2920
MessageGroupFilenameLineFunctionStatus
Non-empty comment count displays for nodes with comment status set to OpenOtherSearchCommentCountToggleTest.php89Drupal\search\Tests\SearchCommentCountToggleTest->testSearchCommentCountToggle()
Non-empty comment count displays for nodes with comment status set to ClosedOtherSearchCommentCountToggleTest.php99Drupal\search\Tests\SearchCommentCountToggleTest->testSearchCommentCountToggle()
ExpandDrupal\search\Tests\SearchCommentTest174190
MessageGroupFilenameLineFunctionStatus
Node found in search results.OtherSearchCommentTest.php93Drupal\search\Tests\SearchCommentTest->testSearchResultsComment()
Comment subject found in search results.OtherSearchCommentTest.php94Drupal\search\Tests\SearchCommentTest->testSearchResultsComment()
Node found in search results.OtherSearchCommentTest.php101Drupal\search\Tests\SearchCommentTest->testSearchResultsComment()
Comment body text found in search results.OtherSearchCommentTest.php104Drupal\search\Tests\SearchCommentTest->testSearchResultsComment()
"fY3X8mv0" foundOtherSearchCommentTest.php147Drupal\search\Tests\SearchCommentTest->testSearchResultsCommentAccess()
"Test comment subject" foundOtherSearchCommentTest.php147Drupal\search\Tests\SearchCommentTest->testSearchResultsCommentAccess()
Anon user has search permission and access comments permission, comments should be indexedOtherSearchCommentTest.php147Drupal\search\Tests\SearchCommentTest->testSearchResultsCommentAccess()
"fY3X8mv0" foundOtherSearchCommentTest.php159Drupal\search\Tests\SearchCommentTest->testSearchResultsCommentAccess()
"Test comment subject" foundOtherSearchCommentTest.php159Drupal\search\Tests\SearchCommentTest->testSearchResultsCommentAccess()
Admin user has search permission and access comments permission, comments should be indexedOtherSearchCommentTest.php159Drupal\search\Tests\SearchCommentTest->testSearchResultsCommentAccess()
"fY3X8mv0" foundOtherSearchCommentTest.php165Drupal\search\Tests\SearchCommentTest->testSearchResultsCommentAccess()
"Test comment subject" foundOtherSearchCommentTest.php165Drupal\search\Tests\SearchCommentTest->testSearchResultsCommentAccess()
Authenticated user has search permission and access comments permission, comments should be indexedOtherSearchCommentTest.php165Drupal\search\Tests\SearchCommentTest->testSearchResultsCommentAccess()
"fY3X8mv0" foundOtherSearchCommentTest.php171Drupal\search\Tests\SearchCommentTest->testSearchResultsCommentAccess()
"Test comment subject" foundOtherSearchCommentTest.php171Drupal\search\Tests\SearchCommentTest->testSearchResultsCommentAccess()
Admin user has search permission and no access comments permission, but comments should be indexed because admin user inherits authenticated user's permission to access commentsOtherSearchCommentTest.php171Drupal\search\Tests\SearchCommentTest->testSearchResultsCommentAccess()
"fY3X8mv0" foundOtherSearchCommentTest.php177Drupal\search\Tests\SearchCommentTest->testSearchResultsCommentAccess()
"Test comment subject" foundOtherSearchCommentTest.php177Drupal\search\Tests\SearchCommentTest->testSearchResultsCommentAccess()
Admin user has access comments permission and no search permission, but comments should be indexed because admin user inherits authenticated user's permission to searchOtherSearchCommentTest.php177Drupal\search\Tests\SearchCommentTest->testSearchResultsCommentAccess()
ExpandDrupal\search\Tests\SearchRankingTest5810
MessageGroupFilenameLineFunctionStatus
Search ranking "comments" order.OtherSearchRankingTest.php101Drupal\search\Tests\SearchRankingTest->testRankings()
ExpandDrupal\system\Tests\Entity\EntityApiTest801
MessageGroupFilenameLineFunctionStatus
Drupal\Core\Entity\EntityStorageException: Field value is unknown. in Drupal\Core\Entity\DatabaseStorageControllerNG->save() (line 321 of /var/lib/drupaltestbot/sites/default/files/checkout/core/lib/Drupal/Core/Entity/DatabaseStorageControllerNG.php). Drupal\Core\Entity\DatabaseStorageControllerNG->save(Object) Drupal\Core\Entity\Entity->save() Drupal\system\Tests\Entity\EntityApiTest->assertCRUD('entity_test_mul', Object) Drupal\system\Tests\Entity\EntityApiTest->testCRUD() Drupal\simpletest\TestBase->run() simpletest_script_run_one_test('171', 'Drupal\system\Tests\Entity\EntityApiTest') Uncaught exceptionDatabaseStorageControllerNG.php321Drupal\Core\Entity\DatabaseStorageControllerNG->save()
ExpandDrupal\system\Tests\Entity\EntityFieldTest64103
MessageGroupFilenameLineFunctionStatus
Drupal\Core\Entity\EntityStorageException: Field value is unknown. in Drupal\Core\Entity\DatabaseStorageControllerNG->save() (line 321 of /var/lib/drupaltestbot/sites/default/files/checkout/core/lib/Drupal/Core/Entity/DatabaseStorageControllerNG.php). Drupal\Core\Entity\DatabaseStorageControllerNG->save(Object) Drupal\Core\Entity\Entity->save() Drupal\system\Tests\Entity\EntityFieldTest->assertSave('entity_test_mul') Drupal\system\Tests\Entity\EntityFieldTest->testSave() Drupal\simpletest\TestBase->run() simpletest_script_run_one_test('173', 'Drupal\system\Tests\Entity\EntityFieldTest') Uncaught exceptionDatabaseStorageControllerNG.php321Drupal\Core\Entity\DatabaseStorageControllerNG->save()
Drupal\Core\Entity\EntityStorageException: Field value is unknown. in Drupal\Core\Entity\DatabaseStorageControllerNG->save() (line 321 of /var/lib/drupaltestbot/sites/default/files/checkout/core/lib/Drupal/Core/Entity/DatabaseStorageControllerNG.php). Drupal\Core\Entity\DatabaseStorageControllerNG->save(Object) Drupal\Core\Entity\Entity->save() Drupal\system\Tests\Entity\EntityFieldTest->assertDataStructureInterfaces('entity_test_mul') Drupal\system\Tests\Entity\EntityFieldTest->testDataStructureInterfaces() Drupal\simpletest\TestBase->run() simpletest_script_run_one_test('173', 'Drupal\system\Tests\Entity\EntityFieldTest') Uncaught exceptionDatabaseStorageControllerNG.php321Drupal\Core\Entity\DatabaseStorageControllerNG->save()
Drupal\Core\Entity\EntityStorageException: Field value is unknown. in Drupal\Core\Entity\DatabaseStorageControllerNG->save() (line 321 of /var/lib/drupaltestbot/sites/default/files/checkout/core/lib/Drupal/Core/Entity/DatabaseStorageControllerNG.php). Drupal\Core\Entity\DatabaseStorageControllerNG->save(Object) Drupal\Core\Entity\Entity->save() Drupal\system\Tests\Entity\EntityFieldTest->assertComputedProperties('entity_test_mul') Drupal\system\Tests\Entity\EntityFieldTest->testComputedProperties() Drupal\simpletest\TestBase->run() simpletest_script_run_one_test('173', 'Drupal\system\Tests\Entity\EntityFieldTest') Uncaught exceptionDatabaseStorageControllerNG.php321Drupal\Core\Entity\DatabaseStorageControllerNG->save()
ExpandDrupal\system\Tests\Entity\EntityFormTest3020
MessageGroupFilenameLineFunctionStatus
The test did not complete due to a fatal error.Completion checkEntityFormTest.php41Drupal\system\Tests\Entity\EntityFormTest->testFormCRUD()
entity_test_mul: Entity found in the database.OtherEntityFormTest.php44Drupal\system\Tests\Entity\EntityFormTest->testFormCRUD()
ExpandDrupal\system\Tests\Entity\EntityRevisionsTest3101
MessageGroupFilenameLineFunctionStatus
Drupal\Core\Entity\EntityStorageException: Field value is unknown. in Drupal\Core\Entity\DatabaseStorageControllerNG->save() (line 321 of /var/lib/drupaltestbot/sites/default/files/checkout/core/lib/Drupal/Core/Entity/DatabaseStorageControllerNG.php). Drupal\Core\Entity\DatabaseStorageControllerNG->save(Object) Drupal\Core\Entity\Entity->save() Drupal\system\Tests\Entity\EntityRevisionsTest->assertRevisions('entity_test_mulrev') Drupal\system\Tests\Entity\EntityRevisionsTest->testRevisions() Drupal\simpletest\TestBase->run() simpletest_script_run_one_test('177', 'Drupal\system\Tests\Entity\EntityRevisionsTest') Uncaught exceptionDatabaseStorageControllerNG.php321Drupal\Core\Entity\DatabaseStorageControllerNG->save()
ExpandDrupal\system\Tests\Entity\EntityTranslationTest7801
MessageGroupFilenameLineFunctionStatus
Drupal\Core\Entity\EntityStorageException: Field value is unknown. in Drupal\Core\Entity\DatabaseStorageControllerNG->save() (line 321 of /var/lib/drupaltestbot/sites/default/files/checkout/core/lib/Drupal/Core/Entity/DatabaseStorageControllerNG.php). Drupal\Core\Entity\DatabaseStorageControllerNG->save(Object) Drupal\Core\Entity\Entity->save() Drupal\system\Tests\Entity\EntityTranslationTest->assertMultilingualProperties('entity_test_mul') Drupal\system\Tests\Entity\EntityTranslationTest->testMultilingualProperties() Drupal\simpletest\TestBase->run() simpletest_script_run_one_test('179', 'Drupal\system\Tests\Entity\EntityTranslationTest') Uncaught exceptionDatabaseStorageControllerNG.php321Drupal\Core\Entity\DatabaseStorageControllerNG->save()
ExpandDrupal\system\Tests\Entity\EntityUUIDTest2001
MessageGroupFilenameLineFunctionStatus
Drupal\Core\Entity\EntityStorageException: Field value is unknown. in Drupal\Core\Entity\DatabaseStorageControllerNG->save() (line 321 of /var/lib/drupaltestbot/sites/default/files/checkout/core/lib/Drupal/Core/Entity/DatabaseStorageControllerNG.php). Drupal\Core\Entity\DatabaseStorageControllerNG->save(Object) Drupal\Core\Entity\Entity->save() Drupal\system\Tests\Entity\EntityUUIDTest->assertCRUD('entity_test_mul') Drupal\system\Tests\Entity\EntityUUIDTest->testCRUD() Drupal\simpletest\TestBase->run() simpletest_script_run_one_test('180', 'Drupal\system\Tests\Entity\EntityUUIDTest') Uncaught exceptionDatabaseStorageControllerNG.php321Drupal\Core\Entity\DatabaseStorageControllerNG->save()
ExpandDrupal\system\Tests\Serialization\EntitySerializationTest110
MessageGroupFilenameLineFunctionStatus
The test did not complete due to a fatal error.Completion checkEntitySerializationTest.php69Drupal\system\Tests\Serialization\EntitySerializationTest->testNormalize()
ExpandDrupal\system\Tests\Theme\EntityFilteringThemeTest810
MessageGroupFilenameLineFunctionStatus
The test did not complete due to a fatal error.Completion checkEntityFilteringThemeTest.php122Drupal\system\Tests\Theme\EntityFilteringThemeTest->testThemedEntity()
ExpandDrupal\system\Tests\Upgrade\LanguageUpgradePathTest18330
MessageGroupFilenameLineFunctionStatus
Node 50 displayed after update.OtherLanguageUpgradePathTest.php50Drupal\system\Tests\Upgrade\LanguageUpgradePathTest->testLanguageUpgrade()
Comment 1 displayed after update.OtherLanguageUpgradePathTest.php51Drupal\system\Tests\Upgrade\LanguageUpgradePathTest->testLanguageUpgrade()
Comment 2 displayed after update.OtherLanguageUpgradePathTest.php52Drupal\system\Tests\Upgrade\LanguageUpgradePathTest->testLanguageUpgrade()
ExpandDrupal\tracker\Tests\TrackerTest22180
MessageGroupFilenameLineFunctionStatus
Nodes that the user has commented on appear in the user's tracker listing.OtherTrackerTest.php121Drupal\tracker\Tests\TrackerTest->testTrackerUser()
Failed to set field status to 0OtherTrackerTest.php126Drupal\tracker\Tests\TrackerTest->testTrackerUser()
Found the Save buttonOtherTrackerTest.php126Drupal\tracker\Tests\TrackerTest->testTrackerUser()
Found the requested form fields at comment/1/editOtherTrackerTest.php126Drupal\tracker\Tests\TrackerTest->testTrackerUser()
New comments are counted on the tracker listing pages.OtherTrackerTest.php180Drupal\tracker\Tests\TrackerTest->testTrackerNewComments()
New comments are counted on the tracker listing pages.OtherTrackerTest.php195Drupal\tracker\Tests\TrackerTest->testTrackerNewComments()
New comment is counted on the tracker listing pages.OtherTrackerTest.php242Drupal\tracker\Tests\TrackerTest->testTrackerCronIndexing()
New comment is counted on the tracker listing pages.OtherTrackerTest.php252Drupal\tracker\Tests\TrackerTest->testTrackerCronIndexing()
ExpandDrupal\translation_entity\Tests\EntityTestTranslationUITest901
MessageGroupFilenameLineFunctionStatus
Drupal\Core\Entity\EntityStorageException: Field value is unknown. in Drupal\Core\Entity\DatabaseStorageControllerNG->save() (line 321 of /var/lib/drupaltestbot/sites/default/files/checkout/core/lib/Drupal/Core/Entity/DatabaseStorageControllerNG.php). Drupal\Core\Entity\DatabaseStorageControllerNG->save(Object) Drupal\Core\Entity\Entity->save() Drupal\translation_entity\Tests\EntityTranslationUITest->createEntity(Array, 'en') Drupal\translation_entity\Tests\EntityTranslationUITest->testTranslationUI() Drupal\simpletest\TestBase->run() simpletest_script_run_one_test('188', 'Drupal\translation_entity\Tests\EntityTestTranslationUITest') Uncaught exceptionDatabaseStorageControllerNG.php321Drupal\Core\Entity\DatabaseStorageControllerNG->save()
ExpandDrupal\views\Tests\DefaultViewsTest210
MessageGroupFilenameLineFunctionStatus
The test did not complete due to a fatal error.Completion checkDefaultViewsTest.php120Drupal\views\Tests\DefaultViewsTest->testDefaultViews()
ExpandDrupal\views\Tests\EntityReference\SelectionTest210
MessageGroupFilenameLineFunctionStatus
The test did not complete due to a fatal error.Completion checkSelectionTest.php30Drupal\views\Tests\EntityReference\SelectionTest->testSelectionHandler()

All

Test namePassFailException
LeafDrupal\action\Tests\BulkFormTest3300
LeafDrupal\action\Tests\ConfigurationTest3900
LeafDrupal\action\Tests\LoopTest2100
LeafDrupal\aggregator\Tests\AddFeedTest7100
LeafDrupal\aggregator\Tests\AggregatorConfigurationTest2000
LeafDrupal\aggregator\Tests\AggregatorCronTest5500
LeafDrupal\aggregator\Tests\AggregatorRenderingTest22500
LeafDrupal\aggregator\Tests\CategorizeFeedItemTest6100
LeafDrupal\aggregator\Tests\CategorizeFeedTest2100
LeafDrupal\aggregator\Tests\FeedParserTest7200
LeafDrupal\aggregator\Tests\ImportOpmlTest7300
LeafDrupal\aggregator\Tests\RemoveFeedItemTest27000
LeafDrupal\aggregator\Tests\RemoveFeedTest2500
LeafDrupal\aggregator\Tests\UpdateFeedItemTest6500
LeafDrupal\aggregator\Tests\UpdateFeedTest7600
LeafDrupal\ban\Tests\IpAddressBlockingTest4300
LeafDrupal\block\Tests\BlockAdminThemeTest1900
LeafDrupal\block\Tests\BlockCacheTest21500
LeafDrupal\block\Tests\BlockHiddenRegionTest2300
LeafDrupal\block\Tests\BlockHtmlIdTest1700
LeafDrupal\block\Tests\BlockInvalidRegionTest2900
LeafDrupal\block\Tests\BlockLanguageTest5500
LeafDrupal\block\Tests\BlockLibrarySearchTest1900
LeafDrupal\block\Tests\BlockTemplateSuggestionsUnitTest300
LeafDrupal\block\Tests\BlockTest34900
LeafDrupal\block\Tests\BlockUiTest900
LeafDrupal\block\Tests\NewDefaultThemeBlocksTest3200
LeafDrupal\block\Tests\NonDefaultBlockAdminTest1200
LeafDrupal\book\Tests\BookTest50700
LeafDrupal\breakpoint\Tests\BreakpointAPITest600
LeafDrupal\breakpoint\Tests\BreakpointCRUDTest2100
LeafDrupal\breakpoint\Tests\BreakpointGroupAPITest400
LeafDrupal\breakpoint\Tests\BreakpointGroupCRUDTest1200
LeafDrupal\breakpoint\Tests\BreakpointMediaQueryTest6300
LeafDrupal\breakpoint\Tests\BreakpointThemeTest2300
LeafDrupal\color\Tests\ColorTest8700
LeafDrupal\comment\Tests\CommentActionsTest3000
LeafDrupal\comment\Tests\CommentAnonymousTest16300
LeafDrupal\comment\Tests\CommentApprovalTest15200
LeafDrupal\comment\Tests\CommentBlockTest11300
LeafDrupal\comment\Tests\CommentContentRebuildTest3300
LeafDrupal\comment\Tests\CommentCSSTest50100
LeafDrupal\comment\Tests\CommentFieldsTest10700
LeafDrupal\comment\Tests\CommentInterfaceTest25100
ExpandDrupal\comment\Tests\CommentLanguageTest601228
MessageGroupFilenameLineFunctionStatus
array_flip(): Can only flip STRING and INTEGER values!array_flip(Array) Drupal\Core\Entity\DatabaseStorageController->load(Array) entity_load_multiple('comment', Array, ) entity_load('comment', ) comment_load() Drupal\comment\Tests\CommentLanguageTest->testCommentLanguage() Drupal\simpletest\TestBase->run() simpletest_script_run_one_test('71', 'Drupal\comment\Tests\CommentLanguageTest') WarningDatabaseStorageController.php182Drupal\Core\Entity\DatabaseStorageController->load()
Trying to get property of non-objectDrupal\comment\Tests\CommentLanguageTest->testCommentLanguage() Drupal\simpletest\TestBase->run() simpletest_script_run_one_test('71', 'Drupal\comment\Tests\CommentLanguageTest') NoticeCommentLanguageTest.php130Drupal\comment\Tests\CommentLanguageTest->testCommentLanguage()
Trying to get property of non-objectDrupal\comment\Tests\CommentLanguageTest->testCommentLanguage() Drupal\simpletest\TestBase->run() simpletest_script_run_one_test('71', 'Drupal\comment\Tests\CommentLanguageTest') NoticeCommentLanguageTest.php130Drupal\comment\Tests\CommentLanguageTest->testCommentLanguage()
Trying to get property of non-objectDrupal\comment\Tests\CommentLanguageTest->testCommentLanguage() Drupal\simpletest\TestBase->run() simpletest_script_run_one_test('71', 'Drupal\comment\Tests\CommentLanguageTest') NoticeCommentLanguageTest.php131Drupal\comment\Tests\CommentLanguageTest->testCommentLanguage()
Trying to get property of non-objectDrupal\comment\Tests\CommentLanguageTest->testCommentLanguage() Drupal\simpletest\TestBase->run() simpletest_script_run_one_test('71', 'Drupal\comment\Tests\CommentLanguageTest') NoticeCommentLanguageTest.php131Drupal\comment\Tests\CommentLanguageTest->testCommentLanguage()
The comment posted with content language en and belonging to the node with language en has language OtherCommentLanguageTest.php131Drupal\comment\Tests\CommentLanguageTest->testCommentLanguage()
Trying to get property of non-objectDrupal\comment\Tests\CommentLanguageTest->testCommentLanguage() Drupal\simpletest\TestBase->run() simpletest_script_run_one_test('71', 'Drupal\comment\Tests\CommentLanguageTest') NoticeCommentLanguageTest.php132Drupal\comment\Tests\CommentLanguageTest->testCommentLanguage()
Trying to get property of non-objectDrupal\comment\Tests\CommentLanguageTest->testCommentLanguage() Drupal\simpletest\TestBase->run() simpletest_script_run_one_test('71', 'Drupal\comment\Tests\CommentLanguageTest') NoticeCommentLanguageTest.php132Drupal\comment\Tests\CommentLanguageTest->testCommentLanguage()
Comment body correctly stored.OtherCommentLanguageTest.php132Drupal\comment\Tests\CommentLanguageTest->testCommentLanguage()
array_flip(): Can only flip STRING and INTEGER values!array_flip(Array) Drupal\Core\Entity\DatabaseStorageController->load(Array) entity_load_multiple('comment', Array, ) entity_load('comment', ) comment_load() Drupal\comment\Tests\CommentLanguageTest->testCommentLanguage() Drupal\simpletest\TestBase->run() simpletest_script_run_one_test('71', 'Drupal\comment\Tests\CommentLanguageTest') WarningDatabaseStorageController.php182Drupal\Core\Entity\DatabaseStorageController->load()
Trying to get property of non-objectDrupal\comment\Tests\CommentLanguageTest->testCommentLanguage() Drupal\simpletest\TestBase->run() simpletest_script_run_one_test('71', 'Drupal\comment\Tests\CommentLanguageTest') NoticeCommentLanguageTest.php130Drupal\comment\Tests\CommentLanguageTest->testCommentLanguage()
Trying to get property of non-objectDrupal\comment\Tests\CommentLanguageTest->testCommentLanguage() Drupal\simpletest\TestBase->run() simpletest_script_run_one_test('71', 'Drupal\comment\Tests\CommentLanguageTest') NoticeCommentLanguageTest.php130Drupal\comment\Tests\CommentLanguageTest->testCommentLanguage()
Trying to get property of non-objectDrupal\comment\Tests\CommentLanguageTest->testCommentLanguage() Drupal\simpletest\TestBase->run() simpletest_script_run_one_test('71', 'Drupal\comment\Tests\CommentLanguageTest') NoticeCommentLanguageTest.php131Drupal\comment\Tests\CommentLanguageTest->testCommentLanguage()
Trying to get property of non-objectDrupal\comment\Tests\CommentLanguageTest->testCommentLanguage() Drupal\simpletest\TestBase->run() simpletest_script_run_one_test('71', 'Drupal\comment\Tests\CommentLanguageTest') NoticeCommentLanguageTest.php131Drupal\comment\Tests\CommentLanguageTest->testCommentLanguage()
The comment posted with content language fr and belonging to the node with language en has language OtherCommentLanguageTest.php131Drupal\comment\Tests\CommentLanguageTest->testCommentLanguage()
Trying to get property of non-objectDrupal\comment\Tests\CommentLanguageTest->testCommentLanguage() Drupal\simpletest\TestBase->run() simpletest_script_run_one_test('71', 'Drupal\comment\Tests\CommentLanguageTest') NoticeCommentLanguageTest.php132Drupal\comment\Tests\CommentLanguageTest->testCommentLanguage()
Trying to get property of non-objectDrupal\comment\Tests\CommentLanguageTest->testCommentLanguage() Drupal\simpletest\TestBase->run() simpletest_script_run_one_test('71', 'Drupal\comment\Tests\CommentLanguageTest') NoticeCommentLanguageTest.php132Drupal\comment\Tests\CommentLanguageTest->testCommentLanguage()
Comment body correctly stored.OtherCommentLanguageTest.php132Drupal\comment\Tests\CommentLanguageTest->testCommentLanguage()
array_flip(): Can only flip STRING and INTEGER values!array_flip(Array) Drupal\Core\Entity\DatabaseStorageController->load(Array) entity_load_multiple('comment', Array, ) entity_load('comment', ) comment_load() Drupal\comment\Tests\CommentLanguageTest->testCommentLanguage() Drupal\simpletest\TestBase->run() simpletest_script_run_one_test('71', 'Drupal\comment\Tests\CommentLanguageTest') WarningDatabaseStorageController.php182Drupal\Core\Entity\DatabaseStorageController->load()
Trying to get property of non-objectDrupal\comment\Tests\CommentLanguageTest->testCommentLanguage() Drupal\simpletest\TestBase->run() simpletest_script_run_one_test('71', 'Drupal\comment\Tests\CommentLanguageTest') NoticeCommentLanguageTest.php130Drupal\comment\Tests\CommentLanguageTest->testCommentLanguage()
Trying to get property of non-objectDrupal\comment\Tests\CommentLanguageTest->testCommentLanguage() Drupal\simpletest\TestBase->run() simpletest_script_run_one_test('71', 'Drupal\comment\Tests\CommentLanguageTest') NoticeCommentLanguageTest.php130Drupal\comment\Tests\CommentLanguageTest->testCommentLanguage()
Trying to get property of non-objectDrupal\comment\Tests\CommentLanguageTest->testCommentLanguage() Drupal\simpletest\TestBase->run() simpletest_script_run_one_test('71', 'Drupal\comment\Tests\CommentLanguageTest') NoticeCommentLanguageTest.php131Drupal\comment\Tests\CommentLanguageTest->testCommentLanguage()
Trying to get property of non-objectDrupal\comment\Tests\CommentLanguageTest->testCommentLanguage() Drupal\simpletest\TestBase->run() simpletest_script_run_one_test('71', 'Drupal\comment\Tests\CommentLanguageTest') NoticeCommentLanguageTest.php131Drupal\comment\Tests\CommentLanguageTest->testCommentLanguage()
The comment posted with content language en and belonging to the node with language fr has language OtherCommentLanguageTest.php131Drupal\comment\Tests\CommentLanguageTest->testCommentLanguage()
Trying to get property of non-objectDrupal\comment\Tests\CommentLanguageTest->testCommentLanguage() Drupal\simpletest\TestBase->run() simpletest_script_run_one_test('71', 'Drupal\comment\Tests\CommentLanguageTest') NoticeCommentLanguageTest.php132Drupal\comment\Tests\CommentLanguageTest->testCommentLanguage()
Trying to get property of non-objectDrupal\comment\Tests\CommentLanguageTest->testCommentLanguage() Drupal\simpletest\TestBase->run() simpletest_script_run_one_test('71', 'Drupal\comment\Tests\CommentLanguageTest') NoticeCommentLanguageTest.php132Drupal\comment\Tests\CommentLanguageTest->testCommentLanguage()
Comment body correctly stored.OtherCommentLanguageTest.php132Drupal\comment\Tests\CommentLanguageTest->testCommentLanguage()
array_flip(): Can only flip STRING and INTEGER values!array_flip(Array) Drupal\Core\Entity\DatabaseStorageController->load(Array) entity_load_multiple('comment', Array, ) entity_load('comment', ) comment_load() Drupal\comment\Tests\CommentLanguageTest->testCommentLanguage() Drupal\simpletest\TestBase->run() simpletest_script_run_one_test('71', 'Drupal\comment\Tests\CommentLanguageTest') WarningDatabaseStorageController.php182Drupal\Core\Entity\DatabaseStorageController->load()
Trying to get property of non-objectDrupal\comment\Tests\CommentLanguageTest->testCommentLanguage() Drupal\simpletest\TestBase->run() simpletest_script_run_one_test('71', 'Drupal\comment\Tests\CommentLanguageTest') NoticeCommentLanguageTest.php130Drupal\comment\Tests\CommentLanguageTest->testCommentLanguage()
Trying to get property of non-objectDrupal\comment\Tests\CommentLanguageTest->testCommentLanguage() Drupal\simpletest\TestBase->run() simpletest_script_run_one_test('71', 'Drupal\comment\Tests\CommentLanguageTest') NoticeCommentLanguageTest.php130Drupal\comment\Tests\CommentLanguageTest->testCommentLanguage()
Trying to get property of non-objectDrupal\comment\Tests\CommentLanguageTest->testCommentLanguage() Drupal\simpletest\TestBase->run() simpletest_script_run_one_test('71', 'Drupal\comment\Tests\CommentLanguageTest') NoticeCommentLanguageTest.php131Drupal\comment\Tests\CommentLanguageTest->testCommentLanguage()
Trying to get property of non-objectDrupal\comment\Tests\CommentLanguageTest->testCommentLanguage() Drupal\simpletest\TestBase->run() simpletest_script_run_one_test('71', 'Drupal\comment\Tests\CommentLanguageTest') NoticeCommentLanguageTest.php131Drupal\comment\Tests\CommentLanguageTest->testCommentLanguage()
The comment posted with content language fr and belonging to the node with language fr has language OtherCommentLanguageTest.php131Drupal\comment\Tests\CommentLanguageTest->testCommentLanguage()
Trying to get property of non-objectDrupal\comment\Tests\CommentLanguageTest->testCommentLanguage() Drupal\simpletest\TestBase->run() simpletest_script_run_one_test('71', 'Drupal\comment\Tests\CommentLanguageTest') NoticeCommentLanguageTest.php132Drupal\comment\Tests\CommentLanguageTest->testCommentLanguage()
Trying to get property of non-objectDrupal\comment\Tests\CommentLanguageTest->testCommentLanguage() Drupal\simpletest\TestBase->run() simpletest_script_run_one_test('71', 'Drupal\comment\Tests\CommentLanguageTest') NoticeCommentLanguageTest.php132Drupal\comment\Tests\CommentLanguageTest->testCommentLanguage()
Comment body correctly stored.OtherCommentLanguageTest.php132Drupal\comment\Tests\CommentLanguageTest->testCommentLanguage()
Raw "cZzfiMtS" foundOtherCommentLanguageTest.php140Drupal\comment\Tests\CommentLanguageTest->testCommentLanguage()
Raw "zI79fpfq" foundOtherCommentLanguageTest.php140Drupal\comment\Tests\CommentLanguageTest->testCommentLanguage()
Raw "pzs00SvQ" foundOtherCommentLanguageTest.php140Drupal\comment\Tests\CommentLanguageTest->testCommentLanguage()
Raw "s88loEcF" foundOtherCommentLanguageTest.php140Drupal\comment\Tests\CommentLanguageTest->testCommentLanguage()
ExpandDrupal\comment\Tests\CommentLinksTest109300
MessageGroupFilenameLineFunctionStatus
Changed environment:array ( 'authenticated' => false, 'comment count' => false, 'form' => 'below', 'user_register' => 'visitors', 'contact' => 'optional', 'comments' => 'open', 'access comments' => 0, 'post comments' => 0, 'skip comment approval' => 1, 'edit own comments' => 0, )DebugCommentLinksTest.php194Drupal\comment\Tests\CommentLinksTest->setEnvironment()
Changed environment:array ( 'authenticated' => true, 'comment count' => false, 'form' => 'below', 'user_register' => 'visitors', 'contact' => 'optional', 'comments' => 'open', 'access comments' => 0, 'post comments' => 0, 'skip comment approval' => 1, 'edit own comments' => 0, )DebugCommentLinksTest.php194Drupal\comment\Tests\CommentLinksTest->setEnvironment()
Changed environment:array ( 'authenticated' => false, 'comment count' => true, 'form' => 'below', 'user_register' => 'visitors', 'contact' => 'optional', 'comments' => 'open', 'access comments' => 0, 'post comments' => 0, 'skip comment approval' => 1, 'edit own comments' => 0, )DebugCommentLinksTest.php194Drupal\comment\Tests\CommentLinksTest->setEnvironment()
Changed environment:array ( 'authenticated' => true, 'comment count' => true, 'form' => 'below', 'user_register' => 'visitors', 'contact' => 'optional', 'comments' => 'open', 'access comments' => 0, 'post comments' => 0, 'skip comment approval' => 1, 'edit own comments' => 0, )DebugCommentLinksTest.php194Drupal\comment\Tests\CommentLinksTest->setEnvironment()
Changed environment:array ( 'authenticated' => false, 'comment count' => false, 'form' => 'below', 'user_register' => 'visitors', 'contact' => 'optional', 'comments' => 'open', 'access comments' => 1, 'post comments' => 0, 'skip comment approval' => 1, 'edit own comments' => 0, )DebugCommentLinksTest.php194Drupal\comment\Tests\CommentLinksTest->setEnvironment()
Changed environment:array ( 'authenticated' => true, 'comment count' => false, 'form' => 'below', 'user_register' => 'visitors', 'contact' => 'optional', 'comments' => 'open', 'access comments' => 1, 'post comments' => 0, 'skip comment approval' => 1, 'edit own comments' => 0, )DebugCommentLinksTest.php194Drupal\comment\Tests\CommentLinksTest->setEnvironment()
Changed environment:array ( 'authenticated' => false, 'comment count' => true, 'form' => 'below', 'user_register' => 'visitors', 'contact' => 'optional', 'comments' => 'open', 'access comments' => 1, 'post comments' => 0, 'skip comment approval' => 1, 'edit own comments' => 0, )DebugCommentLinksTest.php194Drupal\comment\Tests\CommentLinksTest->setEnvironment()
Changed environment:array ( 'authenticated' => true, 'comment count' => true, 'form' => 'below', 'user_register' => 'visitors', 'contact' => 'optional', 'comments' => 'open', 'access comments' => 1, 'post comments' => 0, 'skip comment approval' => 1, 'edit own comments' => 0, )DebugCommentLinksTest.php194Drupal\comment\Tests\CommentLinksTest->setEnvironment()
Changed environment:array ( 'authenticated' => false, 'comment count' => false, 'form' => 'below', 'user_register' => 'visitors', 'contact' => 'optional', 'comments' => 'open', 'access comments' => 0, 'post comments' => 1, 'skip comment approval' => 1, 'edit own comments' => 0, )DebugCommentLinksTest.php194Drupal\comment\Tests\CommentLinksTest->setEnvironment()
Changed environment:array ( 'authenticated' => true, 'comment count' => false, 'form' => 'below', 'user_register' => 'visitors', 'contact' => 'optional', 'comments' => 'open', 'access comments' => 0, 'post comments' => 1, 'skip comment approval' => 1, 'edit own comments' => 0, )DebugCommentLinksTest.php194Drupal\comment\Tests\CommentLinksTest->setEnvironment()
Changed environment:array ( 'authenticated' => false, 'comment count' => true, 'form' => 'below', 'user_register' => 'visitors', 'contact' => 'optional', 'comments' => 'open', 'access comments' => 0, 'post comments' => 1, 'skip comment approval' => 1, 'edit own comments' => 0, )DebugCommentLinksTest.php194Drupal\comment\Tests\CommentLinksTest->setEnvironment()
Changed environment:array ( 'authenticated' => true, 'comment count' => true, 'form' => 'below', 'user_register' => 'visitors', 'contact' => 'optional', 'comments' => 'open', 'access comments' => 0, 'post comments' => 1, 'skip comment approval' => 1, 'edit own comments' => 0, )DebugCommentLinksTest.php194Drupal\comment\Tests\CommentLinksTest->setEnvironment()
Changed environment:array ( 'authenticated' => false, 'comment count' => false, 'form' => 'below', 'user_register' => 'visitors', 'contact' => 'optional', 'comments' => 'open', 'access comments' => 1, 'post comments' => 1, 'skip comment approval' => 1, 'edit own comments' => 0, )DebugCommentLinksTest.php194Drupal\comment\Tests\CommentLinksTest->setEnvironment()
Changed environment:array ( 'authenticated' => true, 'comment count' => false, 'form' => 'below', 'user_register' => 'visitors', 'contact' => 'optional', 'comments' => 'open', 'access comments' => 1, 'post comments' => 1, 'skip comment approval' => 1, 'edit own comments' => 0, )DebugCommentLinksTest.php194Drupal\comment\Tests\CommentLinksTest->setEnvironment()
Changed environment:array ( 'authenticated' => false, 'comment count' => true, 'form' => 'below', 'user_register' => 'visitors', 'contact' => 'optional', 'comments' => 'open', 'access comments' => 1, 'post comments' => 1, 'skip comment approval' => 1, 'edit own comments' => 0, )DebugCommentLinksTest.php194Drupal\comment\Tests\CommentLinksTest->setEnvironment()
Changed environment:array ( 'authenticated' => true, 'comment count' => true, 'form' => 'below', 'user_register' => 'visitors', 'contact' => 'optional', 'comments' => 'open', 'access comments' => 1, 'post comments' => 1, 'skip comment approval' => 1, 'edit own comments' => 0, )DebugCommentLinksTest.php194Drupal\comment\Tests\CommentLinksTest->setEnvironment()
Changed environment:array ( 'authenticated' => false, 'comment count' => false, 'form' => 'separate page', 'user_register' => 'visitors', 'contact' => 'optional', 'comments' => 'open', 'access comments' => 0, 'post comments' => 0, 'skip comment approval' => 1, 'edit own comments' => 0, )DebugCommentLinksTest.php194Drupal\comment\Tests\CommentLinksTest->setEnvironment()
Changed environment:array ( 'authenticated' => true, 'comment count' => false, 'form' => 'separate page', 'user_register' => 'visitors', 'contact' => 'optional', 'comments' => 'open', 'access comments' => 0, 'post comments' => 0, 'skip comment approval' => 1, 'edit own comments' => 0, )DebugCommentLinksTest.php194Drupal\comment\Tests\CommentLinksTest->setEnvironment()
Changed environment:array ( 'authenticated' => false, 'comment count' => true, 'form' => 'separate page', 'user_register' => 'visitors', 'contact' => 'optional', 'comments' => 'open', 'access comments' => 0, 'post comments' => 0, 'skip comment approval' => 1, 'edit own comments' => 0, )DebugCommentLinksTest.php194Drupal\comment\Tests\CommentLinksTest->setEnvironment()
Changed environment:array ( 'authenticated' => true, 'comment count' => true, 'form' => 'separate page', 'user_register' => 'visitors', 'contact' => 'optional', 'comments' => 'open', 'access comments' => 0, 'post comments' => 0, 'skip comment approval' => 1, 'edit own comments' => 0, )DebugCommentLinksTest.php194Drupal\comment\Tests\CommentLinksTest->setEnvironment()
Changed environment:array ( 'authenticated' => false, 'comment count' => false, 'form' => 'separate page', 'user_register' => 'visitors', 'contact' => 'optional', 'comments' => 'open', 'access comments' => 1, 'post comments' => 0, 'skip comment approval' => 1, 'edit own comments' => 0, )DebugCommentLinksTest.php194Drupal\comment\Tests\CommentLinksTest->setEnvironment()
Changed environment:array ( 'authenticated' => true, 'comment count' => false, 'form' => 'separate page', 'user_register' => 'visitors', 'contact' => 'optional', 'comments' => 'open', 'access comments' => 1, 'post comments' => 0, 'skip comment approval' => 1, 'edit own comments' => 0, )DebugCommentLinksTest.php194Drupal\comment\Tests\CommentLinksTest->setEnvironment()
Changed environment:array ( 'authenticated' => false, 'comment count' => true, 'form' => 'separate page', 'user_register' => 'visitors', 'contact' => 'optional', 'comments' => 'open', 'access comments' => 1, 'post comments' => 0, 'skip comment approval' => 1, 'edit own comments' => 0, )DebugCommentLinksTest.php194Drupal\comment\Tests\CommentLinksTest->setEnvironment()
Changed environment:array ( 'authenticated' => true, 'comment count' => true, 'form' => 'separate page', 'user_register' => 'visitors', 'contact' => 'optional', 'comments' => 'open', 'access comments' => 1, 'post comments' => 0, 'skip comment approval' => 1, 'edit own comments' => 0, )DebugCommentLinksTest.php194Drupal\comment\Tests\CommentLinksTest->setEnvironment()
Changed environment:array ( 'authenticated' => false, 'comment count' => false, 'form' => 'separate page', 'user_register' => 'visitors', 'contact' => 'optional', 'comments' => 'open', 'access comments' => 0, 'post comments' => 1, 'skip comment approval' => 1, 'edit own comments' => 0, )DebugCommentLinksTest.php194Drupal\comment\Tests\CommentLinksTest->setEnvironment()
Changed environment:array ( 'authenticated' => true, 'comment count' => false, 'form' => 'separate page', 'user_register' => 'visitors', 'contact' => 'optional', 'comments' => 'open', 'access comments' => 0, 'post comments' => 1, 'skip comment approval' => 1, 'edit own comments' => 0, )DebugCommentLinksTest.php194Drupal\comment\Tests\CommentLinksTest->setEnvironment()
Changed environment:array ( 'authenticated' => false, 'comment count' => true, 'form' => 'separate page', 'user_register' => 'visitors', 'contact' => 'optional', 'comments' => 'open', 'access comments' => 0, 'post comments' => 1, 'skip comment approval' => 1, 'edit own comments' => 0, )DebugCommentLinksTest.php194Drupal\comment\Tests\CommentLinksTest->setEnvironment()
Changed environment:array ( 'authenticated' => true, 'comment count' => true, 'form' => 'separate page', 'user_register' => 'visitors', 'contact' => 'optional', 'comments' => 'open', 'access comments' => 0, 'post comments' => 1, 'skip comment approval' => 1, 'edit own comments' => 0, )DebugCommentLinksTest.php194Drupal\comment\Tests\CommentLinksTest->setEnvironment()
Changed environment:array ( 'authenticated' => false, 'comment count' => false, 'form' => 'separate page', 'user_register' => 'visitors', 'contact' => 'optional', 'comments' => 'open', 'access comments' => 1, 'post comments' => 1, 'skip comment approval' => 1, 'edit own comments' => 0, )DebugCommentLinksTest.php194Drupal\comment\Tests\CommentLinksTest->setEnvironment()
Changed environment:array ( 'authenticated' => true, 'comment count' => false, 'form' => 'separate page', 'user_register' => 'visitors', 'contact' => 'optional', 'comments' => 'open', 'access comments' => 1, 'post comments' => 1, 'skip comment approval' => 1, 'edit own comments' => 0, )DebugCommentLinksTest.php194Drupal\comment\Tests\CommentLinksTest->setEnvironment()
Changed environment:array ( 'authenticated' => false, 'comment count' => true, 'form' => 'separate page', 'user_register' => 'visitors', 'contact' => 'optional', 'comments' => 'open', 'access comments' => 1, 'post comments' => 1, 'skip comment approval' => 1, 'edit own comments' => 0, )DebugCommentLinksTest.php194Drupal\comment\Tests\CommentLinksTest->setEnvironment()
Changed environment:array ( 'authenticated' => true, 'comment count' => true, 'form' => 'separate page', 'user_register' => 'visitors', 'contact' => 'optional', 'comments' => 'open', 'access comments' => 1, 'post comments' => 1, 'skip comment approval' => 1, 'edit own comments' => 0, )DebugCommentLinksTest.php194Drupal\comment\Tests\CommentLinksTest->setEnvironment()
Changed environment:array ( 'authenticated' => false, 'comment count' => false, 'form' => 'below', 'user_register' => 'admin_only', 'contact' => 'optional', 'comments' => 'open', 'access comments' => 0, 'post comments' => 0, 'skip comment approval' => 1, 'edit own comments' => 0, )DebugCommentLinksTest.php194Drupal\comment\Tests\CommentLinksTest->setEnvironment()
Changed environment:array ( 'authenticated' => true, 'comment count' => false, 'form' => 'below', 'user_register' => 'admin_only', 'contact' => 'optional', 'comments' => 'open', 'access comments' => 0, 'post comments' => 0, 'skip comment approval' => 1, 'edit own comments' => 0, )DebugCommentLinksTest.php194Drupal\comment\Tests\CommentLinksTest->setEnvironment()
Changed environment:array ( 'authenticated' => false, 'comment count' => true, 'form' => 'below', 'user_register' => 'admin_only', 'contact' => 'optional', 'comments' => 'open', 'access comments' => 0, 'post comments' => 0, 'skip comment approval' => 1, 'edit own comments' => 0, )DebugCommentLinksTest.php194Drupal\comment\Tests\CommentLinksTest->setEnvironment()
Changed environment:array ( 'authenticated' => true, 'comment count' => true, 'form' => 'below', 'user_register' => 'admin_only', 'contact' => 'optional', 'comments' => 'open', 'access comments' => 0, 'post comments' => 0, 'skip comment approval' => 1, 'edit own comments' => 0, )DebugCommentLinksTest.php194Drupal\comment\Tests\CommentLinksTest->setEnvironment()
Changed environment:array ( 'authenticated' => false, 'comment count' => false, 'form' => 'below', 'user_register' => 'admin_only', 'contact' => 'optional', 'comments' => 'open', 'access comments' => 1, 'post comments' => 0, 'skip comment approval' => 1, 'edit own comments' => 0, )DebugCommentLinksTest.php194Drupal\comment\Tests\CommentLinksTest->setEnvironment()
Changed environment:array ( 'authenticated' => true, 'comment count' => false, 'form' => 'below', 'user_register' => 'admin_only', 'contact' => 'optional', 'comments' => 'open', 'access comments' => 1, 'post comments' => 0, 'skip comment approval' => 1, 'edit own comments' => 0, )DebugCommentLinksTest.php194Drupal\comment\Tests\CommentLinksTest->setEnvironment()
Changed environment:array ( 'authenticated' => false, 'comment count' => true, 'form' => 'below', 'user_register' => 'admin_only', 'contact' => 'optional', 'comments' => 'open', 'access comments' => 1, 'post comments' => 0, 'skip comment approval' => 1, 'edit own comments' => 0, )DebugCommentLinksTest.php194Drupal\comment\Tests\CommentLinksTest->setEnvironment()
Changed environment:array ( 'authenticated' => true, 'comment count' => true, 'form' => 'below', 'user_register' => 'admin_only', 'contact' => 'optional', 'comments' => 'open', 'access comments' => 1, 'post comments' => 0, 'skip comment approval' => 1, 'edit own comments' => 0, )DebugCommentLinksTest.php194Drupal\comment\Tests\CommentLinksTest->setEnvironment()
Changed environment:array ( 'authenticated' => false, 'comment count' => false, 'form' => 'below', 'user_register' => 'admin_only', 'contact' => 'optional', 'comments' => 'open', 'access comments' => 0, 'post comments' => 1, 'skip comment approval' => 1, 'edit own comments' => 0, )DebugCommentLinksTest.php194Drupal\comment\Tests\CommentLinksTest->setEnvironment()
Changed environment:array ( 'authenticated' => true, 'comment count' => false, 'form' => 'below', 'user_register' => 'admin_only', 'contact' => 'optional', 'comments' => 'open', 'access comments' => 0, 'post comments' => 1, 'skip comment approval' => 1, 'edit own comments' => 0, )DebugCommentLinksTest.php194Drupal\comment\Tests\CommentLinksTest->setEnvironment()
Changed environment:array ( 'authenticated' => false, 'comment count' => true, 'form' => 'below', 'user_register' => 'admin_only', 'contact' => 'optional', 'comments' => 'open', 'access comments' => 0, 'post comments' => 1, 'skip comment approval' => 1, 'edit own comments' => 0, )DebugCommentLinksTest.php194Drupal\comment\Tests\CommentLinksTest->setEnvironment()
Changed environment:array ( 'authenticated' => true, 'comment count' => true, 'form' => 'below', 'user_register' => 'admin_only', 'contact' => 'optional', 'comments' => 'open', 'access comments' => 0, 'post comments' => 1, 'skip comment approval' => 1, 'edit own comments' => 0, )DebugCommentLinksTest.php194Drupal\comment\Tests\CommentLinksTest->setEnvironment()
Changed environment:array ( 'authenticated' => false, 'comment count' => false, 'form' => 'below', 'user_register' => 'admin_only', 'contact' => 'optional', 'comments' => 'open', 'access comments' => 1, 'post comments' => 1, 'skip comment approval' => 1, 'edit own comments' => 0, )DebugCommentLinksTest.php194Drupal\comment\Tests\CommentLinksTest->setEnvironment()
Changed environment:array ( 'authenticated' => true, 'comment count' => false, 'form' => 'below', 'user_register' => 'admin_only', 'contact' => 'optional', 'comments' => 'open', 'access comments' => 1, 'post comments' => 1, 'skip comment approval' => 1, 'edit own comments' => 0, )DebugCommentLinksTest.php194Drupal\comment\Tests\CommentLinksTest->setEnvironment()
Changed environment:array ( 'authenticated' => false, 'comment count' => true, 'form' => 'below', 'user_register' => 'admin_only', 'contact' => 'optional', 'comments' => 'open', 'access comments' => 1, 'post comments' => 1, 'skip comment approval' => 1, 'edit own comments' => 0, )DebugCommentLinksTest.php194Drupal\comment\Tests\CommentLinksTest->setEnvironment()
Changed environment:array ( 'authenticated' => true, 'comment count' => true, 'form' => 'below', 'user_register' => 'admin_only', 'contact' => 'optional', 'comments' => 'open', 'access comments' => 1, 'post comments' => 1, 'skip comment approval' => 1, 'edit own comments' => 0, )DebugCommentLinksTest.php194Drupal\comment\Tests\CommentLinksTest->setEnvironment()
Changed environment:array ( 'authenticated' => false, 'comment count' => false, 'form' => 'separate page', 'user_register' => 'admin_only', 'contact' => 'optional', 'comments' => 'open', 'access comments' => 0, 'post comments' => 0, 'skip comment approval' => 1, 'edit own comments' => 0, )DebugCommentLinksTest.php194Drupal\comment\Tests\CommentLinksTest->setEnvironment()
Changed environment:array ( 'authenticated' => true, 'comment count' => false, 'form' => 'separate page', 'user_register' => 'admin_only', 'contact' => 'optional', 'comments' => 'open', 'access comments' => 0, 'post comments' => 0, 'skip comment approval' => 1, 'edit own comments' => 0, )DebugCommentLinksTest.php194Drupal\comment\Tests\CommentLinksTest->setEnvironment()
Changed environment:array ( 'authenticated' => false, 'comment count' => true, 'form' => 'separate page', 'user_register' => 'admin_only', 'contact' => 'optional', 'comments' => 'open', 'access comments' => 0, 'post comments' => 0, 'skip comment approval' => 1, 'edit own comments' => 0, )DebugCommentLinksTest.php194Drupal\comment\Tests\CommentLinksTest->setEnvironment()
Changed environment:array ( 'authenticated' => true, 'comment count' => true, 'form' => 'separate page', 'user_register' => 'admin_only', 'contact' => 'optional', 'comments' => 'open', 'access comments' => 0, 'post comments' => 0, 'skip comment approval' => 1, 'edit own comments' => 0, )DebugCommentLinksTest.php194Drupal\comment\Tests\CommentLinksTest->setEnvironment()
Changed environment:array ( 'authenticated' => false, 'comment count' => false, 'form' => 'separate page', 'user_register' => 'admin_only', 'contact' => 'optional', 'comments' => 'open', 'access comments' => 1, 'post comments' => 0, 'skip comment approval' => 1, 'edit own comments' => 0, )DebugCommentLinksTest.php194Drupal\comment\Tests\CommentLinksTest->setEnvironment()
Changed environment:array ( 'authenticated' => true, 'comment count' => false, 'form' => 'separate page', 'user_register' => 'admin_only', 'contact' => 'optional', 'comments' => 'open', 'access comments' => 1, 'post comments' => 0, 'skip comment approval' => 1, 'edit own comments' => 0, )DebugCommentLinksTest.php194Drupal\comment\Tests\CommentLinksTest->setEnvironment()
Changed environment:array ( 'authenticated' => false, 'comment count' => true, 'form' => 'separate page', 'user_register' => 'admin_only', 'contact' => 'optional', 'comments' => 'open', 'access comments' => 1, 'post comments' => 0, 'skip comment approval' => 1, 'edit own comments' => 0, )DebugCommentLinksTest.php194Drupal\comment\Tests\CommentLinksTest->setEnvironment()
Changed environment:array ( 'authenticated' => true, 'comment count' => true, 'form' => 'separate page', 'user_register' => 'admin_only', 'contact' => 'optional', 'comments' => 'open', 'access comments' => 1, 'post comments' => 0, 'skip comment approval' => 1, 'edit own comments' => 0, )DebugCommentLinksTest.php194Drupal\comment\Tests\CommentLinksTest->setEnvironment()
Changed environment:array ( 'authenticated' => false, 'comment count' => false, 'form' => 'separate page', 'user_register' => 'admin_only', 'contact' => 'optional', 'comments' => 'open', 'access comments' => 0, 'post comments' => 1, 'skip comment approval' => 1, 'edit own comments' => 0, )DebugCommentLinksTest.php194Drupal\comment\Tests\CommentLinksTest->setEnvironment()
Changed environment:array ( 'authenticated' => true, 'comment count' => false, 'form' => 'separate page', 'user_register' => 'admin_only', 'contact' => 'optional', 'comments' => 'open', 'access comments' => 0, 'post comments' => 1, 'skip comment approval' => 1, 'edit own comments' => 0, )DebugCommentLinksTest.php194Drupal\comment\Tests\CommentLinksTest->setEnvironment()
Changed environment:array ( 'authenticated' => false, 'comment count' => true, 'form' => 'separate page', 'user_register' => 'admin_only', 'contact' => 'optional', 'comments' => 'open', 'access comments' => 0, 'post comments' => 1, 'skip comment approval' => 1, 'edit own comments' => 0, )DebugCommentLinksTest.php194Drupal\comment\Tests\CommentLinksTest->setEnvironment()
Changed environment:array ( 'authenticated' => true, 'comment count' => true, 'form' => 'separate page', 'user_register' => 'admin_only', 'contact' => 'optional', 'comments' => 'open', 'access comments' => 0, 'post comments' => 1, 'skip comment approval' => 1, 'edit own comments' => 0, )DebugCommentLinksTest.php194Drupal\comment\Tests\CommentLinksTest->setEnvironment()
Changed environment:array ( 'authenticated' => false, 'comment count' => false, 'form' => 'separate page', 'user_register' => 'admin_only', 'contact' => 'optional', 'comments' => 'open', 'access comments' => 1, 'post comments' => 1, 'skip comment approval' => 1, 'edit own comments' => 0, )DebugCommentLinksTest.php194Drupal\comment\Tests\CommentLinksTest->setEnvironment()
Changed environment:array ( 'authenticated' => true, 'comment count' => false, 'form' => 'separate page', 'user_register' => 'admin_only', 'contact' => 'optional', 'comments' => 'open', 'access comments' => 1, 'post comments' => 1, 'skip comment approval' => 1, 'edit own comments' => 0, )DebugCommentLinksTest.php194Drupal\comment\Tests\CommentLinksTest->setEnvironment()
Changed environment:array ( 'authenticated' => false, 'comment count' => true, 'form' => 'separate page', 'user_register' => 'admin_only', 'contact' => 'optional', 'comments' => 'open', 'access comments' => 1, 'post comments' => 1, 'skip comment approval' => 1, 'edit own comments' => 0, )DebugCommentLinksTest.php194Drupal\comment\Tests\CommentLinksTest->setEnvironment()
Changed environment:array ( 'authenticated' => true, 'comment count' => true, 'form' => 'separate page', 'user_register' => 'admin_only', 'contact' => 'optional', 'comments' => 'open', 'access comments' => 1, 'post comments' => 1, 'skip comment approval' => 1, 'edit own comments' => 0, )DebugCommentLinksTest.php194Drupal\comment\Tests\CommentLinksTest->setEnvironment()
LeafDrupal\comment\Tests\CommentNewIndicatorTest4200
LeafDrupal\comment\Tests\CommentNodeAccessTest5700
LeafDrupal\comment\Tests\CommentNodeChangesTest2400
LeafDrupal\comment\Tests\CommentPagerTest21300
ExpandDrupal\comment\Tests\CommentPreviewTest6610
MessageGroupFilenameLineFunctionStatus
The test did not complete due to a fatal error.Completion checkCommentPreviewTest.php79Drupal\comment\Tests\CommentPreviewTest->testCommentEditPreviewSave()
LeafDrupal\comment\Tests\CommentRssTest2600
LeafDrupal\comment\Tests\CommentStatisticsTest9800
LeafDrupal\comment\Tests\CommentThreadingTest15900
LeafDrupal\comment\Tests\CommentTokenReplaceTest6600
LeafDrupal\comment\Tests\CommentTranslationUITest9800
LeafDrupal\comment\Tests\Views\ArgumentUserUIDTest900
LeafDrupal\comment\Tests\Views\DefaultViewRecentComments800
LeafDrupal\comment\Tests\Views\FilterUserUIDTest900
LeafDrupal\comment\Tests\Views\RowRssTest1200
LeafDrupal\comment\Tests\Views\WizardTest5400
LeafDrupal\config\Tests\ConfigCRUDTest2600
LeafDrupal\config\Tests\ConfigEntityListTest6800
LeafDrupal\config\Tests\ConfigEntityTest13700
LeafDrupal\config\Tests\ConfigEntityUnitTest100
LeafDrupal\config\Tests\ConfigFileContentTest3100
LeafDrupal\config\Tests\ConfigImportTest3800
LeafDrupal\config\Tests\ConfigImportUITest4600
LeafDrupal\config\Tests\ConfigInstallTest1100
LeafDrupal\config\Tests\ConfigOverrideTest1800
LeafDrupal\config\Tests\ConfigUpgradeTest1200
LeafDrupal\config\Tests\LocaleConfigOverride300
LeafDrupal\config\Tests\Storage\DatabaseStorageTest2100
LeafDrupal\config\Tests\Storage\FileStorageTest2300
LeafDrupal\contact\Tests\ContactAuthenticatedUserTest1300
LeafDrupal\contact\Tests\ContactPersonalTest16200
LeafDrupal\contact\Tests\ContactSitewideTest28500
LeafDrupal\contact\Tests\ContactUpgradePathTest4800
LeafDrupal\contact\Tests\Views\ContactFieldsTest600
LeafDrupal\contextual\Tests\ContextualDynamicContextTest1600
LeafDrupal\dblog\Tests\DBLogTest45100
LeafDrupal\editor\Tests\EditorAdminTest4200
LeafDrupal\editor\Tests\EditorLoadingTest6700
LeafDrupal\editor\Tests\EditorManagerTest600
LeafDrupal\edit\Tests\EditorSelectionTest2000
LeafDrupal\edit\Tests\MetadataGeneratorTest300
LeafDrupal\email\Tests\EmailFieldTest1900
LeafDrupal\email\Tests\EmailItemTest600
LeafDrupal\entity\Tests\EntityDisplayTest3800
LeafDrupal\entity_reference\Tests\EntityReferenceAdminTest2900
LeafDrupal\entity_reference\Tests\EntityReferenceAutocompleteTest1700
LeafDrupal\entity_reference\Tests\EntityReferenceAutoCreateTest1800
LeafDrupal\entity_reference\Tests\EntityReferenceItemTest1000
ExpandDrupal\entity_reference\Tests\EntityReferenceSelectionAccessTest6187
MessageGroupFilenameLineFunctionStatus
Illegal offset typeDrupal\entity_reference\Tests\EntityReferenceSelectionAccessTest->testCommentHandler() Drupal\simpletest\TestBase->run() simpletest_script_run_one_test('185', 'Drupal\entity_reference\Tests\EntityReferenceSelectionAccessTest') WarningEntityReferenceSelectionAccessTest.php429Drupal\entity_reference\Tests\EntityReferenceSelectionAccessTest->testCommentHandler()
Illegal offset typeDrupal\entity_reference\Tests\EntityReferenceSelectionAccessTest->testCommentHandler() Drupal\simpletest\TestBase->run() simpletest_script_run_one_test('185', 'Drupal\entity_reference\Tests\EntityReferenceSelectionAccessTest') WarningEntityReferenceSelectionAccessTest.php439Drupal\entity_reference\Tests\EntityReferenceSelectionAccessTest->testCommentHandler()
Valid result set returned by Comment handler.OtherEntityReferenceSelectionAccessTest.php456Drupal\entity_reference\Tests\EntityReferenceSelectionAccessTest->testCommentHandler()
Valid count returned by Comment handler.OtherEntityReferenceSelectionAccessTest.php456Drupal\entity_reference\Tests\EntityReferenceSelectionAccessTest->testCommentHandler()
Valid result set returned by Comment handler.OtherEntityReferenceSelectionAccessTest.php456Drupal\entity_reference\Tests\EntityReferenceSelectionAccessTest->testCommentHandler()
Valid count returned by Comment handler.OtherEntityReferenceSelectionAccessTest.php456Drupal\entity_reference\Tests\EntityReferenceSelectionAccessTest->testCommentHandler()
Illegal offset typeDrupal\entity_reference\Tests\EntityReferenceSelectionAccessTest->testCommentHandler() Drupal\simpletest\TestBase->run() simpletest_script_run_one_test('185', 'Drupal\entity_reference\Tests\EntityReferenceSelectionAccessTest') WarningEntityReferenceSelectionAccessTest.php468Drupal\entity_reference\Tests\EntityReferenceSelectionAccessTest->testCommentHandler()
Illegal offset typeDrupal\entity_reference\Tests\EntityReferenceSelectionAccessTest->testCommentHandler() Drupal\simpletest\TestBase->run() simpletest_script_run_one_test('185', 'Drupal\entity_reference\Tests\EntityReferenceSelectionAccessTest') WarningEntityReferenceSelectionAccessTest.php469Drupal\entity_reference\Tests\EntityReferenceSelectionAccessTest->testCommentHandler()
Valid result set returned by Comment handler (comment admin).OtherEntityReferenceSelectionAccessTest.php474Drupal\entity_reference\Tests\EntityReferenceSelectionAccessTest->testCommentHandler()
Valid count returned by Comment handler (comment admin).OtherEntityReferenceSelectionAccessTest.php474Drupal\entity_reference\Tests\EntityReferenceSelectionAccessTest->testCommentHandler()
Illegal offset typeDrupal\entity_reference\Tests\EntityReferenceSelectionAccessTest->testCommentHandler() Drupal\simpletest\TestBase->run() simpletest_script_run_one_test('185', 'Drupal\entity_reference\Tests\EntityReferenceSelectionAccessTest') WarningEntityReferenceSelectionAccessTest.php486Drupal\entity_reference\Tests\EntityReferenceSelectionAccessTest->testCommentHandler()
Illegal offset typeDrupal\entity_reference\Tests\EntityReferenceSelectionAccessTest->testCommentHandler() Drupal\simpletest\TestBase->run() simpletest_script_run_one_test('185', 'Drupal\entity_reference\Tests\EntityReferenceSelectionAccessTest') WarningEntityReferenceSelectionAccessTest.php487Drupal\entity_reference\Tests\EntityReferenceSelectionAccessTest->testCommentHandler()
Illegal offset typeDrupal\entity_reference\Tests\EntityReferenceSelectionAccessTest->testCommentHandler() Drupal\simpletest\TestBase->run() simpletest_script_run_one_test('185', 'Drupal\entity_reference\Tests\EntityReferenceSelectionAccessTest') WarningEntityReferenceSelectionAccessTest.php488Drupal\entity_reference\Tests\EntityReferenceSelectionAccessTest->testCommentHandler()
Valid result set returned by Comment handler (comment + node admin).OtherEntityReferenceSelectionAccessTest.php493Drupal\entity_reference\Tests\EntityReferenceSelectionAccessTest->testCommentHandler()
Valid count returned by Comment handler (comment + node admin).OtherEntityReferenceSelectionAccessTest.php493Drupal\entity_reference\Tests\EntityReferenceSelectionAccessTest->testCommentHandler()
LeafDrupal\entity_reference\Tests\EntityReferenceSelectionSortTest700
LeafDrupal\field\Tests\BulkDeleteTest7500
LeafDrupal\field\Tests\CrudTest7500
LeafDrupal\field\Tests\DisplayApiTest4600
LeafDrupal\field\Tests\EntityPropertiesTest400
LeafDrupal\field\Tests\FieldAccessTest2100
LeafDrupal\field\Tests\FieldAttachOtherTest10300
LeafDrupal\field\Tests\FieldAttachStorageTest9400
LeafDrupal\field\Tests\FieldInfoTest7000
LeafDrupal\field\Tests\FieldInstanceCrudTest2800
LeafDrupal\field\Tests\FormTest28100
LeafDrupal\field\Tests\TranslationTest9900
LeafDrupal\field\Tests\Views\ApiDataTest1500
LeafDrupal\field\Tests\Views\FieldUITest2800
LeafDrupal\field\Tests\Views\HandlerFieldFieldTest2400
LeafDrupal\field_sql_storage\Tests\FieldSqlStorageTest9200
LeafDrupal\field_ui\Tests\AlterTest2100
LeafDrupal\field_ui\Tests\ManageDisplayTest14900
LeafDrupal\field_ui\Tests\ManageFieldsTest29400
LeafDrupal\file\Tests\CopyTest11000
LeafDrupal\file\Tests\DeleteTest2400
LeafDrupal\file\Tests\DownloadTest4500
LeafDrupal\file\Tests\FileFieldDisplayTest5000
LeafDrupal\file\Tests\FileFieldPathTest2700
LeafDrupal\file\Tests\FileFieldRevisionTest6700
LeafDrupal\file\Tests\FileFieldRSSContentTest2300
LeafDrupal\file\Tests\FileFieldValidateTest11800
ExpandDrupal\file\Tests\FileFieldWidgetTest29739
MessageGroupFilenameLineFunctionStatus
Undefined offset: 1Drupal\file\Tests\FileFieldWidgetTest->testPrivateFileComment() Drupal\simpletest\TestBase->run() simpletest_script_run_one_test('223', 'Drupal\file\Tests\FileFieldWidgetTest') NoticeFileFieldWidgetTest.php284Drupal\file\Tests\FileFieldWidgetTest->testPrivateFileComment()
array_flip(): Can only flip STRING and INTEGER values!array_flip(Array) Drupal\Core\Entity\DatabaseStorageController->load(Array) entity_load_multiple('comment', Array, ) entity_load('comment', NULL) comment_load(NULL) Drupal\file\Tests\FileFieldWidgetTest->testPrivateFileComment() Drupal\simpletest\TestBase->run() simpletest_script_run_one_test('223', 'Drupal\file\Tests\FileFieldWidgetTest') WarningDatabaseStorageController.php182Drupal\Core\Entity\DatabaseStorageController->load()
Trying to get property of non-objectDrupal\file\Tests\FileFieldWidgetTest->testPrivateFileComment() Drupal\simpletest\TestBase->run() simpletest_script_run_one_test('223', 'Drupal\file\Tests\FileFieldWidgetTest') NoticeFileFieldWidgetTest.php290Drupal\file\Tests\FileFieldWidgetTest->testPrivateFileComment()
array_flip(): Can only flip STRING and INTEGER values!array_flip(Array) Drupal\Core\Entity\DatabaseStorageController->load(Array) entity_load_multiple('file', Array) file_load_multiple(Array) file_load(NULL) Drupal\file\Tests\FileFieldWidgetTest->testPrivateFileComment() Drupal\simpletest\TestBase->run() simpletest_script_run_one_test('223', 'Drupal\file\Tests\FileFieldWidgetTest') WarningDatabaseStorageController.php182Drupal\Core\Entity\DatabaseStorageController->load()
Trying to get property of non-objectDrupal\file\Tests\FileFieldTestBase->assertFileExists(, 'New file saved to disk on node creation.') Drupal\file\Tests\FileFieldWidgetTest->testPrivateFileComment() Drupal\simpletest\TestBase->run() simpletest_script_run_one_test('223', 'Drupal\file\Tests\FileFieldWidgetTest') NoticeFileFieldTestBase.php189Drupal\file\Tests\FileFieldTestBase->assertFileExists()
New file saved to disk on node creation.OtherFileFieldWidgetTest.php291Drupal\file\Tests\FileFieldWidgetTest->testPrivateFileComment()
Trying to get property of non-objectDrupal\file\Tests\FileFieldWidgetTest->testPrivateFileComment() Drupal\simpletest\TestBase->run() simpletest_script_run_one_test('223', 'Drupal\file\Tests\FileFieldWidgetTest') NoticeFileFieldWidgetTest.php293Drupal\file\Tests\FileFieldWidgetTest->testPrivateFileComment()
Trying to get property of non-objectDrupal\file\Tests\FileFieldWidgetTest->testPrivateFileComment() Drupal\simpletest\TestBase->run() simpletest_script_run_one_test('223', 'Drupal\file\Tests\FileFieldWidgetTest') NoticeFileFieldWidgetTest.php295Drupal\file\Tests\FileFieldWidgetTest->testPrivateFileComment()
Trying to get property of non-objectDrupal\file\Tests\FileFieldWidgetTest->testPrivateFileComment() Drupal\simpletest\TestBase->run() simpletest_script_run_one_test('223', 'Drupal\file\Tests\FileFieldWidgetTest') NoticeFileFieldWidgetTest.php300Drupal\file\Tests\FileFieldWidgetTest->testPrivateFileComment()
Confirmed that access is denied for the file without the needed permission.BrowserFileFieldWidgetTest.php301Drupal\file\Tests\FileFieldWidgetTest->testPrivateFileComment()
Trying to get property of non-objectDrupal\file\Tests\FileFieldWidgetTest->testPrivateFileComment() Drupal\simpletest\TestBase->run() simpletest_script_run_one_test('223', 'Drupal\file\Tests\FileFieldWidgetTest') NoticeFileFieldWidgetTest.php312Drupal\file\Tests\FileFieldWidgetTest->testPrivateFileComment()
Confirmed that access is denied for the file without the needed permission.BrowserFileFieldWidgetTest.php313Drupal\file\Tests\FileFieldWidgetTest->testPrivateFileComment()
LeafDrupal\file\Tests\FileManagedFileElementTest26800
LeafDrupal\file\Tests\FilePrivateTest3700
LeafDrupal\file\Tests\FileTokenReplaceTest3500
LeafDrupal\file\Tests\LoadTest3400
LeafDrupal\file\Tests\MoveTest11000
LeafDrupal\file\Tests\RemoteFileSaveUploadTest27000
LeafDrupal\file\Tests\SaveDataTest9300
LeafDrupal\file\Tests\SaveTest1600
LeafDrupal\file\Tests\SaveUploadTest27000
LeafDrupal\file\Tests\SpaceUsedTest1200
LeafDrupal\file\Tests\UsageTest3400
LeafDrupal\file\Tests\ValidateTest1200
LeafDrupal\file\Tests\ValidatorTest2900
LeafDrupal\filter\Tests\FilterAdminTest19400
LeafDrupal\filter\Tests\FilterAPITest500
LeafDrupal\filter\Tests\FilterCrudTest23900
LeafDrupal\filter\Tests\FilterDefaultFormatTest3300
LeafDrupal\filter\Tests\FilterFormatAccessTest27200
LeafDrupal\filter\Tests\FilterHooksTest3300
LeafDrupal\filter\Tests\FilterHtmlImageSecureTest4600
LeafDrupal\filter\Tests\FilterNoFormatTest100
LeafDrupal\filter\Tests\FilterSecurityTest4000
LeafDrupal\filter\Tests\FilterSettingsTest1200
LeafDrupal\filter\Tests\FilterUnitTest21500
ExpandDrupal\forum\Tests\ForumBlockTest14702
MessageGroupFilenameLineFunctionStatus
Drupal\Core\Entity\EntityStorageException: Field value is unknown. in Drupal\Core\Entity\DatabaseStorageControllerNG->save() (line 321 of /var/lib/drupaltestbot/sites/default/files/checkout/core/lib/Drupal/Core/Entity/DatabaseStorageControllerNG.php). Drupal\Core\Entity\DatabaseStorageControllerNG->save(Object) Drupal\Core\Entity\Entity->save() comment_save(Object) Drupal\forum\Tests\ForumBlockTest->testActiveForumTopicsBlock() Drupal\simpletest\TestBase->run() simpletest_script_run_one_test('292', 'Drupal\forum\Tests\ForumBlockTest') Uncaught exceptionDatabaseStorageControllerNG.php321Drupal\Core\Entity\DatabaseStorageControllerNG->save()
Drupal\Core\Entity\EntityStorageException: Field value is unknown. in Drupal\Core\Entity\DatabaseStorageControllerNG->save() (line 321 of /var/lib/drupaltestbot/sites/default/files/checkout/core/lib/Drupal/Core/Entity/DatabaseStorageControllerNG.php). Drupal\Core\Entity\DatabaseStorageControllerNG->save(Object) Drupal\Core\Entity\Entity->save() comment_save(Object) Drupal\forum\Tests\ForumBlockTest->testActiveForumTopicsBlock() Drupal\simpletest\TestBase->run() simpletest_script_run_one_test('292', 'Drupal\forum\Tests\ForumBlockTest') Uncaught exceptionDatabaseStorageControllerNG.php321Drupal\Core\Entity\DatabaseStorageControllerNG->save()
LeafDrupal\forum\Tests\ForumIndexTest2700
LeafDrupal\forum\Tests\ForumNodeAccessTest8700
LeafDrupal\forum\Tests\ForumTest58500
LeafDrupal\help\Tests\HelpTest30500
LeafDrupal\help\Tests\NoHelpTest2400
LeafDrupal\history\Tests\Views\HistoryTimestampTest1200
LeafDrupal\image\Tests\ImageAdminStylesTest22200
LeafDrupal\image\Tests\ImageDimensionsScaleUnitTest3000
LeafDrupal\image\Tests\ImageDimensionsTest11200
LeafDrupal\image\Tests\ImageEffectsTest4900
LeafDrupal\image\Tests\ImageFieldDefaultImagesTest4800
LeafDrupal\image\Tests\ImageFieldDisplayTest16500
LeafDrupal\image\Tests\ImageFieldValidateTest3800
LeafDrupal\image\Tests\ImageStylesPathAndUrlTest6500
LeafDrupal\image\Tests\ImageThemeFunctionTest500
LeafDrupal\jsonld\Tests\NormalizeDenormalizeTest1400
LeafDrupal\jsonld\Tests\RdfSchemaSerializationTest400
LeafDrupal\jsonld\Tests\SupportsSerializationTest1000
LeafDrupal\language\Tests\LanguageBrowserDetectionUnitTest10700
LeafDrupal\language\Tests\LanguageConfigurationElementTest5400
LeafDrupal\language\Tests\LanguageConfigurationTest7500
LeafDrupal\language\Tests\LanguageCustomLanguageConfigurationTest3600
LeafDrupal\language\Tests\LanguageDependencyInjectionTest1700
LeafDrupal\language\Tests\LanguageListTest10000
LeafDrupal\language\Tests\LanguageNegotiationInfoTest4900
LeafDrupal\language\Tests\LanguagePathMonolingualTest3500
LeafDrupal\language\Tests\LanguageSwitchingTest2700
LeafDrupal\language\Tests\LanguageUILanguageNegotiationTest15000
LeafDrupal\language\Tests\LanguageUrlRewritingTest4400
LeafDrupal\language\Tests\Views\ArgumentLanguageTest200
LeafDrupal\language\Tests\Views\FieldLanguageTest200
LeafDrupal\language\Tests\Views\FilterLanguageTest200
LeafDrupal\layout\Tests\DisplayInternalLogicTest1500
LeafDrupal\layout\Tests\LayoutDerivativesTest2400
LeafDrupal\link\Tests\LinkFieldTest14000
LeafDrupal\link\Tests\LinkFieldUITest2100
LeafDrupal\locale\Tests\LocaleContentTest17000
LeafDrupal\locale\Tests\LocaleExportTest5700
LeafDrupal\locale\Tests\LocaleImportFunctionalTest16600
LeafDrupal\locale\Tests\LocaleInstallTest200
LeafDrupal\locale\Tests\LocaleJavascriptTranslation6600
LeafDrupal\locale\Tests\LocaleLibraryInfoAlterTest200
LeafDrupal\locale\Tests\LocalePathTest5100
LeafDrupal\locale\Tests\LocalePluralFormatTest16000
LeafDrupal\locale\Tests\LocaleStringTest2600
LeafDrupal\locale\Tests\LocaleTranslationTest35800
LeafDrupal\locale\Tests\LocaleUninstallFrenchTest3600
LeafDrupal\locale\Tests\LocaleUninstallTest3600
LeafDrupal\locale\Tests\LocaleUpdateInterfaceTest4600
LeafDrupal\locale\Tests\LocaleUpdateTest46300
LeafDrupal\menu\Tests\MenuNodeTest6100
LeafDrupal\menu\Tests\MenuTest317900
LeafDrupal\node\Tests\MultiStepNodeFormBasicOptionsTest1600
LeafDrupal\node\Tests\NodeAccessBaseTableTest15900
LeafDrupal\node\Tests\NodeAccessFieldTest5000
LeafDrupal\node\Tests\NodeAccessLanguageTest2500
ExpandDrupal\node\Tests\NodeAccessPagerTest1901
MessageGroupFilenameLineFunctionStatus
Drupal\Core\Entity\EntityStorageException: Field value is unknown. in Drupal\Core\Entity\DatabaseStorageControllerNG->save() (line 321 of /var/lib/drupaltestbot/sites/default/files/checkout/core/lib/Drupal/Core/Entity/DatabaseStorageControllerNG.php). Drupal\Core\Entity\DatabaseStorageControllerNG->save(Object) Drupal\Core\Entity\Entity->save() Drupal\node\Tests\NodeAccessPagerTest->testCommentPager() Drupal\simpletest\TestBase->run() simpletest_script_run_one_test('372', 'Drupal\node\Tests\NodeAccessPagerTest') Uncaught exceptionDatabaseStorageControllerNG.php321Drupal\Core\Entity\DatabaseStorageControllerNG->save()
LeafDrupal\node\Tests\NodeAccessRebuildTest1900
LeafDrupal\node\Tests\NodeAccessRecordsTest2600
LeafDrupal\node\Tests\NodeAccessTest3400
LeafDrupal\node\Tests\NodeAdminTest14500
LeafDrupal\node\Tests\NodeBlockFunctionalTest7300
LeafDrupal\node\Tests\NodeBuildContentTest400
LeafDrupal\node\Tests\NodeCreationTest4900
LeafDrupal\node\Tests\NodeEntityFieldQueryAlterTest3200
LeafDrupal\node\Tests\NodeEntityViewModeAlterTest2000
LeafDrupal\node\Tests\NodeFeedTest100
LeafDrupal\node\Tests\NodeFieldMultilingualTestCase6400
LeafDrupal\node\Tests\NodeLoadHooksTest700
LeafDrupal\node\Tests\NodeLoadMultipleTest2700
LeafDrupal\node\Tests\NodePostSettingsTest4500
LeafDrupal\node\Tests\NodeQueryAlterTest11200
LeafDrupal\node\Tests\NodeRevisionPermissionsTest5900
LeafDrupal\node\Tests\NodeRevisionsTest10900
LeafDrupal\node\Tests\NodeRSSContentTest2200
LeafDrupal\node\Tests\NodeSaveTest6000
LeafDrupal\node\Tests\NodeSyndicateBlockTest1700
LeafDrupal\node\Tests\NodeTitleTest2300
LeafDrupal\node\Tests\NodeTitleXSSTest2300
LeafDrupal\node\Tests\NodeTokenReplaceTest4000
LeafDrupal\node\Tests\NodeTranslationUITest13600
LeafDrupal\node\Tests\NodeTypeInitialLanguageTest8000
LeafDrupal\node\Tests\NodeTypePersistenceTest6500
LeafDrupal\node\Tests\NodeTypeTest13600
LeafDrupal\node\Tests\PageEditTest9700
LeafDrupal\node\Tests\PagePreviewTest4100
LeafDrupal\node\Tests\PageViewTest3400
LeafDrupal\node\Tests\SummaryLengthTest1200
LeafDrupal\node\Tests\Views\FieldTypeTest200
LeafDrupal\node\Tests\Views\FilterUidRevisionTest400
LeafDrupal\node\Tests\Views\RevisionRelationships300
LeafDrupal\node\Tests\Views\StatusExtraTest6800
LeafDrupal\number\Tests\NumberFieldTest8800
LeafDrupal\openid\Tests\OpenIDFunctionalTest41400
LeafDrupal\openid\Tests\OpenIDRegistrationTest22400
LeafDrupal\openid\Tests\OpenIDTest4500
LeafDrupal\openid\Tests\Upgrade\OpenIDAuthmapUpgradePathTest2600
LeafDrupal\options\Tests\OptionsDynamicValuesValidationTest900
LeafDrupal\options\Tests\OptionsFieldTest1600
LeafDrupal\options\Tests\OptionsFieldUITest20700
LeafDrupal\options\Tests\OptionsSelectDynamicValuesTest1600
LeafDrupal\options\Tests\OptionsWidgetsTest26100
LeafDrupal\path\Tests\PathAliasTest13800
LeafDrupal\path\Tests\PathLanguageTest7500
LeafDrupal\path\Tests\PathLanguageUiTest9000
LeafDrupal\path\Tests\PathTaxonomyTermTest3700
LeafDrupal\php\Tests\PhpAccessTest3800
LeafDrupal\php\Tests\PhpFilterTest4200
LeafDrupal\picture\Tests\PictureAdminUITest5400
LeafDrupal\picture\Tests\PictureFieldDisplayTest11500
LeafDrupal\poll\Tests\PollBlockTest16700
LeafDrupal\poll\Tests\PollCreateTest26900
LeafDrupal\poll\Tests\PollDeleteChoiceTest5400
LeafDrupal\poll\Tests\PollExpirationTest5200
LeafDrupal\poll\Tests\PollJsAddChoiceTest1600
LeafDrupal\poll\Tests\PollTokenReplaceTest12500
LeafDrupal\poll\Tests\PollTranslateTest7300
LeafDrupal\poll\Tests\PollVoteCheckHostnameTest14000
LeafDrupal\poll\Tests\PollVoteTest14600
ExpandDrupal\rdf\Tests\CommentAttributesTest1623436
MessageGroupFilenameLineFunctionStatus
Comment subject posted.OtherCommentTestBase.php141Drupal\comment\Tests\CommentTestBase->postComment()
Comment body posted.OtherCommentTestBase.php143Drupal\comment\Tests\CommentTestBase->postComment()
Comment id found.OtherCommentTestBase.php144Drupal\comment\Tests\CommentTestBase->postComment()
Comment subject posted.OtherCommentTestBase.php141Drupal\comment\Tests\CommentTestBase->postComment()
Comment body posted.OtherCommentTestBase.php143Drupal\comment\Tests\CommentTestBase->postComment()
Comment id found.OtherCommentTestBase.php144Drupal\comment\Tests\CommentTestBase->postComment()
RDFa markup for the number of comments found on teaser view.OtherCommentAttributesTest.php79Drupal\rdf\Tests\CommentAttributesTest->testNumberOfCommentsRdfaMarkup()
Empty rel attribute found in comment count link.OtherCommentAttributesTest.php81Drupal\rdf\Tests\CommentAttributesTest->testNumberOfCommentsRdfaMarkup()
RDFa markup for the number of comments found on full node view.OtherCommentAttributesTest.php87Drupal\rdf\Tests\CommentAttributesTest->testNumberOfCommentsRdfaMarkup()
Comment subject posted.OtherCommentTestBase.php141Drupal\comment\Tests\CommentTestBase->postComment()
Comment body posted.OtherCommentTestBase.php143Drupal\comment\Tests\CommentTestBase->postComment()
Comment id found.OtherCommentTestBase.php144Drupal\comment\Tests\CommentTestBase->postComment()
Comment RDF type for comment found.OtherCommentAttributesTest.php182Drupal\rdf\Tests\CommentAttributesTest->_testBasicCommentRdfaMarkup()
Undefined offset: 0Drupal\rdf\Tests\CommentAttributesTest->_testBasicCommentRdfaMarkup(NULL) Drupal\rdf\Tests\CommentAttributesTest->testCommentRdfaMarkup() Drupal\simpletest\TestBase->run() simpletest_script_run_one_test('441', 'Drupal\rdf\Tests\CommentAttributesTest') NoticeCommentAttributesTest.php184Drupal\rdf\Tests\CommentAttributesTest->_testBasicCommentRdfaMarkup()
Trying to get property of non-objectDrupal\rdf\Tests\CommentAttributesTest->_testBasicCommentRdfaMarkup(NULL) Drupal\rdf\Tests\CommentAttributesTest->testCommentRdfaMarkup() Drupal\simpletest\TestBase->run() simpletest_script_run_one_test('441', 'Drupal\rdf\Tests\CommentAttributesTest') NoticeCommentAttributesTest.php184Drupal\rdf\Tests\CommentAttributesTest->_testBasicCommentRdfaMarkup()
Trying to get property of non-objectDrupal\rdf\Tests\CommentAttributesTest->_testBasicCommentRdfaMarkup(NULL) Drupal\rdf\Tests\CommentAttributesTest->testCommentRdfaMarkup() Drupal\simpletest\TestBase->run() simpletest_script_run_one_test('441', 'Drupal\rdf\Tests\CommentAttributesTest') NoticeCommentAttributesTest.php184Drupal\rdf\Tests\CommentAttributesTest->_testBasicCommentRdfaMarkup()
Trying to get property of non-objectDrupal\rdf\Tests\CommentAttributesTest->_testBasicCommentRdfaMarkup(NULL) Drupal\rdf\Tests\CommentAttributesTest->testCommentRdfaMarkup() Drupal\simpletest\TestBase->run() simpletest_script_run_one_test('441', 'Drupal\rdf\Tests\CommentAttributesTest') NoticeCommentAttributesTest.php184Drupal\rdf\Tests\CommentAttributesTest->_testBasicCommentRdfaMarkup()
RDFa markup for the date of the comment found.OtherCommentAttributesTest.php186Drupal\rdf\Tests\CommentAttributesTest->_testBasicCommentRdfaMarkup()
Undefined offset: 0Drupal\rdf\Tests\CommentAttributesTest->_testBasicCommentRdfaMarkup(NULL) Drupal\rdf\Tests\CommentAttributesTest->testCommentRdfaMarkup() Drupal\simpletest\TestBase->run() simpletest_script_run_one_test('441', 'Drupal\rdf\Tests\CommentAttributesTest') NoticeCommentAttributesTest.php190Drupal\rdf\Tests\CommentAttributesTest->_testBasicCommentRdfaMarkup()
RDFa markup for the comment author found.OtherCommentAttributesTest.php190Drupal\rdf\Tests\CommentAttributesTest->_testBasicCommentRdfaMarkup()
Undefined offset: 0Drupal\rdf\Tests\CommentAttributesTest->_testBasicCommentRdfaMarkup(NULL) Drupal\rdf\Tests\CommentAttributesTest->testCommentRdfaMarkup() Drupal\simpletest\TestBase->run() simpletest_script_run_one_test('441', 'Drupal\rdf\Tests\CommentAttributesTest') NoticeCommentAttributesTest.php192Drupal\rdf\Tests\CommentAttributesTest->_testBasicCommentRdfaMarkup()
Trying to get property of non-objectDrupal\rdf\Tests\CommentAttributesTest->_testBasicCommentRdfaMarkup(NULL) Drupal\rdf\Tests\CommentAttributesTest->testCommentRdfaMarkup() Drupal\simpletest\TestBase->run() simpletest_script_run_one_test('441', 'Drupal\rdf\Tests\CommentAttributesTest') NoticeCommentAttributesTest.php192Drupal\rdf\Tests\CommentAttributesTest->_testBasicCommentRdfaMarkup()
Trying to get property of non-objectDrupal\rdf\Tests\CommentAttributesTest->_testBasicCommentRdfaMarkup(NULL) Drupal\rdf\Tests\CommentAttributesTest->testCommentRdfaMarkup() Drupal\simpletest\TestBase->run() simpletest_script_run_one_test('441', 'Drupal\rdf\Tests\CommentAttributesTest') NoticeCommentAttributesTest.php192Drupal\rdf\Tests\CommentAttributesTest->_testBasicCommentRdfaMarkup()
Trying to get property of non-objectDrupal\rdf\Tests\CommentAttributesTest->_testBasicCommentRdfaMarkup(NULL) Drupal\rdf\Tests\CommentAttributesTest->testCommentRdfaMarkup() Drupal\simpletest\TestBase->run() simpletest_script_run_one_test('441', 'Drupal\rdf\Tests\CommentAttributesTest') NoticeCommentAttributesTest.php192Drupal\rdf\Tests\CommentAttributesTest->_testBasicCommentRdfaMarkup()
Comment RDF type for comment found.OtherCommentAttributesTest.php182Drupal\rdf\Tests\CommentAttributesTest->_testBasicCommentRdfaMarkup()
Undefined offset: 0Drupal\rdf\Tests\CommentAttributesTest->_testBasicCommentRdfaMarkup(NULL) Drupal\rdf\Tests\CommentAttributesTest->testCommentRdfaMarkup() Drupal\simpletest\TestBase->run() simpletest_script_run_one_test('441', 'Drupal\rdf\Tests\CommentAttributesTest') NoticeCommentAttributesTest.php184Drupal\rdf\Tests\CommentAttributesTest->_testBasicCommentRdfaMarkup()
Trying to get property of non-objectDrupal\rdf\Tests\CommentAttributesTest->_testBasicCommentRdfaMarkup(NULL) Drupal\rdf\Tests\CommentAttributesTest->testCommentRdfaMarkup() Drupal\simpletest\TestBase->run() simpletest_script_run_one_test('441', 'Drupal\rdf\Tests\CommentAttributesTest') NoticeCommentAttributesTest.php184Drupal\rdf\Tests\CommentAttributesTest->_testBasicCommentRdfaMarkup()
Trying to get property of non-objectDrupal\rdf\Tests\CommentAttributesTest->_testBasicCommentRdfaMarkup(NULL) Drupal\rdf\Tests\CommentAttributesTest->testCommentRdfaMarkup() Drupal\simpletest\TestBase->run() simpletest_script_run_one_test('441', 'Drupal\rdf\Tests\CommentAttributesTest') NoticeCommentAttributesTest.php184Drupal\rdf\Tests\CommentAttributesTest->_testBasicCommentRdfaMarkup()
Trying to get property of non-objectDrupal\rdf\Tests\CommentAttributesTest->_testBasicCommentRdfaMarkup(NULL) Drupal\rdf\Tests\CommentAttributesTest->testCommentRdfaMarkup() Drupal\simpletest\TestBase->run() simpletest_script_run_one_test('441', 'Drupal\rdf\Tests\CommentAttributesTest') NoticeCommentAttributesTest.php184Drupal\rdf\Tests\CommentAttributesTest->_testBasicCommentRdfaMarkup()
RDFa markup for the date of the comment found.OtherCommentAttributesTest.php186Drupal\rdf\Tests\CommentAttributesTest->_testBasicCommentRdfaMarkup()
Undefined offset: 0Drupal\rdf\Tests\CommentAttributesTest->_testBasicCommentRdfaMarkup(NULL) Drupal\rdf\Tests\CommentAttributesTest->testCommentRdfaMarkup() Drupal\simpletest\TestBase->run() simpletest_script_run_one_test('441', 'Drupal\rdf\Tests\CommentAttributesTest') NoticeCommentAttributesTest.php190Drupal\rdf\Tests\CommentAttributesTest->_testBasicCommentRdfaMarkup()
RDFa markup for the comment author found.OtherCommentAttributesTest.php190Drupal\rdf\Tests\CommentAttributesTest->_testBasicCommentRdfaMarkup()
Undefined offset: 0Drupal\rdf\Tests\CommentAttributesTest->_testBasicCommentRdfaMarkup(NULL) Drupal\rdf\Tests\CommentAttributesTest->testCommentRdfaMarkup() Drupal\simpletest\TestBase->run() simpletest_script_run_one_test('441', 'Drupal\rdf\Tests\CommentAttributesTest') NoticeCommentAttributesTest.php192Drupal\rdf\Tests\CommentAttributesTest->_testBasicCommentRdfaMarkup()
Trying to get property of non-objectDrupal\rdf\Tests\CommentAttributesTest->_testBasicCommentRdfaMarkup(NULL) Drupal\rdf\Tests\CommentAttributesTest->testCommentRdfaMarkup() Drupal\simpletest\TestBase->run() simpletest_script_run_one_test('441', 'Drupal\rdf\Tests\CommentAttributesTest') NoticeCommentAttributesTest.php192Drupal\rdf\Tests\CommentAttributesTest->_testBasicCommentRdfaMarkup()
Trying to get property of non-objectDrupal\rdf\Tests\CommentAttributesTest->_testBasicCommentRdfaMarkup(NULL) Drupal\rdf\Tests\CommentAttributesTest->testCommentRdfaMarkup() Drupal\simpletest\TestBase->run() simpletest_script_run_one_test('441', 'Drupal\rdf\Tests\CommentAttributesTest') NoticeCommentAttributesTest.php192Drupal\rdf\Tests\CommentAttributesTest->_testBasicCommentRdfaMarkup()
Trying to get property of non-objectDrupal\rdf\Tests\CommentAttributesTest->_testBasicCommentRdfaMarkup(NULL) Drupal\rdf\Tests\CommentAttributesTest->testCommentRdfaMarkup() Drupal\simpletest\TestBase->run() simpletest_script_run_one_test('441', 'Drupal\rdf\Tests\CommentAttributesTest') NoticeCommentAttributesTest.php192Drupal\rdf\Tests\CommentAttributesTest->_testBasicCommentRdfaMarkup()
Comment subject posted.OtherCommentTestBase.php141Drupal\comment\Tests\CommentTestBase->postComment()
Comment body posted.OtherCommentTestBase.php143Drupal\comment\Tests\CommentTestBase->postComment()
Comment id found.OtherCommentTestBase.php144Drupal\comment\Tests\CommentTestBase->postComment()
Comment RDF type for comment found.OtherCommentAttributesTest.php182Drupal\rdf\Tests\CommentAttributesTest->_testBasicCommentRdfaMarkup()
Undefined offset: 0Drupal\rdf\Tests\CommentAttributesTest->_testBasicCommentRdfaMarkup(NULL, Array) Drupal\rdf\Tests\CommentAttributesTest->testCommentRdfaMarkup() Drupal\simpletest\TestBase->run() simpletest_script_run_one_test('441', 'Drupal\rdf\Tests\CommentAttributesTest') NoticeCommentAttributesTest.php184Drupal\rdf\Tests\CommentAttributesTest->_testBasicCommentRdfaMarkup()
Trying to get property of non-objectDrupal\rdf\Tests\CommentAttributesTest->_testBasicCommentRdfaMarkup(NULL, Array) Drupal\rdf\Tests\CommentAttributesTest->testCommentRdfaMarkup() Drupal\simpletest\TestBase->run() simpletest_script_run_one_test('441', 'Drupal\rdf\Tests\CommentAttributesTest') NoticeCommentAttributesTest.php184Drupal\rdf\Tests\CommentAttributesTest->_testBasicCommentRdfaMarkup()
Trying to get property of non-objectDrupal\rdf\Tests\CommentAttributesTest->_testBasicCommentRdfaMarkup(NULL, Array) Drupal\rdf\Tests\CommentAttributesTest->testCommentRdfaMarkup() Drupal\simpletest\TestBase->run() simpletest_script_run_one_test('441', 'Drupal\rdf\Tests\CommentAttributesTest') NoticeCommentAttributesTest.php184Drupal\rdf\Tests\CommentAttributesTest->_testBasicCommentRdfaMarkup()
Trying to get property of non-objectDrupal\rdf\Tests\CommentAttributesTest->_testBasicCommentRdfaMarkup(NULL, Array) Drupal\rdf\Tests\CommentAttributesTest->testCommentRdfaMarkup() Drupal\simpletest\TestBase->run() simpletest_script_run_one_test('441', 'Drupal\rdf\Tests\CommentAttributesTest') NoticeCommentAttributesTest.php184Drupal\rdf\Tests\CommentAttributesTest->_testBasicCommentRdfaMarkup()
RDFa markup for the date of the comment found.OtherCommentAttributesTest.php186Drupal\rdf\Tests\CommentAttributesTest->_testBasicCommentRdfaMarkup()
Undefined offset: 0Drupal\rdf\Tests\CommentAttributesTest->_testBasicCommentRdfaMarkup(NULL, Array) Drupal\rdf\Tests\CommentAttributesTest->testCommentRdfaMarkup() Drupal\simpletest\TestBase->run() simpletest_script_run_one_test('441', 'Drupal\rdf\Tests\CommentAttributesTest') NoticeCommentAttributesTest.php190Drupal\rdf\Tests\CommentAttributesTest->_testBasicCommentRdfaMarkup()
RDFa markup for the comment author found.OtherCommentAttributesTest.php190Drupal\rdf\Tests\CommentAttributesTest->_testBasicCommentRdfaMarkup()
Undefined offset: 0Drupal\rdf\Tests\CommentAttributesTest->_testBasicCommentRdfaMarkup(NULL, Array) Drupal\rdf\Tests\CommentAttributesTest->testCommentRdfaMarkup() Drupal\simpletest\TestBase->run() simpletest_script_run_one_test('441', 'Drupal\rdf\Tests\CommentAttributesTest') NoticeCommentAttributesTest.php192Drupal\rdf\Tests\CommentAttributesTest->_testBasicCommentRdfaMarkup()
Trying to get property of non-objectDrupal\rdf\Tests\CommentAttributesTest->_testBasicCommentRdfaMarkup(NULL, Array) Drupal\rdf\Tests\CommentAttributesTest->testCommentRdfaMarkup() Drupal\simpletest\TestBase->run() simpletest_script_run_one_test('441', 'Drupal\rdf\Tests\CommentAttributesTest') NoticeCommentAttributesTest.php192Drupal\rdf\Tests\CommentAttributesTest->_testBasicCommentRdfaMarkup()
Trying to get property of non-objectDrupal\rdf\Tests\CommentAttributesTest->_testBasicCommentRdfaMarkup(NULL, Array) Drupal\rdf\Tests\CommentAttributesTest->testCommentRdfaMarkup() Drupal\simpletest\TestBase->run() simpletest_script_run_one_test('441', 'Drupal\rdf\Tests\CommentAttributesTest') NoticeCommentAttributesTest.php192Drupal\rdf\Tests\CommentAttributesTest->_testBasicCommentRdfaMarkup()
Trying to get property of non-objectDrupal\rdf\Tests\CommentAttributesTest->_testBasicCommentRdfaMarkup(NULL, Array) Drupal\rdf\Tests\CommentAttributesTest->testCommentRdfaMarkup() Drupal\simpletest\TestBase->run() simpletest_script_run_one_test('441', 'Drupal\rdf\Tests\CommentAttributesTest') NoticeCommentAttributesTest.php192Drupal\rdf\Tests\CommentAttributesTest->_testBasicCommentRdfaMarkup()
RDFa markup for the homepage of anonymous user found.OtherCommentAttributesTest.php127Drupal\rdf\Tests\CommentAttributesTest->testCommentRdfaMarkup()
Comment RDF type for comment found.OtherCommentAttributesTest.php182Drupal\rdf\Tests\CommentAttributesTest->_testBasicCommentRdfaMarkup()
Undefined offset: 0Drupal\rdf\Tests\CommentAttributesTest->_testBasicCommentRdfaMarkup(NULL, Array) Drupal\rdf\Tests\CommentAttributesTest->testCommentRdfaMarkup() Drupal\simpletest\TestBase->run() simpletest_script_run_one_test('441', 'Drupal\rdf\Tests\CommentAttributesTest') NoticeCommentAttributesTest.php184Drupal\rdf\Tests\CommentAttributesTest->_testBasicCommentRdfaMarkup()
Trying to get property of non-objectDrupal\rdf\Tests\CommentAttributesTest->_testBasicCommentRdfaMarkup(NULL, Array) Drupal\rdf\Tests\CommentAttributesTest->testCommentRdfaMarkup() Drupal\simpletest\TestBase->run() simpletest_script_run_one_test('441', 'Drupal\rdf\Tests\CommentAttributesTest') NoticeCommentAttributesTest.php184Drupal\rdf\Tests\CommentAttributesTest->_testBasicCommentRdfaMarkup()
Trying to get property of non-objectDrupal\rdf\Tests\CommentAttributesTest->_testBasicCommentRdfaMarkup(NULL, Array) Drupal\rdf\Tests\CommentAttributesTest->testCommentRdfaMarkup() Drupal\simpletest\TestBase->run() simpletest_script_run_one_test('441', 'Drupal\rdf\Tests\CommentAttributesTest') NoticeCommentAttributesTest.php184Drupal\rdf\Tests\CommentAttributesTest->_testBasicCommentRdfaMarkup()
Trying to get property of non-objectDrupal\rdf\Tests\CommentAttributesTest->_testBasicCommentRdfaMarkup(NULL, Array) Drupal\rdf\Tests\CommentAttributesTest->testCommentRdfaMarkup() Drupal\simpletest\TestBase->run() simpletest_script_run_one_test('441', 'Drupal\rdf\Tests\CommentAttributesTest') NoticeCommentAttributesTest.php184Drupal\rdf\Tests\CommentAttributesTest->_testBasicCommentRdfaMarkup()
RDFa markup for the date of the comment found.OtherCommentAttributesTest.php186Drupal\rdf\Tests\CommentAttributesTest->_testBasicCommentRdfaMarkup()
Undefined offset: 0Drupal\rdf\Tests\CommentAttributesTest->_testBasicCommentRdfaMarkup(NULL, Array) Drupal\rdf\Tests\CommentAttributesTest->testCommentRdfaMarkup() Drupal\simpletest\TestBase->run() simpletest_script_run_one_test('441', 'Drupal\rdf\Tests\CommentAttributesTest') NoticeCommentAttributesTest.php190Drupal\rdf\Tests\CommentAttributesTest->_testBasicCommentRdfaMarkup()
RDFa markup for the comment author found.OtherCommentAttributesTest.php190Drupal\rdf\Tests\CommentAttributesTest->_testBasicCommentRdfaMarkup()
Undefined offset: 0Drupal\rdf\Tests\CommentAttributesTest->_testBasicCommentRdfaMarkup(NULL, Array) Drupal\rdf\Tests\CommentAttributesTest->testCommentRdfaMarkup() Drupal\simpletest\TestBase->run() simpletest_script_run_one_test('441', 'Drupal\rdf\Tests\CommentAttributesTest') NoticeCommentAttributesTest.php192Drupal\rdf\Tests\CommentAttributesTest->_testBasicCommentRdfaMarkup()
Trying to get property of non-objectDrupal\rdf\Tests\CommentAttributesTest->_testBasicCommentRdfaMarkup(NULL, Array) Drupal\rdf\Tests\CommentAttributesTest->testCommentRdfaMarkup() Drupal\simpletest\TestBase->run() simpletest_script_run_one_test('441', 'Drupal\rdf\Tests\CommentAttributesTest') NoticeCommentAttributesTest.php192Drupal\rdf\Tests\CommentAttributesTest->_testBasicCommentRdfaMarkup()
Trying to get property of non-objectDrupal\rdf\Tests\CommentAttributesTest->_testBasicCommentRdfaMarkup(NULL, Array) Drupal\rdf\Tests\CommentAttributesTest->testCommentRdfaMarkup() Drupal\simpletest\TestBase->run() simpletest_script_run_one_test('441', 'Drupal\rdf\Tests\CommentAttributesTest') NoticeCommentAttributesTest.php192Drupal\rdf\Tests\CommentAttributesTest->_testBasicCommentRdfaMarkup()
Trying to get property of non-objectDrupal\rdf\Tests\CommentAttributesTest->_testBasicCommentRdfaMarkup(NULL, Array) Drupal\rdf\Tests\CommentAttributesTest->testCommentRdfaMarkup() Drupal\simpletest\TestBase->run() simpletest_script_run_one_test('441', 'Drupal\rdf\Tests\CommentAttributesTest') NoticeCommentAttributesTest.php192Drupal\rdf\Tests\CommentAttributesTest->_testBasicCommentRdfaMarkup()
RDFa markup for the homepage of anonymous user found.OtherCommentAttributesTest.php138Drupal\rdf\Tests\CommentAttributesTest->testCommentRdfaMarkup()
The test did not complete due to a fatal error.Completion checkCommentAttributesTest.php147Drupal\rdf\Tests\CommentAttributesTest->testCommentReplyOfRdfaMarkup()
Comment subject posted.OtherCommentTestBase.php141Drupal\comment\Tests\CommentTestBase->postComment()
Comment body posted.OtherCommentTestBase.php143Drupal\comment\Tests\CommentTestBase->postComment()
Comment id found.OtherCommentTestBase.php144Drupal\comment\Tests\CommentTestBase->postComment()
RDFa markup referring to the node is present.OtherCommentAttributesTest.php154Drupal\rdf\Tests\CommentAttributesTest->testCommentReplyOfRdfaMarkup()
LeafDrupal\rdf\Tests\CrudTest1000
LeafDrupal\rdf\Tests\GetNamespacesTest700
LeafDrupal\rdf\Tests\GetRdfNamespacesTest500
LeafDrupal\rdf\Tests\MappingDefinitionTest5900
LeafDrupal\rdf\Tests\MappingHookTest600
LeafDrupal\rdf\Tests\RdfaMarkupTest2900
LeafDrupal\rdf\Tests\RdfMappingEventTest300
LeafDrupal\rdf\Tests\SiteSchemaTest300
ExpandDrupal\rdf\Tests\TrackerAttributesTest2940
MessageGroupFilenameLineFunctionStatus
Num replies property and content attributes found on Anonymous user content.OtherTrackerAttributesTest.php127Drupal\rdf\Tests\TrackerAttributesTest->_testBasicTrackerRdfaMarkup()
Latest activity date found when there are comments on Anonymous user content. Latest activity date content is correct.OtherTrackerAttributesTest.php137Drupal\rdf\Tests\TrackerAttributesTest->_testBasicTrackerRdfaMarkup()
Num replies property and content attributes found on Registered user content.OtherTrackerAttributesTest.php127Drupal\rdf\Tests\TrackerAttributesTest->_testBasicTrackerRdfaMarkup()
Latest activity date found when there are comments on Registered user content. Latest activity date content is correct.OtherTrackerAttributesTest.php137Drupal\rdf\Tests\TrackerAttributesTest->_testBasicTrackerRdfaMarkup()
LeafDrupal\rest\Tests\CreateTest2900
LeafDrupal\rest\Tests\DBLogTest1800
LeafDrupal\rest\Tests\DeleteTest7900
LeafDrupal\rest\Tests\ReadTest3500
LeafDrupal\rest\Tests\UpdateTest6500
LeafDrupal\search\Tests\SearchAdvancedSearchFormTest3400
LeafDrupal\search\Tests\SearchBlockTest4100
ExpandDrupal\search\Tests\SearchCommentCountToggleTest2920
MessageGroupFilenameLineFunctionStatus
Non-empty comment count displays for nodes with comment status set to OpenOtherSearchCommentCountToggleTest.php89Drupal\search\Tests\SearchCommentCountToggleTest->testSearchCommentCountToggle()
Non-empty comment count displays for nodes with comment status set to ClosedOtherSearchCommentCountToggleTest.php99Drupal\search\Tests\SearchCommentCountToggleTest->testSearchCommentCountToggle()
ExpandDrupal\search\Tests\SearchCommentTest174190
MessageGroupFilenameLineFunctionStatus
Node found in search results.OtherSearchCommentTest.php93Drupal\search\Tests\SearchCommentTest->testSearchResultsComment()
Comment subject found in search results.OtherSearchCommentTest.php94Drupal\search\Tests\SearchCommentTest->testSearchResultsComment()
Node found in search results.OtherSearchCommentTest.php101Drupal\search\Tests\SearchCommentTest->testSearchResultsComment()
Comment body text found in search results.OtherSearchCommentTest.php104Drupal\search\Tests\SearchCommentTest->testSearchResultsComment()
"fY3X8mv0" foundOtherSearchCommentTest.php147Drupal\search\Tests\SearchCommentTest->testSearchResultsCommentAccess()
"Test comment subject" foundOtherSearchCommentTest.php147Drupal\search\Tests\SearchCommentTest->testSearchResultsCommentAccess()
Anon user has search permission and access comments permission, comments should be indexedOtherSearchCommentTest.php147Drupal\search\Tests\SearchCommentTest->testSearchResultsCommentAccess()
"fY3X8mv0" foundOtherSearchCommentTest.php159Drupal\search\Tests\SearchCommentTest->testSearchResultsCommentAccess()
"Test comment subject" foundOtherSearchCommentTest.php159Drupal\search\Tests\SearchCommentTest->testSearchResultsCommentAccess()
Admin user has search permission and access comments permission, comments should be indexedOtherSearchCommentTest.php159Drupal\search\Tests\SearchCommentTest->testSearchResultsCommentAccess()
"fY3X8mv0" foundOtherSearchCommentTest.php165Drupal\search\Tests\SearchCommentTest->testSearchResultsCommentAccess()
"Test comment subject" foundOtherSearchCommentTest.php165Drupal\search\Tests\SearchCommentTest->testSearchResultsCommentAccess()
Authenticated user has search permission and access comments permission, comments should be indexedOtherSearchCommentTest.php165Drupal\search\Tests\SearchCommentTest->testSearchResultsCommentAccess()
"fY3X8mv0" foundOtherSearchCommentTest.php171Drupal\search\Tests\SearchCommentTest->testSearchResultsCommentAccess()
"Test comment subject" foundOtherSearchCommentTest.php171Drupal\search\Tests\SearchCommentTest->testSearchResultsCommentAccess()
Admin user has search permission and no access comments permission, but comments should be indexed because admin user inherits authenticated user's permission to access commentsOtherSearchCommentTest.php171Drupal\search\Tests\SearchCommentTest->testSearchResultsCommentAccess()
"fY3X8mv0" foundOtherSearchCommentTest.php177Drupal\search\Tests\SearchCommentTest->testSearchResultsCommentAccess()
"Test comment subject" foundOtherSearchCommentTest.php177Drupal\search\Tests\SearchCommentTest->testSearchResultsCommentAccess()
Admin user has access comments permission and no search permission, but comments should be indexed because admin user inherits authenticated user's permission to searchOtherSearchCommentTest.php177Drupal\search\Tests\SearchCommentTest->testSearchResultsCommentAccess()
LeafDrupal\search\Tests\SearchConfigSettingsFormTest13400
LeafDrupal\search\Tests\SearchEmbedFormTest3200
LeafDrupal\search\Tests\SearchExactTest2500
LeafDrupal\search\Tests\SearchExcerptTest1800
LeafDrupal\search\Tests\SearchExpressionInsertExtractTest2400
LeafDrupal\search\Tests\SearchKeywordsConditionsTest2800
LeafDrupal\search\Tests\SearchLanguageTest4100
LeafDrupal\search\Tests\SearchMatchTest14700
LeafDrupal\search\Tests\SearchMultilingualEntityTest1000
LeafDrupal\search\Tests\SearchNodeAccessTest1600
LeafDrupal\search\Tests\SearchNumberMatchingTest29500
LeafDrupal\search\Tests\SearchNumbersTest17500
LeafDrupal\search\Tests\SearchPageOverrideTest1500
LeafDrupal\search\Tests\SearchPageTextTest3700
LeafDrupal\search\Tests\SearchPreprocessLangcodeTest3900
ExpandDrupal\search\Tests\SearchRankingTest5810
MessageGroupFilenameLineFunctionStatus
Search ranking "comments" order.OtherSearchRankingTest.php101Drupal\search\Tests\SearchRankingTest->testRankings()
LeafDrupal\search\Tests\SearchSimplifyTest65700
LeafDrupal\search\Tests\SearchTokenizerTest800
LeafDrupal\shortcut\Tests\ShortcutLinksTest14800
LeafDrupal\shortcut\Tests\ShortcutSetsTest23500
LeafDrupal\simpletest\Tests\BrokenSetUpTest2100
LeafDrupal\simpletest\Tests\BrowserTest1600
LeafDrupal\simpletest\Tests\DrupalUnitTestBaseTest3000
LeafDrupal\simpletest\Tests\FolderTest200
LeafDrupal\simpletest\Tests\InstallationProfileModuleTestsTest1900
LeafDrupal\simpletest\Tests\MailCaptureTest1200
LeafDrupal\simpletest\Tests\MissingCheckedRequirementsTest1900
LeafDrupal\simpletest\Tests\OtherInstallationProfileModuleTestsTest1200
LeafDrupal\simpletest\Tests\SimpleTestTest13300
LeafDrupal\standard\Tests\StandardTest700
LeafDrupal\statistics\Tests\StatisticsAdminTest13300
LeafDrupal\statistics\Tests\StatisticsBlockVisitorsTest4600
LeafDrupal\statistics\Tests\StatisticsLoggingTest3500
LeafDrupal\statistics\Tests\StatisticsReportsTest11000
LeafDrupal\statistics\Tests\StatisticsTokenReplaceTest3000
LeafDrupal\syslog\Tests\SyslogTest1700
LeafDrupal\system\Tests\Ajax\AjaxCommandsUnitTest1600
LeafDrupal\system\Tests\Ajax\CommandsTest7700
LeafDrupal\system\Tests\Ajax\DialogTest300
LeafDrupal\system\Tests\Ajax\ElementValidationTest700
LeafDrupal\system\Tests\Ajax\FormValuesTest2900
LeafDrupal\system\Tests\Ajax\FrameworkTest3400
LeafDrupal\system\Tests\Ajax\MultiFormTest3600
LeafDrupal\system\Tests\Batch\PageTest1600
LeafDrupal\system\Tests\Batch\PercentagesUnitTest1800
LeafDrupal\system\Tests\Batch\ProcessingTest16100
LeafDrupal\system\Tests\Bootstrap\GetFilenameUnitTest600
LeafDrupal\system\Tests\Bootstrap\HookBootExitTest1900
LeafDrupal\system\Tests\Bootstrap\IpAddressTest1100
LeafDrupal\system\Tests\Bootstrap\MiscUnitTest400
LeafDrupal\system\Tests\Bootstrap\OverrideServerVariablesUnitTest600
LeafDrupal\system\Tests\Bootstrap\PageCacheTest7900
LeafDrupal\system\Tests\Bootstrap\ResettableStaticUnitTest500
LeafDrupal\system\Tests\Bootstrap\TimerUnitTest500
LeafDrupal\system\Tests\Bootstrap\VariableTest900
LeafDrupal\system\Tests\Bundle\BundleTest900
LeafDrupal\system\Tests\Cache\BackendChainImplementationUnitTest4800
LeafDrupal\system\Tests\Cache\BackendChainUnitTest12600
LeafDrupal\system\Tests\Cache\ClearTest900
LeafDrupal\system\Tests\Cache\DatabaseBackendUnitTest12600
LeafDrupal\system\Tests\Cache\MemoryBackendUnitTest12600
LeafDrupal\system\Tests\Cache\NullBackendTest200
LeafDrupal\system\Tests\Common\AddFeedTest700
LeafDrupal\system\Tests\Common\AlterTest700
LeafDrupal\system\Tests\Common\AttributesUnitTest700
LeafDrupal\system\Tests\Common\AutocompleteTagsUnitTest800
LeafDrupal\system\Tests\Common\CascadingStylesheetsTest4300
LeafDrupal\system\Tests\Common\CascadingStylesheetsUnitTest1200
LeafDrupal\system\Tests\Common\ColorTest8500
LeafDrupal\system\Tests\Common\FormatDateTest7300
LeafDrupal\system\Tests\Common\GotoTest2700
LeafDrupal\system\Tests\Common\HtmlIdentifierUnitTest1000
LeafDrupal\system\Tests\Common\HttpRequestTest3600
LeafDrupal\system\Tests\Common\InstallerLanguageTest800
LeafDrupal\system\Tests\Common\JavaScriptTest9300
LeafDrupal\system\Tests\Common\JsonUnitTest2100
LeafDrupal\system\Tests\Common\NestedArrayUnitTest1400
LeafDrupal\system\Tests\Common\ParseInfoFileUnitTest300
LeafDrupal\system\Tests\Common\RegionContentTest1800
LeafDrupal\system\Tests\Common\RenderTest5400
LeafDrupal\system\Tests\Common\SimpleTestErrorCollectorTest1600
LeafDrupal\system\Tests\Common\SizeUnitTest3500
LeafDrupal\system\Tests\Common\SystemListingTest600
LeafDrupal\system\Tests\Common\TableSortExtenderUnitTest600
LeafDrupal\system\Tests\Common\UrlTest7500
LeafDrupal\system\Tests\Common\ValidNumberStepUnitTest2400
LeafDrupal\system\Tests\Common\ValidUrlUnitTest7900
LeafDrupal\system\Tests\Common\WriteRecordTest3400
LeafDrupal\system\Tests\Common\XssUnitTest1700
LeafDrupal\system\Tests\Database\AlterTest2000
LeafDrupal\system\Tests\Database\BasicSyntaxTest600
LeafDrupal\system\Tests\Database\CaseSensitivityTest200
LeafDrupal\system\Tests\Database\ConnectionTest1400
LeafDrupal\system\Tests\Database\ConnectionUnitTest1200
LeafDrupal\system\Tests\Database\DatabaseExceptionWrapperTest100
LeafDrupal\system\Tests\Database\DeleteTruncateTest500
LeafDrupal\system\Tests\Database\EmptyStatementTest400
LeafDrupal\system\Tests\Database\FetchTest2400
LeafDrupal\system\Tests\Database\InsertDefaultsTest400
LeafDrupal\system\Tests\Database\InsertLobTest300
LeafDrupal\system\Tests\Database\InsertTest1500
LeafDrupal\system\Tests\Database\InvalidDataTest200
LeafDrupal\system\Tests\Database\LoggingTest1400
LeafDrupal\system\Tests\Database\MergeTest3500
LeafDrupal\system\Tests\Database\NextIdTest200
LeafDrupal\system\Tests\Database\QueryTest100
LeafDrupal\system\Tests\Database\RangeQueryTest200
LeafDrupal\system\Tests\Database\RegressionTest700
LeafDrupal\system\Tests\Database\SchemaTest58800
LeafDrupal\system\Tests\Database\SelectCloneTest200
LeafDrupal\system\Tests\Database\SelectComplexTest6000
LeafDrupal\system\Tests\Database\SelectOrderedTest1100
LeafDrupal\system\Tests\Database\SelectPagerDefaultTest3600
LeafDrupal\system\Tests\Database\SelectSubqueryTest700
LeafDrupal\system\Tests\Database\SelectTableSortDefaultTest5600
LeafDrupal\system\Tests\Database\SelectTest5400
LeafDrupal\system\Tests\Database\SerializeQueryTest100
LeafDrupal\system\Tests\Database\TaggingTest1000
LeafDrupal\system\Tests\Database\TemporaryQueryTest1200
LeafDrupal\system\Tests\Database\TransactionTest8800
LeafDrupal\system\Tests\Database\UpdateComplexTest3800
LeafDrupal\system\Tests\Database\UpdateLobTest600
LeafDrupal\system\Tests\Database\UpdateTest2600
LeafDrupal\system\Tests\Datetime\DateTimePlusTest10800
LeafDrupal\system\Tests\Datetime\DrupalDateTimeTest2800
LeafDrupal\system\Tests\DrupalKernel\ContentNegotiationTest8000
LeafDrupal\system\Tests\DrupalKernel\DrupalKernelTest1600
LeafDrupal\system\Tests\Entity\EntityAccessTest3400
LeafDrupal\system\Tests\Entity\EntityApiInfoTest600
ExpandDrupal\system\Tests\Entity\EntityApiTest801
MessageGroupFilenameLineFunctionStatus
Drupal\Core\Entity\EntityStorageException: Field value is unknown. in Drupal\Core\Entity\DatabaseStorageControllerNG->save() (line 321 of /var/lib/drupaltestbot/sites/default/files/checkout/core/lib/Drupal/Core/Entity/DatabaseStorageControllerNG.php). Drupal\Core\Entity\DatabaseStorageControllerNG->save(Object) Drupal\Core\Entity\Entity->save() Drupal\system\Tests\Entity\EntityApiTest->assertCRUD('entity_test_mul', Object) Drupal\system\Tests\Entity\EntityApiTest->testCRUD() Drupal\simpletest\TestBase->run() simpletest_script_run_one_test('171', 'Drupal\system\Tests\Entity\EntityApiTest') Uncaught exceptionDatabaseStorageControllerNG.php321Drupal\Core\Entity\DatabaseStorageControllerNG->save()
LeafDrupal\system\Tests\Entity\EntityCrudHookTest11700
ExpandDrupal\system\Tests\Entity\EntityFieldTest64103
MessageGroupFilenameLineFunctionStatus
Drupal\Core\Entity\EntityStorageException: Field value is unknown. in Drupal\Core\Entity\DatabaseStorageControllerNG->save() (line 321 of /var/lib/drupaltestbot/sites/default/files/checkout/core/lib/Drupal/Core/Entity/DatabaseStorageControllerNG.php). Drupal\Core\Entity\DatabaseStorageControllerNG->save(Object) Drupal\Core\Entity\Entity->save() Drupal\system\Tests\Entity\EntityFieldTest->assertSave('entity_test_mul') Drupal\system\Tests\Entity\EntityFieldTest->testSave() Drupal\simpletest\TestBase->run() simpletest_script_run_one_test('173', 'Drupal\system\Tests\Entity\EntityFieldTest') Uncaught exceptionDatabaseStorageControllerNG.php321Drupal\Core\Entity\DatabaseStorageControllerNG->save()
Drupal\Core\Entity\EntityStorageException: Field value is unknown. in Drupal\Core\Entity\DatabaseStorageControllerNG->save() (line 321 of /var/lib/drupaltestbot/sites/default/files/checkout/core/lib/Drupal/Core/Entity/DatabaseStorageControllerNG.php). Drupal\Core\Entity\DatabaseStorageControllerNG->save(Object) Drupal\Core\Entity\Entity->save() Drupal\system\Tests\Entity\EntityFieldTest->assertDataStructureInterfaces('entity_test_mul') Drupal\system\Tests\Entity\EntityFieldTest->testDataStructureInterfaces() Drupal\simpletest\TestBase->run() simpletest_script_run_one_test('173', 'Drupal\system\Tests\Entity\EntityFieldTest') Uncaught exceptionDatabaseStorageControllerNG.php321Drupal\Core\Entity\DatabaseStorageControllerNG->save()
Drupal\Core\Entity\EntityStorageException: Field value is unknown. in Drupal\Core\Entity\DatabaseStorageControllerNG->save() (line 321 of /var/lib/drupaltestbot/sites/default/files/checkout/core/lib/Drupal/Core/Entity/DatabaseStorageControllerNG.php). Drupal\Core\Entity\DatabaseStorageControllerNG->save(Object) Drupal\Core\Entity\Entity->save() Drupal\system\Tests\Entity\EntityFieldTest->assertComputedProperties('entity_test_mul') Drupal\system\Tests\Entity\EntityFieldTest->testComputedProperties() Drupal\simpletest\TestBase->run() simpletest_script_run_one_test('173', 'Drupal\system\Tests\Entity\EntityFieldTest') Uncaught exceptionDatabaseStorageControllerNG.php321Drupal\Core\Entity\DatabaseStorageControllerNG->save()
ExpandDrupal\system\Tests\Entity\EntityFormTest3020
MessageGroupFilenameLineFunctionStatus
The test did not complete due to a fatal error.Completion checkEntityFormTest.php41Drupal\system\Tests\Entity\EntityFormTest->testFormCRUD()
entity_test_mul: Entity found in the database.OtherEntityFormTest.php44Drupal\system\Tests\Entity\EntityFormTest->testFormCRUD()
LeafDrupal\system\Tests\Entity\EntityQueryRelationshipTest2000
LeafDrupal\system\Tests\Entity\EntityQueryTest6200
ExpandDrupal\system\Tests\Entity\EntityRevisionsTest3101
MessageGroupFilenameLineFunctionStatus
Drupal\Core\Entity\EntityStorageException: Field value is unknown. in Drupal\Core\Entity\DatabaseStorageControllerNG->save() (line 321 of /var/lib/drupaltestbot/sites/default/files/checkout/core/lib/Drupal/Core/Entity/DatabaseStorageControllerNG.php). Drupal\Core\Entity\DatabaseStorageControllerNG->save(Object) Drupal\Core\Entity\Entity->save() Drupal\system\Tests\Entity\EntityRevisionsTest->assertRevisions('entity_test_mulrev') Drupal\system\Tests\Entity\EntityRevisionsTest->testRevisions() Drupal\simpletest\TestBase->run() simpletest_script_run_one_test('177', 'Drupal\system\Tests\Entity\EntityRevisionsTest') Uncaught exceptionDatabaseStorageControllerNG.php321Drupal\Core\Entity\DatabaseStorageControllerNG->save()
LeafDrupal\system\Tests\Entity\EntityTranslationFormTest3600
ExpandDrupal\system\Tests\Entity\EntityTranslationTest7801
MessageGroupFilenameLineFunctionStatus
Drupal\Core\Entity\EntityStorageException: Field value is unknown. in Drupal\Core\Entity\DatabaseStorageControllerNG->save() (line 321 of /var/lib/drupaltestbot/sites/default/files/checkout/core/lib/Drupal/Core/Entity/DatabaseStorageControllerNG.php). Drupal\Core\Entity\DatabaseStorageControllerNG->save(Object) Drupal\Core\Entity\Entity->save() Drupal\system\Tests\Entity\EntityTranslationTest->assertMultilingualProperties('entity_test_mul') Drupal\system\Tests\Entity\EntityTranslationTest->testMultilingualProperties() Drupal\simpletest\TestBase->run() simpletest_script_run_one_test('179', 'Drupal\system\Tests\Entity\EntityTranslationTest') Uncaught exceptionDatabaseStorageControllerNG.php321Drupal\Core\Entity\DatabaseStorageControllerNG->save()
ExpandDrupal\system\Tests\Entity\EntityUUIDTest2001
MessageGroupFilenameLineFunctionStatus
Drupal\Core\Entity\EntityStorageException: Field value is unknown. in Drupal\Core\Entity\DatabaseStorageControllerNG->save() (line 321 of /var/lib/drupaltestbot/sites/default/files/checkout/core/lib/Drupal/Core/Entity/DatabaseStorageControllerNG.php). Drupal\Core\Entity\DatabaseStorageControllerNG->save(Object) Drupal\Core\Entity\Entity->save() Drupal\system\Tests\Entity\EntityUUIDTest->assertCRUD('entity_test_mul') Drupal\system\Tests\Entity\EntityUUIDTest->testCRUD() Drupal\simpletest\TestBase->run() simpletest_script_run_one_test('180', 'Drupal\system\Tests\Entity\EntityUUIDTest') Uncaught exceptionDatabaseStorageControllerNG.php321Drupal\Core\Entity\DatabaseStorageControllerNG->save()
LeafDrupal\system\Tests\FileTransfer\FileTransferTest200
LeafDrupal\system\Tests\File\DirectoryTest2000
LeafDrupal\system\Tests\File\MimeTypeTest4200
LeafDrupal\system\Tests\File\NameMungingTest600
LeafDrupal\system\Tests\File\ReadOnlyStreamWrapperTest1600
LeafDrupal\system\Tests\File\RemoteFileDirectoryTest2400
LeafDrupal\system\Tests\File\RemoteFileScanDirectoryTest2900
LeafDrupal\system\Tests\File\RemoteFileUnmanagedCopyTest3200
LeafDrupal\system\Tests\File\RemoteFileUnmanagedDeleteRecursiveTest2100
LeafDrupal\system\Tests\File\RemoteFileUnmanagedDeleteTest1000
LeafDrupal\system\Tests\File\RemoteFileUnmanagedMoveTest2300
LeafDrupal\system\Tests\File\RemoteFileUnmanagedSaveDataTest800
LeafDrupal\system\Tests\File\ScanDirectoryTest2900
LeafDrupal\system\Tests\File\StreamWrapperTest1900
LeafDrupal\system\Tests\File\UnmanagedCopyTest2900
LeafDrupal\system\Tests\File\UnmanagedDeleteRecursiveTest1700
LeafDrupal\system\Tests\File\UnmanagedDeleteTest700
LeafDrupal\system\Tests\File\UnmanagedMoveTest2000
LeafDrupal\system\Tests\File\UnmanagedSaveDataTest700
LeafDrupal\system\Tests\File\UrlRewritingTest1400
LeafDrupal\system\Tests\Form\AlterTest400
LeafDrupal\system\Tests\Form\ArbitraryRebuildTest1600
LeafDrupal\system\Tests\Form\CheckboxTest9700
LeafDrupal\system\Tests\Form\ElementsLabelsTest2000
LeafDrupal\system\Tests\Form\ElementsTableSelectTest7100
LeafDrupal\system\Tests\Form\ElementsVerticalTabsTest3900
LeafDrupal\system\Tests\Form\ElementTest4300
LeafDrupal\system\Tests\Form\EmailTest1700
LeafDrupal\system\Tests\Form\FileInclusionTest1100
LeafDrupal\system\Tests\Form\FormTest72500
LeafDrupal\system\Tests\Form\HTMLIdTest700
LeafDrupal\system\Tests\Form\LanguageSelectElementTest4400
LeafDrupal\system\Tests\Form\ProgrammaticTest2400
LeafDrupal\system\Tests\Form\RebuildTest5300
LeafDrupal\system\Tests\Form\RedirectTest3100
LeafDrupal\system\Tests\Form\StateValuesCleanAdvancedTest700
LeafDrupal\system\Tests\Form\StateValuesCleanTest1400
LeafDrupal\system\Tests\Form\StorageTest17300
LeafDrupal\system\Tests\Form\TriggeringElementTest5000
LeafDrupal\system\Tests\Form\UrlTest1700
LeafDrupal\system\Tests\Form\ValidationTest13500
LeafDrupal\system\Tests\Form\WrapperTest500
LeafDrupal\system\Tests\Graph\GraphUnitTest5600
LeafDrupal\system\Tests\Image\FileMoveTest400
LeafDrupal\system\Tests\Image\ToolkitGdTest20400
LeafDrupal\system\Tests\Image\ToolkitTest5300
LeafDrupal\system\Tests\KeyValueStore\DatabaseStorageExpirableTest6800
LeafDrupal\system\Tests\KeyValueStore\DatabaseStorageTest3600
LeafDrupal\system\Tests\KeyValueStore\GarbageCollectionTest200
LeafDrupal\system\Tests\KeyValueStore\MemoryStorageTest3600
LeafDrupal\system\Tests\Lock\LockFunctionalTest2900
LeafDrupal\system\Tests\Mail\HtmlToTextTest8600
LeafDrupal\system\Tests\Mail\MailTest700
LeafDrupal\system\Tests\Mail\WrapMailUnitTest200
LeafDrupal\system\Tests\Menu\BreadcrumbTest41900
LeafDrupal\system\Tests\Menu\LinksTest5000
LeafDrupal\system\Tests\Menu\MenuRouterTest23400
LeafDrupal\system\Tests\Menu\RebuildTest500
LeafDrupal\system\Tests\Menu\TrailTest8800
LeafDrupal\system\Tests\Menu\TreeDataUnitTest400
LeafDrupal\system\Tests\Menu\TreeOutputTest700
LeafDrupal\system\Tests\Module\ClassLoaderTest1000
LeafDrupal\system\Tests\Module\DependencyTest16000
LeafDrupal\system\Tests\Module\EnableDisableTest218700
LeafDrupal\system\Tests\Module\HookRequirementsTest1600
LeafDrupal\system\Tests\Module\InstallTest300
LeafDrupal\system\Tests\Module\ModuleApiTest6800
LeafDrupal\system\Tests\Module\ModuleEnable300
LeafDrupal\system\Tests\Module\RequiredTest1900
LeafDrupal\system\Tests\Module\UninstallTest200
LeafDrupal\system\Tests\Module\VersionTest5100
LeafDrupal\system\Tests\Pager\PagerTest12300
LeafDrupal\system\Tests\Path\AliasTest2700
LeafDrupal\system\Tests\Path\MatchPathTest4100
LeafDrupal\system\Tests\Path\UrlAlterFunctionalTest3700
LeafDrupal\system\Tests\PhpStorage\FileStorageTest1200
LeafDrupal\system\Tests\PhpStorage\MTimeProtectedFastFileStorageTest1900
LeafDrupal\system\Tests\PhpStorage\MTimeProtectedFileStorageTest1900
LeafDrupal\system\Tests\Plugin\AlterDecoratorTest300
LeafDrupal\system\Tests\Plugin\CacheDecoratorLanguageTest3800
LeafDrupal\system\Tests\Plugin\CacheDecoratorTest1400
LeafDrupal\system\Tests\Plugin\DerivativeTest900
LeafDrupal\system\Tests\Plugin\Discovery\AnnotatedClassDiscoveryTest700
LeafDrupal\system\Tests\Plugin\Discovery\StaticDiscoveryTest600
LeafDrupal\system\Tests\Plugin\FactoryTest900
LeafDrupal\system\Tests\Plugin\InspectionTest1000
LeafDrupal\system\Tests\Plugin\PluginBagTest1900
LeafDrupal\system\Tests\Queue\QueueTest1400
LeafDrupal\system\Tests\Routing\ChainMatcherTest300
LeafDrupal\system\Tests\Routing\ControllerResolverTest100
LeafDrupal\system\Tests\Routing\FirstEntryFinalMatcherTest800
LeafDrupal\system\Tests\Routing\HttpMethodMatcherTest800
LeafDrupal\system\Tests\Routing\MatcherDumperTest800
LeafDrupal\system\Tests\Routing\MimeTypeMatcherTest1100
LeafDrupal\system\Tests\Routing\NestedMatcherTest100
LeafDrupal\system\Tests\Routing\PathMatcherTest2900
LeafDrupal\system\Tests\Routing\RouterPermissionTest1900
LeafDrupal\system\Tests\Routing\RouterTest3000
LeafDrupal\system\Tests\Routing\RouteTest600
ExpandDrupal\system\Tests\Serialization\EntitySerializationTest110
MessageGroupFilenameLineFunctionStatus
The test did not complete due to a fatal error.Completion checkEntitySerializationTest.php69Drupal\system\Tests\Serialization\EntitySerializationTest->testNormalize()
LeafDrupal\system\Tests\Serialization\SerializationTest200
LeafDrupal\system\Tests\Session\SessionHttpsTest8300
LeafDrupal\system\Tests\Session\SessionTest19000
LeafDrupal\system\Tests\System\AccessDeniedTest13100
LeafDrupal\system\Tests\System\AdminMetaTagTest600
LeafDrupal\system\Tests\System\AdminTest29300
LeafDrupal\system\Tests\System\CronRunTest6100
LeafDrupal\system\Tests\System\DateFormatsLanguageTest5600
LeafDrupal\system\Tests\System\DateTimeTest7700
LeafDrupal\system\Tests\System\DefaultMobileMetaTagsTest1200
LeafDrupal\system\Tests\System\ErrorHandlerTest4000
LeafDrupal\system\Tests\System\ExceptionControllerTest200
LeafDrupal\system\Tests\System\FloodTest1000
LeafDrupal\system\Tests\System\FrontPageTest3700
LeafDrupal\system\Tests\System\IndexPhpTest600
LeafDrupal\system\Tests\System\InfoAlterTest1000
LeafDrupal\system\Tests\System\InfoFileParserUnitTest900
LeafDrupal\system\Tests\System\MainContentFallbackTest6000
LeafDrupal\system\Tests\System\PageNotFoundTest1800
LeafDrupal\system\Tests\System\PageTitleFilteringTest4400
LeafDrupal\system\Tests\System\PasswordHashingTest1000
LeafDrupal\system\Tests\System\RetrieveFileTest700
LeafDrupal\system\Tests\System\ShutdownFunctionsTest500
LeafDrupal\system\Tests\System\SiteMaintenanceTest7700
LeafDrupal\system\Tests\System\SystemAuthorizeTest1600
LeafDrupal\system\Tests\System\ThemeTest20500
LeafDrupal\system\Tests\System\TokenReplaceTest3600
LeafDrupal\system\Tests\System\UnicodeUnitTest18200
ExpandDrupal\system\Tests\Theme\EntityFilteringThemeTest810
MessageGroupFilenameLineFunctionStatus
The test did not complete due to a fatal error.Completion checkEntityFilteringThemeTest.php122Drupal\system\Tests\Theme\EntityFilteringThemeTest->testThemedEntity()
LeafDrupal\system\Tests\Theme\FastTest1200
LeafDrupal\system\Tests\Theme\FunctionsTest2500
LeafDrupal\system\Tests\Theme\HookInitTest500
LeafDrupal\system\Tests\Theme\HtmlTagUnitTest200
LeafDrupal\system\Tests\Theme\HtmlTplPhpAttributesTest500
LeafDrupal\system\Tests\Theme\RegistryTest600
LeafDrupal\system\Tests\Theme\TableTest600
LeafDrupal\system\Tests\Theme\ThemeInfoStylesTest1300
LeafDrupal\system\Tests\Theme\ThemeTest4800
LeafDrupal\system\Tests\Theme\ThemeTestTwig1000
LeafDrupal\system\Tests\Theme\TwigReferenceUnitTest1500
LeafDrupal\system\Tests\Transliteration\TransliterationTest2600
LeafDrupal\system\Tests\TypedData\TypedDataTest6800
LeafDrupal\system\Tests\Update\DependencyHookInvocationTest400
LeafDrupal\system\Tests\Update\DependencyMissingTest400
LeafDrupal\system\Tests\Update\DependencyOrderingTest500
LeafDrupal\system\Tests\Update\UpdateScriptTest20100
LeafDrupal\system\Tests\Upgrade\BareMinimalUpgradePathTest6800
LeafDrupal\system\Tests\Upgrade\BareStandardUpgradePathTest7500
LeafDrupal\system\Tests\Upgrade\BlockUpgradePathTest4000
LeafDrupal\system\Tests\Upgrade\DateUpgradePathTest5500
LeafDrupal\system\Tests\Upgrade\FieldUpgradePathTest4200
LeafDrupal\system\Tests\Upgrade\FilledMinimalUpgradePathTest6700
LeafDrupal\system\Tests\Upgrade\FilledStandardUpgradePathTest8500
LeafDrupal\system\Tests\Upgrade\ImageUpgradePathTest3900
ExpandDrupal\system\Tests\Upgrade\LanguageUpgradePathTest18330
MessageGroupFilenameLineFunctionStatus
Node 50 displayed after update.OtherLanguageUpgradePathTest.php50Drupal\system\Tests\Upgrade\LanguageUpgradePathTest->testLanguageUpgrade()
Comment 1 displayed after update.OtherLanguageUpgradePathTest.php51Drupal\system\Tests\Upgrade\LanguageUpgradePathTest->testLanguageUpgrade()
Comment 2 displayed after update.OtherLanguageUpgradePathTest.php52Drupal\system\Tests\Upgrade\LanguageUpgradePathTest->testLanguageUpgrade()
LeafDrupal\system\Tests\Upgrade\ModulesDisabledUpgradePathTest4100
LeafDrupal\system\Tests\Upgrade\StateSystemUpgradePathTest5700
LeafDrupal\system\Tests\Upgrade\SystemUpgradePathTest6600
LeafDrupal\system\Tests\Upgrade\UserPictureUpgradePathTest5000
LeafDrupal\system\Tests\Upgrade\UserRoleUpgradePathTest5500
LeafDrupal\system\Tests\Upgrade\UuidUpgradePathTest4000
LeafDrupal\system\Tests\Uuid\UuidUnitTest700
LeafDrupal\taxonomy\Tests\EfqTest1400
LeafDrupal\taxonomy\Tests\HooksTest2300
LeafDrupal\taxonomy\Tests\LegacyTest1400
LeafDrupal\taxonomy\Tests\LoadMultipleTest1800
LeafDrupal\taxonomy\Tests\RssTest2600
LeafDrupal\taxonomy\Tests\TaxonomyTermReferenceItemTest1000
LeafDrupal\taxonomy\Tests\TermFieldMultipleVocabularyTest2600
LeafDrupal\taxonomy\Tests\TermFieldTest4500
LeafDrupal\taxonomy\Tests\TermIndexTest4600
LeafDrupal\taxonomy\Tests\TermLanguageTest6400
LeafDrupal\taxonomy\Tests\TermTest26400
LeafDrupal\taxonomy\Tests\TermTranslationUITest10000
LeafDrupal\taxonomy\Tests\TermUnitTest1100
LeafDrupal\taxonomy\Tests\ThemeTest1900
LeafDrupal\taxonomy\Tests\TokenReplaceTest5500
ExpandDrupal\taxonomy\Tests\Views\RelationshipNodeTermDataTest200
MessageGroupFilenameLineFunctionStatus
'Missing handler: nid nid sort'Debugviews.module988views_get_handler()
LeafDrupal\taxonomy\Tests\Views\RelationshipRepresentativeNode200
LeafDrupal\taxonomy\Tests\VocabularyLanguageTest6000
LeafDrupal\taxonomy\Tests\VocabularyTest11000
LeafDrupal\taxonomy\Tests\VocabularyUnitTest6800
LeafDrupal\text\Tests\TextFieldTest18600
LeafDrupal\text\Tests\TextSummaryTest13800
LeafDrupal\text\Tests\TextTranslationTest10400
LeafDrupal\toolbar\Tests\ToolbarHookToolbarTest1500
LeafDrupal\tracker\Tests\TrackerNodeAccessTest2800
ExpandDrupal\tracker\Tests\TrackerTest22180
MessageGroupFilenameLineFunctionStatus
Nodes that the user has commented on appear in the user's tracker listing.OtherTrackerTest.php121Drupal\tracker\Tests\TrackerTest->testTrackerUser()
Failed to set field status to 0OtherTrackerTest.php126Drupal\tracker\Tests\TrackerTest->testTrackerUser()
Found the Save buttonOtherTrackerTest.php126Drupal\tracker\Tests\TrackerTest->testTrackerUser()
Found the requested form fields at comment/1/editOtherTrackerTest.php126Drupal\tracker\Tests\TrackerTest->testTrackerUser()
New comments are counted on the tracker listing pages.OtherTrackerTest.php180Drupal\tracker\Tests\TrackerTest->testTrackerNewComments()
New comments are counted on the tracker listing pages.OtherTrackerTest.php195Drupal\tracker\Tests\TrackerTest->testTrackerNewComments()
New comment is counted on the tracker listing pages.OtherTrackerTest.php242Drupal\tracker\Tests\TrackerTest->testTrackerCronIndexing()
New comment is counted on the tracker listing pages.OtherTrackerTest.php252Drupal\tracker\Tests\TrackerTest->testTrackerCronIndexing()
LeafDrupal\translation\Tests\TranslationTest59400
LeafDrupal\translation_entity\Tests\ConfigTestTranslationUITest1300
ExpandDrupal\translation_entity\Tests\EntityTestTranslationUITest901
MessageGroupFilenameLineFunctionStatus
Drupal\Core\Entity\EntityStorageException: Field value is unknown. in Drupal\Core\Entity\DatabaseStorageControllerNG->save() (line 321 of /var/lib/drupaltestbot/sites/default/files/checkout/core/lib/Drupal/Core/Entity/DatabaseStorageControllerNG.php). Drupal\Core\Entity\DatabaseStorageControllerNG->save(Object) Drupal\Core\Entity\Entity->save() Drupal\translation_entity\Tests\EntityTranslationUITest->createEntity(Array, 'en') Drupal\translation_entity\Tests\EntityTranslationUITest->testTranslationUI() Drupal\simpletest\TestBase->run() simpletest_script_run_one_test('188', 'Drupal\translation_entity\Tests\EntityTestTranslationUITest') Uncaught exceptionDatabaseStorageControllerNG.php321Drupal\Core\Entity\DatabaseStorageControllerNG->save()
LeafDrupal\translation_entity\Tests\EntityTranslationSettingsTest4900
LeafDrupal\update\Tests\UpdateContribTest18700
LeafDrupal\update\Tests\UpdateCoreTest22600
LeafDrupal\update\Tests\UpdateCoreUnitTest400
LeafDrupal\update\Tests\UpdateUploadTest6400
LeafDrupal\user\Tests\TempStoreDatabaseTest1900
LeafDrupal\user\Tests\UserAccountLinksTests6100
LeafDrupal\user\Tests\UserAdminSettingsFormTest400
LeafDrupal\user\Tests\UserAdminTest6100
LeafDrupal\user\Tests\UserAutocompleteTest2500
LeafDrupal\user\Tests\UserBlocksTests7600
LeafDrupal\user\Tests\UserCancelTest25400
LeafDrupal\user\Tests\UserCreateTest3300
LeafDrupal\user\Tests\UserDeleteTest1500
LeafDrupal\user\Tests\UserEditedOwnAccountTest2200
LeafDrupal\user\Tests\UserEditTest7300
LeafDrupal\user\Tests\UserEntityCallbacksTest700
LeafDrupal\user\Tests\UserLanguageCreationTest6800
LeafDrupal\user\Tests\UserLanguageTest3900
LeafDrupal\user\Tests\UserLoginTest15900
LeafDrupal\user\Tests\UserPasswordResetTest3000
LeafDrupal\user\Tests\UserPermissionsTest5000
LeafDrupal\user\Tests\UserPictureTest4700
LeafDrupal\user\Tests\UserRegistrationTest12900
LeafDrupal\user\Tests\UserRoleAdminTest5400
LeafDrupal\user\Tests\UserRolesAssignmentTest5100
LeafDrupal\user\Tests\UserSaveTest200
LeafDrupal\user\Tests\UserSearchTest5800
LeafDrupal\user\Tests\UserSignatureTest4600
LeafDrupal\user\Tests\UserTimeZoneTest2900
LeafDrupal\user\Tests\UserTokenReplaceTest4700
LeafDrupal\user\Tests\UserTranslationUITest9000
LeafDrupal\user\Tests\UserValidateCurrentPassCustomFormTest1700
LeafDrupal\user\Tests\UserValidationTest1600
LeafDrupal\user\Tests\Views\AccessPermissionTest1400
LeafDrupal\user\Tests\Views\AccessRoleTest1400
LeafDrupal\user\Tests\Views\ArgumentDefaultTest900
LeafDrupal\user\Tests\Views\ArgumentValidateTest1900
LeafDrupal\user\Tests\Views\HandlerArgumentUserUidTest500
LeafDrupal\user\Tests\Views\HandlerFieldUserNameTest700
LeafDrupal\user\Tests\Views\HandlerFilterUserNameTest5700
LeafDrupal\user\Tests\Views\RelationshipRepresentativeNode300
LeafDrupal\views\Tests\AnalyzeTest2100
LeafDrupal\views\Tests\BasicTest800
ExpandDrupal\views\Tests\DefaultViewsTest210
MessageGroupFilenameLineFunctionStatus
The test did not complete due to a fatal error.Completion checkDefaultViewsTest.php120Drupal\views\Tests\DefaultViewsTest->testDefaultViews()
ExpandDrupal\views\Tests\EntityReference\SelectionTest210
MessageGroupFilenameLineFunctionStatus
The test did not complete due to a fatal error.Completion checkSelectionTest.php30Drupal\views\Tests\EntityReference\SelectionTest->testSelectionHandler()
LeafDrupal\views\Tests\Entity\FieldEntityTest400
LeafDrupal\views\Tests\GlossaryTest800
LeafDrupal\views\Tests\Handler\AreaTest9000
LeafDrupal\views\Tests\Handler\AreaTextTest400
LeafDrupal\views\Tests\Handler\ArgumentNullTest400
LeafDrupal\views\Tests\Handler\ArgumentStringTest400
LeafDrupal\views\Tests\Handler\FieldBooleanTest1000
LeafDrupal\views\Tests\Handler\FieldCounterTest600
LeafDrupal\views\Tests\Handler\FieldCustomTest100
LeafDrupal\views\Tests\Handler\FieldDateTest1400
LeafDrupal\views\Tests\Handler\FieldDropButtonTest1300
LeafDrupal\views\Tests\Handler\FieldFileSizeTest800
LeafDrupal\views\Tests\Handler\FieldUnitTest9000
LeafDrupal\views\Tests\Handler\FieldUrlTest200
LeafDrupal\views\Tests\Handler\FieldWebTest10900
LeafDrupal\views\Tests\Handler\FieldXssTest300
LeafDrupal\views\Tests\Handler\FilterCombineTest100
LeafDrupal\views\Tests\Handler\FilterDateTest2200
LeafDrupal\views\Tests\Handler\FilterEqualityTest400
LeafDrupal\views\Tests\Handler\FilterInOperatorTest800
LeafDrupal\views\Tests\Handler\FilterNumericTest1400
LeafDrupal\views\Tests\Handler\FilterStringTest2600
LeafDrupal\views\Tests\Handler\HandlerAliasTest800
LeafDrupal\views\Tests\Handler\HandlerAllTest26000
ExpandDrupal\views\Tests\Handler\HandlerTest11600
MessageGroupFilenameLineFunctionStatus
'Missing handler: jzuxR0LG b6YiSqGj relationship'Debugviews.module988views_get_handler()
'Missing handler: jzuxR0LG b6YiSqGj relationship'Debugviews.module988views_get_handler()
LeafDrupal\views\Tests\Handler\RelationshipTest400
LeafDrupal\views\Tests\Handler\SortDateTest2400
LeafDrupal\views\Tests\Handler\SortRandomTest600
LeafDrupal\views\Tests\Handler\SortTest800
ExpandDrupal\views\Tests\ModuleTest4800
MessageGroupFilenameLineFunctionStatus
'Missing handler: oS4OAeLA nXmF2j1c field'Debugviews.module988views_get_handler()
'Missing handler: f3dB6Pfy x3azswKL area'Debugviews.module988views_get_handler()
'Missing handler: hNvu6Jf0 kA41bM7R filter'Debugviews.module988views_get_handler()
LeafDrupal\views\Tests\PluginBaseUnitTest1200
LeafDrupal\views\Tests\PluginInstanceTest14400
LeafDrupal\views\Tests\PluginTypeListTest100
LeafDrupal\views\Tests\Plugin\AccessTest3900
LeafDrupal\views\Tests\Plugin\ArgumentDefaultTest2400
LeafDrupal\views\Tests\Plugin\ArgumentValidatorTest400
LeafDrupal\views\Tests\Plugin\CacheTest1200
LeafDrupal\views\Tests\Plugin\DisplayAttachmentTest600
LeafDrupal\views\Tests\Plugin\DisplayExtenderTest600
LeafDrupal\views\Tests\Plugin\DisplayFeedTest2800
LeafDrupal\views\Tests\Plugin\DisplayPageTest700
LeafDrupal\views\Tests\Plugin\DisplayTest5000
LeafDrupal\views\Tests\Plugin\ExposedFormTest11400
LeafDrupal\views\Tests\Plugin\FilterTest1300
ExpandDrupal\views\Tests\Plugin\JoinTest1600
MessageGroupFilenameLineFunctionStatus
array ( 'join type' => 'LEFT', 'table' => 'users', 'alias' => 'users', 'condition' => 'node.uid = users.uid AND (node.uid = 517)', 'arguments' => array ( ), )DebugJoinTest.php70Drupal\views\Tests\Plugin\JoinTest->testExamplePlugin()
LeafDrupal\views\Tests\Plugin\PagerTest11300
LeafDrupal\views\Tests\Plugin\QueryTest200
LeafDrupal\views\Tests\Plugin\StyleMappingTest4200
LeafDrupal\views\Tests\Plugin\StyleTest2400
LeafDrupal\views\Tests\Plugin\StyleUnformattedTest1700
LeafDrupal\views\Tests\QueryGroupByTest4000
LeafDrupal\views\Tests\TokenReplaceTest1100
LeafDrupal\views\Tests\UI\DefaultViewsTest11000
LeafDrupal\views\Tests\UI\DisplayAttachmentTest2400
LeafDrupal\views\Tests\UI\DisplayExtenderUITest2300
LeafDrupal\views\Tests\UI\DisplayPath2200
LeafDrupal\views\Tests\UI\DisplayTest24000
LeafDrupal\views\Tests\UI\GroupByTest2600
LeafDrupal\views\Tests\UI\HandlerTest11000
LeafDrupal\views\Tests\UI\OverrideDisplaysTest24900
LeafDrupal\views\Tests\UI\PreviewTest6600
LeafDrupal\views\Tests\UI\QueryTest3700
LeafDrupal\views\Tests\UI\RedirectTest5200
LeafDrupal\views\Tests\UI\RowUITest6000
LeafDrupal\views\Tests\UI\SettingsTest17600
LeafDrupal\views\Tests\UI\StorageTest4200
LeafDrupal\views\Tests\UI\StyleUITest6000
LeafDrupal\views\Tests\UI\TagTest2200
LeafDrupal\views\Tests\ViewElementTest1500
LeafDrupal\views\Tests\ViewExecutableTest11400
LeafDrupal\views\Tests\ViewRenderTest200
LeafDrupal\views\Tests\ViewsDataTest1100
LeafDrupal\views\Tests\ViewStorageTest10600
LeafDrupal\views\Tests\Wizard\BasicTest10000
LeafDrupal\views\Tests\Wizard\ItemsPerPageTest4400
LeafDrupal\views\Tests\Wizard\MenuTest1900
LeafDrupal\views\Tests\Wizard\SortingTest3500
LeafDrupal\views\Tests\Wizard\TaggedWithTest7800
LeafDrupal\xmlrpc\Tests\XmlRpcBasicTest900
LeafDrupal\xmlrpc\Tests\XmlRpcMessagesTest700
LeafDrupal\xmlrpc\Tests\XmlRpcValidatorTest1000