1847596-er-taxonomy-9.patch

Test status
StatusResult
Last receivedTue, 01/01/2013 - 20:56:54
Last requestedTue, 01/01/2013 - 20:57:02
Last testedTue, 01/01/2013 - 21:43:50
Test count1
Environment status
MySQLfail
File information
File1847596-er-taxonomy-9.patch
BranchDrupal core - 8.x
LinkIssue Link
SummaryFAILED: [[SimpleTest]]: [MySQL] 48,889 pass(es), 113 fail(s), and 163 exception(s).
Details

MySQL

  1. Setup environment
  2. Detect an invalid patch URL
  3. Detect invalid repository information
  4. Detect invalid patch format
  5. Detect a non-applicable patch
  6. Detect invalid PHP syntax
  7. Detect a Drupal installation failure
  8. Detect a test run failure
  9. Detect a failing test
    Review the test failures below then if necessary run them locally until the problem has been fixed.
  10. Complete test suite with all tests passing
48,889 pass(es), 113 fail(s), and 163 exception(s)

Non-pass

Test namePassFailException
ExpandDrupal\field_ui\Tests\ManageFieldsTest25920
MessageGroupFilenameLineFunctionStatus
Value 'entity_reference_autocomplete' is equal to value 'options_select'.OtherManageFieldsTest.php423Drupal\field_ui\Tests\ManageFieldsTest->testWidgetChange()
Value 'Autocomplete' is equal to value 'Select list'.OtherManageFieldsTest.php428Drupal\field_ui\Tests\ManageFieldsTest->testWidgetChange()
ExpandDrupal\forum\Tests\ForumBlockTest20624102
MessageGroupFilenameLineFunctionStatus
Undefined index: tidNoticeforum.module325forum_node_presave()
Undefined index: tidNoticeforum.module527forum_field_storage_pre_insert()
Undefined index: tidNoticeforum.module325forum_node_presave()
Undefined index: tidNoticeforum.module527forum_field_storage_pre_insert()
Undefined index: tidNoticeforum.module325forum_node_presave()
Undefined index: tidNoticeforum.module527forum_field_storage_pre_insert()
Undefined index: tidNoticeforum.module325forum_node_presave()
Undefined index: tidNoticeforum.module527forum_field_storage_pre_insert()
Undefined index: tidNoticeforum.module325forum_node_presave()
Undefined index: tidNoticeforum.module527forum_field_storage_pre_insert()
New forum topics block has a "more"-link.OtherForumBlockTest.php66Drupal\forum\Tests\ForumBlockTest->testNewForumTopicsBlock()
Forum topic rgpg0MHjUWrWKQ7zID5i found in the "New forum topics" block.OtherForumBlockTest.php71Drupal\forum\Tests\ForumBlockTest->testNewForumTopicsBlock()
Forum topic kCEogHpW2HNnqsNIWal5 found in the "New forum topics" block.OtherForumBlockTest.php71Drupal\forum\Tests\ForumBlockTest->testNewForumTopicsBlock()
Forum topic jaxv5amp2FmP5YFTSmiF found in the "New forum topics" block.OtherForumBlockTest.php71Drupal\forum\Tests\ForumBlockTest->testNewForumTopicsBlock()
Forum topic iwoWiu0It0NrU5hBbU7M found in the "New forum topics" block.OtherForumBlockTest.php71Drupal\forum\Tests\ForumBlockTest->testNewForumTopicsBlock()
Forum topic zWGPrgDKsxgz9SSySvvF found in the "New forum topics" block.OtherForumBlockTest.php71Drupal\forum\Tests\ForumBlockTest->testNewForumTopicsBlock()
Forum topic iwoWiu0It0NrU5hBbU7M found in the "New forum topics" block.OtherForumBlockTest.php84Drupal\forum\Tests\ForumBlockTest->testNewForumTopicsBlock()
Forum topic zWGPrgDKsxgz9SSySvvF found in the "New forum topics" block.OtherForumBlockTest.php84Drupal\forum\Tests\ForumBlockTest->testNewForumTopicsBlock()
Undefined index: tidNoticeforum.module325forum_node_presave()
Undefined index: tidNoticeforum.module527forum_field_storage_pre_insert()
Undefined index: tidNoticeforum.module325forum_node_presave()
Undefined index: tidNoticeforum.module527forum_field_storage_pre_insert()
Undefined index: tidNoticeforum.module325forum_node_presave()
Undefined index: tidNoticeforum.module527forum_field_storage_pre_insert()
Undefined index: tidNoticeforum.module325forum_node_presave()
Undefined index: tidNoticeforum.module527forum_field_storage_pre_insert()
Undefined index: tidNoticeforum.module325forum_node_presave()
Undefined index: tidNoticeforum.module527forum_field_storage_pre_insert()
Undefined index: tidNoticeforum.module325forum_node_presave()
Undefined index: tidNoticeforum.module527forum_field_storage_pre_insert()
Undefined index: tidNoticeforum.module325forum_node_presave()
Undefined index: tidNoticeforum.module527forum_field_storage_pre_insert()
Undefined index: tidNoticeforum.module325forum_node_presave()
Undefined index: tidNoticeforum.module527forum_field_storage_pre_insert()
Undefined index: tidNoticeforum.module325forum_node_presave()
Undefined index: tidNoticeforum.module527forum_field_storage_pre_insert()
Undefined index: tidNoticeforum.module325forum_node_presave()
Undefined index: tidNoticeforum.module527forum_field_storage_pre_insert()
Trying to get property of non-objectDrupal\forum\Tests\ForumBlockTest->testActiveForumTopicsBlock() Drupal\simpletest\TestBase->run() simpletest_script_run_one_test('286', 'Drupal\forum\Tests\ForumBlockTest') NoticeForumBlockTest.php112Drupal\forum\Tests\ForumBlockTest->testActiveForumTopicsBlock()
array_flip(): Can only flip STRING and INTEGER values!array_flip(Array) Drupal\Core\Entity\DatabaseStorageController->load(Array) entity_load_multiple('node', Array, ) entity_load('node', NULL, ) node_load(NULL) Drupal\comment\CommentStorageController->preSave(Object) Drupal\Core\Entity\DatabaseStorageController->save(Object) Drupal\Core\Entity\Entity->save() comment_save(Object) Drupal\forum\Tests\ForumBlockTest->testActiveForumTopicsBlock() Drupal\simpletest\TestBase->run() simpletest_script_run_one_test('286', 'Drupal\forum\Tests\ForumBlockTest') WarningDatabaseStorageController.php175Drupal\Core\Entity\DatabaseStorageController->load()
Trying to get property of non-objectDrupal\comment\CommentStorageController->preSave(Object) Drupal\Core\Entity\DatabaseStorageController->save(Object) Drupal\Core\Entity\Entity->save() comment_save(Object) Drupal\forum\Tests\ForumBlockTest->testActiveForumTopicsBlock() Drupal\simpletest\TestBase->run() simpletest_script_run_one_test('286', 'Drupal\forum\Tests\ForumBlockTest') NoticeCommentStorageController.php70Drupal\comment\CommentStorageController->preSave()
Trying to get property of non-objectDrupal\comment\CommentStorageController->updateNodeStatistics(NULL) Drupal\comment\CommentStorageController->postSave(Object, ) Drupal\Core\Entity\DatabaseStorageController->save(Object) Drupal\Core\Entity\Entity->save() comment_save(Object) Drupal\forum\Tests\ForumBlockTest->testActiveForumTopicsBlock() Drupal\simpletest\TestBase->run() simpletest_script_run_one_test('286', 'Drupal\forum\Tests\ForumBlockTest') NoticeCommentStorageController.php231Drupal\comment\CommentStorageController->updateNodeStatistics()
Trying to get property of non-objectDrupal\comment\CommentStorageController->updateNodeStatistics(NULL) Drupal\comment\CommentStorageController->postSave(Object, ) Drupal\Core\Entity\DatabaseStorageController->save(Object) Drupal\Core\Entity\Entity->save() comment_save(Object) Drupal\forum\Tests\ForumBlockTest->testActiveForumTopicsBlock() Drupal\simpletest\TestBase->run() simpletest_script_run_one_test('286', 'Drupal\forum\Tests\ForumBlockTest') NoticeCommentStorageController.php233Drupal\comment\CommentStorageController->updateNodeStatistics()
Trying to get property of non-object_forum_update_forum_index(NULL) forum_comment_publish(Object) call_user_func_array('forum_comment_publish', Array) module_invoke_all('comment_publish', Object) Drupal\comment\CommentStorageController->postSave(Object, ) Drupal\Core\Entity\DatabaseStorageController->save(Object) Drupal\Core\Entity\Entity->save() comment_save(Object) Drupal\forum\Tests\ForumBlockTest->testActiveForumTopicsBlock() Drupal\simpletest\TestBase->run() simpletest_script_run_one_test('286', 'Drupal\forum\Tests\ForumBlockTest') Noticeforum.module1386_forum_update_forum_index()
Trying to get property of non-objectDrupal\forum\Tests\ForumBlockTest->testActiveForumTopicsBlock() Drupal\simpletest\TestBase->run() simpletest_script_run_one_test('286', 'Drupal\forum\Tests\ForumBlockTest') NoticeForumBlockTest.php112Drupal\forum\Tests\ForumBlockTest->testActiveForumTopicsBlock()
array_flip(): Can only flip STRING and INTEGER values!array_flip(Array) Drupal\Core\Entity\DatabaseStorageController->load(Array) entity_load_multiple('node', Array, ) entity_load('node', NULL, ) node_load(NULL) Drupal\comment\CommentStorageController->preSave(Object) Drupal\Core\Entity\DatabaseStorageController->save(Object) Drupal\Core\Entity\Entity->save() comment_save(Object) Drupal\forum\Tests\ForumBlockTest->testActiveForumTopicsBlock() Drupal\simpletest\TestBase->run() simpletest_script_run_one_test('286', 'Drupal\forum\Tests\ForumBlockTest') WarningDatabaseStorageController.php175Drupal\Core\Entity\DatabaseStorageController->load()
Trying to get property of non-objectDrupal\comment\CommentStorageController->preSave(Object) Drupal\Core\Entity\DatabaseStorageController->save(Object) Drupal\Core\Entity\Entity->save() comment_save(Object) Drupal\forum\Tests\ForumBlockTest->testActiveForumTopicsBlock() Drupal\simpletest\TestBase->run() simpletest_script_run_one_test('286', 'Drupal\forum\Tests\ForumBlockTest') NoticeCommentStorageController.php70Drupal\comment\CommentStorageController->preSave()
Trying to get property of non-objectDrupal\comment\CommentStorageController->updateNodeStatistics(NULL) Drupal\comment\CommentStorageController->postSave(Object, ) Drupal\Core\Entity\DatabaseStorageController->save(Object) Drupal\Core\Entity\Entity->save() comment_save(Object) Drupal\forum\Tests\ForumBlockTest->testActiveForumTopicsBlock() Drupal\simpletest\TestBase->run() simpletest_script_run_one_test('286', 'Drupal\forum\Tests\ForumBlockTest') NoticeCommentStorageController.php231Drupal\comment\CommentStorageController->updateNodeStatistics()
Trying to get property of non-objectDrupal\comment\CommentStorageController->updateNodeStatistics(NULL) Drupal\comment\CommentStorageController->postSave(Object, ) Drupal\Core\Entity\DatabaseStorageController->save(Object) Drupal\Core\Entity\Entity->save() comment_save(Object) Drupal\forum\Tests\ForumBlockTest->testActiveForumTopicsBlock() Drupal\simpletest\TestBase->run() simpletest_script_run_one_test('286', 'Drupal\forum\Tests\ForumBlockTest') NoticeCommentStorageController.php233Drupal\comment\CommentStorageController->updateNodeStatistics()
Trying to get property of non-object_forum_update_forum_index(NULL) forum_comment_publish(Object) call_user_func_array('forum_comment_publish', Array) module_invoke_all('comment_publish', Object) Drupal\comment\CommentStorageController->postSave(Object, ) Drupal\Core\Entity\DatabaseStorageController->save(Object) Drupal\Core\Entity\Entity->save() comment_save(Object) Drupal\forum\Tests\ForumBlockTest->testActiveForumTopicsBlock() Drupal\simpletest\TestBase->run() simpletest_script_run_one_test('286', 'Drupal\forum\Tests\ForumBlockTest') Noticeforum.module1386_forum_update_forum_index()
Trying to get property of non-objectDrupal\forum\Tests\ForumBlockTest->testActiveForumTopicsBlock() Drupal\simpletest\TestBase->run() simpletest_script_run_one_test('286', 'Drupal\forum\Tests\ForumBlockTest') NoticeForumBlockTest.php112Drupal\forum\Tests\ForumBlockTest->testActiveForumTopicsBlock()
array_flip(): Can only flip STRING and INTEGER values!array_flip(Array) Drupal\Core\Entity\DatabaseStorageController->load(Array) entity_load_multiple('node', Array, ) entity_load('node', NULL, ) node_load(NULL) Drupal\comment\CommentStorageController->preSave(Object) Drupal\Core\Entity\DatabaseStorageController->save(Object) Drupal\Core\Entity\Entity->save() comment_save(Object) Drupal\forum\Tests\ForumBlockTest->testActiveForumTopicsBlock() Drupal\simpletest\TestBase->run() simpletest_script_run_one_test('286', 'Drupal\forum\Tests\ForumBlockTest') WarningDatabaseStorageController.php175Drupal\Core\Entity\DatabaseStorageController->load()
Trying to get property of non-objectDrupal\comment\CommentStorageController->preSave(Object) Drupal\Core\Entity\DatabaseStorageController->save(Object) Drupal\Core\Entity\Entity->save() comment_save(Object) Drupal\forum\Tests\ForumBlockTest->testActiveForumTopicsBlock() Drupal\simpletest\TestBase->run() simpletest_script_run_one_test('286', 'Drupal\forum\Tests\ForumBlockTest') NoticeCommentStorageController.php70Drupal\comment\CommentStorageController->preSave()
Trying to get property of non-objectDrupal\comment\CommentStorageController->updateNodeStatistics(NULL) Drupal\comment\CommentStorageController->postSave(Object, ) Drupal\Core\Entity\DatabaseStorageController->save(Object) Drupal\Core\Entity\Entity->save() comment_save(Object) Drupal\forum\Tests\ForumBlockTest->testActiveForumTopicsBlock() Drupal\simpletest\TestBase->run() simpletest_script_run_one_test('286', 'Drupal\forum\Tests\ForumBlockTest') NoticeCommentStorageController.php231Drupal\comment\CommentStorageController->updateNodeStatistics()
Trying to get property of non-objectDrupal\comment\CommentStorageController->updateNodeStatistics(NULL) Drupal\comment\CommentStorageController->postSave(Object, ) Drupal\Core\Entity\DatabaseStorageController->save(Object) Drupal\Core\Entity\Entity->save() comment_save(Object) Drupal\forum\Tests\ForumBlockTest->testActiveForumTopicsBlock() Drupal\simpletest\TestBase->run() simpletest_script_run_one_test('286', 'Drupal\forum\Tests\ForumBlockTest') NoticeCommentStorageController.php233Drupal\comment\CommentStorageController->updateNodeStatistics()
Trying to get property of non-object_forum_update_forum_index(NULL) forum_comment_publish(Object) call_user_func_array('forum_comment_publish', Array) module_invoke_all('comment_publish', Object) Drupal\comment\CommentStorageController->postSave(Object, ) Drupal\Core\Entity\DatabaseStorageController->save(Object) Drupal\Core\Entity\Entity->save() comment_save(Object) Drupal\forum\Tests\ForumBlockTest->testActiveForumTopicsBlock() Drupal\simpletest\TestBase->run() simpletest_script_run_one_test('286', 'Drupal\forum\Tests\ForumBlockTest') Noticeforum.module1386_forum_update_forum_index()
Trying to get property of non-objectDrupal\forum\Tests\ForumBlockTest->testActiveForumTopicsBlock() Drupal\simpletest\TestBase->run() simpletest_script_run_one_test('286', 'Drupal\forum\Tests\ForumBlockTest') NoticeForumBlockTest.php112Drupal\forum\Tests\ForumBlockTest->testActiveForumTopicsBlock()
array_flip(): Can only flip STRING and INTEGER values!array_flip(Array) Drupal\Core\Entity\DatabaseStorageController->load(Array) entity_load_multiple('node', Array, ) entity_load('node', NULL, ) node_load(NULL) Drupal\comment\CommentStorageController->preSave(Object) Drupal\Core\Entity\DatabaseStorageController->save(Object) Drupal\Core\Entity\Entity->save() comment_save(Object) Drupal\forum\Tests\ForumBlockTest->testActiveForumTopicsBlock() Drupal\simpletest\TestBase->run() simpletest_script_run_one_test('286', 'Drupal\forum\Tests\ForumBlockTest') WarningDatabaseStorageController.php175Drupal\Core\Entity\DatabaseStorageController->load()
Undefined index: tidNoticeforum.module325forum_node_presave()
Undefined index: tidNoticeforum.module527forum_field_storage_pre_insert()
New forum topics block has a "more"-link.OtherForumBlockTest.php66Drupal\forum\Tests\ForumBlockTest->testNewForumTopicsBlock()
Forum topic rgpg0MHjUWrWKQ7zID5i found in the "New forum topics" block.OtherForumBlockTest.php71Drupal\forum\Tests\ForumBlockTest->testNewForumTopicsBlock()
Forum topic kCEogHpW2HNnqsNIWal5 found in the "New forum topics" block.OtherForumBlockTest.php71Drupal\forum\Tests\ForumBlockTest->testNewForumTopicsBlock()
Forum topic jaxv5amp2FmP5YFTSmiF found in the "New forum topics" block.OtherForumBlockTest.php71Drupal\forum\Tests\ForumBlockTest->testNewForumTopicsBlock()
Forum topic iwoWiu0It0NrU5hBbU7M found in the "New forum topics" block.OtherForumBlockTest.php71Drupal\forum\Tests\ForumBlockTest->testNewForumTopicsBlock()
Forum topic zWGPrgDKsxgz9SSySvvF found in the "New forum topics" block.OtherForumBlockTest.php71Drupal\forum\Tests\ForumBlockTest->testNewForumTopicsBlock()
Forum topic iwoWiu0It0NrU5hBbU7M found in the "New forum topics" block.OtherForumBlockTest.php84Drupal\forum\Tests\ForumBlockTest->testNewForumTopicsBlock()
Forum topic zWGPrgDKsxgz9SSySvvF found in the "New forum topics" block.OtherForumBlockTest.php84Drupal\forum\Tests\ForumBlockTest->testNewForumTopicsBlock()
Undefined index: tidNoticeforum.module325forum_node_presave()
Undefined index: tidNoticeforum.module527forum_field_storage_pre_insert()
Undefined index: tidNoticeforum.module325forum_node_presave()
Undefined index: tidNoticeforum.module527forum_field_storage_pre_insert()
Undefined index: tidNoticeforum.module325forum_node_presave()
Undefined index: tidNoticeforum.module527forum_field_storage_pre_insert()
Undefined index: tidNoticeforum.module325forum_node_presave()
Undefined index: tidNoticeforum.module527forum_field_storage_pre_insert()
Undefined index: tidNoticeforum.module325forum_node_presave()
Undefined index: tidNoticeforum.module527forum_field_storage_pre_insert()
Undefined index: tidNoticeforum.module325forum_node_presave()
Undefined index: tidNoticeforum.module527forum_field_storage_pre_insert()
Undefined index: tidNoticeforum.module325forum_node_presave()
Undefined index: tidNoticeforum.module527forum_field_storage_pre_insert()
Undefined index: tidNoticeforum.module325forum_node_presave()
Undefined index: tidNoticeforum.module527forum_field_storage_pre_insert()
Undefined index: tidNoticeforum.module325forum_node_presave()
Undefined index: tidNoticeforum.module527forum_field_storage_pre_insert()
Undefined index: tidNoticeforum.module325forum_node_presave()
Undefined index: tidNoticeforum.module527forum_field_storage_pre_insert()
Trying to get property of non-objectDrupal\forum\Tests\ForumBlockTest->testActiveForumTopicsBlock() Drupal\simpletest\TestBase->run() simpletest_script_run_one_test('286', 'Drupal\forum\Tests\ForumBlockTest') NoticeForumBlockTest.php112Drupal\forum\Tests\ForumBlockTest->testActiveForumTopicsBlock()
array_flip(): Can only flip STRING and INTEGER values!array_flip(Array) Drupal\Core\Entity\DatabaseStorageController->load(Array) entity_load_multiple('node', Array, ) entity_load('node', NULL, ) node_load(NULL) Drupal\comment\CommentStorageController->preSave(Object) Drupal\Core\Entity\DatabaseStorageController->save(Object) Drupal\Core\Entity\Entity->save() comment_save(Object) Drupal\forum\Tests\ForumBlockTest->testActiveForumTopicsBlock() Drupal\simpletest\TestBase->run() simpletest_script_run_one_test('286', 'Drupal\forum\Tests\ForumBlockTest') WarningDatabaseStorageController.php175Drupal\Core\Entity\DatabaseStorageController->load()
Trying to get property of non-objectDrupal\comment\CommentStorageController->preSave(Object) Drupal\Core\Entity\DatabaseStorageController->save(Object) Drupal\Core\Entity\Entity->save() comment_save(Object) Drupal\forum\Tests\ForumBlockTest->testActiveForumTopicsBlock() Drupal\simpletest\TestBase->run() simpletest_script_run_one_test('286', 'Drupal\forum\Tests\ForumBlockTest') NoticeCommentStorageController.php70Drupal\comment\CommentStorageController->preSave()
Trying to get property of non-objectDrupal\comment\CommentStorageController->updateNodeStatistics(NULL) Drupal\comment\CommentStorageController->postSave(Object, ) Drupal\Core\Entity\DatabaseStorageController->save(Object) Drupal\Core\Entity\Entity->save() comment_save(Object) Drupal\forum\Tests\ForumBlockTest->testActiveForumTopicsBlock() Drupal\simpletest\TestBase->run() simpletest_script_run_one_test('286', 'Drupal\forum\Tests\ForumBlockTest') NoticeCommentStorageController.php231Drupal\comment\CommentStorageController->updateNodeStatistics()
Trying to get property of non-objectDrupal\comment\CommentStorageController->updateNodeStatistics(NULL) Drupal\comment\CommentStorageController->postSave(Object, ) Drupal\Core\Entity\DatabaseStorageController->save(Object) Drupal\Core\Entity\Entity->save() comment_save(Object) Drupal\forum\Tests\ForumBlockTest->testActiveForumTopicsBlock() Drupal\simpletest\TestBase->run() simpletest_script_run_one_test('286', 'Drupal\forum\Tests\ForumBlockTest') NoticeCommentStorageController.php233Drupal\comment\CommentStorageController->updateNodeStatistics()
Trying to get property of non-object_forum_update_forum_index(NULL) forum_comment_publish(Object) call_user_func_array('forum_comment_publish', Array) module_invoke_all('comment_publish', Object) Drupal\comment\CommentStorageController->postSave(Object, ) Drupal\Core\Entity\DatabaseStorageController->save(Object) Drupal\Core\Entity\Entity->save() comment_save(Object) Drupal\forum\Tests\ForumBlockTest->testActiveForumTopicsBlock() Drupal\simpletest\TestBase->run() simpletest_script_run_one_test('286', 'Drupal\forum\Tests\ForumBlockTest') Noticeforum.module1386_forum_update_forum_index()
Trying to get property of non-objectDrupal\forum\Tests\ForumBlockTest->testActiveForumTopicsBlock() Drupal\simpletest\TestBase->run() simpletest_script_run_one_test('286', 'Drupal\forum\Tests\ForumBlockTest') NoticeForumBlockTest.php112Drupal\forum\Tests\ForumBlockTest->testActiveForumTopicsBlock()
array_flip(): Can only flip STRING and INTEGER values!array_flip(Array) Drupal\Core\Entity\DatabaseStorageController->load(Array) entity_load_multiple('node', Array, ) entity_load('node', NULL, ) node_load(NULL) Drupal\comment\CommentStorageController->preSave(Object) Drupal\Core\Entity\DatabaseStorageController->save(Object) Drupal\Core\Entity\Entity->save() comment_save(Object) Drupal\forum\Tests\ForumBlockTest->testActiveForumTopicsBlock() Drupal\simpletest\TestBase->run() simpletest_script_run_one_test('286', 'Drupal\forum\Tests\ForumBlockTest') WarningDatabaseStorageController.php175Drupal\Core\Entity\DatabaseStorageController->load()
Trying to get property of non-objectDrupal\comment\CommentStorageController->preSave(Object) Drupal\Core\Entity\DatabaseStorageController->save(Object) Drupal\Core\Entity\Entity->save() comment_save(Object) Drupal\forum\Tests\ForumBlockTest->testActiveForumTopicsBlock() Drupal\simpletest\TestBase->run() simpletest_script_run_one_test('286', 'Drupal\forum\Tests\ForumBlockTest') NoticeCommentStorageController.php70Drupal\comment\CommentStorageController->preSave()
Trying to get property of non-objectDrupal\comment\CommentStorageController->updateNodeStatistics(NULL) Drupal\comment\CommentStorageController->postSave(Object, ) Drupal\Core\Entity\DatabaseStorageController->save(Object) Drupal\Core\Entity\Entity->save() comment_save(Object) Drupal\forum\Tests\ForumBlockTest->testActiveForumTopicsBlock() Drupal\simpletest\TestBase->run() simpletest_script_run_one_test('286', 'Drupal\forum\Tests\ForumBlockTest') NoticeCommentStorageController.php231Drupal\comment\CommentStorageController->updateNodeStatistics()
Trying to get property of non-objectDrupal\comment\CommentStorageController->updateNodeStatistics(NULL) Drupal\comment\CommentStorageController->postSave(Object, ) Drupal\Core\Entity\DatabaseStorageController->save(Object) Drupal\Core\Entity\Entity->save() comment_save(Object) Drupal\forum\Tests\ForumBlockTest->testActiveForumTopicsBlock() Drupal\simpletest\TestBase->run() simpletest_script_run_one_test('286', 'Drupal\forum\Tests\ForumBlockTest') NoticeCommentStorageController.php233Drupal\comment\CommentStorageController->updateNodeStatistics()
Trying to get property of non-object_forum_update_forum_index(NULL) forum_comment_publish(Object) call_user_func_array('forum_comment_publish', Array) module_invoke_all('comment_publish', Object) Drupal\comment\CommentStorageController->postSave(Object, ) Drupal\Core\Entity\DatabaseStorageController->save(Object) Drupal\Core\Entity\Entity->save() comment_save(Object) Drupal\forum\Tests\ForumBlockTest->testActiveForumTopicsBlock() Drupal\simpletest\TestBase->run() simpletest_script_run_one_test('286', 'Drupal\forum\Tests\ForumBlockTest') Noticeforum.module1386_forum_update_forum_index()
Trying to get property of non-objectDrupal\forum\Tests\ForumBlockTest->testActiveForumTopicsBlock() Drupal\simpletest\TestBase->run() simpletest_script_run_one_test('286', 'Drupal\forum\Tests\ForumBlockTest') NoticeForumBlockTest.php112Drupal\forum\Tests\ForumBlockTest->testActiveForumTopicsBlock()
array_flip(): Can only flip STRING and INTEGER values!array_flip(Array) Drupal\Core\Entity\DatabaseStorageController->load(Array) entity_load_multiple('node', Array, ) entity_load('node', NULL, ) node_load(NULL) Drupal\comment\CommentStorageController->preSave(Object) Drupal\Core\Entity\DatabaseStorageController->save(Object) Drupal\Core\Entity\Entity->save() comment_save(Object) Drupal\forum\Tests\ForumBlockTest->testActiveForumTopicsBlock() Drupal\simpletest\TestBase->run() simpletest_script_run_one_test('286', 'Drupal\forum\Tests\ForumBlockTest') WarningDatabaseStorageController.php175Drupal\Core\Entity\DatabaseStorageController->load()
Trying to get property of non-objectDrupal\comment\CommentStorageController->preSave(Object) Drupal\Core\Entity\DatabaseStorageController->save(Object) Drupal\Core\Entity\Entity->save() comment_save(Object) Drupal\forum\Tests\ForumBlockTest->testActiveForumTopicsBlock() Drupal\simpletest\TestBase->run() simpletest_script_run_one_test('286', 'Drupal\forum\Tests\ForumBlockTest') NoticeCommentStorageController.php70Drupal\comment\CommentStorageController->preSave()
Trying to get property of non-objectDrupal\comment\CommentStorageController->updateNodeStatistics(NULL) Drupal\comment\CommentStorageController->postSave(Object, ) Drupal\Core\Entity\DatabaseStorageController->save(Object) Drupal\Core\Entity\Entity->save() comment_save(Object) Drupal\forum\Tests\ForumBlockTest->testActiveForumTopicsBlock() Drupal\simpletest\TestBase->run() simpletest_script_run_one_test('286', 'Drupal\forum\Tests\ForumBlockTest') NoticeCommentStorageController.php231Drupal\comment\CommentStorageController->updateNodeStatistics()
Trying to get property of non-objectDrupal\comment\CommentStorageController->updateNodeStatistics(NULL) Drupal\comment\CommentStorageController->postSave(Object, ) Drupal\Core\Entity\DatabaseStorageController->save(Object) Drupal\Core\Entity\Entity->save() comment_save(Object) Drupal\forum\Tests\ForumBlockTest->testActiveForumTopicsBlock() Drupal\simpletest\TestBase->run() simpletest_script_run_one_test('286', 'Drupal\forum\Tests\ForumBlockTest') NoticeCommentStorageController.php233Drupal\comment\CommentStorageController->updateNodeStatistics()
Trying to get property of non-object_forum_update_forum_index(NULL) forum_comment_publish(Object) call_user_func_array('forum_comment_publish', Array) module_invoke_all('comment_publish', Object) Drupal\comment\CommentStorageController->postSave(Object, ) Drupal\Core\Entity\DatabaseStorageController->save(Object) Drupal\Core\Entity\Entity->save() comment_save(Object) Drupal\forum\Tests\ForumBlockTest->testActiveForumTopicsBlock() Drupal\simpletest\TestBase->run() simpletest_script_run_one_test('286', 'Drupal\forum\Tests\ForumBlockTest') Noticeforum.module1386_forum_update_forum_index()
Trying to get property of non-objectDrupal\forum\Tests\ForumBlockTest->testActiveForumTopicsBlock() Drupal\simpletest\TestBase->run() simpletest_script_run_one_test('286', 'Drupal\forum\Tests\ForumBlockTest') NoticeForumBlockTest.php112Drupal\forum\Tests\ForumBlockTest->testActiveForumTopicsBlock()
array_flip(): Can only flip STRING and INTEGER values!array_flip(Array) Drupal\Core\Entity\DatabaseStorageController->load(Array) entity_load_multiple('node', Array, ) entity_load('node', NULL, ) node_load(NULL) Drupal\comment\CommentStorageController->preSave(Object) Drupal\Core\Entity\DatabaseStorageController->save(Object) Drupal\Core\Entity\Entity->save() comment_save(Object) Drupal\forum\Tests\ForumBlockTest->testActiveForumTopicsBlock() Drupal\simpletest\TestBase->run() simpletest_script_run_one_test('286', 'Drupal\forum\Tests\ForumBlockTest') WarningDatabaseStorageController.php175Drupal\Core\Entity\DatabaseStorageController->load()
Trying to get property of non-objectDrupal\comment\CommentStorageController->preSave(Object) Drupal\Core\Entity\DatabaseStorageController->save(Object) Drupal\Core\Entity\Entity->save() comment_save(Object) Drupal\forum\Tests\ForumBlockTest->testActiveForumTopicsBlock() Drupal\simpletest\TestBase->run() simpletest_script_run_one_test('286', 'Drupal\forum\Tests\ForumBlockTest') NoticeCommentStorageController.php70Drupal\comment\CommentStorageController->preSave()
Trying to get property of non-objectDrupal\comment\CommentStorageController->updateNodeStatistics(NULL) Drupal\comment\CommentStorageController->postSave(Object, ) Drupal\Core\Entity\DatabaseStorageController->save(Object) Drupal\Core\Entity\Entity->save() comment_save(Object) Drupal\forum\Tests\ForumBlockTest->testActiveForumTopicsBlock() Drupal\simpletest\TestBase->run() simpletest_script_run_one_test('286', 'Drupal\forum\Tests\ForumBlockTest') NoticeCommentStorageController.php231Drupal\comment\CommentStorageController->updateNodeStatistics()
Trying to get property of non-objectDrupal\comment\CommentStorageController->updateNodeStatistics(NULL) Drupal\comment\CommentStorageController->postSave(Object, ) Drupal\Core\Entity\DatabaseStorageController->save(Object) Drupal\Core\Entity\Entity->save() comment_save(Object) Drupal\forum\Tests\ForumBlockTest->testActiveForumTopicsBlock() Drupal\simpletest\TestBase->run() simpletest_script_run_one_test('286', 'Drupal\forum\Tests\ForumBlockTest') NoticeCommentStorageController.php233Drupal\comment\CommentStorageController->updateNodeStatistics()
Trying to get property of non-object_forum_update_forum_index(NULL) forum_comment_publish(Object) call_user_func_array('forum_comment_publish', Array) module_invoke_all('comment_publish', Object) Drupal\comment\CommentStorageController->postSave(Object, ) Drupal\Core\Entity\DatabaseStorageController->save(Object) Drupal\Core\Entity\Entity->save() comment_save(Object) Drupal\forum\Tests\ForumBlockTest->testActiveForumTopicsBlock() Drupal\simpletest\TestBase->run() simpletest_script_run_one_test('286', 'Drupal\forum\Tests\ForumBlockTest') Noticeforum.module1386_forum_update_forum_index()
Trying to get property of non-objectDrupal\forum\Tests\ForumBlockTest->testActiveForumTopicsBlock() Drupal\simpletest\TestBase->run() simpletest_script_run_one_test('286', 'Drupal\forum\Tests\ForumBlockTest') NoticeForumBlockTest.php112Drupal\forum\Tests\ForumBlockTest->testActiveForumTopicsBlock()
array_flip(): Can only flip STRING and INTEGER values!array_flip(Array) Drupal\Core\Entity\DatabaseStorageController->load(Array) entity_load_multiple('node', Array, ) entity_load('node', NULL, ) node_load(NULL) Drupal\comment\CommentStorageController->preSave(Object) Drupal\Core\Entity\DatabaseStorageController->save(Object) Drupal\Core\Entity\Entity->save() comment_save(Object) Drupal\forum\Tests\ForumBlockTest->testActiveForumTopicsBlock() Drupal\simpletest\TestBase->run() simpletest_script_run_one_test('286', 'Drupal\forum\Tests\ForumBlockTest') WarningDatabaseStorageController.php175Drupal\Core\Entity\DatabaseStorageController->load()
Trying to get property of non-objectDrupal\comment\CommentStorageController->preSave(Object) Drupal\Core\Entity\DatabaseStorageController->save(Object) Drupal\Core\Entity\Entity->save() comment_save(Object) Drupal\forum\Tests\ForumBlockTest->testActiveForumTopicsBlock() Drupal\simpletest\TestBase->run() simpletest_script_run_one_test('286', 'Drupal\forum\Tests\ForumBlockTest') NoticeCommentStorageController.php70Drupal\comment\CommentStorageController->preSave()
Trying to get property of non-objectDrupal\comment\CommentStorageController->updateNodeStatistics(NULL) Drupal\comment\CommentStorageController->postSave(Object, ) Drupal\Core\Entity\DatabaseStorageController->save(Object) Drupal\Core\Entity\Entity->save() comment_save(Object) Drupal\forum\Tests\ForumBlockTest->testActiveForumTopicsBlock() Drupal\simpletest\TestBase->run() simpletest_script_run_one_test('286', 'Drupal\forum\Tests\ForumBlockTest') NoticeCommentStorageController.php231Drupal\comment\CommentStorageController->updateNodeStatistics()
Trying to get property of non-objectDrupal\comment\CommentStorageController->updateNodeStatistics(NULL) Drupal\comment\CommentStorageController->postSave(Object, ) Drupal\Core\Entity\DatabaseStorageController->save(Object) Drupal\Core\Entity\Entity->save() comment_save(Object) Drupal\forum\Tests\ForumBlockTest->testActiveForumTopicsBlock() Drupal\simpletest\TestBase->run() simpletest_script_run_one_test('286', 'Drupal\forum\Tests\ForumBlockTest') NoticeCommentStorageController.php233Drupal\comment\CommentStorageController->updateNodeStatistics()
Trying to get property of non-object_forum_update_forum_index(NULL) forum_comment_publish(Object) call_user_func_array('forum_comment_publish', Array) module_invoke_all('comment_publish', Object) Drupal\comment\CommentStorageController->postSave(Object, ) Drupal\Core\Entity\DatabaseStorageController->save(Object) Drupal\Core\Entity\Entity->save() comment_save(Object) Drupal\forum\Tests\ForumBlockTest->testActiveForumTopicsBlock() Drupal\simpletest\TestBase->run() simpletest_script_run_one_test('286', 'Drupal\forum\Tests\ForumBlockTest') Noticeforum.module1386_forum_update_forum_index()
Active forum topics block has a "more"-link.OtherForumBlockTest.php126Drupal\forum\Tests\ForumBlockTest->testActiveForumTopicsBlock()
Forum topic yFfXYwJokeexVQfL6YrT found in the "Active forum topics" block.OtherForumBlockTest.php134Drupal\forum\Tests\ForumBlockTest->testActiveForumTopicsBlock()
Forum topic yseXFbl2C7i6LrydSEfE found in the "Active forum topics" block.OtherForumBlockTest.php134Drupal\forum\Tests\ForumBlockTest->testActiveForumTopicsBlock()
Forum topic erGuXjIiQyXPVqXP9ytT found in the "Active forum topics" block.OtherForumBlockTest.php134Drupal\forum\Tests\ForumBlockTest->testActiveForumTopicsBlock()
Forum topic f1eo42IEwEsd48Rzd8fD found in the "Active forum topics" block.OtherForumBlockTest.php134Drupal\forum\Tests\ForumBlockTest->testActiveForumTopicsBlock()
Forum topic g3bdfSg92SyozvcJKrHi found in the "Active forum topics" block.OtherForumBlockTest.php134Drupal\forum\Tests\ForumBlockTest->testActiveForumTopicsBlock()
Forum topic found in the "Active forum topics" block.OtherForumBlockTest.php151Drupal\forum\Tests\ForumBlockTest->testActiveForumTopicsBlock()
Forum topic found in the "Active forum topics" block.OtherForumBlockTest.php151Drupal\forum\Tests\ForumBlockTest->testActiveForumTopicsBlock()
ExpandDrupal\forum\Tests\ForumIndexTest44128
MessageGroupFilenameLineFunctionStatus
Undefined index: tidNoticeforum.module325forum_node_presave()
Undefined index: tidNoticeforum.module527forum_field_storage_pre_insert()
New forum node found in database.OtherForumIndexTest.php62Drupal\forum\Tests\ForumIndexTest->testForumIndexStatus()
Published forum topic appears on index.OtherForumIndexTest.php66Drupal\forum\Tests\ForumIndexTest->testForumIndexStatus()
Trying to get property of non-objectDrupal\forum\Tests\ForumIndexTest->testForumIndexStatus() Drupal\simpletest\TestBase->run() simpletest_script_run_one_test('287', 'Drupal\forum\Tests\ForumIndexTest') NoticeForumIndexTest.php72Drupal\forum\Tests\ForumIndexTest->testForumIndexStatus()
Failed to set field status to OtherForumIndexTest.php72Drupal\forum\Tests\ForumIndexTest->testForumIndexStatus()
Found the Save buttonOtherForumIndexTest.php72Drupal\forum\Tests\ForumIndexTest->testForumIndexStatus()
Found the requested form fields at node//editOtherForumIndexTest.php72Drupal\forum\Tests\ForumIndexTest->testForumIndexStatus()
Trying to get property of non-objectDrupal\forum\Tests\ForumIndexTest->testForumIndexStatus() Drupal\simpletest\TestBase->run() simpletest_script_run_one_test('287', 'Drupal\forum\Tests\ForumIndexTest') NoticeForumIndexTest.php73Drupal\forum\Tests\ForumIndexTest->testForumIndexStatus()
Unpublished node is no longer accessible.OtherForumIndexTest.php74Drupal\forum\Tests\ForumIndexTest->testForumIndexStatus()
Undefined index: tidNoticeforum.module325forum_node_presave()
Undefined index: tidNoticeforum.module527forum_field_storage_pre_insert()
New forum node found in database.OtherForumIndexTest.php62Drupal\forum\Tests\ForumIndexTest->testForumIndexStatus()
Published forum topic appears on index.OtherForumIndexTest.php66Drupal\forum\Tests\ForumIndexTest->testForumIndexStatus()
Trying to get property of non-objectDrupal\forum\Tests\ForumIndexTest->testForumIndexStatus() Drupal\simpletest\TestBase->run() simpletest_script_run_one_test('287', 'Drupal\forum\Tests\ForumIndexTest') NoticeForumIndexTest.php72Drupal\forum\Tests\ForumIndexTest->testForumIndexStatus()
Failed to set field status to OtherForumIndexTest.php72Drupal\forum\Tests\ForumIndexTest->testForumIndexStatus()
Found the Save buttonOtherForumIndexTest.php72Drupal\forum\Tests\ForumIndexTest->testForumIndexStatus()
Found the requested form fields at node//editOtherForumIndexTest.php72Drupal\forum\Tests\ForumIndexTest->testForumIndexStatus()
Trying to get property of non-objectDrupal\forum\Tests\ForumIndexTest->testForumIndexStatus() Drupal\simpletest\TestBase->run() simpletest_script_run_one_test('287', 'Drupal\forum\Tests\ForumIndexTest') NoticeForumIndexTest.php73Drupal\forum\Tests\ForumIndexTest->testForumIndexStatus()
Unpublished node is no longer accessible.OtherForumIndexTest.php74Drupal\forum\Tests\ForumIndexTest->testForumIndexStatus()
ExpandDrupal\forum\Tests\ForumNodeAccessTest1161016
MessageGroupFilenameLineFunctionStatus
Undefined index: tidNoticeforum.module325forum_node_presave()
Undefined index: tidNoticeforum.module527forum_field_storage_pre_insert()
New private forum node found in database.OtherForumNodeAccessTest.php66Drupal\forum\Tests\ForumNodeAccessTest->testForumNodeAccess()
Undefined index: tidNoticeforum.module325forum_node_presave()
Undefined index: tidNoticeforum.module527forum_field_storage_pre_insert()
New public forum node found in database.OtherForumNodeAccessTest.php76Drupal\forum\Tests\ForumNodeAccessTest->testForumNodeAccess()
Trying to get property of non-objectDrupal\forum\Tests\ForumNodeAccessTest->testForumNodeAccess() Drupal\simpletest\TestBase->run() simpletest_script_run_one_test('288', 'Drupal\forum\Tests\ForumNodeAccessTest') NoticeForumNodeAccessTest.php97Drupal\forum\Tests\ForumNodeAccessTest->testForumNodeAccess()
Private node found in block by $access_userOtherForumNodeAccessTest.php97Drupal\forum\Tests\ForumNodeAccessTest->testForumNodeAccess()
Trying to get property of non-objectDrupal\forum\Tests\ForumNodeAccessTest->testForumNodeAccess() Drupal\simpletest\TestBase->run() simpletest_script_run_one_test('288', 'Drupal\forum\Tests\ForumNodeAccessTest') NoticeForumNodeAccessTest.php98Drupal\forum\Tests\ForumNodeAccessTest->testForumNodeAccess()
Public node found in block by $access_userOtherForumNodeAccessTest.php98Drupal\forum\Tests\ForumNodeAccessTest->testForumNodeAccess()
Trying to get property of non-objectDrupal\forum\Tests\ForumNodeAccessTest->testForumNodeAccess() Drupal\simpletest\TestBase->run() simpletest_script_run_one_test('288', 'Drupal\forum\Tests\ForumNodeAccessTest') NoticeForumNodeAccessTest.php105Drupal\forum\Tests\ForumNodeAccessTest->testForumNodeAccess()
Trying to get property of non-objectDrupal\forum\Tests\ForumNodeAccessTest->testForumNodeAccess() Drupal\simpletest\TestBase->run() simpletest_script_run_one_test('288', 'Drupal\forum\Tests\ForumNodeAccessTest') NoticeForumNodeAccessTest.php106Drupal\forum\Tests\ForumNodeAccessTest->testForumNodeAccess()
Public node found in block by $no_access_userOtherForumNodeAccessTest.php106Drupal\forum\Tests\ForumNodeAccessTest->testForumNodeAccess()
Undefined index: tidNoticeforum.module325forum_node_presave()
Undefined index: tidNoticeforum.module527forum_field_storage_pre_insert()
New private forum node found in database.OtherForumNodeAccessTest.php66Drupal\forum\Tests\ForumNodeAccessTest->testForumNodeAccess()
Undefined index: tidNoticeforum.module325forum_node_presave()
Undefined index: tidNoticeforum.module527forum_field_storage_pre_insert()
New public forum node found in database.OtherForumNodeAccessTest.php76Drupal\forum\Tests\ForumNodeAccessTest->testForumNodeAccess()
Trying to get property of non-objectDrupal\forum\Tests\ForumNodeAccessTest->testForumNodeAccess() Drupal\simpletest\TestBase->run() simpletest_script_run_one_test('288', 'Drupal\forum\Tests\ForumNodeAccessTest') NoticeForumNodeAccessTest.php97Drupal\forum\Tests\ForumNodeAccessTest->testForumNodeAccess()
Private node found in block by $access_userOtherForumNodeAccessTest.php97Drupal\forum\Tests\ForumNodeAccessTest->testForumNodeAccess()
Trying to get property of non-objectDrupal\forum\Tests\ForumNodeAccessTest->testForumNodeAccess() Drupal\simpletest\TestBase->run() simpletest_script_run_one_test('288', 'Drupal\forum\Tests\ForumNodeAccessTest') NoticeForumNodeAccessTest.php98Drupal\forum\Tests\ForumNodeAccessTest->testForumNodeAccess()
Public node found in block by $access_userOtherForumNodeAccessTest.php98Drupal\forum\Tests\ForumNodeAccessTest->testForumNodeAccess()
Trying to get property of non-objectDrupal\forum\Tests\ForumNodeAccessTest->testForumNodeAccess() Drupal\simpletest\TestBase->run() simpletest_script_run_one_test('288', 'Drupal\forum\Tests\ForumNodeAccessTest') NoticeForumNodeAccessTest.php105Drupal\forum\Tests\ForumNodeAccessTest->testForumNodeAccess()
Trying to get property of non-objectDrupal\forum\Tests\ForumNodeAccessTest->testForumNodeAccess() Drupal\simpletest\TestBase->run() simpletest_script_run_one_test('288', 'Drupal\forum\Tests\ForumNodeAccessTest') NoticeForumNodeAccessTest.php106Drupal\forum\Tests\ForumNodeAccessTest->testForumNodeAccess()
Public node found in block by $no_access_userOtherForumNodeAccessTest.php106Drupal\forum\Tests\ForumNodeAccessTest->testForumNodeAccess()
ExpandDrupal\forum\Tests\ForumTest2313233
MessageGroupFilenameLineFunctionStatus
The test did not complete due to a fatal error.Completion checkForumTest.php127Drupal\forum\Tests\ForumTest->testForum()
Undefined index: tidNoticeforum.module325forum_node_presave()
Undefined index: tidNoticeforum.module527forum_field_storage_pre_insert()
Forum topic was createdOtherForumTest.php477Drupal\forum\Tests\ForumTest->createForumTopic()
Node qxOZBCZwm4GyIgWqxHjV was loadedOtherForumTest.php483Drupal\forum\Tests\ForumTest->createForumTopic()
Trying to get property of non-objectDrupal\forum\Tests\ForumTest->createForumTopic(Array, ) Drupal\forum\Tests\ForumTest->generateForumTopics(Array) Drupal\forum\Tests\ForumTest->testForum() Drupal\simpletest\TestBase->run() simpletest_script_run_one_test('289', 'Drupal\forum\Tests\ForumTest') NoticeForumTest.php484Drupal\forum\Tests\ForumTest->createForumTopic()
Saved forum topic was in the expected forumOtherForumTest.php484Drupal\forum\Tests\ForumTest->createForumTopic()
Trying to get property of non-objectDrupal\forum\Tests\ForumTest->createForumTopic(Array, ) Drupal\forum\Tests\ForumTest->generateForumTopics(Array) Drupal\forum\Tests\ForumTest->testForum() Drupal\simpletest\TestBase->run() simpletest_script_run_one_test('289', 'Drupal\forum\Tests\ForumTest') NoticeForumTest.php487Drupal\forum\Tests\ForumTest->createForumTopic()
Subject was foundOtherForumTest.php488Drupal\forum\Tests\ForumTest->createForumTopic()
Body was foundOtherForumTest.php489Drupal\forum\Tests\ForumTest->createForumTopic()
Trying to get property of non-objectDrupal\forum\Tests\ForumTest->generateForumTopics(Array) Drupal\forum\Tests\ForumTest->testForum() Drupal\simpletest\TestBase->run() simpletest_script_run_one_test('289', 'Drupal\forum\Tests\ForumTest') NoticeForumTest.php604Drupal\forum\Tests\ForumTest->generateForumTopics()
Undefined index: tidNoticeforum.module325forum_node_presave()
Undefined index: tidNoticeforum.module527forum_field_storage_pre_insert()
Forum topic was createdOtherForumTest.php477Drupal\forum\Tests\ForumTest->createForumTopic()
Node opBiSE8n6KvswflBV9eK was loadedOtherForumTest.php483Drupal\forum\Tests\ForumTest->createForumTopic()
Trying to get property of non-objectDrupal\forum\Tests\ForumTest->createForumTopic(Array, ) Drupal\forum\Tests\ForumTest->generateForumTopics(Array) Drupal\forum\Tests\ForumTest->testForum() Drupal\simpletest\TestBase->run() simpletest_script_run_one_test('289', 'Drupal\forum\Tests\ForumTest') NoticeForumTest.php484Drupal\forum\Tests\ForumTest->createForumTopic()
Saved forum topic was in the expected forumOtherForumTest.php484Drupal\forum\Tests\ForumTest->createForumTopic()
Trying to get property of non-objectDrupal\forum\Tests\ForumTest->createForumTopic(Array, ) Drupal\forum\Tests\ForumTest->generateForumTopics(Array) Drupal\forum\Tests\ForumTest->testForum() Drupal\simpletest\TestBase->run() simpletest_script_run_one_test('289', 'Drupal\forum\Tests\ForumTest') NoticeForumTest.php487Drupal\forum\Tests\ForumTest->createForumTopic()
Subject was foundOtherForumTest.php488Drupal\forum\Tests\ForumTest->createForumTopic()
Body was foundOtherForumTest.php489Drupal\forum\Tests\ForumTest->createForumTopic()
Trying to get property of non-objectDrupal\forum\Tests\ForumTest->generateForumTopics(Array) Drupal\forum\Tests\ForumTest->testForum() Drupal\simpletest\TestBase->run() simpletest_script_run_one_test('289', 'Drupal\forum\Tests\ForumTest') NoticeForumTest.php604Drupal\forum\Tests\ForumTest->generateForumTopics()
Undefined index: tidNoticeforum.module325forum_node_presave()
Undefined index: tidNoticeforum.module527forum_field_storage_pre_insert()
Forum topic was createdOtherForumTest.php477Drupal\forum\Tests\ForumTest->createForumTopic()
Node umeTWoCSMxgo9dUN0XMA was loadedOtherForumTest.php483Drupal\forum\Tests\ForumTest->createForumTopic()
Trying to get property of non-objectDrupal\forum\Tests\ForumTest->createForumTopic(Array, ) Drupal\forum\Tests\ForumTest->generateForumTopics(Array) Drupal\forum\Tests\ForumTest->testForum() Drupal\simpletest\TestBase->run() simpletest_script_run_one_test('289', 'Drupal\forum\Tests\ForumTest') NoticeForumTest.php484Drupal\forum\Tests\ForumTest->createForumTopic()
Saved forum topic was in the expected forumOtherForumTest.php484Drupal\forum\Tests\ForumTest->createForumTopic()
Trying to get property of non-objectDrupal\forum\Tests\ForumTest->createForumTopic(Array, ) Drupal\forum\Tests\ForumTest->generateForumTopics(Array) Drupal\forum\Tests\ForumTest->testForum() Drupal\simpletest\TestBase->run() simpletest_script_run_one_test('289', 'Drupal\forum\Tests\ForumTest') NoticeForumTest.php487Drupal\forum\Tests\ForumTest->createForumTopic()
Subject was foundOtherForumTest.php488Drupal\forum\Tests\ForumTest->createForumTopic()
Body was foundOtherForumTest.php489Drupal\forum\Tests\ForumTest->createForumTopic()
Trying to get property of non-objectDrupal\forum\Tests\ForumTest->generateForumTopics(Array) Drupal\forum\Tests\ForumTest->testForum() Drupal\simpletest\TestBase->run() simpletest_script_run_one_test('289', 'Drupal\forum\Tests\ForumTest') NoticeForumTest.php604Drupal\forum\Tests\ForumTest->generateForumTopics()
Undefined index: tidNoticeforum.module325forum_node_presave()
Undefined index: tidNoticeforum.module527forum_field_storage_pre_insert()
Forum topic was createdOtherForumTest.php477Drupal\forum\Tests\ForumTest->createForumTopic()
Node xBAZ2WljlyWknpeXf9YP was loadedOtherForumTest.php483Drupal\forum\Tests\ForumTest->createForumTopic()
Trying to get property of non-objectDrupal\forum\Tests\ForumTest->createForumTopic(Array, ) Drupal\forum\Tests\ForumTest->generateForumTopics(Array) Drupal\forum\Tests\ForumTest->testForum() Drupal\simpletest\TestBase->run() simpletest_script_run_one_test('289', 'Drupal\forum\Tests\ForumTest') NoticeForumTest.php484Drupal\forum\Tests\ForumTest->createForumTopic()
Saved forum topic was in the expected forumOtherForumTest.php484Drupal\forum\Tests\ForumTest->createForumTopic()
Trying to get property of non-objectDrupal\forum\Tests\ForumTest->createForumTopic(Array, ) Drupal\forum\Tests\ForumTest->generateForumTopics(Array) Drupal\forum\Tests\ForumTest->testForum() Drupal\simpletest\TestBase->run() simpletest_script_run_one_test('289', 'Drupal\forum\Tests\ForumTest') NoticeForumTest.php487Drupal\forum\Tests\ForumTest->createForumTopic()
Subject was foundOtherForumTest.php488Drupal\forum\Tests\ForumTest->createForumTopic()
Body was foundOtherForumTest.php489Drupal\forum\Tests\ForumTest->createForumTopic()
Trying to get property of non-objectDrupal\forum\Tests\ForumTest->generateForumTopics(Array) Drupal\forum\Tests\ForumTest->testForum() Drupal\simpletest\TestBase->run() simpletest_script_run_one_test('289', 'Drupal\forum\Tests\ForumTest') NoticeForumTest.php604Drupal\forum\Tests\ForumTest->generateForumTopics()
Undefined index: tidNoticeforum.module325forum_node_presave()
Undefined index: tidNoticeforum.module527forum_field_storage_pre_insert()
Forum topic was createdOtherForumTest.php477Drupal\forum\Tests\ForumTest->createForumTopic()
Node aesMaBEJU4hHAPehc4ZY was loadedOtherForumTest.php483Drupal\forum\Tests\ForumTest->createForumTopic()
Trying to get property of non-objectDrupal\forum\Tests\ForumTest->createForumTopic(Array, ) Drupal\forum\Tests\ForumTest->generateForumTopics(Array) Drupal\forum\Tests\ForumTest->testForum() Drupal\simpletest\TestBase->run() simpletest_script_run_one_test('289', 'Drupal\forum\Tests\ForumTest') NoticeForumTest.php484Drupal\forum\Tests\ForumTest->createForumTopic()
Saved forum topic was in the expected forumOtherForumTest.php484Drupal\forum\Tests\ForumTest->createForumTopic()
Trying to get property of non-objectDrupal\forum\Tests\ForumTest->createForumTopic(Array, ) Drupal\forum\Tests\ForumTest->generateForumTopics(Array) Drupal\forum\Tests\ForumTest->testForum() Drupal\simpletest\TestBase->run() simpletest_script_run_one_test('289', 'Drupal\forum\Tests\ForumTest') NoticeForumTest.php487Drupal\forum\Tests\ForumTest->createForumTopic()
Subject was foundOtherForumTest.php488Drupal\forum\Tests\ForumTest->createForumTopic()
Body was foundOtherForumTest.php489Drupal\forum\Tests\ForumTest->createForumTopic()
Trying to get property of non-objectDrupal\forum\Tests\ForumTest->generateForumTopics(Array) Drupal\forum\Tests\ForumTest->testForum() Drupal\simpletest\TestBase->run() simpletest_script_run_one_test('289', 'Drupal\forum\Tests\ForumTest') NoticeForumTest.php604Drupal\forum\Tests\ForumTest->generateForumTopics()
Undefined index: tidNoticeforum.module325forum_node_presave()
Undefined index: tidNoticeforum.module527forum_field_storage_pre_insert()
Error message was shownOtherForumTest.php473Drupal\forum\Tests\ForumTest->createForumTopic()
Undefined index: tidNoticeforum.module325forum_node_presave()
Undefined index: tidNoticeforum.module527forum_field_storage_pre_insert()
Forum topic was createdOtherForumTest.php477Drupal\forum\Tests\ForumTest->createForumTopic()
Node spnE5zzbEs97XIel2ptb was loadedOtherForumTest.php483Drupal\forum\Tests\ForumTest->createForumTopic()
Trying to get property of non-objectDrupal\forum\Tests\ForumTest->createForumTopic(Array, ) Drupal\forum\Tests\ForumTest->doBasicTests(Object, 1) Drupal\forum\Tests\ForumTest->testForum() Drupal\simpletest\TestBase->run() simpletest_script_run_one_test('289', 'Drupal\forum\Tests\ForumTest') NoticeForumTest.php484Drupal\forum\Tests\ForumTest->createForumTopic()
Saved forum topic was in the expected forumOtherForumTest.php484Drupal\forum\Tests\ForumTest->createForumTopic()
Trying to get property of non-objectDrupal\forum\Tests\ForumTest->createForumTopic(Array, ) Drupal\forum\Tests\ForumTest->doBasicTests(Object, 1) Drupal\forum\Tests\ForumTest->testForum() Drupal\simpletest\TestBase->run() simpletest_script_run_one_test('289', 'Drupal\forum\Tests\ForumTest') NoticeForumTest.php487Drupal\forum\Tests\ForumTest->createForumTopic()
Subject was foundOtherForumTest.php488Drupal\forum\Tests\ForumTest->createForumTopic()
Body was foundOtherForumTest.php489Drupal\forum\Tests\ForumTest->createForumTopic()
Argument 2 passed to Drupal\forum\Tests\ForumTest::verifyForums() must be an instance of Drupal\node\Plugin\Core\Entity\Node, boolean given, called in /var/lib/drupaltestbot/sites/default/files/checkout/core/modules/forum/lib/Drupal/forum/Tests/ForumTest.php on line 441 and definedDrupal\forum\Tests\ForumTest->verifyForums(Object, , 1) Drupal\forum\Tests\ForumTest->doBasicTests(Object, 1) Drupal\forum\Tests\ForumTest->testForum() Drupal\simpletest\TestBase->run() simpletest_script_run_one_test('289', 'Drupal\forum\Tests\ForumTest') Recoverable errorForumTest.php506Drupal\forum\Tests\ForumTest->verifyForums()
Trying to get property of non-objectDrupal\forum\Tests\ForumTest->verifyForums(Object, , 1) Drupal\forum\Tests\ForumTest->doBasicTests(Object, 1) Drupal\forum\Tests\ForumTest->testForum() Drupal\simpletest\TestBase->run() simpletest_script_run_one_test('289', 'Drupal\forum\Tests\ForumTest') NoticeForumTest.php525Drupal\forum\Tests\ForumTest->verifyForums()
ExpandDrupal\node\Tests\NodeAccessBaseTableTest14950
MessageGroupFilenameLineFunctionStatus
A public node by user 3 is not visible for user 2 on the public page.OtherNodeAccessBaseTableTest.php125Drupal\node\Tests\NodeAccessBaseTableTest->testNodeAccessBasic()
A public node by user 3 is not visible for user 3 on the public page.OtherNodeAccessBaseTableTest.php125Drupal\node\Tests\NodeAccessBaseTableTest->testNodeAccessBasic()
A private node by user 3 is not visible for user 3 on the private page.OtherNodeAccessBaseTableTest.php125Drupal\node\Tests\NodeAccessBaseTableTest->testNodeAccessBasic()
A public node by user 3 is not visible for user 3 on the public page.OtherNodeAccessBaseTableTest.php141Drupal\node\Tests\NodeAccessBaseTableTest->testNodeAccessBasic()
A private node by user 3 is not visible for user 3 on the private page.OtherNodeAccessBaseTableTest.php141Drupal\node\Tests\NodeAccessBaseTableTest->testNodeAccessBasic()
ExpandDrupal\node\Tests\NodeAccessPagerTest2102
MessageGroupFilenameLineFunctionStatus
Undefined index: target_identity_reference_field_presave('node', Object, Array, Object, 'und', Array, NULL, NULL) _field_invoke('presave', 'node', Object) field_attach_presave('node', Object) Drupal\Core\Entity\DatabaseStorageController->invokeHook('presave', Object) Drupal\node\NodeStorageController->invokeHook('presave', Object) Drupal\Core\Entity\DatabaseStorageController->save(Object) Drupal\Core\Entity\Entity->save() Drupal\simpletest\WebTestBase->drupalCreateNode(Array) Drupal\node\Tests\NodeAccessPagerTest->testForumPager() Drupal\simpletest\TestBase->run() simpletest_script_run_one_test('366', 'Drupal\node\Tests\NodeAccessPagerTest') Noticeentity_reference.module126entity_reference_field_presave()
Drupal\Core\Entity\EntityStorageException: SQLSTATE[23000]: Integrity constraint violation: 1048 Column 'taxonomy_forums_target_id' cannot be null: INSERT INTO {field_data_taxonomy_forums} (entity_type, entity_id, revision_id, bundle, delta, langcode, taxonomy_forums_target_id, taxonomy_forums_revision_id) VALUES (:db_insert_placeholder_0, :db_insert_placeholder_1, :db_insert_placeholder_2, :db_insert_placeholder_3, :db_insert_placeholder_4, :db_insert_placeholder_5, :db_insert_placeholder_6, :db_insert_placeholder_7); Array ( [:db_insert_placeholder_0] => node [:db_insert_placeholder_1] => 1 [:db_insert_placeholder_2] => 1 [:db_insert_placeholder_3] => forum [:db_insert_placeholder_4] => 0 [:db_insert_placeholder_5] => und [:db_insert_placeholder_6] => [:db_insert_placeholder_7] => ) in Drupal\Core\Entity\DatabaseStorageController->save() (line 546 of /var/lib/drupaltestbot/sites/default/files/checkout/core/lib/Drupal/Core/Entity/DatabaseStorageController.php). Drupal\Core\Entity\DatabaseStorageController->save(Object) Drupal\Core\Entity\Entity->save() Drupal\simpletest\WebTestBase->drupalCreateNode(Array) Drupal\node\Tests\NodeAccessPagerTest->testForumPager() Drupal\simpletest\TestBase->run() simpletest_script_run_one_test('366', 'Drupal\node\Tests\NodeAccessPagerTest') Uncaught exceptionDatabaseStorageController.php546Drupal\Core\Entity\DatabaseStorageController->save()
ExpandDrupal\rdf\Tests\RdfaMarkupTest2720
MessageGroupFilenameLineFunctionStatus
Property dc:subject is present for the tag1 field item.OtherRdfaMarkupTest.php181Drupal\rdf\Tests\RdfaMarkupTest->testAttributesInMarkupFile()
Property dc:subject is present for the tag2 field item.OtherRdfaMarkupTest.php186Drupal\rdf\Tests\RdfaMarkupTest->testAttributesInMarkupFile()
ExpandDrupal\system\Tests\Entity\EntityQueryRelationshipTest110
MessageGroupFilenameLineFunctionStatus
The test did not complete due to a fatal error.Completion checkEntityQueryRelationshipTest.php136Drupal\system\Tests\Entity\EntityQueryRelationshipTest->testQuery()
ExpandDrupal\system\Tests\Module\DependencyTest15190
MessageGroupFilenameLineFunctionStatus
"You must enable the History, Taxonomy, Options, Comment, Poll, PHP Filter modules to install Forum." foundOtherDependencyTest.php149Drupal\system\Tests\Module\DependencyTest->testModuleEnableOrder()
Module "forum" is enabled.OtherDependencyTest.php157Drupal\system\Tests\Module\DependencyTest->testModuleEnableOrder()
Module "poll" is enabled.OtherDependencyTest.php157Drupal\system\Tests\Module\DependencyTest->testModuleEnableOrder()
Module "php" is enabled.OtherDependencyTest.php157Drupal\system\Tests\Module\DependencyTest->testModuleEnableOrder()
Module "comment" is enabled.OtherDependencyTest.php157Drupal\system\Tests\Module\DependencyTest->testModuleEnableOrder()
Module "history" is enabled.OtherDependencyTest.php157Drupal\system\Tests\Module\DependencyTest->testModuleEnableOrder()
Module "taxonomy" is enabled.OtherDependencyTest.php157Drupal\system\Tests\Module\DependencyTest->testModuleEnableOrder()
Module "options" is enabled.OtherDependencyTest.php157Drupal\system\Tests\Module\DependencyTest->testModuleEnableOrder()
Value array ( 0 => 'module_test', ) is identical to value array ( 0 => 'comment', 1 => 'history', 2 => 'options', 3 => 'taxonomy', 4 => 'php', 5 => 'poll', 6 => 'forum', ).OtherDependencyTest.php161Drupal\system\Tests\Module\DependencyTest->testModuleEnableOrder()
ExpandDrupal\system\Tests\Theme\EntityFilteringThemeTest811
MessageGroupFilenameLineFunctionStatus
The test did not complete due to a fatal error.Completion checkEntityFilteringThemeTest.php122Drupal\system\Tests\Theme\EntityFilteringThemeTest->testThemedEntity()
Undefined index: target_identity_reference_field_presave('node', Object, Array, Object, 'und', Array, NULL, NULL) _field_invoke('presave', 'node', Object) field_attach_presave('node', Object) Drupal\Core\Entity\DatabaseStorageController->invokeHook('presave', Object) Drupal\node\NodeStorageController->invokeHook('presave', Object) Drupal\Core\Entity\DatabaseStorageController->save(Object) Drupal\Core\Entity\Entity->save() Drupal\simpletest\WebTestBase->drupalCreateNode(Array) Drupal\system\Tests\Theme\EntityFilteringThemeTest->setUp() Drupal\simpletest\TestBase->run() simpletest_script_run_one_test('548', 'Drupal\system\Tests\Theme\EntityFilteringThemeTest') Noticeentity_reference.module126entity_reference_field_presave()
ExpandDrupal\system\Tests\Upgrade\FilledStandardUpgradePathTest8450
MessageGroupFilenameLineFunctionStatus
HTTP response expected 200, actual 500BrowserFilledStandardUpgradePathTest.php45Drupal\system\Tests\Upgrade\FilledStandardUpgradePathTest->testFilledStandardUpgrade()
"Tools" foundOtherFilledStandardUpgradePathTest.php48Drupal\system\Tests\Upgrade\FilledStandardUpgradePathTest->testFilledStandardUpgrade()
"My account" foundOtherFilledStandardUpgradePathTest.php51Drupal\system\Tests\Upgrade\FilledStandardUpgradePathTest->testFilledStandardUpgrade()
"Log out" foundOtherFilledStandardUpgradePathTest.php52Drupal\system\Tests\Upgrade\FilledStandardUpgradePathTest->testFilledStandardUpgrade()
Link with label Home found.OtherFilledStandardUpgradePathTest.php55Drupal\system\Tests\Upgrade\FilledStandardUpgradePathTest->testFilledStandardUpgrade()
ExpandDrupal\system\Tests\Upgrade\ModulesDisabledUpgradePathTest3401
MessageGroupFilenameLineFunctionStatus
Drupal\field\FieldException: Attempt to create field name <em class="placeholder">taxonomy_forums</em> which already exists, although it is inactive. in field_create_field() (line 86 of /var/lib/drupaltestbot/sites/default/files/checkout/core/modules/field/field.crud.inc). field_create_field(Array) forum_enable() call_user_func_array('forum_enable', Array) module_invoke('forum', 'enable') module_enable(Array) Drupal\system\Tests\Upgrade\ModulesDisabledUpgradePathTest->testDisabledUpgrade() Drupal\simpletest\TestBase->run() simpletest_script_run_one_test('583', 'Drupal\system\Tests\Upgrade\ModulesDisabledUpgradePathTest') Uncaught exceptionfield.crud.inc86field_create_field()
ExpandDrupal\taxonomy\Tests\RssTest1010
MessageGroupFilenameLineFunctionStatus
The test did not complete due to a fatal error.Completion checkRssTest.php77Drupal\taxonomy\Tests\RssTest->testTaxonomyRss()
ExpandDrupal\taxonomy\Tests\TermFieldMultipleVocabularyTest1010
MessageGroupFilenameLineFunctionStatus
The test did not complete due to a fatal error.Completion checkTermFieldMultipleVocabularyTest.php82Drupal\taxonomy\Tests\TermFieldMultipleVocabularyTest->testTaxonomyTermFieldMultipleVocabularies()
ExpandDrupal\taxonomy\Tests\TermFieldTest1010
MessageGroupFilenameLineFunctionStatus
The test did not complete due to a fatal error.Completion checkTermFieldTest.php80Drupal\taxonomy\Tests\TermFieldTest->testTaxonomyTermFieldValidation()
ExpandDrupal\taxonomy\Tests\TermIndexTest1010
MessageGroupFilenameLineFunctionStatus
The test did not complete due to a fatal error.Completion checkTermIndexTest.php105Drupal\taxonomy\Tests\TermIndexTest->testTaxonomyIndex()
ExpandDrupal\taxonomy\Tests\TermTest1010
MessageGroupFilenameLineFunctionStatus
The test did not complete due to a fatal error.Completion checkTermTest.php67Drupal\taxonomy\Tests\TermTest->testTaxonomyTermHierarchy()
ExpandDrupal\taxonomy\Tests\TokenReplaceTest1010
MessageGroupFilenameLineFunctionStatus
The test did not complete due to a fatal error.Completion checkTokenReplaceTest.php68Drupal\taxonomy\Tests\TokenReplaceTest->testTaxonomyTokenReplacement()
ExpandDrupal\taxonomy\Tests\Views\RelationshipNodeTermDataTest110
MessageGroupFilenameLineFunctionStatus
The test did not complete due to a fatal error.Completion checkRelationshipNodeTermDataTest.php30Drupal\taxonomy\Tests\Views\RelationshipNodeTermDataTest->testViewsHandlerRelationshipNodeTermData()
ExpandDrupal\taxonomy\Tests\Views\RelationshipRepresentativeNode110
MessageGroupFilenameLineFunctionStatus
The test did not complete due to a fatal error.Completion checkRelationshipRepresentativeNode.php33Drupal\taxonomy\Tests\Views\RelationshipRepresentativeNode->testRelationship()
ExpandDrupal\views\Tests\DefaultViewsTest110
MessageGroupFilenameLineFunctionStatus
The test did not complete due to a fatal error.Completion checkDefaultViewsTest.php123Drupal\views\Tests\DefaultViewsTest->testDefaultViews()
ExpandDrupal\views\Tests\Wizard\TaggedWithTest1110
MessageGroupFilenameLineFunctionStatus
The test did not complete due to a fatal error.Completion checkTaggedWithTest.php104Drupal\views\Tests\Wizard\TaggedWithTest->testTaggedWith()

All

Test namePassFailException
LeafDrupal\action\Tests\BulkFormTest3300
LeafDrupal\action\Tests\ConfigurationTest3900
LeafDrupal\action\Tests\LoopTest2100
LeafDrupal\aggregator\Tests\AddFeedTest7100
LeafDrupal\aggregator\Tests\AggregatorConfigurationTest2000
LeafDrupal\aggregator\Tests\AggregatorCronTest5500
LeafDrupal\aggregator\Tests\AggregatorRenderingTest22800
LeafDrupal\aggregator\Tests\CategorizeFeedItemTest6100
LeafDrupal\aggregator\Tests\CategorizeFeedTest2100
LeafDrupal\aggregator\Tests\FeedParserTest7200
LeafDrupal\aggregator\Tests\ImportOpmlTest5500
LeafDrupal\aggregator\Tests\RemoveFeedItemTest27000
LeafDrupal\aggregator\Tests\RemoveFeedTest2500
LeafDrupal\aggregator\Tests\UpdateFeedItemTest6500
LeafDrupal\aggregator\Tests\UpdateFeedTest7600
LeafDrupal\ban\Tests\IpAddressBlockingTest4300
LeafDrupal\block\Tests\BlockAdminThemeTest1900
LeafDrupal\block\Tests\BlockCacheTest20500
LeafDrupal\block\Tests\BlockHiddenRegionTest1800
LeafDrupal\block\Tests\BlockHtmlIdTest1600
LeafDrupal\block\Tests\BlockInvalidRegionTest2400
LeafDrupal\block\Tests\BlockLanguageTest9100
LeafDrupal\block\Tests\BlockTemplateSuggestionsUnitTest300
LeafDrupal\block\Tests\BlockTest36000
LeafDrupal\block\Tests\BlockUserAccountSettingsTest1200
LeafDrupal\block\Tests\NewDefaultThemeBlocksTest2300
LeafDrupal\block\Tests\NonDefaultBlockAdminTest1100
LeafDrupal\book\Tests\BookTest51700
LeafDrupal\breakpoint\Tests\BreakpointAPITest600
LeafDrupal\breakpoint\Tests\BreakpointCRUDTest2100
LeafDrupal\breakpoint\Tests\BreakpointGroupAPITest400
LeafDrupal\breakpoint\Tests\BreakpointGroupCRUDTest1200
LeafDrupal\breakpoint\Tests\BreakpointMediaQueryTest6300
LeafDrupal\breakpoint\Tests\BreakpointThemeTest2300
LeafDrupal\color\Tests\ColorTest8700
LeafDrupal\comment\Tests\CommentActionsTest3000
LeafDrupal\comment\Tests\CommentAnonymousTest16300
LeafDrupal\comment\Tests\CommentApprovalTest15200
LeafDrupal\comment\Tests\CommentBlockTest11800
LeafDrupal\comment\Tests\CommentContentRebuildTest3300
LeafDrupal\comment\Tests\CommentCSSTest50100
LeafDrupal\comment\Tests\CommentFieldsTest10700
LeafDrupal\comment\Tests\CommentInterfaceTest25100
LeafDrupal\comment\Tests\CommentLanguageTest7200
ExpandDrupal\comment\Tests\CommentLinksTest109300
MessageGroupFilenameLineFunctionStatus
Changed environment:array ( 'authenticated' => false, 'comment count' => false, 'form' => 'below', 'user_register' => 'visitors', 'contact' => 'optional', 'comments' => 'open', 'access comments' => 0, 'post comments' => 0, 'skip comment approval' => 1, 'edit own comments' => 0, )DebugCommentLinksTest.php194Drupal\comment\Tests\CommentLinksTest->setEnvironment()
Changed environment:array ( 'authenticated' => true, 'comment count' => false, 'form' => 'below', 'user_register' => 'visitors', 'contact' => 'optional', 'comments' => 'open', 'access comments' => 0, 'post comments' => 0, 'skip comment approval' => 1, 'edit own comments' => 0, )DebugCommentLinksTest.php194Drupal\comment\Tests\CommentLinksTest->setEnvironment()
Changed environment:array ( 'authenticated' => false, 'comment count' => true, 'form' => 'below', 'user_register' => 'visitors', 'contact' => 'optional', 'comments' => 'open', 'access comments' => 0, 'post comments' => 0, 'skip comment approval' => 1, 'edit own comments' => 0, )DebugCommentLinksTest.php194Drupal\comment\Tests\CommentLinksTest->setEnvironment()
Changed environment:array ( 'authenticated' => true, 'comment count' => true, 'form' => 'below', 'user_register' => 'visitors', 'contact' => 'optional', 'comments' => 'open', 'access comments' => 0, 'post comments' => 0, 'skip comment approval' => 1, 'edit own comments' => 0, )DebugCommentLinksTest.php194Drupal\comment\Tests\CommentLinksTest->setEnvironment()
Changed environment:array ( 'authenticated' => false, 'comment count' => false, 'form' => 'below', 'user_register' => 'visitors', 'contact' => 'optional', 'comments' => 'open', 'access comments' => 1, 'post comments' => 0, 'skip comment approval' => 1, 'edit own comments' => 0, )DebugCommentLinksTest.php194Drupal\comment\Tests\CommentLinksTest->setEnvironment()
Changed environment:array ( 'authenticated' => true, 'comment count' => false, 'form' => 'below', 'user_register' => 'visitors', 'contact' => 'optional', 'comments' => 'open', 'access comments' => 1, 'post comments' => 0, 'skip comment approval' => 1, 'edit own comments' => 0, )DebugCommentLinksTest.php194Drupal\comment\Tests\CommentLinksTest->setEnvironment()
Changed environment:array ( 'authenticated' => false, 'comment count' => true, 'form' => 'below', 'user_register' => 'visitors', 'contact' => 'optional', 'comments' => 'open', 'access comments' => 1, 'post comments' => 0, 'skip comment approval' => 1, 'edit own comments' => 0, )DebugCommentLinksTest.php194Drupal\comment\Tests\CommentLinksTest->setEnvironment()
Changed environment:array ( 'authenticated' => true, 'comment count' => true, 'form' => 'below', 'user_register' => 'visitors', 'contact' => 'optional', 'comments' => 'open', 'access comments' => 1, 'post comments' => 0, 'skip comment approval' => 1, 'edit own comments' => 0, )DebugCommentLinksTest.php194Drupal\comment\Tests\CommentLinksTest->setEnvironment()
Changed environment:array ( 'authenticated' => false, 'comment count' => false, 'form' => 'below', 'user_register' => 'visitors', 'contact' => 'optional', 'comments' => 'open', 'access comments' => 0, 'post comments' => 1, 'skip comment approval' => 1, 'edit own comments' => 0, )DebugCommentLinksTest.php194Drupal\comment\Tests\CommentLinksTest->setEnvironment()
Changed environment:array ( 'authenticated' => true, 'comment count' => false, 'form' => 'below', 'user_register' => 'visitors', 'contact' => 'optional', 'comments' => 'open', 'access comments' => 0, 'post comments' => 1, 'skip comment approval' => 1, 'edit own comments' => 0, )DebugCommentLinksTest.php194Drupal\comment\Tests\CommentLinksTest->setEnvironment()
Changed environment:array ( 'authenticated' => false, 'comment count' => true, 'form' => 'below', 'user_register' => 'visitors', 'contact' => 'optional', 'comments' => 'open', 'access comments' => 0, 'post comments' => 1, 'skip comment approval' => 1, 'edit own comments' => 0, )DebugCommentLinksTest.php194Drupal\comment\Tests\CommentLinksTest->setEnvironment()
Changed environment:array ( 'authenticated' => true, 'comment count' => true, 'form' => 'below', 'user_register' => 'visitors', 'contact' => 'optional', 'comments' => 'open', 'access comments' => 0, 'post comments' => 1, 'skip comment approval' => 1, 'edit own comments' => 0, )DebugCommentLinksTest.php194Drupal\comment\Tests\CommentLinksTest->setEnvironment()
Changed environment:array ( 'authenticated' => false, 'comment count' => false, 'form' => 'below', 'user_register' => 'visitors', 'contact' => 'optional', 'comments' => 'open', 'access comments' => 1, 'post comments' => 1, 'skip comment approval' => 1, 'edit own comments' => 0, )DebugCommentLinksTest.php194Drupal\comment\Tests\CommentLinksTest->setEnvironment()
Changed environment:array ( 'authenticated' => true, 'comment count' => false, 'form' => 'below', 'user_register' => 'visitors', 'contact' => 'optional', 'comments' => 'open', 'access comments' => 1, 'post comments' => 1, 'skip comment approval' => 1, 'edit own comments' => 0, )DebugCommentLinksTest.php194Drupal\comment\Tests\CommentLinksTest->setEnvironment()
Changed environment:array ( 'authenticated' => false, 'comment count' => true, 'form' => 'below', 'user_register' => 'visitors', 'contact' => 'optional', 'comments' => 'open', 'access comments' => 1, 'post comments' => 1, 'skip comment approval' => 1, 'edit own comments' => 0, )DebugCommentLinksTest.php194Drupal\comment\Tests\CommentLinksTest->setEnvironment()
Changed environment:array ( 'authenticated' => true, 'comment count' => true, 'form' => 'below', 'user_register' => 'visitors', 'contact' => 'optional', 'comments' => 'open', 'access comments' => 1, 'post comments' => 1, 'skip comment approval' => 1, 'edit own comments' => 0, )DebugCommentLinksTest.php194Drupal\comment\Tests\CommentLinksTest->setEnvironment()
Changed environment:array ( 'authenticated' => false, 'comment count' => false, 'form' => 'separate page', 'user_register' => 'visitors', 'contact' => 'optional', 'comments' => 'open', 'access comments' => 0, 'post comments' => 0, 'skip comment approval' => 1, 'edit own comments' => 0, )DebugCommentLinksTest.php194Drupal\comment\Tests\CommentLinksTest->setEnvironment()
Changed environment:array ( 'authenticated' => true, 'comment count' => false, 'form' => 'separate page', 'user_register' => 'visitors', 'contact' => 'optional', 'comments' => 'open', 'access comments' => 0, 'post comments' => 0, 'skip comment approval' => 1, 'edit own comments' => 0, )DebugCommentLinksTest.php194Drupal\comment\Tests\CommentLinksTest->setEnvironment()
Changed environment:array ( 'authenticated' => false, 'comment count' => true, 'form' => 'separate page', 'user_register' => 'visitors', 'contact' => 'optional', 'comments' => 'open', 'access comments' => 0, 'post comments' => 0, 'skip comment approval' => 1, 'edit own comments' => 0, )DebugCommentLinksTest.php194Drupal\comment\Tests\CommentLinksTest->setEnvironment()
Changed environment:array ( 'authenticated' => true, 'comment count' => true, 'form' => 'separate page', 'user_register' => 'visitors', 'contact' => 'optional', 'comments' => 'open', 'access comments' => 0, 'post comments' => 0, 'skip comment approval' => 1, 'edit own comments' => 0, )DebugCommentLinksTest.php194Drupal\comment\Tests\CommentLinksTest->setEnvironment()
Changed environment:array ( 'authenticated' => false, 'comment count' => false, 'form' => 'separate page', 'user_register' => 'visitors', 'contact' => 'optional', 'comments' => 'open', 'access comments' => 1, 'post comments' => 0, 'skip comment approval' => 1, 'edit own comments' => 0, )DebugCommentLinksTest.php194Drupal\comment\Tests\CommentLinksTest->setEnvironment()
Changed environment:array ( 'authenticated' => true, 'comment count' => false, 'form' => 'separate page', 'user_register' => 'visitors', 'contact' => 'optional', 'comments' => 'open', 'access comments' => 1, 'post comments' => 0, 'skip comment approval' => 1, 'edit own comments' => 0, )DebugCommentLinksTest.php194Drupal\comment\Tests\CommentLinksTest->setEnvironment()
Changed environment:array ( 'authenticated' => false, 'comment count' => true, 'form' => 'separate page', 'user_register' => 'visitors', 'contact' => 'optional', 'comments' => 'open', 'access comments' => 1, 'post comments' => 0, 'skip comment approval' => 1, 'edit own comments' => 0, )DebugCommentLinksTest.php194Drupal\comment\Tests\CommentLinksTest->setEnvironment()
Changed environment:array ( 'authenticated' => true, 'comment count' => true, 'form' => 'separate page', 'user_register' => 'visitors', 'contact' => 'optional', 'comments' => 'open', 'access comments' => 1, 'post comments' => 0, 'skip comment approval' => 1, 'edit own comments' => 0, )DebugCommentLinksTest.php194Drupal\comment\Tests\CommentLinksTest->setEnvironment()
Changed environment:array ( 'authenticated' => false, 'comment count' => false, 'form' => 'separate page', 'user_register' => 'visitors', 'contact' => 'optional', 'comments' => 'open', 'access comments' => 0, 'post comments' => 1, 'skip comment approval' => 1, 'edit own comments' => 0, )DebugCommentLinksTest.php194Drupal\comment\Tests\CommentLinksTest->setEnvironment()
Changed environment:array ( 'authenticated' => true, 'comment count' => false, 'form' => 'separate page', 'user_register' => 'visitors', 'contact' => 'optional', 'comments' => 'open', 'access comments' => 0, 'post comments' => 1, 'skip comment approval' => 1, 'edit own comments' => 0, )DebugCommentLinksTest.php194Drupal\comment\Tests\CommentLinksTest->setEnvironment()
Changed environment:array ( 'authenticated' => false, 'comment count' => true, 'form' => 'separate page', 'user_register' => 'visitors', 'contact' => 'optional', 'comments' => 'open', 'access comments' => 0, 'post comments' => 1, 'skip comment approval' => 1, 'edit own comments' => 0, )DebugCommentLinksTest.php194Drupal\comment\Tests\CommentLinksTest->setEnvironment()
Changed environment:array ( 'authenticated' => true, 'comment count' => true, 'form' => 'separate page', 'user_register' => 'visitors', 'contact' => 'optional', 'comments' => 'open', 'access comments' => 0, 'post comments' => 1, 'skip comment approval' => 1, 'edit own comments' => 0, )DebugCommentLinksTest.php194Drupal\comment\Tests\CommentLinksTest->setEnvironment()
Changed environment:array ( 'authenticated' => false, 'comment count' => false, 'form' => 'separate page', 'user_register' => 'visitors', 'contact' => 'optional', 'comments' => 'open', 'access comments' => 1, 'post comments' => 1, 'skip comment approval' => 1, 'edit own comments' => 0, )DebugCommentLinksTest.php194Drupal\comment\Tests\CommentLinksTest->setEnvironment()
Changed environment:array ( 'authenticated' => true, 'comment count' => false, 'form' => 'separate page', 'user_register' => 'visitors', 'contact' => 'optional', 'comments' => 'open', 'access comments' => 1, 'post comments' => 1, 'skip comment approval' => 1, 'edit own comments' => 0, )DebugCommentLinksTest.php194Drupal\comment\Tests\CommentLinksTest->setEnvironment()
Changed environment:array ( 'authenticated' => false, 'comment count' => true, 'form' => 'separate page', 'user_register' => 'visitors', 'contact' => 'optional', 'comments' => 'open', 'access comments' => 1, 'post comments' => 1, 'skip comment approval' => 1, 'edit own comments' => 0, )DebugCommentLinksTest.php194Drupal\comment\Tests\CommentLinksTest->setEnvironment()
Changed environment:array ( 'authenticated' => true, 'comment count' => true, 'form' => 'separate page', 'user_register' => 'visitors', 'contact' => 'optional', 'comments' => 'open', 'access comments' => 1, 'post comments' => 1, 'skip comment approval' => 1, 'edit own comments' => 0, )DebugCommentLinksTest.php194Drupal\comment\Tests\CommentLinksTest->setEnvironment()
Changed environment:array ( 'authenticated' => false, 'comment count' => false, 'form' => 'below', 'user_register' => 'admin_only', 'contact' => 'optional', 'comments' => 'open', 'access comments' => 0, 'post comments' => 0, 'skip comment approval' => 1, 'edit own comments' => 0, )DebugCommentLinksTest.php194Drupal\comment\Tests\CommentLinksTest->setEnvironment()
Changed environment:array ( 'authenticated' => true, 'comment count' => false, 'form' => 'below', 'user_register' => 'admin_only', 'contact' => 'optional', 'comments' => 'open', 'access comments' => 0, 'post comments' => 0, 'skip comment approval' => 1, 'edit own comments' => 0, )DebugCommentLinksTest.php194Drupal\comment\Tests\CommentLinksTest->setEnvironment()
Changed environment:array ( 'authenticated' => false, 'comment count' => true, 'form' => 'below', 'user_register' => 'admin_only', 'contact' => 'optional', 'comments' => 'open', 'access comments' => 0, 'post comments' => 0, 'skip comment approval' => 1, 'edit own comments' => 0, )DebugCommentLinksTest.php194Drupal\comment\Tests\CommentLinksTest->setEnvironment()
Changed environment:array ( 'authenticated' => true, 'comment count' => true, 'form' => 'below', 'user_register' => 'admin_only', 'contact' => 'optional', 'comments' => 'open', 'access comments' => 0, 'post comments' => 0, 'skip comment approval' => 1, 'edit own comments' => 0, )DebugCommentLinksTest.php194Drupal\comment\Tests\CommentLinksTest->setEnvironment()
Changed environment:array ( 'authenticated' => false, 'comment count' => false, 'form' => 'below', 'user_register' => 'admin_only', 'contact' => 'optional', 'comments' => 'open', 'access comments' => 1, 'post comments' => 0, 'skip comment approval' => 1, 'edit own comments' => 0, )DebugCommentLinksTest.php194Drupal\comment\Tests\CommentLinksTest->setEnvironment()
Changed environment:array ( 'authenticated' => true, 'comment count' => false, 'form' => 'below', 'user_register' => 'admin_only', 'contact' => 'optional', 'comments' => 'open', 'access comments' => 1, 'post comments' => 0, 'skip comment approval' => 1, 'edit own comments' => 0, )DebugCommentLinksTest.php194Drupal\comment\Tests\CommentLinksTest->setEnvironment()
Changed environment:array ( 'authenticated' => false, 'comment count' => true, 'form' => 'below', 'user_register' => 'admin_only', 'contact' => 'optional', 'comments' => 'open', 'access comments' => 1, 'post comments' => 0, 'skip comment approval' => 1, 'edit own comments' => 0, )DebugCommentLinksTest.php194Drupal\comment\Tests\CommentLinksTest->setEnvironment()
Changed environment:array ( 'authenticated' => true, 'comment count' => true, 'form' => 'below', 'user_register' => 'admin_only', 'contact' => 'optional', 'comments' => 'open', 'access comments' => 1, 'post comments' => 0, 'skip comment approval' => 1, 'edit own comments' => 0, )DebugCommentLinksTest.php194Drupal\comment\Tests\CommentLinksTest->setEnvironment()
Changed environment:array ( 'authenticated' => false, 'comment count' => false, 'form' => 'below', 'user_register' => 'admin_only', 'contact' => 'optional', 'comments' => 'open', 'access comments' => 0, 'post comments' => 1, 'skip comment approval' => 1, 'edit own comments' => 0, )DebugCommentLinksTest.php194Drupal\comment\Tests\CommentLinksTest->setEnvironment()
Changed environment:array ( 'authenticated' => true, 'comment count' => false, 'form' => 'below', 'user_register' => 'admin_only', 'contact' => 'optional', 'comments' => 'open', 'access comments' => 0, 'post comments' => 1, 'skip comment approval' => 1, 'edit own comments' => 0, )DebugCommentLinksTest.php194Drupal\comment\Tests\CommentLinksTest->setEnvironment()
Changed environment:array ( 'authenticated' => false, 'comment count' => true, 'form' => 'below', 'user_register' => 'admin_only', 'contact' => 'optional', 'comments' => 'open', 'access comments' => 0, 'post comments' => 1, 'skip comment approval' => 1, 'edit own comments' => 0, )DebugCommentLinksTest.php194Drupal\comment\Tests\CommentLinksTest->setEnvironment()
Changed environment:array ( 'authenticated' => true, 'comment count' => true, 'form' => 'below', 'user_register' => 'admin_only', 'contact' => 'optional', 'comments' => 'open', 'access comments' => 0, 'post comments' => 1, 'skip comment approval' => 1, 'edit own comments' => 0, )DebugCommentLinksTest.php194Drupal\comment\Tests\CommentLinksTest->setEnvironment()
Changed environment:array ( 'authenticated' => false, 'comment count' => false, 'form' => 'below', 'user_register' => 'admin_only', 'contact' => 'optional', 'comments' => 'open', 'access comments' => 1, 'post comments' => 1, 'skip comment approval' => 1, 'edit own comments' => 0, )DebugCommentLinksTest.php194Drupal\comment\Tests\CommentLinksTest->setEnvironment()
Changed environment:array ( 'authenticated' => true, 'comment count' => false, 'form' => 'below', 'user_register' => 'admin_only', 'contact' => 'optional', 'comments' => 'open', 'access comments' => 1, 'post comments' => 1, 'skip comment approval' => 1, 'edit own comments' => 0, )DebugCommentLinksTest.php194Drupal\comment\Tests\CommentLinksTest->setEnvironment()
Changed environment:array ( 'authenticated' => false, 'comment count' => true, 'form' => 'below', 'user_register' => 'admin_only', 'contact' => 'optional', 'comments' => 'open', 'access comments' => 1, 'post comments' => 1, 'skip comment approval' => 1, 'edit own comments' => 0, )DebugCommentLinksTest.php194Drupal\comment\Tests\CommentLinksTest->setEnvironment()
Changed environment:array ( 'authenticated' => true, 'comment count' => true, 'form' => 'below', 'user_register' => 'admin_only', 'contact' => 'optional', 'comments' => 'open', 'access comments' => 1, 'post comments' => 1, 'skip comment approval' => 1, 'edit own comments' => 0, )DebugCommentLinksTest.php194Drupal\comment\Tests\CommentLinksTest->setEnvironment()
Changed environment:array ( 'authenticated' => false, 'comment count' => false, 'form' => 'separate page', 'user_register' => 'admin_only', 'contact' => 'optional', 'comments' => 'open', 'access comments' => 0, 'post comments' => 0, 'skip comment approval' => 1, 'edit own comments' => 0, )DebugCommentLinksTest.php194Drupal\comment\Tests\CommentLinksTest->setEnvironment()
Changed environment:array ( 'authenticated' => true, 'comment count' => false, 'form' => 'separate page', 'user_register' => 'admin_only', 'contact' => 'optional', 'comments' => 'open', 'access comments' => 0, 'post comments' => 0, 'skip comment approval' => 1, 'edit own comments' => 0, )DebugCommentLinksTest.php194Drupal\comment\Tests\CommentLinksTest->setEnvironment()
Changed environment:array ( 'authenticated' => false, 'comment count' => true, 'form' => 'separate page', 'user_register' => 'admin_only', 'contact' => 'optional', 'comments' => 'open', 'access comments' => 0, 'post comments' => 0, 'skip comment approval' => 1, 'edit own comments' => 0, )DebugCommentLinksTest.php194Drupal\comment\Tests\CommentLinksTest->setEnvironment()
Changed environment:array ( 'authenticated' => true, 'comment count' => true, 'form' => 'separate page', 'user_register' => 'admin_only', 'contact' => 'optional', 'comments' => 'open', 'access comments' => 0, 'post comments' => 0, 'skip comment approval' => 1, 'edit own comments' => 0, )DebugCommentLinksTest.php194Drupal\comment\Tests\CommentLinksTest->setEnvironment()
Changed environment:array ( 'authenticated' => false, 'comment count' => false, 'form' => 'separate page', 'user_register' => 'admin_only', 'contact' => 'optional', 'comments' => 'open', 'access comments' => 1, 'post comments' => 0, 'skip comment approval' => 1, 'edit own comments' => 0, )DebugCommentLinksTest.php194Drupal\comment\Tests\CommentLinksTest->setEnvironment()
Changed environment:array ( 'authenticated' => true, 'comment count' => false, 'form' => 'separate page', 'user_register' => 'admin_only', 'contact' => 'optional', 'comments' => 'open', 'access comments' => 1, 'post comments' => 0, 'skip comment approval' => 1, 'edit own comments' => 0, )DebugCommentLinksTest.php194Drupal\comment\Tests\CommentLinksTest->setEnvironment()
Changed environment:array ( 'authenticated' => false, 'comment count' => true, 'form' => 'separate page', 'user_register' => 'admin_only', 'contact' => 'optional', 'comments' => 'open', 'access comments' => 1, 'post comments' => 0, 'skip comment approval' => 1, 'edit own comments' => 0, )DebugCommentLinksTest.php194Drupal\comment\Tests\CommentLinksTest->setEnvironment()
Changed environment:array ( 'authenticated' => true, 'comment count' => true, 'form' => 'separate page', 'user_register' => 'admin_only', 'contact' => 'optional', 'comments' => 'open', 'access comments' => 1, 'post comments' => 0, 'skip comment approval' => 1, 'edit own comments' => 0, )DebugCommentLinksTest.php194Drupal\comment\Tests\CommentLinksTest->setEnvironment()
Changed environment:array ( 'authenticated' => false, 'comment count' => false, 'form' => 'separate page', 'user_register' => 'admin_only', 'contact' => 'optional', 'comments' => 'open', 'access comments' => 0, 'post comments' => 1, 'skip comment approval' => 1, 'edit own comments' => 0, )DebugCommentLinksTest.php194Drupal\comment\Tests\CommentLinksTest->setEnvironment()
Changed environment:array ( 'authenticated' => true, 'comment count' => false, 'form' => 'separate page', 'user_register' => 'admin_only', 'contact' => 'optional', 'comments' => 'open', 'access comments' => 0, 'post comments' => 1, 'skip comment approval' => 1, 'edit own comments' => 0, )DebugCommentLinksTest.php194Drupal\comment\Tests\CommentLinksTest->setEnvironment()
Changed environment:array ( 'authenticated' => false, 'comment count' => true, 'form' => 'separate page', 'user_register' => 'admin_only', 'contact' => 'optional', 'comments' => 'open', 'access comments' => 0, 'post comments' => 1, 'skip comment approval' => 1, 'edit own comments' => 0, )DebugCommentLinksTest.php194Drupal\comment\Tests\CommentLinksTest->setEnvironment()
Changed environment:array ( 'authenticated' => true, 'comment count' => true, 'form' => 'separate page', 'user_register' => 'admin_only', 'contact' => 'optional', 'comments' => 'open', 'access comments' => 0, 'post comments' => 1, 'skip comment approval' => 1, 'edit own comments' => 0, )DebugCommentLinksTest.php194Drupal\comment\Tests\CommentLinksTest->setEnvironment()
Changed environment:array ( 'authenticated' => false, 'comment count' => false, 'form' => 'separate page', 'user_register' => 'admin_only', 'contact' => 'optional', 'comments' => 'open', 'access comments' => 1, 'post comments' => 1, 'skip comment approval' => 1, 'edit own comments' => 0, )DebugCommentLinksTest.php194Drupal\comment\Tests\CommentLinksTest->setEnvironment()
Changed environment:array ( 'authenticated' => true, 'comment count' => false, 'form' => 'separate page', 'user_register' => 'admin_only', 'contact' => 'optional', 'comments' => 'open', 'access comments' => 1, 'post comments' => 1, 'skip comment approval' => 1, 'edit own comments' => 0, )DebugCommentLinksTest.php194Drupal\comment\Tests\CommentLinksTest->setEnvironment()
Changed environment:array ( 'authenticated' => false, 'comment count' => true, 'form' => 'separate page', 'user_register' => 'admin_only', 'contact' => 'optional', 'comments' => 'open', 'access comments' => 1, 'post comments' => 1, 'skip comment approval' => 1, 'edit own comments' => 0, )DebugCommentLinksTest.php194Drupal\comment\Tests\CommentLinksTest->setEnvironment()
Changed environment:array ( 'authenticated' => true, 'comment count' => true, 'form' => 'separate page', 'user_register' => 'admin_only', 'contact' => 'optional', 'comments' => 'open', 'access comments' => 1, 'post comments' => 1, 'skip comment approval' => 1, 'edit own comments' => 0, )DebugCommentLinksTest.php194Drupal\comment\Tests\CommentLinksTest->setEnvironment()
LeafDrupal\comment\Tests\CommentNewIndicatorTest4200
LeafDrupal\comment\Tests\CommentNodeAccessTest5700
LeafDrupal\comment\Tests\CommentNodeChangesTest2400
LeafDrupal\comment\Tests\CommentPagerTest21300
LeafDrupal\comment\Tests\CommentPreviewTest9800
LeafDrupal\comment\Tests\CommentRssTest2600
LeafDrupal\comment\Tests\CommentStatisticsTest9800
LeafDrupal\comment\Tests\CommentThreadingTest15900
LeafDrupal\comment\Tests\CommentTokenReplaceTest6600
LeafDrupal\comment\Tests\CommentTranslationUITest9600
LeafDrupal\comment\Tests\Views\ArgumentUserUIDTest900
LeafDrupal\comment\Tests\Views\DefaultViewRecentComments800
LeafDrupal\comment\Tests\Views\FilterUserUIDTest900
LeafDrupal\comment\Tests\Views\RowRssTest1200
LeafDrupal\comment\Tests\Views\WizardTest3300
LeafDrupal\config\Tests\ConfigCRUDTest2000
LeafDrupal\config\Tests\ConfigEntityListTest6800
LeafDrupal\config\Tests\ConfigEntityTest13700
LeafDrupal\config\Tests\ConfigEntityUnitTest100
LeafDrupal\config\Tests\ConfigFileContentTest3100
LeafDrupal\config\Tests\ConfigImportTest3800
LeafDrupal\config\Tests\ConfigImportUITest4600
LeafDrupal\config\Tests\ConfigInstallTest1100
LeafDrupal\config\Tests\ConfigOverrideTest1800
LeafDrupal\config\Tests\ConfigUpgradeTest1200
LeafDrupal\config\Tests\LocaleConfigOverride300
LeafDrupal\config\Tests\Storage\DatabaseStorageTest2100
LeafDrupal\config\Tests\Storage\FileStorageTest2300
LeafDrupal\contact\Tests\ContactAuthenticatedUserTest1300
LeafDrupal\contact\Tests\ContactPersonalTest16200
LeafDrupal\contact\Tests\ContactSitewideTest24500
LeafDrupal\contact\Tests\ContactUpgradePathTest4500
LeafDrupal\contextual\Tests\ContextualDynamicContextTest1600
LeafDrupal\dblog\Tests\DBLogTest37700
LeafDrupal\edit\Tests\EditorSelectionTest1000
LeafDrupal\email\Tests\EmailFieldTest1900
LeafDrupal\entity\Tests\EntityDisplayTest2900
LeafDrupal\entity_reference\Tests\EntityReferenceAdminTest3400
LeafDrupal\entity_reference\Tests\EntityReferenceAutoCreateTest1800
LeafDrupal\entity_reference\Tests\EntityReferenceItemTest1000
LeafDrupal\entity_reference\Tests\EntityReferenceSelectionAccessTest6900
LeafDrupal\entity_reference\Tests\EntityReferenceSelectionSortTest700
LeafDrupal\field\Tests\BulkDeleteTest7500
LeafDrupal\field\Tests\CrudTest7500
LeafDrupal\field\Tests\DisplayApiTest4600
LeafDrupal\field\Tests\EntityPropertiesTest400
LeafDrupal\field\Tests\FieldAccessTest2100
LeafDrupal\field\Tests\FieldAttachOtherTest10300
LeafDrupal\field\Tests\FieldAttachStorageTest9200
LeafDrupal\field\Tests\FieldInfoTest7000
LeafDrupal\field\Tests\FieldInstanceCrudTest2800
LeafDrupal\field\Tests\FormTest26500
LeafDrupal\field\Tests\TranslationTest9200
LeafDrupal\field\Tests\Views\ApiDataTest1500
LeafDrupal\field\Tests\Views\HandlerFieldFieldTest2400
LeafDrupal\field_sql_storage\Tests\FieldSqlStorageTest9200
LeafDrupal\field_ui\Tests\AlterTest2100
LeafDrupal\field_ui\Tests\ManageDisplayTest14900
ExpandDrupal\field_ui\Tests\ManageFieldsTest25920
MessageGroupFilenameLineFunctionStatus
Value 'entity_reference_autocomplete' is equal to value 'options_select'.OtherManageFieldsTest.php423Drupal\field_ui\Tests\ManageFieldsTest->testWidgetChange()
Value 'Autocomplete' is equal to value 'Select list'.OtherManageFieldsTest.php428Drupal\field_ui\Tests\ManageFieldsTest->testWidgetChange()
LeafDrupal\file\Tests\CopyTest11000
LeafDrupal\file\Tests\DeleteTest2400
LeafDrupal\file\Tests\DownloadTest4500
LeafDrupal\file\Tests\FileFieldDisplayTest5000
LeafDrupal\file\Tests\FileFieldPathTest2700
LeafDrupal\file\Tests\FileFieldRevisionTest6700
LeafDrupal\file\Tests\FileFieldRSSContentTest2300
LeafDrupal\file\Tests\FileFieldValidateTest11800
LeafDrupal\file\Tests\FileFieldWidgetTest29900
LeafDrupal\file\Tests\FileManagedFileElementTest26800
LeafDrupal\file\Tests\FilePrivateTest3700
LeafDrupal\file\Tests\FileTokenReplaceTest3500
LeafDrupal\file\Tests\LoadTest3400
LeafDrupal\file\Tests\MoveTest11000
LeafDrupal\file\Tests\RemoteFileSaveUploadTest27000
LeafDrupal\file\Tests\SaveDataTest9300
LeafDrupal\file\Tests\SaveTest1600
LeafDrupal\file\Tests\SaveUploadTest27000
LeafDrupal\file\Tests\SpaceUsedTest1200
LeafDrupal\file\Tests\UsageTest3400
LeafDrupal\file\Tests\ValidateTest1200
LeafDrupal\file\Tests\ValidatorTest2900
LeafDrupal\filter\Tests\FilterAdminTest19400
LeafDrupal\filter\Tests\FilterAPITest500
LeafDrupal\filter\Tests\FilterCrudTest23900
LeafDrupal\filter\Tests\FilterDefaultFormatTest3300
LeafDrupal\filter\Tests\FilterFormatAccessTest27200
LeafDrupal\filter\Tests\FilterHooksTest3300
LeafDrupal\filter\Tests\FilterHtmlImageSecureTest4600
LeafDrupal\filter\Tests\FilterNoFormatTest100
LeafDrupal\filter\Tests\FilterSecurityTest4000
LeafDrupal\filter\Tests\FilterSettingsTest1200
LeafDrupal\filter\Tests\FilterUnitTest21500
ExpandDrupal\forum\Tests\ForumBlockTest20624102
MessageGroupFilenameLineFunctionStatus
Undefined index: tidNoticeforum.module325forum_node_presave()
Undefined index: tidNoticeforum.module527forum_field_storage_pre_insert()
Undefined index: tidNoticeforum.module325forum_node_presave()
Undefined index: tidNoticeforum.module527forum_field_storage_pre_insert()
Undefined index: tidNoticeforum.module325forum_node_presave()
Undefined index: tidNoticeforum.module527forum_field_storage_pre_insert()
Undefined index: tidNoticeforum.module325forum_node_presave()
Undefined index: tidNoticeforum.module527forum_field_storage_pre_insert()
Undefined index: tidNoticeforum.module325forum_node_presave()
Undefined index: tidNoticeforum.module527forum_field_storage_pre_insert()
New forum topics block has a "more"-link.OtherForumBlockTest.php66Drupal\forum\Tests\ForumBlockTest->testNewForumTopicsBlock()
Forum topic rgpg0MHjUWrWKQ7zID5i found in the "New forum topics" block.OtherForumBlockTest.php71Drupal\forum\Tests\ForumBlockTest->testNewForumTopicsBlock()
Forum topic kCEogHpW2HNnqsNIWal5 found in the "New forum topics" block.OtherForumBlockTest.php71Drupal\forum\Tests\ForumBlockTest->testNewForumTopicsBlock()
Forum topic jaxv5amp2FmP5YFTSmiF found in the "New forum topics" block.OtherForumBlockTest.php71Drupal\forum\Tests\ForumBlockTest->testNewForumTopicsBlock()
Forum topic iwoWiu0It0NrU5hBbU7M found in the "New forum topics" block.OtherForumBlockTest.php71Drupal\forum\Tests\ForumBlockTest->testNewForumTopicsBlock()
Forum topic zWGPrgDKsxgz9SSySvvF found in the "New forum topics" block.OtherForumBlockTest.php71Drupal\forum\Tests\ForumBlockTest->testNewForumTopicsBlock()
Forum topic iwoWiu0It0NrU5hBbU7M found in the "New forum topics" block.OtherForumBlockTest.php84Drupal\forum\Tests\ForumBlockTest->testNewForumTopicsBlock()
Forum topic zWGPrgDKsxgz9SSySvvF found in the "New forum topics" block.OtherForumBlockTest.php84Drupal\forum\Tests\ForumBlockTest->testNewForumTopicsBlock()
Undefined index: tidNoticeforum.module325forum_node_presave()
Undefined index: tidNoticeforum.module527forum_field_storage_pre_insert()
Undefined index: tidNoticeforum.module325forum_node_presave()
Undefined index: tidNoticeforum.module527forum_field_storage_pre_insert()
Undefined index: tidNoticeforum.module325forum_node_presave()
Undefined index: tidNoticeforum.module527forum_field_storage_pre_insert()
Undefined index: tidNoticeforum.module325forum_node_presave()
Undefined index: tidNoticeforum.module527forum_field_storage_pre_insert()
Undefined index: tidNoticeforum.module325forum_node_presave()
Undefined index: tidNoticeforum.module527forum_field_storage_pre_insert()
Undefined index: tidNoticeforum.module325forum_node_presave()
Undefined index: tidNoticeforum.module527forum_field_storage_pre_insert()
Undefined index: tidNoticeforum.module325forum_node_presave()
Undefined index: tidNoticeforum.module527forum_field_storage_pre_insert()
Undefined index: tidNoticeforum.module325forum_node_presave()
Undefined index: tidNoticeforum.module527forum_field_storage_pre_insert()
Undefined index: tidNoticeforum.module325forum_node_presave()
Undefined index: tidNoticeforum.module527forum_field_storage_pre_insert()
Undefined index: tidNoticeforum.module325forum_node_presave()
Undefined index: tidNoticeforum.module527forum_field_storage_pre_insert()
Trying to get property of non-objectDrupal\forum\Tests\ForumBlockTest->testActiveForumTopicsBlock() Drupal\simpletest\TestBase->run() simpletest_script_run_one_test('286', 'Drupal\forum\Tests\ForumBlockTest') NoticeForumBlockTest.php112Drupal\forum\Tests\ForumBlockTest->testActiveForumTopicsBlock()
array_flip(): Can only flip STRING and INTEGER values!array_flip(Array) Drupal\Core\Entity\DatabaseStorageController->load(Array) entity_load_multiple('node', Array, ) entity_load('node', NULL, ) node_load(NULL) Drupal\comment\CommentStorageController->preSave(Object) Drupal\Core\Entity\DatabaseStorageController->save(Object) Drupal\Core\Entity\Entity->save() comment_save(Object) Drupal\forum\Tests\ForumBlockTest->testActiveForumTopicsBlock() Drupal\simpletest\TestBase->run() simpletest_script_run_one_test('286', 'Drupal\forum\Tests\ForumBlockTest') WarningDatabaseStorageController.php175Drupal\Core\Entity\DatabaseStorageController->load()
Trying to get property of non-objectDrupal\comment\CommentStorageController->preSave(Object) Drupal\Core\Entity\DatabaseStorageController->save(Object) Drupal\Core\Entity\Entity->save() comment_save(Object) Drupal\forum\Tests\ForumBlockTest->testActiveForumTopicsBlock() Drupal\simpletest\TestBase->run() simpletest_script_run_one_test('286', 'Drupal\forum\Tests\ForumBlockTest') NoticeCommentStorageController.php70Drupal\comment\CommentStorageController->preSave()
Trying to get property of non-objectDrupal\comment\CommentStorageController->updateNodeStatistics(NULL) Drupal\comment\CommentStorageController->postSave(Object, ) Drupal\Core\Entity\DatabaseStorageController->save(Object) Drupal\Core\Entity\Entity->save() comment_save(Object) Drupal\forum\Tests\ForumBlockTest->testActiveForumTopicsBlock() Drupal\simpletest\TestBase->run() simpletest_script_run_one_test('286', 'Drupal\forum\Tests\ForumBlockTest') NoticeCommentStorageController.php231Drupal\comment\CommentStorageController->updateNodeStatistics()
Trying to get property of non-objectDrupal\comment\CommentStorageController->updateNodeStatistics(NULL) Drupal\comment\CommentStorageController->postSave(Object, ) Drupal\Core\Entity\DatabaseStorageController->save(Object) Drupal\Core\Entity\Entity->save() comment_save(Object) Drupal\forum\Tests\ForumBlockTest->testActiveForumTopicsBlock() Drupal\simpletest\TestBase->run() simpletest_script_run_one_test('286', 'Drupal\forum\Tests\ForumBlockTest') NoticeCommentStorageController.php233Drupal\comment\CommentStorageController->updateNodeStatistics()
Trying to get property of non-object_forum_update_forum_index(NULL) forum_comment_publish(Object) call_user_func_array('forum_comment_publish', Array) module_invoke_all('comment_publish', Object) Drupal\comment\CommentStorageController->postSave(Object, ) Drupal\Core\Entity\DatabaseStorageController->save(Object) Drupal\Core\Entity\Entity->save() comment_save(Object) Drupal\forum\Tests\ForumBlockTest->testActiveForumTopicsBlock() Drupal\simpletest\TestBase->run() simpletest_script_run_one_test('286', 'Drupal\forum\Tests\ForumBlockTest') Noticeforum.module1386_forum_update_forum_index()
Trying to get property of non-objectDrupal\forum\Tests\ForumBlockTest->testActiveForumTopicsBlock() Drupal\simpletest\TestBase->run() simpletest_script_run_one_test('286', 'Drupal\forum\Tests\ForumBlockTest') NoticeForumBlockTest.php112Drupal\forum\Tests\ForumBlockTest->testActiveForumTopicsBlock()
array_flip(): Can only flip STRING and INTEGER values!array_flip(Array) Drupal\Core\Entity\DatabaseStorageController->load(Array) entity_load_multiple('node', Array, ) entity_load('node', NULL, ) node_load(NULL) Drupal\comment\CommentStorageController->preSave(Object) Drupal\Core\Entity\DatabaseStorageController->save(Object) Drupal\Core\Entity\Entity->save() comment_save(Object) Drupal\forum\Tests\ForumBlockTest->testActiveForumTopicsBlock() Drupal\simpletest\TestBase->run() simpletest_script_run_one_test('286', 'Drupal\forum\Tests\ForumBlockTest') WarningDatabaseStorageController.php175Drupal\Core\Entity\DatabaseStorageController->load()
Trying to get property of non-objectDrupal\comment\CommentStorageController->preSave(Object) Drupal\Core\Entity\DatabaseStorageController->save(Object) Drupal\Core\Entity\Entity->save() comment_save(Object) Drupal\forum\Tests\ForumBlockTest->testActiveForumTopicsBlock() Drupal\simpletest\TestBase->run() simpletest_script_run_one_test('286', 'Drupal\forum\Tests\ForumBlockTest') NoticeCommentStorageController.php70Drupal\comment\CommentStorageController->preSave()
Trying to get property of non-objectDrupal\comment\CommentStorageController->updateNodeStatistics(NULL) Drupal\comment\CommentStorageController->postSave(Object, ) Drupal\Core\Entity\DatabaseStorageController->save(Object) Drupal\Core\Entity\Entity->save() comment_save(Object) Drupal\forum\Tests\ForumBlockTest->testActiveForumTopicsBlock() Drupal\simpletest\TestBase->run() simpletest_script_run_one_test('286', 'Drupal\forum\Tests\ForumBlockTest') NoticeCommentStorageController.php231Drupal\comment\CommentStorageController->updateNodeStatistics()
Trying to get property of non-objectDrupal\comment\CommentStorageController->updateNodeStatistics(NULL) Drupal\comment\CommentStorageController->postSave(Object, ) Drupal\Core\Entity\DatabaseStorageController->save(Object) Drupal\Core\Entity\Entity->save() comment_save(Object) Drupal\forum\Tests\ForumBlockTest->testActiveForumTopicsBlock() Drupal\simpletest\TestBase->run() simpletest_script_run_one_test('286', 'Drupal\forum\Tests\ForumBlockTest') NoticeCommentStorageController.php233Drupal\comment\CommentStorageController->updateNodeStatistics()
Trying to get property of non-object_forum_update_forum_index(NULL) forum_comment_publish(Object) call_user_func_array('forum_comment_publish', Array) module_invoke_all('comment_publish', Object) Drupal\comment\CommentStorageController->postSave(Object, ) Drupal\Core\Entity\DatabaseStorageController->save(Object) Drupal\Core\Entity\Entity->save() comment_save(Object) Drupal\forum\Tests\ForumBlockTest->testActiveForumTopicsBlock() Drupal\simpletest\TestBase->run() simpletest_script_run_one_test('286', 'Drupal\forum\Tests\ForumBlockTest') Noticeforum.module1386_forum_update_forum_index()
Trying to get property of non-objectDrupal\forum\Tests\ForumBlockTest->testActiveForumTopicsBlock() Drupal\simpletest\TestBase->run() simpletest_script_run_one_test('286', 'Drupal\forum\Tests\ForumBlockTest') NoticeForumBlockTest.php112Drupal\forum\Tests\ForumBlockTest->testActiveForumTopicsBlock()
array_flip(): Can only flip STRING and INTEGER values!array_flip(Array) Drupal\Core\Entity\DatabaseStorageController->load(Array) entity_load_multiple('node', Array, ) entity_load('node', NULL, ) node_load(NULL) Drupal\comment\CommentStorageController->preSave(Object) Drupal\Core\Entity\DatabaseStorageController->save(Object) Drupal\Core\Entity\Entity->save() comment_save(Object) Drupal\forum\Tests\ForumBlockTest->testActiveForumTopicsBlock() Drupal\simpletest\TestBase->run() simpletest_script_run_one_test('286', 'Drupal\forum\Tests\ForumBlockTest') WarningDatabaseStorageController.php175Drupal\Core\Entity\DatabaseStorageController->load()
Trying to get property of non-objectDrupal\comment\CommentStorageController->preSave(Object) Drupal\Core\Entity\DatabaseStorageController->save(Object) Drupal\Core\Entity\Entity->save() comment_save(Object) Drupal\forum\Tests\ForumBlockTest->testActiveForumTopicsBlock() Drupal\simpletest\TestBase->run() simpletest_script_run_one_test('286', 'Drupal\forum\Tests\ForumBlockTest') NoticeCommentStorageController.php70Drupal\comment\CommentStorageController->preSave()
Trying to get property of non-objectDrupal\comment\CommentStorageController->updateNodeStatistics(NULL) Drupal\comment\CommentStorageController->postSave(Object, ) Drupal\Core\Entity\DatabaseStorageController->save(Object) Drupal\Core\Entity\Entity->save() comment_save(Object) Drupal\forum\Tests\ForumBlockTest->testActiveForumTopicsBlock() Drupal\simpletest\TestBase->run() simpletest_script_run_one_test('286', 'Drupal\forum\Tests\ForumBlockTest') NoticeCommentStorageController.php231Drupal\comment\CommentStorageController->updateNodeStatistics()
Trying to get property of non-objectDrupal\comment\CommentStorageController->updateNodeStatistics(NULL) Drupal\comment\CommentStorageController->postSave(Object, ) Drupal\Core\Entity\DatabaseStorageController->save(Object) Drupal\Core\Entity\Entity->save() comment_save(Object) Drupal\forum\Tests\ForumBlockTest->testActiveForumTopicsBlock() Drupal\simpletest\TestBase->run() simpletest_script_run_one_test('286', 'Drupal\forum\Tests\ForumBlockTest') NoticeCommentStorageController.php233Drupal\comment\CommentStorageController->updateNodeStatistics()
Trying to get property of non-object_forum_update_forum_index(NULL) forum_comment_publish(Object) call_user_func_array('forum_comment_publish', Array) module_invoke_all('comment_publish', Object) Drupal\comment\CommentStorageController->postSave(Object, ) Drupal\Core\Entity\DatabaseStorageController->save(Object) Drupal\Core\Entity\Entity->save() comment_save(Object) Drupal\forum\Tests\ForumBlockTest->testActiveForumTopicsBlock() Drupal\simpletest\TestBase->run() simpletest_script_run_one_test('286', 'Drupal\forum\Tests\ForumBlockTest') Noticeforum.module1386_forum_update_forum_index()
Trying to get property of non-objectDrupal\forum\Tests\ForumBlockTest->testActiveForumTopicsBlock() Drupal\simpletest\TestBase->run() simpletest_script_run_one_test('286', 'Drupal\forum\Tests\ForumBlockTest') NoticeForumBlockTest.php112Drupal\forum\Tests\ForumBlockTest->testActiveForumTopicsBlock()
array_flip(): Can only flip STRING and INTEGER values!array_flip(Array) Drupal\Core\Entity\DatabaseStorageController->load(Array) entity_load_multiple('node', Array, ) entity_load('node', NULL, ) node_load(NULL) Drupal\comment\CommentStorageController->preSave(Object) Drupal\Core\Entity\DatabaseStorageController->save(Object) Drupal\Core\Entity\Entity->save() comment_save(Object) Drupal\forum\Tests\ForumBlockTest->testActiveForumTopicsBlock() Drupal\simpletest\TestBase->run() simpletest_script_run_one_test('286', 'Drupal\forum\Tests\ForumBlockTest') WarningDatabaseStorageController.php175Drupal\Core\Entity\DatabaseStorageController->load()
Undefined index: tidNoticeforum.module325forum_node_presave()
Undefined index: tidNoticeforum.module527forum_field_storage_pre_insert()
New forum topics block has a "more"-link.OtherForumBlockTest.php66Drupal\forum\Tests\ForumBlockTest->testNewForumTopicsBlock()
Forum topic rgpg0MHjUWrWKQ7zID5i found in the "New forum topics" block.OtherForumBlockTest.php71Drupal\forum\Tests\ForumBlockTest->testNewForumTopicsBlock()
Forum topic kCEogHpW2HNnqsNIWal5 found in the "New forum topics" block.OtherForumBlockTest.php71Drupal\forum\Tests\ForumBlockTest->testNewForumTopicsBlock()
Forum topic jaxv5amp2FmP5YFTSmiF found in the "New forum topics" block.OtherForumBlockTest.php71Drupal\forum\Tests\ForumBlockTest->testNewForumTopicsBlock()
Forum topic iwoWiu0It0NrU5hBbU7M found in the "New forum topics" block.OtherForumBlockTest.php71Drupal\forum\Tests\ForumBlockTest->testNewForumTopicsBlock()
Forum topic zWGPrgDKsxgz9SSySvvF found in the "New forum topics" block.OtherForumBlockTest.php71Drupal\forum\Tests\ForumBlockTest->testNewForumTopicsBlock()
Forum topic iwoWiu0It0NrU5hBbU7M found in the "New forum topics" block.OtherForumBlockTest.php84Drupal\forum\Tests\ForumBlockTest->testNewForumTopicsBlock()
Forum topic zWGPrgDKsxgz9SSySvvF found in the "New forum topics" block.OtherForumBlockTest.php84Drupal\forum\Tests\ForumBlockTest->testNewForumTopicsBlock()
Undefined index: tidNoticeforum.module325forum_node_presave()
Undefined index: tidNoticeforum.module527forum_field_storage_pre_insert()
Undefined index: tidNoticeforum.module325forum_node_presave()
Undefined index: tidNoticeforum.module527forum_field_storage_pre_insert()
Undefined index: tidNoticeforum.module325forum_node_presave()
Undefined index: tidNoticeforum.module527forum_field_storage_pre_insert()
Undefined index: tidNoticeforum.module325forum_node_presave()
Undefined index: tidNoticeforum.module527forum_field_storage_pre_insert()
Undefined index: tidNoticeforum.module325forum_node_presave()
Undefined index: tidNoticeforum.module527forum_field_storage_pre_insert()
Undefined index: tidNoticeforum.module325forum_node_presave()
Undefined index: tidNoticeforum.module527forum_field_storage_pre_insert()
Undefined index: tidNoticeforum.module325forum_node_presave()
Undefined index: tidNoticeforum.module527forum_field_storage_pre_insert()
Undefined index: tidNoticeforum.module325forum_node_presave()
Undefined index: tidNoticeforum.module527forum_field_storage_pre_insert()
Undefined index: tidNoticeforum.module325forum_node_presave()
Undefined index: tidNoticeforum.module527forum_field_storage_pre_insert()
Undefined index: tidNoticeforum.module325forum_node_presave()
Undefined index: tidNoticeforum.module527forum_field_storage_pre_insert()
Trying to get property of non-objectDrupal\forum\Tests\ForumBlockTest->testActiveForumTopicsBlock() Drupal\simpletest\TestBase->run() simpletest_script_run_one_test('286', 'Drupal\forum\Tests\ForumBlockTest') NoticeForumBlockTest.php112Drupal\forum\Tests\ForumBlockTest->testActiveForumTopicsBlock()
array_flip(): Can only flip STRING and INTEGER values!array_flip(Array) Drupal\Core\Entity\DatabaseStorageController->load(Array) entity_load_multiple('node', Array, ) entity_load('node', NULL, ) node_load(NULL) Drupal\comment\CommentStorageController->preSave(Object) Drupal\Core\Entity\DatabaseStorageController->save(Object) Drupal\Core\Entity\Entity->save() comment_save(Object) Drupal\forum\Tests\ForumBlockTest->testActiveForumTopicsBlock() Drupal\simpletest\TestBase->run() simpletest_script_run_one_test('286', 'Drupal\forum\Tests\ForumBlockTest') WarningDatabaseStorageController.php175Drupal\Core\Entity\DatabaseStorageController->load()
Trying to get property of non-objectDrupal\comment\CommentStorageController->preSave(Object) Drupal\Core\Entity\DatabaseStorageController->save(Object) Drupal\Core\Entity\Entity->save() comment_save(Object) Drupal\forum\Tests\ForumBlockTest->testActiveForumTopicsBlock() Drupal\simpletest\TestBase->run() simpletest_script_run_one_test('286', 'Drupal\forum\Tests\ForumBlockTest') NoticeCommentStorageController.php70Drupal\comment\CommentStorageController->preSave()
Trying to get property of non-objectDrupal\comment\CommentStorageController->updateNodeStatistics(NULL) Drupal\comment\CommentStorageController->postSave(Object, ) Drupal\Core\Entity\DatabaseStorageController->save(Object) Drupal\Core\Entity\Entity->save() comment_save(Object) Drupal\forum\Tests\ForumBlockTest->testActiveForumTopicsBlock() Drupal\simpletest\TestBase->run() simpletest_script_run_one_test('286', 'Drupal\forum\Tests\ForumBlockTest') NoticeCommentStorageController.php231Drupal\comment\CommentStorageController->updateNodeStatistics()
Trying to get property of non-objectDrupal\comment\CommentStorageController->updateNodeStatistics(NULL) Drupal\comment\CommentStorageController->postSave(Object, ) Drupal\Core\Entity\DatabaseStorageController->save(Object) Drupal\Core\Entity\Entity->save() comment_save(Object) Drupal\forum\Tests\ForumBlockTest->testActiveForumTopicsBlock() Drupal\simpletest\TestBase->run() simpletest_script_run_one_test('286', 'Drupal\forum\Tests\ForumBlockTest') NoticeCommentStorageController.php233Drupal\comment\CommentStorageController->updateNodeStatistics()
Trying to get property of non-object_forum_update_forum_index(NULL) forum_comment_publish(Object) call_user_func_array('forum_comment_publish', Array) module_invoke_all('comment_publish', Object) Drupal\comment\CommentStorageController->postSave(Object, ) Drupal\Core\Entity\DatabaseStorageController->save(Object) Drupal\Core\Entity\Entity->save() comment_save(Object) Drupal\forum\Tests\ForumBlockTest->testActiveForumTopicsBlock() Drupal\simpletest\TestBase->run() simpletest_script_run_one_test('286', 'Drupal\forum\Tests\ForumBlockTest') Noticeforum.module1386_forum_update_forum_index()
Trying to get property of non-objectDrupal\forum\Tests\ForumBlockTest->testActiveForumTopicsBlock() Drupal\simpletest\TestBase->run() simpletest_script_run_one_test('286', 'Drupal\forum\Tests\ForumBlockTest') NoticeForumBlockTest.php112Drupal\forum\Tests\ForumBlockTest->testActiveForumTopicsBlock()
array_flip(): Can only flip STRING and INTEGER values!array_flip(Array) Drupal\Core\Entity\DatabaseStorageController->load(Array) entity_load_multiple('node', Array, ) entity_load('node', NULL, ) node_load(NULL) Drupal\comment\CommentStorageController->preSave(Object) Drupal\Core\Entity\DatabaseStorageController->save(Object) Drupal\Core\Entity\Entity->save() comment_save(Object) Drupal\forum\Tests\ForumBlockTest->testActiveForumTopicsBlock() Drupal\simpletest\TestBase->run() simpletest_script_run_one_test('286', 'Drupal\forum\Tests\ForumBlockTest') WarningDatabaseStorageController.php175Drupal\Core\Entity\DatabaseStorageController->load()
Trying to get property of non-objectDrupal\comment\CommentStorageController->preSave(Object) Drupal\Core\Entity\DatabaseStorageController->save(Object) Drupal\Core\Entity\Entity->save() comment_save(Object) Drupal\forum\Tests\ForumBlockTest->testActiveForumTopicsBlock() Drupal\simpletest\TestBase->run() simpletest_script_run_one_test('286', 'Drupal\forum\Tests\ForumBlockTest') NoticeCommentStorageController.php70Drupal\comment\CommentStorageController->preSave()
Trying to get property of non-objectDrupal\comment\CommentStorageController->updateNodeStatistics(NULL) Drupal\comment\CommentStorageController->postSave(Object, ) Drupal\Core\Entity\DatabaseStorageController->save(Object) Drupal\Core\Entity\Entity->save() comment_save(Object) Drupal\forum\Tests\ForumBlockTest->testActiveForumTopicsBlock() Drupal\simpletest\TestBase->run() simpletest_script_run_one_test('286', 'Drupal\forum\Tests\ForumBlockTest') NoticeCommentStorageController.php231Drupal\comment\CommentStorageController->updateNodeStatistics()
Trying to get property of non-objectDrupal\comment\CommentStorageController->updateNodeStatistics(NULL) Drupal\comment\CommentStorageController->postSave(Object, ) Drupal\Core\Entity\DatabaseStorageController->save(Object) Drupal\Core\Entity\Entity->save() comment_save(Object) Drupal\forum\Tests\ForumBlockTest->testActiveForumTopicsBlock() Drupal\simpletest\TestBase->run() simpletest_script_run_one_test('286', 'Drupal\forum\Tests\ForumBlockTest') NoticeCommentStorageController.php233Drupal\comment\CommentStorageController->updateNodeStatistics()
Trying to get property of non-object_forum_update_forum_index(NULL) forum_comment_publish(Object) call_user_func_array('forum_comment_publish', Array) module_invoke_all('comment_publish', Object) Drupal\comment\CommentStorageController->postSave(Object, ) Drupal\Core\Entity\DatabaseStorageController->save(Object) Drupal\Core\Entity\Entity->save() comment_save(Object) Drupal\forum\Tests\ForumBlockTest->testActiveForumTopicsBlock() Drupal\simpletest\TestBase->run() simpletest_script_run_one_test('286', 'Drupal\forum\Tests\ForumBlockTest') Noticeforum.module1386_forum_update_forum_index()
Trying to get property of non-objectDrupal\forum\Tests\ForumBlockTest->testActiveForumTopicsBlock() Drupal\simpletest\TestBase->run() simpletest_script_run_one_test('286', 'Drupal\forum\Tests\ForumBlockTest') NoticeForumBlockTest.php112Drupal\forum\Tests\ForumBlockTest->testActiveForumTopicsBlock()
array_flip(): Can only flip STRING and INTEGER values!array_flip(Array) Drupal\Core\Entity\DatabaseStorageController->load(Array) entity_load_multiple('node', Array, ) entity_load('node', NULL, ) node_load(NULL) Drupal\comment\CommentStorageController->preSave(Object) Drupal\Core\Entity\DatabaseStorageController->save(Object) Drupal\Core\Entity\Entity->save() comment_save(Object) Drupal\forum\Tests\ForumBlockTest->testActiveForumTopicsBlock() Drupal\simpletest\TestBase->run() simpletest_script_run_one_test('286', 'Drupal\forum\Tests\ForumBlockTest') WarningDatabaseStorageController.php175Drupal\Core\Entity\DatabaseStorageController->load()
Trying to get property of non-objectDrupal\comment\CommentStorageController->preSave(Object) Drupal\Core\Entity\DatabaseStorageController->save(Object) Drupal\Core\Entity\Entity->save() comment_save(Object) Drupal\forum\Tests\ForumBlockTest->testActiveForumTopicsBlock() Drupal\simpletest\TestBase->run() simpletest_script_run_one_test('286', 'Drupal\forum\Tests\ForumBlockTest') NoticeCommentStorageController.php70Drupal\comment\CommentStorageController->preSave()
Trying to get property of non-objectDrupal\comment\CommentStorageController->updateNodeStatistics(NULL) Drupal\comment\CommentStorageController->postSave(Object, ) Drupal\Core\Entity\DatabaseStorageController->save(Object) Drupal\Core\Entity\Entity->save() comment_save(Object) Drupal\forum\Tests\ForumBlockTest->testActiveForumTopicsBlock() Drupal\simpletest\TestBase->run() simpletest_script_run_one_test('286', 'Drupal\forum\Tests\ForumBlockTest') NoticeCommentStorageController.php231Drupal\comment\CommentStorageController->updateNodeStatistics()
Trying to get property of non-objectDrupal\comment\CommentStorageController->updateNodeStatistics(NULL) Drupal\comment\CommentStorageController->postSave(Object, ) Drupal\Core\Entity\DatabaseStorageController->save(Object) Drupal\Core\Entity\Entity->save() comment_save(Object) Drupal\forum\Tests\ForumBlockTest->testActiveForumTopicsBlock() Drupal\simpletest\TestBase->run() simpletest_script_run_one_test('286', 'Drupal\forum\Tests\ForumBlockTest') NoticeCommentStorageController.php233Drupal\comment\CommentStorageController->updateNodeStatistics()
Trying to get property of non-object_forum_update_forum_index(NULL) forum_comment_publish(Object) call_user_func_array('forum_comment_publish', Array) module_invoke_all('comment_publish', Object) Drupal\comment\CommentStorageController->postSave(Object, ) Drupal\Core\Entity\DatabaseStorageController->save(Object) Drupal\Core\Entity\Entity->save() comment_save(Object) Drupal\forum\Tests\ForumBlockTest->testActiveForumTopicsBlock() Drupal\simpletest\TestBase->run() simpletest_script_run_one_test('286', 'Drupal\forum\Tests\ForumBlockTest') Noticeforum.module1386_forum_update_forum_index()
Trying to get property of non-objectDrupal\forum\Tests\ForumBlockTest->testActiveForumTopicsBlock() Drupal\simpletest\TestBase->run() simpletest_script_run_one_test('286', 'Drupal\forum\Tests\ForumBlockTest') NoticeForumBlockTest.php112Drupal\forum\Tests\ForumBlockTest->testActiveForumTopicsBlock()
array_flip(): Can only flip STRING and INTEGER values!array_flip(Array) Drupal\Core\Entity\DatabaseStorageController->load(Array) entity_load_multiple('node', Array, ) entity_load('node', NULL, ) node_load(NULL) Drupal\comment\CommentStorageController->preSave(Object) Drupal\Core\Entity\DatabaseStorageController->save(Object) Drupal\Core\Entity\Entity->save() comment_save(Object) Drupal\forum\Tests\ForumBlockTest->testActiveForumTopicsBlock() Drupal\simpletest\TestBase->run() simpletest_script_run_one_test('286', 'Drupal\forum\Tests\ForumBlockTest') WarningDatabaseStorageController.php175Drupal\Core\Entity\DatabaseStorageController->load()
Trying to get property of non-objectDrupal\comment\CommentStorageController->preSave(Object) Drupal\Core\Entity\DatabaseStorageController->save(Object) Drupal\Core\Entity\Entity->save() comment_save(Object) Drupal\forum\Tests\ForumBlockTest->testActiveForumTopicsBlock() Drupal\simpletest\TestBase->run() simpletest_script_run_one_test('286', 'Drupal\forum\Tests\ForumBlockTest') NoticeCommentStorageController.php70Drupal\comment\CommentStorageController->preSave()
Trying to get property of non-objectDrupal\comment\CommentStorageController->updateNodeStatistics(NULL) Drupal\comment\CommentStorageController->postSave(Object, ) Drupal\Core\Entity\DatabaseStorageController->save(Object) Drupal\Core\Entity\Entity->save() comment_save(Object) Drupal\forum\Tests\ForumBlockTest->testActiveForumTopicsBlock() Drupal\simpletest\TestBase->run() simpletest_script_run_one_test('286', 'Drupal\forum\Tests\ForumBlockTest') NoticeCommentStorageController.php231Drupal\comment\CommentStorageController->updateNodeStatistics()
Trying to get property of non-objectDrupal\comment\CommentStorageController->updateNodeStatistics(NULL) Drupal\comment\CommentStorageController->postSave(Object, ) Drupal\Core\Entity\DatabaseStorageController->save(Object) Drupal\Core\Entity\Entity->save() comment_save(Object) Drupal\forum\Tests\ForumBlockTest->testActiveForumTopicsBlock() Drupal\simpletest\TestBase->run() simpletest_script_run_one_test('286', 'Drupal\forum\Tests\ForumBlockTest') NoticeCommentStorageController.php233Drupal\comment\CommentStorageController->updateNodeStatistics()
Trying to get property of non-object_forum_update_forum_index(NULL) forum_comment_publish(Object) call_user_func_array('forum_comment_publish', Array) module_invoke_all('comment_publish', Object) Drupal\comment\CommentStorageController->postSave(Object, ) Drupal\Core\Entity\DatabaseStorageController->save(Object) Drupal\Core\Entity\Entity->save() comment_save(Object) Drupal\forum\Tests\ForumBlockTest->testActiveForumTopicsBlock() Drupal\simpletest\TestBase->run() simpletest_script_run_one_test('286', 'Drupal\forum\Tests\ForumBlockTest') Noticeforum.module1386_forum_update_forum_index()
Trying to get property of non-objectDrupal\forum\Tests\ForumBlockTest->testActiveForumTopicsBlock() Drupal\simpletest\TestBase->run() simpletest_script_run_one_test('286', 'Drupal\forum\Tests\ForumBlockTest') NoticeForumBlockTest.php112Drupal\forum\Tests\ForumBlockTest->testActiveForumTopicsBlock()
array_flip(): Can only flip STRING and INTEGER values!array_flip(Array) Drupal\Core\Entity\DatabaseStorageController->load(Array) entity_load_multiple('node', Array, ) entity_load('node', NULL, ) node_load(NULL) Drupal\comment\CommentStorageController->preSave(Object) Drupal\Core\Entity\DatabaseStorageController->save(Object) Drupal\Core\Entity\Entity->save() comment_save(Object) Drupal\forum\Tests\ForumBlockTest->testActiveForumTopicsBlock() Drupal\simpletest\TestBase->run() simpletest_script_run_one_test('286', 'Drupal\forum\Tests\ForumBlockTest') WarningDatabaseStorageController.php175Drupal\Core\Entity\DatabaseStorageController->load()
Trying to get property of non-objectDrupal\comment\CommentStorageController->preSave(Object) Drupal\Core\Entity\DatabaseStorageController->save(Object) Drupal\Core\Entity\Entity->save() comment_save(Object) Drupal\forum\Tests\ForumBlockTest->testActiveForumTopicsBlock() Drupal\simpletest\TestBase->run() simpletest_script_run_one_test('286', 'Drupal\forum\Tests\ForumBlockTest') NoticeCommentStorageController.php70Drupal\comment\CommentStorageController->preSave()
Trying to get property of non-objectDrupal\comment\CommentStorageController->updateNodeStatistics(NULL) Drupal\comment\CommentStorageController->postSave(Object, ) Drupal\Core\Entity\DatabaseStorageController->save(Object) Drupal\Core\Entity\Entity->save() comment_save(Object) Drupal\forum\Tests\ForumBlockTest->testActiveForumTopicsBlock() Drupal\simpletest\TestBase->run() simpletest_script_run_one_test('286', 'Drupal\forum\Tests\ForumBlockTest') NoticeCommentStorageController.php231Drupal\comment\CommentStorageController->updateNodeStatistics()
Trying to get property of non-objectDrupal\comment\CommentStorageController->updateNodeStatistics(NULL) Drupal\comment\CommentStorageController->postSave(Object, ) Drupal\Core\Entity\DatabaseStorageController->save(Object) Drupal\Core\Entity\Entity->save() comment_save(Object) Drupal\forum\Tests\ForumBlockTest->testActiveForumTopicsBlock() Drupal\simpletest\TestBase->run() simpletest_script_run_one_test('286', 'Drupal\forum\Tests\ForumBlockTest') NoticeCommentStorageController.php233Drupal\comment\CommentStorageController->updateNodeStatistics()
Trying to get property of non-object_forum_update_forum_index(NULL) forum_comment_publish(Object) call_user_func_array('forum_comment_publish', Array) module_invoke_all('comment_publish', Object) Drupal\comment\CommentStorageController->postSave(Object, ) Drupal\Core\Entity\DatabaseStorageController->save(Object) Drupal\Core\Entity\Entity->save() comment_save(Object) Drupal\forum\Tests\ForumBlockTest->testActiveForumTopicsBlock() Drupal\simpletest\TestBase->run() simpletest_script_run_one_test('286', 'Drupal\forum\Tests\ForumBlockTest') Noticeforum.module1386_forum_update_forum_index()
Active forum topics block has a "more"-link.OtherForumBlockTest.php126Drupal\forum\Tests\ForumBlockTest->testActiveForumTopicsBlock()
Forum topic yFfXYwJokeexVQfL6YrT found in the "Active forum topics" block.OtherForumBlockTest.php134Drupal\forum\Tests\ForumBlockTest->testActiveForumTopicsBlock()
Forum topic yseXFbl2C7i6LrydSEfE found in the "Active forum topics" block.OtherForumBlockTest.php134Drupal\forum\Tests\ForumBlockTest->testActiveForumTopicsBlock()
Forum topic erGuXjIiQyXPVqXP9ytT found in the "Active forum topics" block.OtherForumBlockTest.php134Drupal\forum\Tests\ForumBlockTest->testActiveForumTopicsBlock()
Forum topic f1eo42IEwEsd48Rzd8fD found in the "Active forum topics" block.OtherForumBlockTest.php134Drupal\forum\Tests\ForumBlockTest->testActiveForumTopicsBlock()
Forum topic g3bdfSg92SyozvcJKrHi found in the "Active forum topics" block.OtherForumBlockTest.php134Drupal\forum\Tests\ForumBlockTest->testActiveForumTopicsBlock()
Forum topic found in the "Active forum topics" block.OtherForumBlockTest.php151Drupal\forum\Tests\ForumBlockTest->testActiveForumTopicsBlock()
Forum topic found in the "Active forum topics" block.OtherForumBlockTest.php151Drupal\forum\Tests\ForumBlockTest->testActiveForumTopicsBlock()
ExpandDrupal\forum\Tests\ForumIndexTest44128
MessageGroupFilenameLineFunctionStatus
Undefined index: tidNoticeforum.module325forum_node_presave()
Undefined index: tidNoticeforum.module527forum_field_storage_pre_insert()
New forum node found in database.OtherForumIndexTest.php62Drupal\forum\Tests\ForumIndexTest->testForumIndexStatus()
Published forum topic appears on index.OtherForumIndexTest.php66Drupal\forum\Tests\ForumIndexTest->testForumIndexStatus()
Trying to get property of non-objectDrupal\forum\Tests\ForumIndexTest->testForumIndexStatus() Drupal\simpletest\TestBase->run() simpletest_script_run_one_test('287', 'Drupal\forum\Tests\ForumIndexTest') NoticeForumIndexTest.php72Drupal\forum\Tests\ForumIndexTest->testForumIndexStatus()
Failed to set field status to OtherForumIndexTest.php72Drupal\forum\Tests\ForumIndexTest->testForumIndexStatus()
Found the Save buttonOtherForumIndexTest.php72Drupal\forum\Tests\ForumIndexTest->testForumIndexStatus()
Found the requested form fields at node//editOtherForumIndexTest.php72Drupal\forum\Tests\ForumIndexTest->testForumIndexStatus()
Trying to get property of non-objectDrupal\forum\Tests\ForumIndexTest->testForumIndexStatus() Drupal\simpletest\TestBase->run() simpletest_script_run_one_test('287', 'Drupal\forum\Tests\ForumIndexTest') NoticeForumIndexTest.php73Drupal\forum\Tests\ForumIndexTest->testForumIndexStatus()
Unpublished node is no longer accessible.OtherForumIndexTest.php74Drupal\forum\Tests\ForumIndexTest->testForumIndexStatus()
Undefined index: tidNoticeforum.module325forum_node_presave()
Undefined index: tidNoticeforum.module527forum_field_storage_pre_insert()
New forum node found in database.OtherForumIndexTest.php62Drupal\forum\Tests\ForumIndexTest->testForumIndexStatus()
Published forum topic appears on index.OtherForumIndexTest.php66Drupal\forum\Tests\ForumIndexTest->testForumIndexStatus()
Trying to get property of non-objectDrupal\forum\Tests\ForumIndexTest->testForumIndexStatus() Drupal\simpletest\TestBase->run() simpletest_script_run_one_test('287', 'Drupal\forum\Tests\ForumIndexTest') NoticeForumIndexTest.php72Drupal\forum\Tests\ForumIndexTest->testForumIndexStatus()
Failed to set field status to OtherForumIndexTest.php72Drupal\forum\Tests\ForumIndexTest->testForumIndexStatus()
Found the Save buttonOtherForumIndexTest.php72Drupal\forum\Tests\ForumIndexTest->testForumIndexStatus()
Found the requested form fields at node//editOtherForumIndexTest.php72Drupal\forum\Tests\ForumIndexTest->testForumIndexStatus()
Trying to get property of non-objectDrupal\forum\Tests\ForumIndexTest->testForumIndexStatus() Drupal\simpletest\TestBase->run() simpletest_script_run_one_test('287', 'Drupal\forum\Tests\ForumIndexTest') NoticeForumIndexTest.php73Drupal\forum\Tests\ForumIndexTest->testForumIndexStatus()
Unpublished node is no longer accessible.OtherForumIndexTest.php74Drupal\forum\Tests\ForumIndexTest->testForumIndexStatus()
ExpandDrupal\forum\Tests\ForumNodeAccessTest1161016
MessageGroupFilenameLineFunctionStatus
Undefined index: tidNoticeforum.module325forum_node_presave()
Undefined index: tidNoticeforum.module527forum_field_storage_pre_insert()
New private forum node found in database.OtherForumNodeAccessTest.php66Drupal\forum\Tests\ForumNodeAccessTest->testForumNodeAccess()
Undefined index: tidNoticeforum.module325forum_node_presave()
Undefined index: tidNoticeforum.module527forum_field_storage_pre_insert()
New public forum node found in database.OtherForumNodeAccessTest.php76Drupal\forum\Tests\ForumNodeAccessTest->testForumNodeAccess()
Trying to get property of non-objectDrupal\forum\Tests\ForumNodeAccessTest->testForumNodeAccess() Drupal\simpletest\TestBase->run() simpletest_script_run_one_test('288', 'Drupal\forum\Tests\ForumNodeAccessTest') NoticeForumNodeAccessTest.php97Drupal\forum\Tests\ForumNodeAccessTest->testForumNodeAccess()
Private node found in block by $access_userOtherForumNodeAccessTest.php97Drupal\forum\Tests\ForumNodeAccessTest->testForumNodeAccess()
Trying to get property of non-objectDrupal\forum\Tests\ForumNodeAccessTest->testForumNodeAccess() Drupal\simpletest\TestBase->run() simpletest_script_run_one_test('288', 'Drupal\forum\Tests\ForumNodeAccessTest') NoticeForumNodeAccessTest.php98Drupal\forum\Tests\ForumNodeAccessTest->testForumNodeAccess()
Public node found in block by $access_userOtherForumNodeAccessTest.php98Drupal\forum\Tests\ForumNodeAccessTest->testForumNodeAccess()
Trying to get property of non-objectDrupal\forum\Tests\ForumNodeAccessTest->testForumNodeAccess() Drupal\simpletest\TestBase->run() simpletest_script_run_one_test('288', 'Drupal\forum\Tests\ForumNodeAccessTest') NoticeForumNodeAccessTest.php105Drupal\forum\Tests\ForumNodeAccessTest->testForumNodeAccess()
Trying to get property of non-objectDrupal\forum\Tests\ForumNodeAccessTest->testForumNodeAccess() Drupal\simpletest\TestBase->run() simpletest_script_run_one_test('288', 'Drupal\forum\Tests\ForumNodeAccessTest') NoticeForumNodeAccessTest.php106Drupal\forum\Tests\ForumNodeAccessTest->testForumNodeAccess()
Public node found in block by $no_access_userOtherForumNodeAccessTest.php106Drupal\forum\Tests\ForumNodeAccessTest->testForumNodeAccess()
Undefined index: tidNoticeforum.module325forum_node_presave()
Undefined index: tidNoticeforum.module527forum_field_storage_pre_insert()
New private forum node found in database.OtherForumNodeAccessTest.php66Drupal\forum\Tests\ForumNodeAccessTest->testForumNodeAccess()
Undefined index: tidNoticeforum.module325forum_node_presave()
Undefined index: tidNoticeforum.module527forum_field_storage_pre_insert()
New public forum node found in database.OtherForumNodeAccessTest.php76Drupal\forum\Tests\ForumNodeAccessTest->testForumNodeAccess()
Trying to get property of non-objectDrupal\forum\Tests\ForumNodeAccessTest->testForumNodeAccess() Drupal\simpletest\TestBase->run() simpletest_script_run_one_test('288', 'Drupal\forum\Tests\ForumNodeAccessTest') NoticeForumNodeAccessTest.php97Drupal\forum\Tests\ForumNodeAccessTest->testForumNodeAccess()
Private node found in block by $access_userOtherForumNodeAccessTest.php97Drupal\forum\Tests\ForumNodeAccessTest->testForumNodeAccess()
Trying to get property of non-objectDrupal\forum\Tests\ForumNodeAccessTest->testForumNodeAccess() Drupal\simpletest\TestBase->run() simpletest_script_run_one_test('288', 'Drupal\forum\Tests\ForumNodeAccessTest') NoticeForumNodeAccessTest.php98Drupal\forum\Tests\ForumNodeAccessTest->testForumNodeAccess()
Public node found in block by $access_userOtherForumNodeAccessTest.php98Drupal\forum\Tests\ForumNodeAccessTest->testForumNodeAccess()
Trying to get property of non-objectDrupal\forum\Tests\ForumNodeAccessTest->testForumNodeAccess() Drupal\simpletest\TestBase->run() simpletest_script_run_one_test('288', 'Drupal\forum\Tests\ForumNodeAccessTest') NoticeForumNodeAccessTest.php105Drupal\forum\Tests\ForumNodeAccessTest->testForumNodeAccess()
Trying to get property of non-objectDrupal\forum\Tests\ForumNodeAccessTest->testForumNodeAccess() Drupal\simpletest\TestBase->run() simpletest_script_run_one_test('288', 'Drupal\forum\Tests\ForumNodeAccessTest') NoticeForumNodeAccessTest.php106Drupal\forum\Tests\ForumNodeAccessTest->testForumNodeAccess()
Public node found in block by $no_access_userOtherForumNodeAccessTest.php106Drupal\forum\Tests\ForumNodeAccessTest->testForumNodeAccess()
ExpandDrupal\forum\Tests\ForumTest2313233
MessageGroupFilenameLineFunctionStatus
The test did not complete due to a fatal error.Completion checkForumTest.php127Drupal\forum\Tests\ForumTest->testForum()
Undefined index: tidNoticeforum.module325forum_node_presave()
Undefined index: tidNoticeforum.module527forum_field_storage_pre_insert()
Forum topic was createdOtherForumTest.php477Drupal\forum\Tests\ForumTest->createForumTopic()
Node qxOZBCZwm4GyIgWqxHjV was loadedOtherForumTest.php483Drupal\forum\Tests\ForumTest->createForumTopic()
Trying to get property of non-objectDrupal\forum\Tests\ForumTest->createForumTopic(Array, ) Drupal\forum\Tests\ForumTest->generateForumTopics(Array) Drupal\forum\Tests\ForumTest->testForum() Drupal\simpletest\TestBase->run() simpletest_script_run_one_test('289', 'Drupal\forum\Tests\ForumTest') NoticeForumTest.php484Drupal\forum\Tests\ForumTest->createForumTopic()
Saved forum topic was in the expected forumOtherForumTest.php484Drupal\forum\Tests\ForumTest->createForumTopic()
Trying to get property of non-objectDrupal\forum\Tests\ForumTest->createForumTopic(Array, ) Drupal\forum\Tests\ForumTest->generateForumTopics(Array) Drupal\forum\Tests\ForumTest->testForum() Drupal\simpletest\TestBase->run() simpletest_script_run_one_test('289', 'Drupal\forum\Tests\ForumTest') NoticeForumTest.php487Drupal\forum\Tests\ForumTest->createForumTopic()
Subject was foundOtherForumTest.php488Drupal\forum\Tests\ForumTest->createForumTopic()
Body was foundOtherForumTest.php489Drupal\forum\Tests\ForumTest->createForumTopic()
Trying to get property of non-objectDrupal\forum\Tests\ForumTest->generateForumTopics(Array) Drupal\forum\Tests\ForumTest->testForum() Drupal\simpletest\TestBase->run() simpletest_script_run_one_test('289', 'Drupal\forum\Tests\ForumTest') NoticeForumTest.php604Drupal\forum\Tests\ForumTest->generateForumTopics()
Undefined index: tidNoticeforum.module325forum_node_presave()
Undefined index: tidNoticeforum.module527forum_field_storage_pre_insert()
Forum topic was createdOtherForumTest.php477Drupal\forum\Tests\ForumTest->createForumTopic()
Node opBiSE8n6KvswflBV9eK was loadedOtherForumTest.php483Drupal\forum\Tests\ForumTest->createForumTopic()
Trying to get property of non-objectDrupal\forum\Tests\ForumTest->createForumTopic(Array, ) Drupal\forum\Tests\ForumTest->generateForumTopics(Array) Drupal\forum\Tests\ForumTest->testForum() Drupal\simpletest\TestBase->run() simpletest_script_run_one_test('289', 'Drupal\forum\Tests\ForumTest') NoticeForumTest.php484Drupal\forum\Tests\ForumTest->createForumTopic()
Saved forum topic was in the expected forumOtherForumTest.php484Drupal\forum\Tests\ForumTest->createForumTopic()
Trying to get property of non-objectDrupal\forum\Tests\ForumTest->createForumTopic(Array, ) Drupal\forum\Tests\ForumTest->generateForumTopics(Array) Drupal\forum\Tests\ForumTest->testForum() Drupal\simpletest\TestBase->run() simpletest_script_run_one_test('289', 'Drupal\forum\Tests\ForumTest') NoticeForumTest.php487Drupal\forum\Tests\ForumTest->createForumTopic()
Subject was foundOtherForumTest.php488Drupal\forum\Tests\ForumTest->createForumTopic()
Body was foundOtherForumTest.php489Drupal\forum\Tests\ForumTest->createForumTopic()
Trying to get property of non-objectDrupal\forum\Tests\ForumTest->generateForumTopics(Array) Drupal\forum\Tests\ForumTest->testForum() Drupal\simpletest\TestBase->run() simpletest_script_run_one_test('289', 'Drupal\forum\Tests\ForumTest') NoticeForumTest.php604Drupal\forum\Tests\ForumTest->generateForumTopics()
Undefined index: tidNoticeforum.module325forum_node_presave()
Undefined index: tidNoticeforum.module527forum_field_storage_pre_insert()
Forum topic was createdOtherForumTest.php477Drupal\forum\Tests\ForumTest->createForumTopic()
Node umeTWoCSMxgo9dUN0XMA was loadedOtherForumTest.php483Drupal\forum\Tests\ForumTest->createForumTopic()
Trying to get property of non-objectDrupal\forum\Tests\ForumTest->createForumTopic(Array, ) Drupal\forum\Tests\ForumTest->generateForumTopics(Array) Drupal\forum\Tests\ForumTest->testForum() Drupal\simpletest\TestBase->run() simpletest_script_run_one_test('289', 'Drupal\forum\Tests\ForumTest') NoticeForumTest.php484Drupal\forum\Tests\ForumTest->createForumTopic()
Saved forum topic was in the expected forumOtherForumTest.php484Drupal\forum\Tests\ForumTest->createForumTopic()
Trying to get property of non-objectDrupal\forum\Tests\ForumTest->createForumTopic(Array, ) Drupal\forum\Tests\ForumTest->generateForumTopics(Array) Drupal\forum\Tests\ForumTest->testForum() Drupal\simpletest\TestBase->run() simpletest_script_run_one_test('289', 'Drupal\forum\Tests\ForumTest') NoticeForumTest.php487Drupal\forum\Tests\ForumTest->createForumTopic()
Subject was foundOtherForumTest.php488Drupal\forum\Tests\ForumTest->createForumTopic()
Body was foundOtherForumTest.php489Drupal\forum\Tests\ForumTest->createForumTopic()
Trying to get property of non-objectDrupal\forum\Tests\ForumTest->generateForumTopics(Array) Drupal\forum\Tests\ForumTest->testForum() Drupal\simpletest\TestBase->run() simpletest_script_run_one_test('289', 'Drupal\forum\Tests\ForumTest') NoticeForumTest.php604Drupal\forum\Tests\ForumTest->generateForumTopics()
Undefined index: tidNoticeforum.module325forum_node_presave()
Undefined index: tidNoticeforum.module527forum_field_storage_pre_insert()
Forum topic was createdOtherForumTest.php477Drupal\forum\Tests\ForumTest->createForumTopic()
Node xBAZ2WljlyWknpeXf9YP was loadedOtherForumTest.php483Drupal\forum\Tests\ForumTest->createForumTopic()
Trying to get property of non-objectDrupal\forum\Tests\ForumTest->createForumTopic(Array, ) Drupal\forum\Tests\ForumTest->generateForumTopics(Array) Drupal\forum\Tests\ForumTest->testForum() Drupal\simpletest\TestBase->run() simpletest_script_run_one_test('289', 'Drupal\forum\Tests\ForumTest') NoticeForumTest.php484Drupal\forum\Tests\ForumTest->createForumTopic()
Saved forum topic was in the expected forumOtherForumTest.php484Drupal\forum\Tests\ForumTest->createForumTopic()
Trying to get property of non-objectDrupal\forum\Tests\ForumTest->createForumTopic(Array, ) Drupal\forum\Tests\ForumTest->generateForumTopics(Array) Drupal\forum\Tests\ForumTest->testForum() Drupal\simpletest\TestBase->run() simpletest_script_run_one_test('289', 'Drupal\forum\Tests\ForumTest') NoticeForumTest.php487Drupal\forum\Tests\ForumTest->createForumTopic()
Subject was foundOtherForumTest.php488Drupal\forum\Tests\ForumTest->createForumTopic()
Body was foundOtherForumTest.php489Drupal\forum\Tests\ForumTest->createForumTopic()
Trying to get property of non-objectDrupal\forum\Tests\ForumTest->generateForumTopics(Array) Drupal\forum\Tests\ForumTest->testForum() Drupal\simpletest\TestBase->run() simpletest_script_run_one_test('289', 'Drupal\forum\Tests\ForumTest') NoticeForumTest.php604Drupal\forum\Tests\ForumTest->generateForumTopics()
Undefined index: tidNoticeforum.module325forum_node_presave()
Undefined index: tidNoticeforum.module527forum_field_storage_pre_insert()
Forum topic was createdOtherForumTest.php477Drupal\forum\Tests\ForumTest->createForumTopic()
Node aesMaBEJU4hHAPehc4ZY was loadedOtherForumTest.php483Drupal\forum\Tests\ForumTest->createForumTopic()
Trying to get property of non-objectDrupal\forum\Tests\ForumTest->createForumTopic(Array, ) Drupal\forum\Tests\ForumTest->generateForumTopics(Array) Drupal\forum\Tests\ForumTest->testForum() Drupal\simpletest\TestBase->run() simpletest_script_run_one_test('289', 'Drupal\forum\Tests\ForumTest') NoticeForumTest.php484Drupal\forum\Tests\ForumTest->createForumTopic()
Saved forum topic was in the expected forumOtherForumTest.php484Drupal\forum\Tests\ForumTest->createForumTopic()
Trying to get property of non-objectDrupal\forum\Tests\ForumTest->createForumTopic(Array, ) Drupal\forum\Tests\ForumTest->generateForumTopics(Array) Drupal\forum\Tests\ForumTest->testForum() Drupal\simpletest\TestBase->run() simpletest_script_run_one_test('289', 'Drupal\forum\Tests\ForumTest') NoticeForumTest.php487Drupal\forum\Tests\ForumTest->createForumTopic()
Subject was foundOtherForumTest.php488Drupal\forum\Tests\ForumTest->createForumTopic()
Body was foundOtherForumTest.php489Drupal\forum\Tests\ForumTest->createForumTopic()
Trying to get property of non-objectDrupal\forum\Tests\ForumTest->generateForumTopics(Array) Drupal\forum\Tests\ForumTest->testForum() Drupal\simpletest\TestBase->run() simpletest_script_run_one_test('289', 'Drupal\forum\Tests\ForumTest') NoticeForumTest.php604Drupal\forum\Tests\ForumTest->generateForumTopics()
Undefined index: tidNoticeforum.module325forum_node_presave()
Undefined index: tidNoticeforum.module527forum_field_storage_pre_insert()
Error message was shownOtherForumTest.php473Drupal\forum\Tests\ForumTest->createForumTopic()
Undefined index: tidNoticeforum.module325forum_node_presave()
Undefined index: tidNoticeforum.module527forum_field_storage_pre_insert()
Forum topic was createdOtherForumTest.php477Drupal\forum\Tests\ForumTest->createForumTopic()
Node spnE5zzbEs97XIel2ptb was loadedOtherForumTest.php483Drupal\forum\Tests\ForumTest->createForumTopic()
Trying to get property of non-objectDrupal\forum\Tests\ForumTest->createForumTopic(Array, ) Drupal\forum\Tests\ForumTest->doBasicTests(Object, 1) Drupal\forum\Tests\ForumTest->testForum() Drupal\simpletest\TestBase->run() simpletest_script_run_one_test('289', 'Drupal\forum\Tests\ForumTest') NoticeForumTest.php484Drupal\forum\Tests\ForumTest->createForumTopic()
Saved forum topic was in the expected forumOtherForumTest.php484Drupal\forum\Tests\ForumTest->createForumTopic()
Trying to get property of non-objectDrupal\forum\Tests\ForumTest->createForumTopic(Array, ) Drupal\forum\Tests\ForumTest->doBasicTests(Object, 1) Drupal\forum\Tests\ForumTest->testForum() Drupal\simpletest\TestBase->run() simpletest_script_run_one_test('289', 'Drupal\forum\Tests\ForumTest') NoticeForumTest.php487Drupal\forum\Tests\ForumTest->createForumTopic()
Subject was foundOtherForumTest.php488Drupal\forum\Tests\ForumTest->createForumTopic()
Body was foundOtherForumTest.php489Drupal\forum\Tests\ForumTest->createForumTopic()
Argument 2 passed to Drupal\forum\Tests\ForumTest::verifyForums() must be an instance of Drupal\node\Plugin\Core\Entity\Node, boolean given, called in /var/lib/drupaltestbot/sites/default/files/checkout/core/modules/forum/lib/Drupal/forum/Tests/ForumTest.php on line 441 and definedDrupal\forum\Tests\ForumTest->verifyForums(Object, , 1) Drupal\forum\Tests\ForumTest->doBasicTests(Object, 1) Drupal\forum\Tests\ForumTest->testForum() Drupal\simpletest\TestBase->run() simpletest_script_run_one_test('289', 'Drupal\forum\Tests\ForumTest') Recoverable errorForumTest.php506Drupal\forum\Tests\ForumTest->verifyForums()
Trying to get property of non-objectDrupal\forum\Tests\ForumTest->verifyForums(Object, , 1) Drupal\forum\Tests\ForumTest->doBasicTests(Object, 1) Drupal\forum\Tests\ForumTest->testForum() Drupal\simpletest\TestBase->run() simpletest_script_run_one_test('289', 'Drupal\forum\Tests\ForumTest') NoticeForumTest.php525Drupal\forum\Tests\ForumTest->verifyForums()
LeafDrupal\help\Tests\HelpTest30500
LeafDrupal\help\Tests\NoHelpTest2200
LeafDrupal\history\Tests\Views\HistoryTimestampTest1200
LeafDrupal\image\Tests\ImageAdminStylesTest20500
LeafDrupal\image\Tests\ImageDimensionsScaleUnitTest3000
LeafDrupal\image\Tests\ImageDimensionsTest5600
LeafDrupal\image\Tests\ImageEffectsTest4300
LeafDrupal\image\Tests\ImageFieldDefaultImagesTest4000
LeafDrupal\image\Tests\ImageFieldDisplayTest15900
LeafDrupal\image\Tests\ImageFieldValidateTest3800
LeafDrupal\image\Tests\ImageStylesPathAndUrlTest6500
LeafDrupal\image\Tests\ImageThemeFunctionTest500
LeafDrupal\jsonld\Tests\NormalizeDenormalizeTest1400
LeafDrupal\jsonld\Tests\RdfSchemaSerializationTest400
LeafDrupal\jsonld\Tests\SupportsSerializationTest1000
LeafDrupal\language\Tests\LanguageBrowserDetectionUnitTest10700
LeafDrupal\language\Tests\LanguageConfigurationElementTest5400
LeafDrupal\language\Tests\LanguageConfigurationTest4600
LeafDrupal\language\Tests\LanguageCustomLanguageConfigurationTest3600
LeafDrupal\language\Tests\LanguageDependencyInjectionTest1700
LeafDrupal\language\Tests\LanguageListTest10000
LeafDrupal\language\Tests\LanguageNegotiationInfoTest4900
LeafDrupal\language\Tests\LanguagePathMonolingualTest3500
LeafDrupal\language\Tests\LanguageSwitchingTest2600
LeafDrupal\language\Tests\LanguageUILanguageNegotiationTest14900
LeafDrupal\language\Tests\LanguageUrlRewritingTest4400
LeafDrupal\language\Tests\Views\ArgumentLanguageTest200
LeafDrupal\language\Tests\Views\FieldLanguageTest200
LeafDrupal\language\Tests\Views\FilterLanguageTest200
LeafDrupal\layout\Tests\DisplayInternalLogicTest1100
LeafDrupal\layout\Tests\LayoutDerivativesTest2400
LeafDrupal\link\Tests\LinkFieldTest14000
LeafDrupal\link\Tests\LinkFieldUITest2100
LeafDrupal\locale\Tests\LocaleContentTest17000
LeafDrupal\locale\Tests\LocaleExportTest5700
LeafDrupal\locale\Tests\LocaleImportFunctionalTest16600
LeafDrupal\locale\Tests\LocaleInstallTest200
LeafDrupal\locale\Tests\LocaleJavascriptTranslation6600
LeafDrupal\locale\Tests\LocaleLibraryInfoAlterTest200
LeafDrupal\locale\Tests\LocalePathTest5100
LeafDrupal\locale\Tests\LocalePluralFormatTest16000
LeafDrupal\locale\Tests\LocaleStringTest2600
LeafDrupal\locale\Tests\LocaleTranslationTest32600
LeafDrupal\locale\Tests\LocaleUninstallFrenchTest3600
LeafDrupal\locale\Tests\LocaleUninstallTest3600
LeafDrupal\locale\Tests\LocaleUpdateInterfaceTest4600
LeafDrupal\locale\Tests\LocaleUpdateTest46300
LeafDrupal\menu\Tests\MenuNodeTest6100
LeafDrupal\menu\Tests\MenuTest318600
LeafDrupal\node\Tests\MultiStepNodeFormBasicOptionsTest1600
ExpandDrupal\node\Tests\NodeAccessBaseTableTest14950
MessageGroupFilenameLineFunctionStatus
A public node by user 3 is not visible for user 2 on the public page.OtherNodeAccessBaseTableTest.php125Drupal\node\Tests\NodeAccessBaseTableTest->testNodeAccessBasic()
A public node by user 3 is not visible for user 3 on the public page.OtherNodeAccessBaseTableTest.php125Drupal\node\Tests\NodeAccessBaseTableTest->testNodeAccessBasic()
A private node by user 3 is not visible for user 3 on the private page.OtherNodeAccessBaseTableTest.php125Drupal\node\Tests\NodeAccessBaseTableTest->testNodeAccessBasic()
A public node by user 3 is not visible for user 3 on the public page.OtherNodeAccessBaseTableTest.php141Drupal\node\Tests\NodeAccessBaseTableTest->testNodeAccessBasic()
A private node by user 3 is not visible for user 3 on the private page.OtherNodeAccessBaseTableTest.php141Drupal\node\Tests\NodeAccessBaseTableTest->testNodeAccessBasic()
LeafDrupal\node\Tests\NodeAccessFieldTest5000
LeafDrupal\node\Tests\NodeAccessLanguageTest2500
ExpandDrupal\node\Tests\NodeAccessPagerTest2102
MessageGroupFilenameLineFunctionStatus
Undefined index: target_identity_reference_field_presave('node', Object, Array, Object, 'und', Array, NULL, NULL) _field_invoke('presave', 'node', Object) field_attach_presave('node', Object) Drupal\Core\Entity\DatabaseStorageController->invokeHook('presave', Object) Drupal\node\NodeStorageController->invokeHook('presave', Object) Drupal\Core\Entity\DatabaseStorageController->save(Object) Drupal\Core\Entity\Entity->save() Drupal\simpletest\WebTestBase->drupalCreateNode(Array) Drupal\node\Tests\NodeAccessPagerTest->testForumPager() Drupal\simpletest\TestBase->run() simpletest_script_run_one_test('366', 'Drupal\node\Tests\NodeAccessPagerTest') Noticeentity_reference.module126entity_reference_field_presave()
Drupal\Core\Entity\EntityStorageException: SQLSTATE[23000]: Integrity constraint violation: 1048 Column 'taxonomy_forums_target_id' cannot be null: INSERT INTO {field_data_taxonomy_forums} (entity_type, entity_id, revision_id, bundle, delta, langcode, taxonomy_forums_target_id, taxonomy_forums_revision_id) VALUES (:db_insert_placeholder_0, :db_insert_placeholder_1, :db_insert_placeholder_2, :db_insert_placeholder_3, :db_insert_placeholder_4, :db_insert_placeholder_5, :db_insert_placeholder_6, :db_insert_placeholder_7); Array ( [:db_insert_placeholder_0] => node [:db_insert_placeholder_1] => 1 [:db_insert_placeholder_2] => 1 [:db_insert_placeholder_3] => forum [:db_insert_placeholder_4] => 0 [:db_insert_placeholder_5] => und [:db_insert_placeholder_6] => [:db_insert_placeholder_7] => ) in Drupal\Core\Entity\DatabaseStorageController->save() (line 546 of /var/lib/drupaltestbot/sites/default/files/checkout/core/lib/Drupal/Core/Entity/DatabaseStorageController.php). Drupal\Core\Entity\DatabaseStorageController->save(Object) Drupal\Core\Entity\Entity->save() Drupal\simpletest\WebTestBase->drupalCreateNode(Array) Drupal\node\Tests\NodeAccessPagerTest->testForumPager() Drupal\simpletest\TestBase->run() simpletest_script_run_one_test('366', 'Drupal\node\Tests\NodeAccessPagerTest') Uncaught exceptionDatabaseStorageController.php546Drupal\Core\Entity\DatabaseStorageController->save()
LeafDrupal\node\Tests\NodeAccessRebuildTest1900
LeafDrupal\node\Tests\NodeAccessRecordsTest2600
LeafDrupal\node\Tests\NodeAccessTest3400
LeafDrupal\node\Tests\NodeAdminTest14500
LeafDrupal\node\Tests\NodeBlockFunctionalTest8400
LeafDrupal\node\Tests\NodeBlockTest2100
LeafDrupal\node\Tests\NodeBuildContentTest400
LeafDrupal\node\Tests\NodeCreationTest4900
LeafDrupal\node\Tests\NodeEntityFieldQueryAlterTest3200
LeafDrupal\node\Tests\NodeEntityViewModeAlterTest2000
LeafDrupal\node\Tests\NodeFeedTest100
LeafDrupal\node\Tests\NodeFieldMultilingualTestCase6400
LeafDrupal\node\Tests\NodeLoadHooksTest700
LeafDrupal\node\Tests\NodeLoadMultipleTest2700
LeafDrupal\node\Tests\NodePostSettingsTest4000
LeafDrupal\node\Tests\NodeQueryAlterTest11200
LeafDrupal\node\Tests\NodeRevisionPermissionsTest5900
LeafDrupal\node\Tests\NodeRevisionsTest10900
LeafDrupal\node\Tests\NodeRSSContentTest3200
LeafDrupal\node\Tests\NodeSaveTest6000
LeafDrupal\node\Tests\NodeTitleTest2300
LeafDrupal\node\Tests\NodeTitleXSSTest2300
LeafDrupal\node\Tests\NodeTokenReplaceTest4000
LeafDrupal\node\Tests\NodeTranslationUITest13500
LeafDrupal\node\Tests\NodeTypeInitialLanguageTest8000
LeafDrupal\node\Tests\NodeTypePersistenceTest6500
LeafDrupal\node\Tests\NodeTypeTest13600
LeafDrupal\node\Tests\PageEditTest9700
LeafDrupal\node\Tests\PagePreviewTest4100
LeafDrupal\node\Tests\PageViewTest3400
LeafDrupal\node\Tests\SummaryLengthTest1200
LeafDrupal\node\Tests\Views\FieldTypeTest200
LeafDrupal\node\Tests\Views\FilterUidRevisionTest400
LeafDrupal\node\Tests\Views\RevisionRelationships300
LeafDrupal\node\Tests\Views\StatusExtraTest6800
LeafDrupal\number\Tests\NumberFieldTest8800
LeafDrupal\openid\Tests\OpenIDFunctionalTest30600
LeafDrupal\openid\Tests\OpenIDRegistrationTest13400
LeafDrupal\openid\Tests\OpenIDTest4500
LeafDrupal\openid\Tests\Upgrade\OpenIDAuthmapUpgradePathTest2500
LeafDrupal\options\Tests\OptionsDynamicValuesValidationTest900
LeafDrupal\options\Tests\OptionsFieldTest1600
LeafDrupal\options\Tests\OptionsFieldUITest20700
LeafDrupal\options\Tests\OptionsSelectDynamicValuesTest1600
LeafDrupal\options\Tests\OptionsWidgetsTest26100
LeafDrupal\path\Tests\PathAliasTest13800
LeafDrupal\path\Tests\PathLanguageTest7500
LeafDrupal\path\Tests\PathLanguageUiTest9000
LeafDrupal\path\Tests\PathTaxonomyTermTest3700
LeafDrupal\php\Tests\PhpAccessTest3800
LeafDrupal\php\Tests\PhpFilterTest4200
LeafDrupal\picture\Tests\PictureAdminUITest5400
LeafDrupal\picture\Tests\PictureFieldDisplayTest11500
LeafDrupal\poll\Tests\PollBlockTest17200
LeafDrupal\poll\Tests\PollCreateTest26900
LeafDrupal\poll\Tests\PollDeleteChoiceTest5400
LeafDrupal\poll\Tests\PollExpirationTest5200
LeafDrupal\poll\Tests\PollJsAddChoiceTest1600
LeafDrupal\poll\Tests\PollTokenReplaceTest12500
LeafDrupal\poll\Tests\PollTranslateTest7300
LeafDrupal\poll\Tests\PollVoteCheckHostnameTest14000
LeafDrupal\poll\Tests\PollVoteTest14600
LeafDrupal\rdf\Tests\CommentAttributesTest20300
LeafDrupal\rdf\Tests\CrudTest1000
LeafDrupal\rdf\Tests\GetNamespacesTest700
LeafDrupal\rdf\Tests\GetRdfNamespacesTest500
LeafDrupal\rdf\Tests\MappingDefinitionTest5900
LeafDrupal\rdf\Tests\MappingHookTest600
ExpandDrupal\rdf\Tests\RdfaMarkupTest2720
MessageGroupFilenameLineFunctionStatus
Property dc:subject is present for the tag1 field item.OtherRdfaMarkupTest.php181Drupal\rdf\Tests\RdfaMarkupTest->testAttributesInMarkupFile()
Property dc:subject is present for the tag2 field item.OtherRdfaMarkupTest.php186Drupal\rdf\Tests\RdfaMarkupTest->testAttributesInMarkupFile()
LeafDrupal\rdf\Tests\RdfMappingEventTest300
LeafDrupal\rdf\Tests\SiteSchemaTest300
LeafDrupal\rdf\Tests\TrackerAttributesTest3300
LeafDrupal\rest\Tests\CreateTest2900
LeafDrupal\rest\Tests\DBLogTest1800
LeafDrupal\rest\Tests\DeleteTest7900
LeafDrupal\rest\Tests\ReadTest3500
LeafDrupal\rest\Tests\UpdateTest6500
LeafDrupal\search\Tests\SearchAdvancedSearchFormTest3400
LeafDrupal\search\Tests\SearchBlockTest6400
LeafDrupal\search\Tests\SearchCommentCountToggleTest3100
LeafDrupal\search\Tests\SearchCommentTest19300
LeafDrupal\search\Tests\SearchConfigSettingsFormTest13200
LeafDrupal\search\Tests\SearchEmbedFormTest3200
LeafDrupal\search\Tests\SearchExactTest2500
LeafDrupal\search\Tests\SearchExcerptTest1800
LeafDrupal\search\Tests\SearchExpressionInsertExtractTest2400
LeafDrupal\search\Tests\SearchKeywordsConditionsTest2800
LeafDrupal\search\Tests\SearchLanguageTest4100
LeafDrupal\search\Tests\SearchMatchTest14700
LeafDrupal\search\Tests\SearchMultilingualEntityTest1000
LeafDrupal\search\Tests\SearchNodeAccessTest1600
LeafDrupal\search\Tests\SearchNumberMatchingTest29500
LeafDrupal\search\Tests\SearchNumbersTest17500
LeafDrupal\search\Tests\SearchPageOverrideTest1500
LeafDrupal\search\Tests\SearchPageTextTest3700
LeafDrupal\search\Tests\SearchPreprocessLangcodeTest3900
LeafDrupal\search\Tests\SearchRankingTest5900
LeafDrupal\search\Tests\SearchSimplifyTest65700
LeafDrupal\search\Tests\SearchTokenizerTest800
LeafDrupal\shortcut\Tests\ShortcutLinksTest14800
LeafDrupal\shortcut\Tests\ShortcutSetsTest25000
LeafDrupal\simpletest\Tests\BrokenSetUpTest2100
LeafDrupal\simpletest\Tests\BrowserTest1600
LeafDrupal\simpletest\Tests\DrupalUnitTestBaseTest3000
LeafDrupal\simpletest\Tests\FolderTest200
LeafDrupal\simpletest\Tests\InstallationProfileModuleTestsTest1900
LeafDrupal\simpletest\Tests\MailCaptureTest1200
LeafDrupal\simpletest\Tests\MissingCheckedRequirementsTest1900
LeafDrupal\simpletest\Tests\OtherInstallationProfileModuleTestsTest1200
LeafDrupal\simpletest\Tests\SimpleTestTest13000
LeafDrupal\standard\Tests\StandardTest700
LeafDrupal\statistics\Tests\StatisticsAdminTest11000
LeafDrupal\statistics\Tests\StatisticsBlockVisitorsTest4600
LeafDrupal\statistics\Tests\StatisticsLoggingTest3500
LeafDrupal\statistics\Tests\StatisticsReportsTest12700
LeafDrupal\statistics\Tests\StatisticsTokenReplaceTest3000
LeafDrupal\syslog\Tests\SyslogTest1700
LeafDrupal\system\Tests\Ajax\AjaxCommandsUnitTest1600
LeafDrupal\system\Tests\Ajax\CommandsTest7300
LeafDrupal\system\Tests\Ajax\DialogTest300
LeafDrupal\system\Tests\Ajax\ElementValidationTest700
LeafDrupal\system\Tests\Ajax\FormValuesTest2900
LeafDrupal\system\Tests\Ajax\FrameworkTest3400
LeafDrupal\system\Tests\Ajax\MultiFormTest3600
LeafDrupal\system\Tests\Batch\PageTest1600
LeafDrupal\system\Tests\Batch\PercentagesUnitTest1800
LeafDrupal\system\Tests\Batch\ProcessingTest16100
LeafDrupal\system\Tests\Bootstrap\GetFilenameUnitTest600
LeafDrupal\system\Tests\Bootstrap\HookBootExitTest1900
LeafDrupal\system\Tests\Bootstrap\IpAddressTest1100
LeafDrupal\system\Tests\Bootstrap\MiscUnitTest400
LeafDrupal\system\Tests\Bootstrap\OverrideServerVariablesUnitTest600
LeafDrupal\system\Tests\Bootstrap\PageCacheTest7900
LeafDrupal\system\Tests\Bootstrap\ResettableStaticUnitTest500
LeafDrupal\system\Tests\Bootstrap\TimerUnitTest500
LeafDrupal\system\Tests\Bootstrap\VariableTest900
LeafDrupal\system\Tests\Bundle\BundleTest900
LeafDrupal\system\Tests\Cache\BackendChainImplementationUnitTest4800
LeafDrupal\system\Tests\Cache\BackendChainUnitTest12600
LeafDrupal\system\Tests\Cache\ClearTest900
LeafDrupal\system\Tests\Cache\DatabaseBackendUnitTest12600
LeafDrupal\system\Tests\Cache\InstallTest1500
LeafDrupal\system\Tests\Cache\MemoryBackendUnitTest12600
LeafDrupal\system\Tests\Cache\NullBackendTest200
LeafDrupal\system\Tests\Common\AddFeedTest700
LeafDrupal\system\Tests\Common\AlterTest700
LeafDrupal\system\Tests\Common\AttributesUnitTest700
LeafDrupal\system\Tests\Common\AutocompleteTagsUnitTest800
LeafDrupal\system\Tests\Common\CascadingStylesheetsTest3600
LeafDrupal\system\Tests\Common\CascadingStylesheetsUnitTest1200
LeafDrupal\system\Tests\Common\ColorTest8500
LeafDrupal\system\Tests\Common\FormatDateTest7300
LeafDrupal\system\Tests\Common\GotoTest2700
LeafDrupal\system\Tests\Common\HtmlIdentifierUnitTest1000
LeafDrupal\system\Tests\Common\HttpRequestTest3600
LeafDrupal\system\Tests\Common\InstallerLanguageTest800
LeafDrupal\system\Tests\Common\JavaScriptTest9700
LeafDrupal\system\Tests\Common\JsonUnitTest2100
LeafDrupal\system\Tests\Common\ParseInfoFileUnitTest300
LeafDrupal\system\Tests\Common\RegionContentTest1800
LeafDrupal\system\Tests\Common\RenderTest5400
LeafDrupal\system\Tests\Common\SchemaTest58800
LeafDrupal\system\Tests\Common\SimpleTestErrorCollectorTest1600
LeafDrupal\system\Tests\Common\SizeUnitTest3500
LeafDrupal\system\Tests\Common\SystemListingTest600
LeafDrupal\system\Tests\Common\TableSortExtenderUnitTest600
LeafDrupal\system\Tests\Common\UrlTest7000
LeafDrupal\system\Tests\Common\ValidNumberStepUnitTest2400
LeafDrupal\system\Tests\Common\ValidUrlUnitTest7900
LeafDrupal\system\Tests\Common\WriteRecordTest3400
LeafDrupal\system\Tests\Common\XssUnitTest1700
LeafDrupal\system\Tests\Database\AlterTest6200
LeafDrupal\system\Tests\Database\BasicSyntaxTest3000
LeafDrupal\system\Tests\Database\CaseSensitivityTest800
LeafDrupal\system\Tests\Database\ConnectionTest3800
LeafDrupal\system\Tests\Database\ConnectionUnitTest1200
LeafDrupal\system\Tests\Database\DeleteTruncateTest2300
LeafDrupal\system\Tests\Database\EmptyStatementTest400
LeafDrupal\system\Tests\Database\FetchTest9000
LeafDrupal\system\Tests\Database\InsertDefaultsTest2200
LeafDrupal\system\Tests\Database\InsertLobTest1500
LeafDrupal\system\Tests\Database\InsertTest8400
LeafDrupal\system\Tests\Database\InvalidDataTest800
LeafDrupal\system\Tests\Database\LoggingTest7700
LeafDrupal\system\Tests\Database\MergeTest12500
LeafDrupal\system\Tests\Database\NextIdTest400
LeafDrupal\system\Tests\Database\QueryTest1400
LeafDrupal\system\Tests\Database\RangeQueryTest1600
LeafDrupal\system\Tests\Database\RegressionTest6200
LeafDrupal\system\Tests\Database\SelectComplexTest22000
LeafDrupal\system\Tests\Database\SelectOrderedTest5800
LeafDrupal\system\Tests\Database\SelectPagerDefaultTest7100
LeafDrupal\system\Tests\Database\SelectSubqueryTest5100
LeafDrupal\system\Tests\Database\SelectTableSortDefaultTest6300
LeafDrupal\system\Tests\Database\SelectTest15600
LeafDrupal\system\Tests\Database\SerializeQueryTest700
LeafDrupal\system\Tests\Database\TaggingTest3200
LeafDrupal\system\Tests\Database\TemporaryQueryTest1100
LeafDrupal\system\Tests\Database\TransactionTest7400
LeafDrupal\system\Tests\Database\UpdateComplexTest6700
LeafDrupal\system\Tests\Database\UpdateLobTest1500
LeafDrupal\system\Tests\Database\UpdateTest5600
LeafDrupal\system\Tests\Datetime\DateTimePlusTest5400
LeafDrupal\system\Tests\Datetime\DrupalDateTimeTest1400
LeafDrupal\system\Tests\DrupalKernel\ContentNegotiationTest4000
LeafDrupal\system\Tests\DrupalKernel\DrupalKernelTest800
LeafDrupal\system\Tests\Entity\EntityAccessTest3400
LeafDrupal\system\Tests\Entity\EntityApiInfoTest600
LeafDrupal\system\Tests\Entity\EntityApiTest800
LeafDrupal\system\Tests\Entity\EntityCrudHookTest11400
LeafDrupal\system\Tests\Entity\EntityFieldTest14900
LeafDrupal\system\Tests\Entity\EntityFormTest2600
ExpandDrupal\system\Tests\Entity\EntityQueryRelationshipTest110
MessageGroupFilenameLineFunctionStatus
The test did not complete due to a fatal error.Completion checkEntityQueryRelationshipTest.php136Drupal\system\Tests\Entity\EntityQueryRelationshipTest->testQuery()
LeafDrupal\system\Tests\Entity\EntityQueryTest6200
LeafDrupal\system\Tests\Entity\EntityRevisionsTest3100
LeafDrupal\system\Tests\Entity\EntityTranslationFormTest3600
LeafDrupal\system\Tests\Entity\EntityTranslationTest5100
LeafDrupal\system\Tests\Entity\EntityUUIDTest2100
LeafDrupal\system\Tests\FileTransfer\FileTransferTest200
LeafDrupal\system\Tests\File\DirectoryTest2000
LeafDrupal\system\Tests\File\MimeTypeTest4200
LeafDrupal\system\Tests\File\NameMungingTest600
LeafDrupal\system\Tests\File\RemoteFileDirectoryTest2400
LeafDrupal\system\Tests\File\RemoteFileScanDirectoryTest2900
LeafDrupal\system\Tests\File\RemoteFileUnmanagedCopyTest3200
LeafDrupal\system\Tests\File\RemoteFileUnmanagedDeleteRecursiveTest2100
LeafDrupal\system\Tests\File\RemoteFileUnmanagedDeleteTest1000
LeafDrupal\system\Tests\File\RemoteFileUnmanagedMoveTest2300
LeafDrupal\system\Tests\File\RemoteFileUnmanagedSaveDataTest800
LeafDrupal\system\Tests\File\ScanDirectoryTest2900
LeafDrupal\system\Tests\File\StreamWrapperTest1900
LeafDrupal\system\Tests\File\UnmanagedCopyTest2900
LeafDrupal\system\Tests\File\UnmanagedDeleteRecursiveTest1700
LeafDrupal\system\Tests\File\UnmanagedDeleteTest700
LeafDrupal\system\Tests\File\UnmanagedMoveTest2000
LeafDrupal\system\Tests\File\UnmanagedSaveDataTest700
LeafDrupal\system\Tests\File\UrlRewritingTest1400
LeafDrupal\system\Tests\Form\AlterTest400
LeafDrupal\system\Tests\Form\ArbitraryRebuildTest1600
LeafDrupal\system\Tests\Form\CheckboxTest9700
LeafDrupal\system\Tests\Form\ElementsLabelsTest2000
LeafDrupal\system\Tests\Form\ElementsTableSelectTest7200
LeafDrupal\system\Tests\Form\ElementsVerticalTabsTest3900
LeafDrupal\system\Tests\Form\ElementTest4200
LeafDrupal\system\Tests\Form\EmailTest1700
LeafDrupal\system\Tests\Form\FileInclusionTest1100
LeafDrupal\system\Tests\Form\FormTest73100
LeafDrupal\system\Tests\Form\HTMLIdTest700
LeafDrupal\system\Tests\Form\LanguageSelectElementTest4400
LeafDrupal\system\Tests\Form\ProgrammaticTest2400
LeafDrupal\system\Tests\Form\RebuildTest5300
LeafDrupal\system\Tests\Form\RedirectTest3100
LeafDrupal\system\Tests\Form\StateValuesCleanAdvancedTest700
LeafDrupal\system\Tests\Form\StateValuesCleanTest1400
LeafDrupal\system\Tests\Form\StorageTest14900
LeafDrupal\system\Tests\Form\TriggeringElementTest5000
LeafDrupal\system\Tests\Form\UrlTest1700
LeafDrupal\system\Tests\Form\ValidationTest16900
LeafDrupal\system\Tests\Form\WrapperTest500
LeafDrupal\system\Tests\Graph\GraphUnitTest5600
LeafDrupal\system\Tests\Image\FileMoveTest400
LeafDrupal\system\Tests\Image\ToolkitGdTest20400
LeafDrupal\system\Tests\Image\ToolkitTest5300
LeafDrupal\system\Tests\KeyValueStore\DatabaseStorageExpirableTest6800
LeafDrupal\system\Tests\KeyValueStore\DatabaseStorageTest3600
LeafDrupal\system\Tests\KeyValueStore\GarbageCollectionTest200
LeafDrupal\system\Tests\KeyValueStore\MemoryStorageTest3600
LeafDrupal\system\Tests\Lock\LockFunctionalTest2900
LeafDrupal\system\Tests\Mail\HtmlToTextTest8600
LeafDrupal\system\Tests\Mail\MailTest700
LeafDrupal\system\Tests\Mail\WrapMailUnitTest200
LeafDrupal\system\Tests\Menu\BreadcrumbTest40900
LeafDrupal\system\Tests\Menu\LinksTest5000
LeafDrupal\system\Tests\Menu\RebuildTest500
LeafDrupal\system\Tests\Menu\RouterTest22700
LeafDrupal\system\Tests\Menu\TrailTest6800
LeafDrupal\system\Tests\Menu\TreeDataUnitTest400
LeafDrupal\system\Tests\Menu\TreeOutputTest700
LeafDrupal\system\Tests\Module\ClassLoaderTest1000
ExpandDrupal\system\Tests\Module\DependencyTest15190
MessageGroupFilenameLineFunctionStatus
"You must enable the History, Taxonomy, Options, Comment, Poll, PHP Filter modules to install Forum." foundOtherDependencyTest.php149Drupal\system\Tests\Module\DependencyTest->testModuleEnableOrder()
Module "forum" is enabled.OtherDependencyTest.php157Drupal\system\Tests\Module\DependencyTest->testModuleEnableOrder()
Module "poll" is enabled.OtherDependencyTest.php157Drupal\system\Tests\Module\DependencyTest->testModuleEnableOrder()
Module "php" is enabled.OtherDependencyTest.php157Drupal\system\Tests\Module\DependencyTest->testModuleEnableOrder()
Module "comment" is enabled.OtherDependencyTest.php157Drupal\system\Tests\Module\DependencyTest->testModuleEnableOrder()
Module "history" is enabled.OtherDependencyTest.php157Drupal\system\Tests\Module\DependencyTest->testModuleEnableOrder()
Module "taxonomy" is enabled.OtherDependencyTest.php157Drupal\system\Tests\Module\DependencyTest->testModuleEnableOrder()
Module "options" is enabled.OtherDependencyTest.php157Drupal\system\Tests\Module\DependencyTest->testModuleEnableOrder()
Value array ( 0 => 'module_test', ) is identical to value array ( 0 => 'comment', 1 => 'history', 2 => 'options', 3 => 'taxonomy', 4 => 'php', 5 => 'poll', 6 => 'forum', ).OtherDependencyTest.php161Drupal\system\Tests\Module\DependencyTest->testModuleEnableOrder()
LeafDrupal\system\Tests\Module\EnableDisableTest196200
LeafDrupal\system\Tests\Module\HookRequirementsTest1600
LeafDrupal\system\Tests\Module\InstallTest300
LeafDrupal\system\Tests\Module\ModuleApiTest6800
LeafDrupal\system\Tests\Module\ModuleEnable300
LeafDrupal\system\Tests\Module\RequiredTest1900
LeafDrupal\system\Tests\Module\UninstallTest200
LeafDrupal\system\Tests\Module\VersionTest5100
LeafDrupal\system\Tests\Pager\PagerTest12300
LeafDrupal\system\Tests\Path\AliasTest2700
LeafDrupal\system\Tests\Path\MatchPathTest4100
LeafDrupal\system\Tests\Path\UrlAlterFunctionalTest3700
LeafDrupal\system\Tests\PhpStorage\FileStorageTest1200
LeafDrupal\system\Tests\PhpStorage\MTimeProtectedFastFileStorageTest1900
LeafDrupal\system\Tests\PhpStorage\MTimeProtectedFileStorageTest1900
LeafDrupal\system\Tests\Plugin\AlterDecoratorTest300
LeafDrupal\system\Tests\Plugin\CacheDecoratorTest1400
LeafDrupal\system\Tests\Plugin\DerivativeTest900
LeafDrupal\system\Tests\Plugin\Discovery\AnnotatedClassDiscoveryTest700
LeafDrupal\system\Tests\Plugin\Discovery\StaticDiscoveryTest600
LeafDrupal\system\Tests\Plugin\FactoryTest900
LeafDrupal\system\Tests\Plugin\InspectionTest1000
LeafDrupal\system\Tests\Queue\QueueTest1400
LeafDrupal\system\Tests\Routing\ChainMatcherTest300
LeafDrupal\system\Tests\Routing\ControllerResolverTest100
LeafDrupal\system\Tests\Routing\FirstEntryFinalMatcherTest800
LeafDrupal\system\Tests\Routing\HttpMethodMatcherTest800
LeafDrupal\system\Tests\Routing\MatcherDumperTest800
LeafDrupal\system\Tests\Routing\MimeTypeMatcherTest1100
LeafDrupal\system\Tests\Routing\NestedMatcherTest100
LeafDrupal\system\Tests\Routing\PathMatcherTest2900
LeafDrupal\system\Tests\Routing\RouterPermissionTest1900
LeafDrupal\system\Tests\Routing\RouterTest3000
LeafDrupal\system\Tests\Routing\RouteTest600
LeafDrupal\system\Tests\Serialization\EntitySerializationTest1300
LeafDrupal\system\Tests\Serialization\SerializationTest200
LeafDrupal\system\Tests\Session\SessionHttpsTest8300
LeafDrupal\system\Tests\Session\SessionTest19000
LeafDrupal\system\Tests\System\AccessDeniedTest6800
LeafDrupal\system\Tests\System\AdminMetaTagTest300
LeafDrupal\system\Tests\System\AdminTest18100
LeafDrupal\system\Tests\System\CronRunTest6400
LeafDrupal\system\Tests\System\DateFormatsLanguageTest5600
LeafDrupal\system\Tests\System\DateTimeTest11100
LeafDrupal\system\Tests\System\DefaultMobileMetaTagsTest1200
LeafDrupal\system\Tests\System\ErrorHandlerTest5100
LeafDrupal\system\Tests\System\ExceptionControllerTest200
LeafDrupal\system\Tests\System\FloodTest2000
LeafDrupal\system\Tests\System\FrontPageTest7400
LeafDrupal\system\Tests\System\IndexPhpTest1200
LeafDrupal\system\Tests\System\InfoAlterTest2000
LeafDrupal\system\Tests\System\InfoFileParserUnitTest1800
LeafDrupal\system\Tests\System\MainContentFallbackTest8400
LeafDrupal\system\Tests\System\PageNotFoundTest3600
LeafDrupal\system\Tests\System\PageTitleFilteringTest4800
LeafDrupal\system\Tests\System\PasswordHashingTest2000
LeafDrupal\system\Tests\System\RetrieveFileTest700
LeafDrupal\system\Tests\System\ShutdownFunctionsTest500
LeafDrupal\system\Tests\System\SiteMaintenanceTest7700
LeafDrupal\system\Tests\System\SystemAuthorizeTest1600
LeafDrupal\system\Tests\System\ThemeTest20500
LeafDrupal\system\Tests\System\TokenReplaceTest3600
LeafDrupal\system\Tests\System\UnicodeUnitTest18200
ExpandDrupal\system\Tests\Theme\EntityFilteringThemeTest811
MessageGroupFilenameLineFunctionStatus
The test did not complete due to a fatal error.Completion checkEntityFilteringThemeTest.php122Drupal\system\Tests\Theme\EntityFilteringThemeTest->testThemedEntity()
Undefined index: target_identity_reference_field_presave('node', Object, Array, Object, 'und', Array, NULL, NULL) _field_invoke('presave', 'node', Object) field_attach_presave('node', Object) Drupal\Core\Entity\DatabaseStorageController->invokeHook('presave', Object) Drupal\node\NodeStorageController->invokeHook('presave', Object) Drupal\Core\Entity\DatabaseStorageController->save(Object) Drupal\Core\Entity\Entity->save() Drupal\simpletest\WebTestBase->drupalCreateNode(Array) Drupal\system\Tests\Theme\EntityFilteringThemeTest->setUp() Drupal\simpletest\TestBase->run() simpletest_script_run_one_test('548', 'Drupal\system\Tests\Theme\EntityFilteringThemeTest') Noticeentity_reference.module126entity_reference_field_presave()
LeafDrupal\system\Tests\Theme\FastTest1200
LeafDrupal\system\Tests\Theme\FunctionsTest2500
LeafDrupal\system\Tests\Theme\HookInitTest500
LeafDrupal\system\Tests\Theme\HtmlTagUnitTest200
LeafDrupal\system\Tests\Theme\HtmlTplPhpAttributesTest500
LeafDrupal\system\Tests\Theme\RegistryTest600
LeafDrupal\system\Tests\Theme\TableTest600
LeafDrupal\system\Tests\Theme\ThemeInfoStylesTest1300
LeafDrupal\system\Tests\Theme\ThemeTest4800
LeafDrupal\system\Tests\Theme\ThemeTestTwig1000
LeafDrupal\system\Tests\Theme\TwigReferenceUnitTest1500
LeafDrupal\system\Tests\Transliteration\TransliterationTest2600
LeafDrupal\system\Tests\TypedData\TypedDataTest6100
LeafDrupal\system\Tests\Update\DependencyHookInvocationTest400
LeafDrupal\system\Tests\Update\DependencyMissingTest400
LeafDrupal\system\Tests\Update\DependencyOrderingTest500
LeafDrupal\system\Tests\Update\UpdateScriptTest20100
LeafDrupal\system\Tests\Upgrade\BareMinimalUpgradePathTest6500
LeafDrupal\system\Tests\Upgrade\BareStandardUpgradePathTest7000
LeafDrupal\system\Tests\Upgrade\BlockUpgradePathTest3600
LeafDrupal\system\Tests\Upgrade\DateUpgradePathTest5200
LeafDrupal\system\Tests\Upgrade\FieldUpgradePathTest4100
LeafDrupal\system\Tests\Upgrade\FilledMinimalUpgradePathTest6600
ExpandDrupal\system\Tests\Upgrade\FilledStandardUpgradePathTest8450
MessageGroupFilenameLineFunctionStatus
HTTP response expected 200, actual 500BrowserFilledStandardUpgradePathTest.php45Drupal\system\Tests\Upgrade\FilledStandardUpgradePathTest->testFilledStandardUpgrade()
"Tools" foundOtherFilledStandardUpgradePathTest.php48Drupal\system\Tests\Upgrade\FilledStandardUpgradePathTest->testFilledStandardUpgrade()
"My account" foundOtherFilledStandardUpgradePathTest.php51Drupal\system\Tests\Upgrade\FilledStandardUpgradePathTest->testFilledStandardUpgrade()
"Log out" foundOtherFilledStandardUpgradePathTest.php52Drupal\system\Tests\Upgrade\FilledStandardUpgradePathTest->testFilledStandardUpgrade()
Link with label Home found.OtherFilledStandardUpgradePathTest.php55Drupal\system\Tests\Upgrade\FilledStandardUpgradePathTest->testFilledStandardUpgrade()
LeafDrupal\system\Tests\Upgrade\ImageUpgradePathTest3400
LeafDrupal\system\Tests\Upgrade\LanguageUpgradePathTest17100
ExpandDrupal\system\Tests\Upgrade\ModulesDisabledUpgradePathTest3401
MessageGroupFilenameLineFunctionStatus
Drupal\field\FieldException: Attempt to create field name <em class="placeholder">taxonomy_forums</em> which already exists, although it is inactive. in field_create_field() (line 86 of /var/lib/drupaltestbot/sites/default/files/checkout/core/modules/field/field.crud.inc). field_create_field(Array) forum_enable() call_user_func_array('forum_enable', Array) module_invoke('forum', 'enable') module_enable(Array) Drupal\system\Tests\Upgrade\ModulesDisabledUpgradePathTest->testDisabledUpgrade() Drupal\simpletest\TestBase->run() simpletest_script_run_one_test('583', 'Drupal\system\Tests\Upgrade\ModulesDisabledUpgradePathTest') Uncaught exceptionfield.crud.inc86field_create_field()
LeafDrupal\system\Tests\Upgrade\StateSystemUpgradePathTest5400
LeafDrupal\system\Tests\Upgrade\SystemUpgradePathTest5900
LeafDrupal\system\Tests\Upgrade\UserPictureUpgradePathTest4300
LeafDrupal\system\Tests\Upgrade\UserRoleUpgradePathTest4900
LeafDrupal\system\Tests\Upgrade\UuidUpgradePathTest3500
LeafDrupal\system\Tests\Uuid\UuidUnitTest700
LeafDrupal\taxonomy\Tests\EfqTest1400
LeafDrupal\taxonomy\Tests\HooksTest2300
LeafDrupal\taxonomy\Tests\LegacyTest1400
LeafDrupal\taxonomy\Tests\LoadMultipleTest1800
ExpandDrupal\taxonomy\Tests\RssTest1010
MessageGroupFilenameLineFunctionStatus
The test did not complete due to a fatal error.Completion checkRssTest.php77Drupal\taxonomy\Tests\RssTest->testTaxonomyRss()
ExpandDrupal\taxonomy\Tests\TermFieldMultipleVocabularyTest1010
MessageGroupFilenameLineFunctionStatus
The test did not complete due to a fatal error.Completion checkTermFieldMultipleVocabularyTest.php82Drupal\taxonomy\Tests\TermFieldMultipleVocabularyTest->testTaxonomyTermFieldMultipleVocabularies()
ExpandDrupal\taxonomy\Tests\TermFieldTest1010
MessageGroupFilenameLineFunctionStatus
The test did not complete due to a fatal error.Completion checkTermFieldTest.php80Drupal\taxonomy\Tests\TermFieldTest->testTaxonomyTermFieldValidation()
ExpandDrupal\taxonomy\Tests\TermIndexTest1010
MessageGroupFilenameLineFunctionStatus
The test did not complete due to a fatal error.Completion checkTermIndexTest.php105Drupal\taxonomy\Tests\TermIndexTest->testTaxonomyIndex()
LeafDrupal\taxonomy\Tests\TermLanguageTest6400
ExpandDrupal\taxonomy\Tests\TermTest1010
MessageGroupFilenameLineFunctionStatus
The test did not complete due to a fatal error.Completion checkTermTest.php67Drupal\taxonomy\Tests\TermTest->testTaxonomyTermHierarchy()
LeafDrupal\taxonomy\Tests\TermTranslationUITest9900
LeafDrupal\taxonomy\Tests\TermUnitTest1100
LeafDrupal\taxonomy\Tests\ThemeTest1900
ExpandDrupal\taxonomy\Tests\TokenReplaceTest1010
MessageGroupFilenameLineFunctionStatus
The test did not complete due to a fatal error.Completion checkTokenReplaceTest.php68Drupal\taxonomy\Tests\TokenReplaceTest->testTaxonomyTokenReplacement()
ExpandDrupal\taxonomy\Tests\Views\RelationshipNodeTermDataTest110
MessageGroupFilenameLineFunctionStatus
The test did not complete due to a fatal error.Completion checkRelationshipNodeTermDataTest.php30Drupal\taxonomy\Tests\Views\RelationshipNodeTermDataTest->testViewsHandlerRelationshipNodeTermData()
ExpandDrupal\taxonomy\Tests\Views\RelationshipRepresentativeNode110
MessageGroupFilenameLineFunctionStatus
The test did not complete due to a fatal error.Completion checkRelationshipRepresentativeNode.php33Drupal\taxonomy\Tests\Views\RelationshipRepresentativeNode->testRelationship()
LeafDrupal\taxonomy\Tests\VocabularyLanguageTest6000
LeafDrupal\taxonomy\Tests\VocabularyTest11000
LeafDrupal\taxonomy\Tests\VocabularyUnitTest6800
LeafDrupal\text\Tests\TextFieldTest18600
LeafDrupal\text\Tests\TextSummaryTest13800
LeafDrupal\text\Tests\TextTranslationTest10400
LeafDrupal\toolbar\Tests\ToolbarHookToolbarTest1500
LeafDrupal\tracker\Tests\TrackerNodeAccessTest2800
LeafDrupal\tracker\Tests\TrackerTest22800
LeafDrupal\translation\Tests\TranslationTest59000
LeafDrupal\translation_entity\Tests\ConfigTestTranslationUITest1300
LeafDrupal\translation_entity\Tests\EntityTestTranslationUITest6800
LeafDrupal\translation_entity\Tests\EntityTranslationSettingsTest4900
LeafDrupal\update\Tests\UpdateContribTest18700
LeafDrupal\update\Tests\UpdateCoreTest21400
LeafDrupal\update\Tests\UpdateCoreUnitTest400
LeafDrupal\update\Tests\UpdateUploadTest6400
LeafDrupal\user\Tests\TempStoreDatabaseTest1900
LeafDrupal\user\Tests\UserAccountLinksTests6100
LeafDrupal\user\Tests\UserAdminSettingsFormTest400
LeafDrupal\user\Tests\UserAdminTest6100
LeafDrupal\user\Tests\UserAutocompleteTest2500
LeafDrupal\user\Tests\UserBlocksTests4000
LeafDrupal\user\Tests\UserCancelTest25400
LeafDrupal\user\Tests\UserCreateTest3300
LeafDrupal\user\Tests\UserDeleteTest1500
LeafDrupal\user\Tests\UserEditedOwnAccountTest2200
LeafDrupal\user\Tests\UserEditTest7300
LeafDrupal\user\Tests\UserEntityCallbacksTest700
LeafDrupal\user\Tests\UserLanguageCreationTest6800
LeafDrupal\user\Tests\UserLanguageTest3900
LeafDrupal\user\Tests\UserLoginTest15900
LeafDrupal\user\Tests\UserPasswordResetTest3000
LeafDrupal\user\Tests\UserPermissionsTest5000
LeafDrupal\user\Tests\UserPictureTest4700
LeafDrupal\user\Tests\UserRegistrationTest12900
LeafDrupal\user\Tests\UserRoleAdminTest5400
LeafDrupal\user\Tests\UserRolesAssignmentTest5100
LeafDrupal\user\Tests\UserSaveTest200
LeafDrupal\user\Tests\UserSearchTest5800
LeafDrupal\user\Tests\UserSignatureTest4600
LeafDrupal\user\Tests\UserTimeZoneTest2900
LeafDrupal\user\Tests\UserTokenReplaceTest4700
LeafDrupal\user\Tests\UserTranslationUITest8900
LeafDrupal\user\Tests\UserValidateCurrentPassCustomFormTest1700
LeafDrupal\user\Tests\UserValidationTest1600
LeafDrupal\user\Tests\Views\AccessPermissionTest1400
LeafDrupal\user\Tests\Views\AccessRoleTest1400
LeafDrupal\user\Tests\Views\ArgumentDefaultTest900
LeafDrupal\user\Tests\Views\ArgumentValidateTest1900
LeafDrupal\user\Tests\Views\HandlerArgumentUserUidTest500
LeafDrupal\user\Tests\Views\HandlerFieldUserNameTest700
LeafDrupal\user\Tests\Views\HandlerFilterUserNameTest5700
LeafDrupal\user\Tests\Views\RelationshipRepresentativeNode300
LeafDrupal\views\Tests\AnalyzeTest1800
LeafDrupal\views\Tests\BasicTest800
ExpandDrupal\views\Tests\DefaultViewsTest110
MessageGroupFilenameLineFunctionStatus
The test did not complete due to a fatal error.Completion checkDefaultViewsTest.php123Drupal\views\Tests\DefaultViewsTest->testDefaultViews()
LeafDrupal\views\Tests\EntityReference\SelectionTest300
LeafDrupal\views\Tests\Entity\FieldEntityTest400
LeafDrupal\views\Tests\GlossaryTest800
LeafDrupal\views\Tests\Handler\AreaTest9000
LeafDrupal\views\Tests\Handler\AreaTextTest400
LeafDrupal\views\Tests\Handler\ArgumentNullTest400
LeafDrupal\views\Tests\Handler\ArgumentStringTest400
LeafDrupal\views\Tests\Handler\FieldBooleanTest1000
LeafDrupal\views\Tests\Handler\FieldCounterTest600
LeafDrupal\views\Tests\Handler\FieldCustomTest100
LeafDrupal\views\Tests\Handler\FieldDateTest1400
LeafDrupal\views\Tests\Handler\FieldDropButtonTest1300
LeafDrupal\views\Tests\Handler\FieldFileSizeTest800
LeafDrupal\views\Tests\Handler\FieldUnitTest9000
LeafDrupal\views\Tests\Handler\FieldUrlTest200
LeafDrupal\views\Tests\Handler\FieldWebTest10900
LeafDrupal\views\Tests\Handler\FieldXssTest300
LeafDrupal\views\Tests\Handler\FilterCombineTest100
LeafDrupal\views\Tests\Handler\FilterDateTest2200
LeafDrupal\views\Tests\Handler\FilterEqualityTest400
LeafDrupal\views\Tests\Handler\FilterInOperatorTest800
LeafDrupal\views\Tests\Handler\FilterNumericTest1400
LeafDrupal\views\Tests\Handler\FilterStringTest2600
LeafDrupal\views\Tests\Handler\HandlerAliasTest800
LeafDrupal\views\Tests\Handler\HandlerAllTest26000
ExpandDrupal\views\Tests\Handler\HandlerTest11600
MessageGroupFilenameLineFunctionStatus
'Missing handler: xShd3AsU xKIa4bEV relationship'Debugviews.module1113views_get_handler()
'Missing handler: xShd3AsU xKIa4bEV relationship'Debugviews.module1113views_get_handler()
LeafDrupal\views\Tests\Handler\RelationshipTest400
LeafDrupal\views\Tests\Handler\SortDateTest2400
LeafDrupal\views\Tests\Handler\SortRandomTest600
LeafDrupal\views\Tests\Handler\SortTest800
ExpandDrupal\views\Tests\ModuleTest4800
MessageGroupFilenameLineFunctionStatus
'Missing handler: wGSb95IX fnrq9qxb field'Debugviews.module1113views_get_handler()
'Missing handler: pnd5ngty wlsHVuCO area'Debugviews.module1113views_get_handler()
'Missing handler: efdsi5mv qqfqFLdC filter'Debugviews.module1113views_get_handler()
LeafDrupal\views\Tests\PluginBaseUnitTest1200
LeafDrupal\views\Tests\PluginInstanceTest26000
LeafDrupal\views\Tests\PluginTypeListTest100
LeafDrupal\views\Tests\Plugin\AccessTest3900
LeafDrupal\views\Tests\Plugin\ArgumentDefaultTest2400
LeafDrupal\views\Tests\Plugin\ArgumentValidatorTest400
LeafDrupal\views\Tests\Plugin\CacheTest1200
LeafDrupal\views\Tests\Plugin\DisplayAttachmentTest600
LeafDrupal\views\Tests\Plugin\DisplayExtenderTest600
LeafDrupal\views\Tests\Plugin\DisplayFeedTest2800
LeafDrupal\views\Tests\Plugin\DisplayPageTest700
LeafDrupal\views\Tests\Plugin\DisplayTest5000
LeafDrupal\views\Tests\Plugin\ExposedFormTest11400
LeafDrupal\views\Tests\Plugin\FilterTest1300
ExpandDrupal\views\Tests\Plugin\JoinTest1600
MessageGroupFilenameLineFunctionStatus
array ( 'join type' => 'LEFT', 'table' => 'users', 'alias' => 'users', 'condition' => 'node.uid = users.uid AND (node.uid = 65)', 'arguments' => array ( ), )DebugJoinTest.php70Drupal\views\Tests\Plugin\JoinTest->testExamplePlugin()
LeafDrupal\views\Tests\Plugin\PagerTest9200
LeafDrupal\views\Tests\Plugin\QueryTest200
LeafDrupal\views\Tests\Plugin\StyleMappingTest4200
LeafDrupal\views\Tests\Plugin\StyleTest2400
LeafDrupal\views\Tests\Plugin\StyleUnformattedTest1700
LeafDrupal\views\Tests\QueryGroupByTest4000
LeafDrupal\views\Tests\TokenReplaceTest1100
LeafDrupal\views\Tests\UI\DefaultViewsTest11000
LeafDrupal\views\Tests\UI\DisplayExtenderUITest2300
LeafDrupal\views\Tests\UI\DisplayPath2200
LeafDrupal\views\Tests\UI\DisplayTest19500
LeafDrupal\views\Tests\UI\GroupByTest2600
LeafDrupal\views\Tests\UI\HandlerTest11000
LeafDrupal\views\Tests\UI\OverrideDisplaysTest16700
LeafDrupal\views\Tests\UI\PreviewTest4200
LeafDrupal\views\Tests\UI\QueryTest1900
LeafDrupal\views\Tests\UI\RedirectTest2600
LeafDrupal\views\Tests\UI\RowUITest3000
LeafDrupal\views\Tests\UI\SettingsTest8800
LeafDrupal\views\Tests\UI\StorageTest2100
LeafDrupal\views\Tests\UI\StyleUITest3000
LeafDrupal\views\Tests\UI\TagTest1100
LeafDrupal\views\Tests\ViewElementTest1500
LeafDrupal\views\Tests\ViewExecutableTest11500
LeafDrupal\views\Tests\ViewRenderTest200
LeafDrupal\views\Tests\ViewsDataTest1000
ExpandDrupal\views\Tests\ViewStorageTest10900
MessageGroupFilenameLineFunctionStatus
'Missing handler: views_test_data id field'Debugviews.module1113views_get_handler()
'Missing handler: views_test_data name field'Debugviews.module1113views_get_handler()
LeafDrupal\views\Tests\Wizard\BasicTest8300
LeafDrupal\views\Tests\Wizard\ItemsPerPageTest4200
LeafDrupal\views\Tests\Wizard\MenuTest1900
LeafDrupal\views\Tests\Wizard\SortingTest3500
ExpandDrupal\views\Tests\Wizard\TaggedWithTest1110
MessageGroupFilenameLineFunctionStatus
The test did not complete due to a fatal error.Completion checkTaggedWithTest.php104Drupal\views\Tests\Wizard\TaggedWithTest->testTaggedWith()
LeafDrupal\xmlrpc\Tests\XmlRpcBasicTest900
LeafDrupal\xmlrpc\Tests\XmlRpcMessagesTest700
LeafDrupal\xmlrpc\Tests\XmlRpcValidatorTest1000