1847596-er-taxonomy-6.patch

Test status
StatusResult
Last receivedSun, 12/30/2012 - 21:01:28
Last requestedSun, 12/30/2012 - 21:22:21
Last testedSun, 12/30/2012 - 22:10:14
Test count1
Environment status
MySQLfail
File information
File1847596-er-taxonomy-6.patch
BranchDrupal core - 8.x
LinkIssue Link
SummaryFAILED: [[SimpleTest]]: [MySQL] 48,110 pass(es), 83 fail(s), and 23 exception(s).
Details

MySQL

  1. Setup environment
  2. Detect an invalid patch URL
  3. Detect invalid repository information
  4. Detect invalid patch format
  5. Detect a non-applicable patch
  6. Detect invalid PHP syntax
  7. Detect a Drupal installation failure
  8. Detect a test run failure
  9. Detect a failing test
    Review the test failures below then if necessary run them locally until the problem has been fixed.
  10. Complete test suite with all tests passing
48,110 pass(es), 83 fail(s), and 23 exception(s)

Non-pass

Test namePassFailException
ExpandDrupal\field_ui\Tests\ManageFieldsTest1210
MessageGroupFilenameLineFunctionStatus
The test did not complete due to a fatal error.Completion checkManageFieldsTest.php66Drupal\field_ui\Tests\ManageFieldsTest->testCRUDFields()
ExpandDrupal\forum\Tests\ForumBlockTest010
MessageGroupFilenameLineFunctionStatus
The test did not complete due to a fatal error.Completion checkForumBlockTest.php54Drupal\forum\Tests\ForumBlockTest->testNewForumTopicsBlock()
ExpandDrupal\forum\Tests\ForumIndexTest010
MessageGroupFilenameLineFunctionStatus
The test did not complete due to a fatal error.Completion checkForumIndexTest.php43Drupal\forum\Tests\ForumIndexTest->testForumIndexStatus()
ExpandDrupal\forum\Tests\ForumNodeAccessTest010
MessageGroupFilenameLineFunctionStatus
The test did not complete due to a fatal error.Completion checkForumNodeAccessTest.php48Drupal\forum\Tests\ForumNodeAccessTest->testForumNodeAccess()
ExpandDrupal\forum\Tests\ForumTest010
MessageGroupFilenameLineFunctionStatus
The test did not complete due to a fatal error.Completion checkForumTest.php103Drupal\forum\Tests\ForumTest->testEnableForumField()
ExpandDrupal\node\Tests\NodeAccessBaseTableTest101220
MessageGroupFilenameLineFunctionStatus
Failed to set field field_tags[und] to publicOtherNodeAccessBaseTableTest.php87Drupal\node\Tests\NodeAccessBaseTableTest->testNodeAccessBasic()
Found the requested form fields at node/add/articleOtherNodeAccessBaseTableTest.php87Drupal\node\Tests\NodeAccessBaseTableTest->testNodeAccessBasic()
Failed to set field field_tags[und] to privateOtherNodeAccessBaseTableTest.php87Drupal\node\Tests\NodeAccessBaseTableTest->testNodeAccessBasic()
Found the requested form fields at node/add/articleOtherNodeAccessBaseTableTest.php87Drupal\node\Tests\NodeAccessBaseTableTest->testNodeAccessBasic()
The private status of the node was properly set in the node_access_test table.OtherNodeAccessBaseTableTest.php90Drupal\node\Tests\NodeAccessBaseTableTest->testNodeAccessBasic()
Failed to set field field_tags[und] to publicOtherNodeAccessBaseTableTest.php87Drupal\node\Tests\NodeAccessBaseTableTest->testNodeAccessBasic()
Found the requested form fields at node/add/articleOtherNodeAccessBaseTableTest.php87Drupal\node\Tests\NodeAccessBaseTableTest->testNodeAccessBasic()
Failed to set field field_tags[und] to privateOtherNodeAccessBaseTableTest.php87Drupal\node\Tests\NodeAccessBaseTableTest->testNodeAccessBasic()
Found the requested form fields at node/add/articleOtherNodeAccessBaseTableTest.php87Drupal\node\Tests\NodeAccessBaseTableTest->testNodeAccessBasic()
The private status of the node was properly set in the node_access_test table.OtherNodeAccessBaseTableTest.php90Drupal\node\Tests\NodeAccessBaseTableTest->testNodeAccessBasic()
Public tid was foundOtherNodeAccessBaseTableTest.php100Drupal\node\Tests\NodeAccessBaseTableTest->testNodeAccessBasic()
Private tid was foundOtherNodeAccessBaseTableTest.php101Drupal\node\Tests\NodeAccessBaseTableTest->testNodeAccessBasic()
A private node by user 2 is visible for user 2.BrowserNodeAccessBaseTableTest.php119Drupal\node\Tests\NodeAccessBaseTableTest->testNodeAccessBasic()
A private node by user 3 is not visible for user 2.BrowserNodeAccessBaseTableTest.php119Drupal\node\Tests\NodeAccessBaseTableTest->testNodeAccessBasic()
A private node by user 2 is not visible for user 2 on the private page.OtherNodeAccessBaseTableTest.php125Drupal\node\Tests\NodeAccessBaseTableTest->testNodeAccessBasic()
A private node by user 2 is not visible for user 3.BrowserNodeAccessBaseTableTest.php119Drupal\node\Tests\NodeAccessBaseTableTest->testNodeAccessBasic()
A private node by user 3 is visible for user 3.BrowserNodeAccessBaseTableTest.php119Drupal\node\Tests\NodeAccessBaseTableTest->testNodeAccessBasic()
A private node by user 3 is not visible for user 3 on the private page.OtherNodeAccessBaseTableTest.php125Drupal\node\Tests\NodeAccessBaseTableTest->testNodeAccessBasic()
HTTP response expected 200, actual 404BrowserNodeAccessBaseTableTest.php135Drupal\node\Tests\NodeAccessBaseTableTest->testNodeAccessBasic()
HTTP response expected 200, actual 404BrowserNodeAccessBaseTableTest.php135Drupal\node\Tests\NodeAccessBaseTableTest->testNodeAccessBasic()
A private node by user 2 is not visible for user 3 on the private page.OtherNodeAccessBaseTableTest.php141Drupal\node\Tests\NodeAccessBaseTableTest->testNodeAccessBasic()
A private node by user 3 is not visible for user 3 on the private page.OtherNodeAccessBaseTableTest.php141Drupal\node\Tests\NodeAccessBaseTableTest->testNodeAccessBasic()
ExpandDrupal\node\Tests\NodeAccessPagerTest010
MessageGroupFilenameLineFunctionStatus
The test did not complete due to a fatal error.Completion checkNodeAccessPagerTest.php42Drupal\node\Tests\NodeAccessPagerTest->testCommentPager()
ExpandDrupal\rdf\Tests\RdfaMarkupTest2640
MessageGroupFilenameLineFunctionStatus
Failed to set field field_tags[und] to ocfY3Zzi, o3JqKXprOtherRdfaMarkupTest.php174Drupal\rdf\Tests\RdfaMarkupTest->testAttributesInMarkupFile()
Found the requested form fields at node/1/editOtherRdfaMarkupTest.php174Drupal\rdf\Tests\RdfaMarkupTest->testAttributesInMarkupFile()
Property dc:subject is present for the tag1 field item.OtherRdfaMarkupTest.php181Drupal\rdf\Tests\RdfaMarkupTest->testAttributesInMarkupFile()
Property dc:subject is present for the tag2 field item.OtherRdfaMarkupTest.php186Drupal\rdf\Tests\RdfaMarkupTest->testAttributesInMarkupFile()
ExpandDrupal\system\Tests\Entity\EntityQueryRelationshipTest110
MessageGroupFilenameLineFunctionStatus
The test did not complete due to a fatal error.Completion checkEntityQueryRelationshipTest.php136Drupal\system\Tests\Entity\EntityQueryRelationshipTest->testQuery()
ExpandDrupal\system\Tests\Menu\BreadcrumbTest3921217
MessageGroupFilenameLineFunctionStatus
Undefined index: taxonomy_autocompleteNoticeFieldOverview.php143Drupal\field_ui\FieldOverview->form()
Failed to set field field_tags[und] to Drupal,BreadcrumbsOtherBreadcrumbTest.php309Drupal\system\Tests\Menu\BreadcrumbTest->testBreadCrumbs()
Found the requested form fields at node/4/editOtherBreadcrumbTest.php309Drupal\system\Tests\Menu\BreadcrumbTest->testBreadCrumbs()
Trying to get property of non-objectDrupal\system\Tests\Menu\BreadcrumbTest->testBreadCrumbs() Drupal\simpletest\TestBase->run() simpletest_script_run_one_test('345', 'Drupal\system\Tests\Menu\BreadcrumbTest') NoticeBreadcrumbTest.php325Drupal\system\Tests\Menu\BreadcrumbTest->testBreadCrumbs()
Trying to get property of non-objectDrupal\system\Tests\Menu\BreadcrumbTest->testBreadCrumbs() Drupal\simpletest\TestBase->run() simpletest_script_run_one_test('345', 'Drupal\system\Tests\Menu\BreadcrumbTest') NoticeBreadcrumbTest.php325Drupal\system\Tests\Menu\BreadcrumbTest->testBreadCrumbs()
Trying to get property of non-objectDrupal\system\Tests\Menu\BreadcrumbTest->testBreadCrumbs() Drupal\simpletest\TestBase->run() simpletest_script_run_one_test('345', 'Drupal\system\Tests\Menu\BreadcrumbTest') NoticeBreadcrumbTest.php332Drupal\system\Tests\Menu\BreadcrumbTest->testBreadCrumbs()
Undefined index: mlidDrupal\system\Tests\Menu\BreadcrumbTest->testBreadCrumbs() Drupal\simpletest\TestBase->run() simpletest_script_run_one_test('345', 'Drupal\system\Tests\Menu\BreadcrumbTest') NoticeBreadcrumbTest.php341Drupal\system\Tests\Menu\BreadcrumbTest->testBreadCrumbs()
Trying to get property of non-objectDrupal\system\Tests\Menu\BreadcrumbTest->testBreadCrumbs() Drupal\simpletest\TestBase->run() simpletest_script_run_one_test('345', 'Drupal\system\Tests\Menu\BreadcrumbTest') NoticeBreadcrumbTest.php332Drupal\system\Tests\Menu\BreadcrumbTest->testBreadCrumbs()
Failed to set field parent to tools:OtherBreadcrumbTest.php335Drupal\system\Tests\Menu\BreadcrumbTest->testBreadCrumbs()
Found the requested form fields at admin/structure/menu/manage/tools/addOtherBreadcrumbTest.php335Drupal\system\Tests\Menu\BreadcrumbTest->testBreadCrumbs()
Undefined index: mlidDrupal\system\Tests\Menu\BreadcrumbTest->testBreadCrumbs() Drupal\simpletest\TestBase->run() simpletest_script_run_one_test('345', 'Drupal\system\Tests\Menu\BreadcrumbTest') NoticeBreadcrumbTest.php341Drupal\system\Tests\Menu\BreadcrumbTest->testBreadCrumbs()
Undefined index: link_titleDrupal\system\Tests\Menu\BreadcrumbTest->testBreadCrumbs() Drupal\simpletest\TestBase->run() simpletest_script_run_one_test('345', 'Drupal\system\Tests\Menu\BreadcrumbTest') NoticeBreadcrumbTest.php352Drupal\system\Tests\Menu\BreadcrumbTest->testBreadCrumbs()
Trying to get property of non-objectDrupal\system\Tests\Menu\BreadcrumbTest->testBreadCrumbs() Drupal\simpletest\TestBase->run() simpletest_script_run_one_test('345', 'Drupal\system\Tests\Menu\BreadcrumbTest') NoticeBreadcrumbTest.php354Drupal\system\Tests\Menu\BreadcrumbTest->testBreadCrumbs()
Breadcrumb Home found on http://drupaltestbot953-mysql.osuosl.test/checkout/taxonomy/term/.OtherBreadcrumbTest.php354Drupal\system\Tests\Menu\BreadcrumbTest->testBreadCrumbs()
SimpleXMLElement::xpath(): Invalid expressionSimpleXMLElement->xpath('//li[contains(@class, "active-trail")]/a[contains(@href, "/checkout/taxonomy/term/") and contains(@class, "active")and contains(text(), )]') Drupal\simpletest\WebTestBase->xpath('//li[contains(@class, :class-trail)]/a[contains(@href, :href) and contains(@class, :class-active)and contains(text(), :title)]', Array) Drupal\system\Tests\Menu\MenuTestBase->assertBreadcrumb('taxonomy/term/', Array, NULL, Array) Drupal\system\Tests\Menu\BreadcrumbTest->testBreadCrumbs() Drupal\simpletest\TestBase->run() simpletest_script_run_one_test('345', 'Drupal\system\Tests\Menu\BreadcrumbTest') WarningWebTestBase.php1708Drupal\simpletest\WebTestBase->xpath()
SimpleXMLElement::xpath(): xmlXPathEval: evaluation failedSimpleXMLElement->xpath('//li[contains(@class, "active-trail")]/a[contains(@href, "/checkout/taxonomy/term/") and contains(@class, "active")and contains(text(), )]') Drupal\simpletest\WebTestBase->xpath('//li[contains(@class, :class-trail)]/a[contains(@href, :href) and contains(@class, :class-active)and contains(text(), :title)]', Array) Drupal\system\Tests\Menu\MenuTestBase->assertBreadcrumb('taxonomy/term/', Array, NULL, Array) Drupal\system\Tests\Menu\BreadcrumbTest->testBreadCrumbs() Drupal\simpletest\TestBase->run() simpletest_script_run_one_test('345', 'Drupal\system\Tests\Menu\BreadcrumbTest') WarningWebTestBase.php1708Drupal\simpletest\WebTestBase->xpath()
Active link was found in menu tree, including active trail links .OtherBreadcrumbTest.php354Drupal\system\Tests\Menu\BreadcrumbTest->testBreadCrumbs()
Tagged node found.OtherBreadcrumbTest.php355Drupal\system\Tests\Menu\BreadcrumbTest->testBreadCrumbs()
Link to taxonomy/term/ appears only once.OtherBreadcrumbTest.php365Drupal\system\Tests\Menu\BreadcrumbTest->testBreadCrumbs()
Trying to get property of non-objectDrupal\system\Tests\Menu\BreadcrumbTest->testBreadCrumbs() Drupal\simpletest\TestBase->run() simpletest_script_run_one_test('345', 'Drupal\system\Tests\Menu\BreadcrumbTest') NoticeBreadcrumbTest.php370Drupal\system\Tests\Menu\BreadcrumbTest->testBreadCrumbs()
Undefined index: link_titleDrupal\system\Tests\Menu\BreadcrumbTest->testBreadCrumbs() Drupal\simpletest\TestBase->run() simpletest_script_run_one_test('345', 'Drupal\system\Tests\Menu\BreadcrumbTest') NoticeBreadcrumbTest.php352Drupal\system\Tests\Menu\BreadcrumbTest->testBreadCrumbs()
Trying to get property of non-objectDrupal\system\Tests\Menu\BreadcrumbTest->testBreadCrumbs() Drupal\simpletest\TestBase->run() simpletest_script_run_one_test('345', 'Drupal\system\Tests\Menu\BreadcrumbTest') NoticeBreadcrumbTest.php354Drupal\system\Tests\Menu\BreadcrumbTest->testBreadCrumbs()
Breadcrumb Home » found on http://drupaltestbot953-mysql.osuosl.test/checkout/taxonomy/term/.OtherBreadcrumbTest.php354Drupal\system\Tests\Menu\BreadcrumbTest->testBreadCrumbs()
SimpleXMLElement::xpath(): Invalid expressionSimpleXMLElement->xpath('//li[contains(@class, "active-trail")]/a[contains(@href, "/checkout/taxonomy/term/") and contains(@class, "active")and contains(text(), )]') Drupal\simpletest\WebTestBase->xpath('//li[contains(@class, :class-trail)]/a[contains(@href, :href) and contains(@class, :class-active)and contains(text(), :title)]', Array) Drupal\system\Tests\Menu\MenuTestBase->assertBreadcrumb('taxonomy/term/', Array, NULL, Array) Drupal\system\Tests\Menu\BreadcrumbTest->testBreadCrumbs() Drupal\simpletest\TestBase->run() simpletest_script_run_one_test('345', 'Drupal\system\Tests\Menu\BreadcrumbTest') WarningWebTestBase.php1708Drupal\simpletest\WebTestBase->xpath()
SimpleXMLElement::xpath(): xmlXPathEval: evaluation failedSimpleXMLElement->xpath('//li[contains(@class, "active-trail")]/a[contains(@href, "/checkout/taxonomy/term/") and contains(@class, "active")and contains(text(), )]') Drupal\simpletest\WebTestBase->xpath('//li[contains(@class, :class-trail)]/a[contains(@href, :href) and contains(@class, :class-active)and contains(text(), :title)]', Array) Drupal\system\Tests\Menu\MenuTestBase->assertBreadcrumb('taxonomy/term/', Array, NULL, Array) Drupal\system\Tests\Menu\BreadcrumbTest->testBreadCrumbs() Drupal\simpletest\TestBase->run() simpletest_script_run_one_test('345', 'Drupal\system\Tests\Menu\BreadcrumbTest') WarningWebTestBase.php1708Drupal\simpletest\WebTestBase->xpath()
Active link was found in menu tree, including active trail links .OtherBreadcrumbTest.php354Drupal\system\Tests\Menu\BreadcrumbTest->testBreadCrumbs()
Tagged node found.OtherBreadcrumbTest.php355Drupal\system\Tests\Menu\BreadcrumbTest->testBreadCrumbs()
Link to taxonomy/term/ appears only once.OtherBreadcrumbTest.php365Drupal\system\Tests\Menu\BreadcrumbTest->testBreadCrumbs()
Trying to get property of non-objectDrupal\system\Tests\Menu\BreadcrumbTest->testBreadCrumbs() Drupal\simpletest\TestBase->run() simpletest_script_run_one_test('345', 'Drupal\system\Tests\Menu\BreadcrumbTest') NoticeBreadcrumbTest.php370Drupal\system\Tests\Menu\BreadcrumbTest->testBreadCrumbs()
ExpandDrupal\system\Tests\Module\DependencyTest15910
MessageGroupFilenameLineFunctionStatus
Value array ( 0 => 'module_test', ) is identical to value array ( 0 => 'comment', 1 => 'history', 2 => 'options', 3 => 'taxonomy', 4 => 'php', 5 => 'poll', 6 => 'forum', ).OtherDependencyTest.php161Drupal\system\Tests\Module\DependencyTest->testModuleEnableOrder()
ExpandDrupal\system\Tests\Module\EnableDisableTest1923120
MessageGroupFilenameLineFunctionStatus
Modules status has been updated.OtherEnableDisableTest.php98Drupal\system\Tests\Module\EnableDisableTest->testEnableDisable()
"hook_modules_installed fired for forum" foundOtherEnableDisableTest.php105Drupal\system\Tests\Module\EnableDisableTest->testEnableDisable()
"hook_modules_enabled fired for forum" foundOtherEnableDisableTest.php106Drupal\system\Tests\Module\EnableDisableTest->testEnableDisable()
watchdog table contains 0 rows for %module module enabled.OtherEnableDisableTest.php111Drupal\system\Tests\Module\EnableDisableTest->testEnableDisable()
"hook_modules_installed fired for history" foundOtherEnableDisableTest.php105Drupal\system\Tests\Module\EnableDisableTest->testEnableDisable()
"hook_modules_enabled fired for history" foundOtherEnableDisableTest.php106Drupal\system\Tests\Module\EnableDisableTest->testEnableDisable()
"hook_modules_installed fired for taxonomy" foundOtherEnableDisableTest.php105Drupal\system\Tests\Module\EnableDisableTest->testEnableDisable()
"hook_modules_enabled fired for taxonomy" foundOtherEnableDisableTest.php106Drupal\system\Tests\Module\EnableDisableTest->testEnableDisable()
"hook_modules_installed fired for options" foundOtherEnableDisableTest.php105Drupal\system\Tests\Module\EnableDisableTest->testEnableDisable()
"hook_modules_enabled fired for options" foundOtherEnableDisableTest.php106Drupal\system\Tests\Module\EnableDisableTest->testEnableDisable()
"hook_modules_installed fired for comment" foundOtherEnableDisableTest.php105Drupal\system\Tests\Module\EnableDisableTest->testEnableDisable()
"hook_modules_enabled fired for comment" foundOtherEnableDisableTest.php106Drupal\system\Tests\Module\EnableDisableTest->testEnableDisable()
ExpandDrupal\system\Tests\Path\UrlAlterFunctionalTest010
MessageGroupFilenameLineFunctionStatus
The test did not complete due to a fatal error.Completion checkUrlAlterFunctionalTest.php35Drupal\system\Tests\Path\UrlAlterFunctionalTest->testUrlAlter()
ExpandDrupal\system\Tests\Theme\EntityFilteringThemeTest821
MessageGroupFilenameLineFunctionStatus
The test did not complete due to a fatal error.Completion checkEntityFilteringThemeTest.php122Drupal\system\Tests\Theme\EntityFilteringThemeTest->testThemedEntity()
The test did not complete due to a fatal error.Completion checkEntityFilteringThemeTest.php122Drupal\system\Tests\Theme\EntityFilteringThemeTest->testThemedEntity()
Undefined index: target_identity_reference_field_presave('node', Object, Array, Object, 'und', Array, NULL, NULL) _field_invoke('presave', 'node', Object) field_attach_presave('node', Object) Drupal\Core\Entity\DatabaseStorageController->invokeHook('presave', Object) Drupal\node\NodeStorageController->invokeHook('presave', Object) Drupal\Core\Entity\DatabaseStorageController->save(Object) Drupal\Core\Entity\Entity->save() Drupal\simpletest\WebTestBase->drupalCreateNode(Array) Drupal\system\Tests\Theme\EntityFilteringThemeTest->setUp() Drupal\simpletest\TestBase->run() simpletest_script_run_one_test('548', 'Drupal\system\Tests\Theme\EntityFilteringThemeTest') Noticeentity_reference.module126entity_reference_field_presave()
ExpandDrupal\system\Tests\Upgrade\FilledStandardUpgradePathTest8250
MessageGroupFilenameLineFunctionStatus
HTTP response expected 200, actual 500BrowserFilledStandardUpgradePathTest.php45Drupal\system\Tests\Upgrade\FilledStandardUpgradePathTest->testFilledStandardUpgrade()
"Tools" foundOtherFilledStandardUpgradePathTest.php48Drupal\system\Tests\Upgrade\FilledStandardUpgradePathTest->testFilledStandardUpgrade()
"My account" foundOtherFilledStandardUpgradePathTest.php51Drupal\system\Tests\Upgrade\FilledStandardUpgradePathTest->testFilledStandardUpgrade()
"Log out" foundOtherFilledStandardUpgradePathTest.php52Drupal\system\Tests\Upgrade\FilledStandardUpgradePathTest->testFilledStandardUpgrade()
Link with label Home found.OtherFilledStandardUpgradePathTest.php55Drupal\system\Tests\Upgrade\FilledStandardUpgradePathTest->testFilledStandardUpgrade()
ExpandDrupal\system\Tests\Upgrade\ModulesDisabledUpgradePathTest3401
MessageGroupFilenameLineFunctionStatus
Drupal\field\FieldException: Attempt to create field name <em class="placeholder">taxonomy_forums</em> which already exists, although it is inactive. in field_create_field() (line 86 of /var/lib/drupaltestbot/sites/default/files/checkout/core/modules/field/field.crud.inc). field_create_field(Array) forum_enable() call_user_func_array('forum_enable', Array) module_invoke('forum', 'enable') module_enable(Array) Drupal\system\Tests\Upgrade\ModulesDisabledUpgradePathTest->testDisabledUpgrade() Drupal\simpletest\TestBase->run() simpletest_script_run_one_test('583', 'Drupal\system\Tests\Upgrade\ModulesDisabledUpgradePathTest') Uncaught exceptionfield.crud.inc86field_create_field()
ExpandDrupal\taxonomy\Tests\LegacyTest2462
MessageGroupFilenameLineFunctionStatus
Failed to set field field_tags[und] to bkR1ItzmOtherLegacyTest.php42Drupal\taxonomy\Tests\LegacyTest->testTaxonomyLegacyNode()
Found the requested form fields at node/add/articleOtherLegacyTest.php42Drupal\taxonomy\Tests\LegacyTest->testTaxonomyLegacyNode()
Trying to get property of non-objectDrupal\taxonomy\Tests\LegacyTest->testTaxonomyLegacyNode() Drupal\simpletest\TestBase->run() simpletest_script_run_one_test('532', 'Drupal\taxonomy\Tests\LegacyTest') NoticeLegacyTest.php45Drupal\taxonomy\Tests\LegacyTest->testTaxonomyLegacyNode()
Legacy node was saved with the right date.OtherLegacyTest.php45Drupal\taxonomy\Tests\LegacyTest->testTaxonomyLegacyNode()
Failed to set field field_tags[und] to bkR1ItzmOtherLegacyTest.php42Drupal\taxonomy\Tests\LegacyTest->testTaxonomyLegacyNode()
Found the requested form fields at node/add/articleOtherLegacyTest.php42Drupal\taxonomy\Tests\LegacyTest->testTaxonomyLegacyNode()
Trying to get property of non-objectDrupal\taxonomy\Tests\LegacyTest->testTaxonomyLegacyNode() Drupal\simpletest\TestBase->run() simpletest_script_run_one_test('532', 'Drupal\taxonomy\Tests\LegacyTest') NoticeLegacyTest.php45Drupal\taxonomy\Tests\LegacyTest->testTaxonomyLegacyNode()
Legacy node was saved with the right date.OtherLegacyTest.php45Drupal\taxonomy\Tests\LegacyTest->testTaxonomyLegacyNode()
ExpandDrupal\taxonomy\Tests\RssTest1010
MessageGroupFilenameLineFunctionStatus
The test did not complete due to a fatal error.Completion checkRssTest.php77Drupal\taxonomy\Tests\RssTest->testTaxonomyRss()
ExpandDrupal\taxonomy\Tests\TermFieldMultipleVocabularyTest1010
MessageGroupFilenameLineFunctionStatus
The test did not complete due to a fatal error.Completion checkTermFieldMultipleVocabularyTest.php82Drupal\taxonomy\Tests\TermFieldMultipleVocabularyTest->testTaxonomyTermFieldMultipleVocabularies()
ExpandDrupal\taxonomy\Tests\TermFieldTest1010
MessageGroupFilenameLineFunctionStatus
The test did not complete due to a fatal error.Completion checkTermFieldTest.php80Drupal\taxonomy\Tests\TermFieldTest->testTaxonomyTermFieldValidation()
ExpandDrupal\taxonomy\Tests\TermIndexTest1510
MessageGroupFilenameLineFunctionStatus
The test did not complete due to a fatal error.Completion checkTermIndexTest.php105Drupal\taxonomy\Tests\TermIndexTest->testTaxonomyIndex()
ExpandDrupal\taxonomy\Tests\TermTest2010
MessageGroupFilenameLineFunctionStatus
The test did not complete due to a fatal error.Completion checkTermTest.php67Drupal\taxonomy\Tests\TermTest->testTaxonomyTermHierarchy()
ExpandDrupal\taxonomy\Tests\TokenReplaceTest2020
MessageGroupFilenameLineFunctionStatus
The test did not complete due to a fatal error.Completion checkTokenReplaceTest.php68Drupal\taxonomy\Tests\TokenReplaceTest->testTaxonomyTokenReplacement()
The test did not complete due to a fatal error.Completion checkTokenReplaceTest.php68Drupal\taxonomy\Tests\TokenReplaceTest->testTaxonomyTokenReplacement()
ExpandDrupal\taxonomy\Tests\Views\RelationshipNodeTermDataTest110
MessageGroupFilenameLineFunctionStatus
The test did not complete due to a fatal error.Completion checkRelationshipNodeTermDataTest.php30Drupal\taxonomy\Tests\Views\RelationshipNodeTermDataTest->testViewsHandlerRelationshipNodeTermData()
ExpandDrupal\taxonomy\Tests\Views\RelationshipRepresentativeNode110
MessageGroupFilenameLineFunctionStatus
The test did not complete due to a fatal error.Completion checkRelationshipRepresentativeNode.php33Drupal\taxonomy\Tests\Views\RelationshipRepresentativeNode->testRelationship()
ExpandDrupal\text\Tests\TextTranslationTest10402
MessageGroupFilenameLineFunctionStatus
Undefined index: taxonomy_autocompleteNoticeFieldOverview.php143Drupal\field_ui\FieldOverview->form()
Undefined index: taxonomy_autocompleteNoticeFieldOverview.php143Drupal\field_ui\FieldOverview->form()
ExpandDrupal\views\Tests\DefaultViewsTest110
MessageGroupFilenameLineFunctionStatus
The test did not complete due to a fatal error.Completion checkDefaultViewsTest.php123Drupal\views\Tests\DefaultViewsTest->testDefaultViews()
ExpandDrupal\views\Tests\Wizard\TaggedWithTest1110
MessageGroupFilenameLineFunctionStatus
The test did not complete due to a fatal error.Completion checkTaggedWithTest.php104Drupal\views\Tests\Wizard\TaggedWithTest->testTaggedWith()

All

Test namePassFailException
LeafDrupal\action\Tests\BulkFormTest3300
LeafDrupal\action\Tests\ConfigurationTest3900
LeafDrupal\action\Tests\LoopTest2100
LeafDrupal\aggregator\Tests\AddFeedTest7100
LeafDrupal\aggregator\Tests\AggregatorConfigurationTest2000
LeafDrupal\aggregator\Tests\AggregatorCronTest5500
LeafDrupal\aggregator\Tests\AggregatorRenderingTest22800
LeafDrupal\aggregator\Tests\CategorizeFeedItemTest6100
LeafDrupal\aggregator\Tests\CategorizeFeedTest2100
LeafDrupal\aggregator\Tests\FeedParserTest7200
LeafDrupal\aggregator\Tests\ImportOpmlTest5500
LeafDrupal\aggregator\Tests\RemoveFeedItemTest27000
LeafDrupal\aggregator\Tests\RemoveFeedTest2500
LeafDrupal\aggregator\Tests\UpdateFeedItemTest6500
LeafDrupal\aggregator\Tests\UpdateFeedTest7600
LeafDrupal\ban\Tests\IpAddressBlockingTest4300
LeafDrupal\block\Tests\BlockAdminThemeTest1900
LeafDrupal\block\Tests\BlockCacheTest20500
LeafDrupal\block\Tests\BlockHiddenRegionTest1800
LeafDrupal\block\Tests\BlockHtmlIdTest1600
LeafDrupal\block\Tests\BlockInvalidRegionTest2400
LeafDrupal\block\Tests\BlockLanguageTest9100
LeafDrupal\block\Tests\BlockTemplateSuggestionsUnitTest300
LeafDrupal\block\Tests\BlockTest36000
LeafDrupal\block\Tests\BlockUserAccountSettingsTest1200
LeafDrupal\block\Tests\NewDefaultThemeBlocksTest2300
LeafDrupal\block\Tests\NonDefaultBlockAdminTest1100
LeafDrupal\book\Tests\BookTest51700
LeafDrupal\breakpoint\Tests\BreakpointAPITest600
LeafDrupal\breakpoint\Tests\BreakpointCRUDTest2100
LeafDrupal\breakpoint\Tests\BreakpointGroupAPITest400
LeafDrupal\breakpoint\Tests\BreakpointGroupCRUDTest1200
LeafDrupal\breakpoint\Tests\BreakpointMediaQueryTest6300
LeafDrupal\breakpoint\Tests\BreakpointThemeTest2300
LeafDrupal\color\Tests\ColorTest8700
LeafDrupal\comment\Tests\CommentActionsTest3000
LeafDrupal\comment\Tests\CommentAnonymousTest16300
LeafDrupal\comment\Tests\CommentApprovalTest15200
LeafDrupal\comment\Tests\CommentBlockTest11800
LeafDrupal\comment\Tests\CommentContentRebuildTest3300
LeafDrupal\comment\Tests\CommentCSSTest50100
LeafDrupal\comment\Tests\CommentFieldsTest10700
LeafDrupal\comment\Tests\CommentInterfaceTest25100
LeafDrupal\comment\Tests\CommentLanguageTest7200
ExpandDrupal\comment\Tests\CommentLinksTest109300
MessageGroupFilenameLineFunctionStatus
Changed environment:array ( 'authenticated' => false, 'comment count' => false, 'form' => 'below', 'user_register' => 'visitors', 'contact' => 'optional', 'comments' => 'open', 'access comments' => 0, 'post comments' => 0, 'skip comment approval' => 1, 'edit own comments' => 0, )DebugCommentLinksTest.php194Drupal\comment\Tests\CommentLinksTest->setEnvironment()
Changed environment:array ( 'authenticated' => true, 'comment count' => false, 'form' => 'below', 'user_register' => 'visitors', 'contact' => 'optional', 'comments' => 'open', 'access comments' => 0, 'post comments' => 0, 'skip comment approval' => 1, 'edit own comments' => 0, )DebugCommentLinksTest.php194Drupal\comment\Tests\CommentLinksTest->setEnvironment()
Changed environment:array ( 'authenticated' => false, 'comment count' => true, 'form' => 'below', 'user_register' => 'visitors', 'contact' => 'optional', 'comments' => 'open', 'access comments' => 0, 'post comments' => 0, 'skip comment approval' => 1, 'edit own comments' => 0, )DebugCommentLinksTest.php194Drupal\comment\Tests\CommentLinksTest->setEnvironment()
Changed environment:array ( 'authenticated' => true, 'comment count' => true, 'form' => 'below', 'user_register' => 'visitors', 'contact' => 'optional', 'comments' => 'open', 'access comments' => 0, 'post comments' => 0, 'skip comment approval' => 1, 'edit own comments' => 0, )DebugCommentLinksTest.php194Drupal\comment\Tests\CommentLinksTest->setEnvironment()
Changed environment:array ( 'authenticated' => false, 'comment count' => false, 'form' => 'below', 'user_register' => 'visitors', 'contact' => 'optional', 'comments' => 'open', 'access comments' => 1, 'post comments' => 0, 'skip comment approval' => 1, 'edit own comments' => 0, )DebugCommentLinksTest.php194Drupal\comment\Tests\CommentLinksTest->setEnvironment()
Changed environment:array ( 'authenticated' => true, 'comment count' => false, 'form' => 'below', 'user_register' => 'visitors', 'contact' => 'optional', 'comments' => 'open', 'access comments' => 1, 'post comments' => 0, 'skip comment approval' => 1, 'edit own comments' => 0, )DebugCommentLinksTest.php194Drupal\comment\Tests\CommentLinksTest->setEnvironment()
Changed environment:array ( 'authenticated' => false, 'comment count' => true, 'form' => 'below', 'user_register' => 'visitors', 'contact' => 'optional', 'comments' => 'open', 'access comments' => 1, 'post comments' => 0, 'skip comment approval' => 1, 'edit own comments' => 0, )DebugCommentLinksTest.php194Drupal\comment\Tests\CommentLinksTest->setEnvironment()
Changed environment:array ( 'authenticated' => true, 'comment count' => true, 'form' => 'below', 'user_register' => 'visitors', 'contact' => 'optional', 'comments' => 'open', 'access comments' => 1, 'post comments' => 0, 'skip comment approval' => 1, 'edit own comments' => 0, )DebugCommentLinksTest.php194Drupal\comment\Tests\CommentLinksTest->setEnvironment()
Changed environment:array ( 'authenticated' => false, 'comment count' => false, 'form' => 'below', 'user_register' => 'visitors', 'contact' => 'optional', 'comments' => 'open', 'access comments' => 0, 'post comments' => 1, 'skip comment approval' => 1, 'edit own comments' => 0, )DebugCommentLinksTest.php194Drupal\comment\Tests\CommentLinksTest->setEnvironment()
Changed environment:array ( 'authenticated' => true, 'comment count' => false, 'form' => 'below', 'user_register' => 'visitors', 'contact' => 'optional', 'comments' => 'open', 'access comments' => 0, 'post comments' => 1, 'skip comment approval' => 1, 'edit own comments' => 0, )DebugCommentLinksTest.php194Drupal\comment\Tests\CommentLinksTest->setEnvironment()
Changed environment:array ( 'authenticated' => false, 'comment count' => true, 'form' => 'below', 'user_register' => 'visitors', 'contact' => 'optional', 'comments' => 'open', 'access comments' => 0, 'post comments' => 1, 'skip comment approval' => 1, 'edit own comments' => 0, )DebugCommentLinksTest.php194Drupal\comment\Tests\CommentLinksTest->setEnvironment()
Changed environment:array ( 'authenticated' => true, 'comment count' => true, 'form' => 'below', 'user_register' => 'visitors', 'contact' => 'optional', 'comments' => 'open', 'access comments' => 0, 'post comments' => 1, 'skip comment approval' => 1, 'edit own comments' => 0, )DebugCommentLinksTest.php194Drupal\comment\Tests\CommentLinksTest->setEnvironment()
Changed environment:array ( 'authenticated' => false, 'comment count' => false, 'form' => 'below', 'user_register' => 'visitors', 'contact' => 'optional', 'comments' => 'open', 'access comments' => 1, 'post comments' => 1, 'skip comment approval' => 1, 'edit own comments' => 0, )DebugCommentLinksTest.php194Drupal\comment\Tests\CommentLinksTest->setEnvironment()
Changed environment:array ( 'authenticated' => true, 'comment count' => false, 'form' => 'below', 'user_register' => 'visitors', 'contact' => 'optional', 'comments' => 'open', 'access comments' => 1, 'post comments' => 1, 'skip comment approval' => 1, 'edit own comments' => 0, )DebugCommentLinksTest.php194Drupal\comment\Tests\CommentLinksTest->setEnvironment()
Changed environment:array ( 'authenticated' => false, 'comment count' => true, 'form' => 'below', 'user_register' => 'visitors', 'contact' => 'optional', 'comments' => 'open', 'access comments' => 1, 'post comments' => 1, 'skip comment approval' => 1, 'edit own comments' => 0, )DebugCommentLinksTest.php194Drupal\comment\Tests\CommentLinksTest->setEnvironment()
Changed environment:array ( 'authenticated' => true, 'comment count' => true, 'form' => 'below', 'user_register' => 'visitors', 'contact' => 'optional', 'comments' => 'open', 'access comments' => 1, 'post comments' => 1, 'skip comment approval' => 1, 'edit own comments' => 0, )DebugCommentLinksTest.php194Drupal\comment\Tests\CommentLinksTest->setEnvironment()
Changed environment:array ( 'authenticated' => false, 'comment count' => false, 'form' => 'separate page', 'user_register' => 'visitors', 'contact' => 'optional', 'comments' => 'open', 'access comments' => 0, 'post comments' => 0, 'skip comment approval' => 1, 'edit own comments' => 0, )DebugCommentLinksTest.php194Drupal\comment\Tests\CommentLinksTest->setEnvironment()
Changed environment:array ( 'authenticated' => true, 'comment count' => false, 'form' => 'separate page', 'user_register' => 'visitors', 'contact' => 'optional', 'comments' => 'open', 'access comments' => 0, 'post comments' => 0, 'skip comment approval' => 1, 'edit own comments' => 0, )DebugCommentLinksTest.php194Drupal\comment\Tests\CommentLinksTest->setEnvironment()
Changed environment:array ( 'authenticated' => false, 'comment count' => true, 'form' => 'separate page', 'user_register' => 'visitors', 'contact' => 'optional', 'comments' => 'open', 'access comments' => 0, 'post comments' => 0, 'skip comment approval' => 1, 'edit own comments' => 0, )DebugCommentLinksTest.php194Drupal\comment\Tests\CommentLinksTest->setEnvironment()
Changed environment:array ( 'authenticated' => true, 'comment count' => true, 'form' => 'separate page', 'user_register' => 'visitors', 'contact' => 'optional', 'comments' => 'open', 'access comments' => 0, 'post comments' => 0, 'skip comment approval' => 1, 'edit own comments' => 0, )DebugCommentLinksTest.php194Drupal\comment\Tests\CommentLinksTest->setEnvironment()
Changed environment:array ( 'authenticated' => false, 'comment count' => false, 'form' => 'separate page', 'user_register' => 'visitors', 'contact' => 'optional', 'comments' => 'open', 'access comments' => 1, 'post comments' => 0, 'skip comment approval' => 1, 'edit own comments' => 0, )DebugCommentLinksTest.php194Drupal\comment\Tests\CommentLinksTest->setEnvironment()
Changed environment:array ( 'authenticated' => true, 'comment count' => false, 'form' => 'separate page', 'user_register' => 'visitors', 'contact' => 'optional', 'comments' => 'open', 'access comments' => 1, 'post comments' => 0, 'skip comment approval' => 1, 'edit own comments' => 0, )DebugCommentLinksTest.php194Drupal\comment\Tests\CommentLinksTest->setEnvironment()
Changed environment:array ( 'authenticated' => false, 'comment count' => true, 'form' => 'separate page', 'user_register' => 'visitors', 'contact' => 'optional', 'comments' => 'open', 'access comments' => 1, 'post comments' => 0, 'skip comment approval' => 1, 'edit own comments' => 0, )DebugCommentLinksTest.php194Drupal\comment\Tests\CommentLinksTest->setEnvironment()
Changed environment:array ( 'authenticated' => true, 'comment count' => true, 'form' => 'separate page', 'user_register' => 'visitors', 'contact' => 'optional', 'comments' => 'open', 'access comments' => 1, 'post comments' => 0, 'skip comment approval' => 1, 'edit own comments' => 0, )DebugCommentLinksTest.php194Drupal\comment\Tests\CommentLinksTest->setEnvironment()
Changed environment:array ( 'authenticated' => false, 'comment count' => false, 'form' => 'separate page', 'user_register' => 'visitors', 'contact' => 'optional', 'comments' => 'open', 'access comments' => 0, 'post comments' => 1, 'skip comment approval' => 1, 'edit own comments' => 0, )DebugCommentLinksTest.php194Drupal\comment\Tests\CommentLinksTest->setEnvironment()
Changed environment:array ( 'authenticated' => true, 'comment count' => false, 'form' => 'separate page', 'user_register' => 'visitors', 'contact' => 'optional', 'comments' => 'open', 'access comments' => 0, 'post comments' => 1, 'skip comment approval' => 1, 'edit own comments' => 0, )DebugCommentLinksTest.php194Drupal\comment\Tests\CommentLinksTest->setEnvironment()
Changed environment:array ( 'authenticated' => false, 'comment count' => true, 'form' => 'separate page', 'user_register' => 'visitors', 'contact' => 'optional', 'comments' => 'open', 'access comments' => 0, 'post comments' => 1, 'skip comment approval' => 1, 'edit own comments' => 0, )DebugCommentLinksTest.php194Drupal\comment\Tests\CommentLinksTest->setEnvironment()
Changed environment:array ( 'authenticated' => true, 'comment count' => true, 'form' => 'separate page', 'user_register' => 'visitors', 'contact' => 'optional', 'comments' => 'open', 'access comments' => 0, 'post comments' => 1, 'skip comment approval' => 1, 'edit own comments' => 0, )DebugCommentLinksTest.php194Drupal\comment\Tests\CommentLinksTest->setEnvironment()
Changed environment:array ( 'authenticated' => false, 'comment count' => false, 'form' => 'separate page', 'user_register' => 'visitors', 'contact' => 'optional', 'comments' => 'open', 'access comments' => 1, 'post comments' => 1, 'skip comment approval' => 1, 'edit own comments' => 0, )DebugCommentLinksTest.php194Drupal\comment\Tests\CommentLinksTest->setEnvironment()
Changed environment:array ( 'authenticated' => true, 'comment count' => false, 'form' => 'separate page', 'user_register' => 'visitors', 'contact' => 'optional', 'comments' => 'open', 'access comments' => 1, 'post comments' => 1, 'skip comment approval' => 1, 'edit own comments' => 0, )DebugCommentLinksTest.php194Drupal\comment\Tests\CommentLinksTest->setEnvironment()
Changed environment:array ( 'authenticated' => false, 'comment count' => true, 'form' => 'separate page', 'user_register' => 'visitors', 'contact' => 'optional', 'comments' => 'open', 'access comments' => 1, 'post comments' => 1, 'skip comment approval' => 1, 'edit own comments' => 0, )DebugCommentLinksTest.php194Drupal\comment\Tests\CommentLinksTest->setEnvironment()
Changed environment:array ( 'authenticated' => true, 'comment count' => true, 'form' => 'separate page', 'user_register' => 'visitors', 'contact' => 'optional', 'comments' => 'open', 'access comments' => 1, 'post comments' => 1, 'skip comment approval' => 1, 'edit own comments' => 0, )DebugCommentLinksTest.php194Drupal\comment\Tests\CommentLinksTest->setEnvironment()
Changed environment:array ( 'authenticated' => false, 'comment count' => false, 'form' => 'below', 'user_register' => 'admin_only', 'contact' => 'optional', 'comments' => 'open', 'access comments' => 0, 'post comments' => 0, 'skip comment approval' => 1, 'edit own comments' => 0, )DebugCommentLinksTest.php194Drupal\comment\Tests\CommentLinksTest->setEnvironment()
Changed environment:array ( 'authenticated' => true, 'comment count' => false, 'form' => 'below', 'user_register' => 'admin_only', 'contact' => 'optional', 'comments' => 'open', 'access comments' => 0, 'post comments' => 0, 'skip comment approval' => 1, 'edit own comments' => 0, )DebugCommentLinksTest.php194Drupal\comment\Tests\CommentLinksTest->setEnvironment()
Changed environment:array ( 'authenticated' => false, 'comment count' => true, 'form' => 'below', 'user_register' => 'admin_only', 'contact' => 'optional', 'comments' => 'open', 'access comments' => 0, 'post comments' => 0, 'skip comment approval' => 1, 'edit own comments' => 0, )DebugCommentLinksTest.php194Drupal\comment\Tests\CommentLinksTest->setEnvironment()
Changed environment:array ( 'authenticated' => true, 'comment count' => true, 'form' => 'below', 'user_register' => 'admin_only', 'contact' => 'optional', 'comments' => 'open', 'access comments' => 0, 'post comments' => 0, 'skip comment approval' => 1, 'edit own comments' => 0, )DebugCommentLinksTest.php194Drupal\comment\Tests\CommentLinksTest->setEnvironment()
Changed environment:array ( 'authenticated' => false, 'comment count' => false, 'form' => 'below', 'user_register' => 'admin_only', 'contact' => 'optional', 'comments' => 'open', 'access comments' => 1, 'post comments' => 0, 'skip comment approval' => 1, 'edit own comments' => 0, )DebugCommentLinksTest.php194Drupal\comment\Tests\CommentLinksTest->setEnvironment()
Changed environment:array ( 'authenticated' => true, 'comment count' => false, 'form' => 'below', 'user_register' => 'admin_only', 'contact' => 'optional', 'comments' => 'open', 'access comments' => 1, 'post comments' => 0, 'skip comment approval' => 1, 'edit own comments' => 0, )DebugCommentLinksTest.php194Drupal\comment\Tests\CommentLinksTest->setEnvironment()
Changed environment:array ( 'authenticated' => false, 'comment count' => true, 'form' => 'below', 'user_register' => 'admin_only', 'contact' => 'optional', 'comments' => 'open', 'access comments' => 1, 'post comments' => 0, 'skip comment approval' => 1, 'edit own comments' => 0, )DebugCommentLinksTest.php194Drupal\comment\Tests\CommentLinksTest->setEnvironment()
Changed environment:array ( 'authenticated' => true, 'comment count' => true, 'form' => 'below', 'user_register' => 'admin_only', 'contact' => 'optional', 'comments' => 'open', 'access comments' => 1, 'post comments' => 0, 'skip comment approval' => 1, 'edit own comments' => 0, )DebugCommentLinksTest.php194Drupal\comment\Tests\CommentLinksTest->setEnvironment()
Changed environment:array ( 'authenticated' => false, 'comment count' => false, 'form' => 'below', 'user_register' => 'admin_only', 'contact' => 'optional', 'comments' => 'open', 'access comments' => 0, 'post comments' => 1, 'skip comment approval' => 1, 'edit own comments' => 0, )DebugCommentLinksTest.php194Drupal\comment\Tests\CommentLinksTest->setEnvironment()
Changed environment:array ( 'authenticated' => true, 'comment count' => false, 'form' => 'below', 'user_register' => 'admin_only', 'contact' => 'optional', 'comments' => 'open', 'access comments' => 0, 'post comments' => 1, 'skip comment approval' => 1, 'edit own comments' => 0, )DebugCommentLinksTest.php194Drupal\comment\Tests\CommentLinksTest->setEnvironment()
Changed environment:array ( 'authenticated' => false, 'comment count' => true, 'form' => 'below', 'user_register' => 'admin_only', 'contact' => 'optional', 'comments' => 'open', 'access comments' => 0, 'post comments' => 1, 'skip comment approval' => 1, 'edit own comments' => 0, )DebugCommentLinksTest.php194Drupal\comment\Tests\CommentLinksTest->setEnvironment()
Changed environment:array ( 'authenticated' => true, 'comment count' => true, 'form' => 'below', 'user_register' => 'admin_only', 'contact' => 'optional', 'comments' => 'open', 'access comments' => 0, 'post comments' => 1, 'skip comment approval' => 1, 'edit own comments' => 0, )DebugCommentLinksTest.php194Drupal\comment\Tests\CommentLinksTest->setEnvironment()
Changed environment:array ( 'authenticated' => false, 'comment count' => false, 'form' => 'below', 'user_register' => 'admin_only', 'contact' => 'optional', 'comments' => 'open', 'access comments' => 1, 'post comments' => 1, 'skip comment approval' => 1, 'edit own comments' => 0, )DebugCommentLinksTest.php194Drupal\comment\Tests\CommentLinksTest->setEnvironment()
Changed environment:array ( 'authenticated' => true, 'comment count' => false, 'form' => 'below', 'user_register' => 'admin_only', 'contact' => 'optional', 'comments' => 'open', 'access comments' => 1, 'post comments' => 1, 'skip comment approval' => 1, 'edit own comments' => 0, )DebugCommentLinksTest.php194Drupal\comment\Tests\CommentLinksTest->setEnvironment()
Changed environment:array ( 'authenticated' => false, 'comment count' => true, 'form' => 'below', 'user_register' => 'admin_only', 'contact' => 'optional', 'comments' => 'open', 'access comments' => 1, 'post comments' => 1, 'skip comment approval' => 1, 'edit own comments' => 0, )DebugCommentLinksTest.php194Drupal\comment\Tests\CommentLinksTest->setEnvironment()
Changed environment:array ( 'authenticated' => true, 'comment count' => true, 'form' => 'below', 'user_register' => 'admin_only', 'contact' => 'optional', 'comments' => 'open', 'access comments' => 1, 'post comments' => 1, 'skip comment approval' => 1, 'edit own comments' => 0, )DebugCommentLinksTest.php194Drupal\comment\Tests\CommentLinksTest->setEnvironment()
Changed environment:array ( 'authenticated' => false, 'comment count' => false, 'form' => 'separate page', 'user_register' => 'admin_only', 'contact' => 'optional', 'comments' => 'open', 'access comments' => 0, 'post comments' => 0, 'skip comment approval' => 1, 'edit own comments' => 0, )DebugCommentLinksTest.php194Drupal\comment\Tests\CommentLinksTest->setEnvironment()
Changed environment:array ( 'authenticated' => true, 'comment count' => false, 'form' => 'separate page', 'user_register' => 'admin_only', 'contact' => 'optional', 'comments' => 'open', 'access comments' => 0, 'post comments' => 0, 'skip comment approval' => 1, 'edit own comments' => 0, )DebugCommentLinksTest.php194Drupal\comment\Tests\CommentLinksTest->setEnvironment()
Changed environment:array ( 'authenticated' => false, 'comment count' => true, 'form' => 'separate page', 'user_register' => 'admin_only', 'contact' => 'optional', 'comments' => 'open', 'access comments' => 0, 'post comments' => 0, 'skip comment approval' => 1, 'edit own comments' => 0, )DebugCommentLinksTest.php194Drupal\comment\Tests\CommentLinksTest->setEnvironment()
Changed environment:array ( 'authenticated' => true, 'comment count' => true, 'form' => 'separate page', 'user_register' => 'admin_only', 'contact' => 'optional', 'comments' => 'open', 'access comments' => 0, 'post comments' => 0, 'skip comment approval' => 1, 'edit own comments' => 0, )DebugCommentLinksTest.php194Drupal\comment\Tests\CommentLinksTest->setEnvironment()
Changed environment:array ( 'authenticated' => false, 'comment count' => false, 'form' => 'separate page', 'user_register' => 'admin_only', 'contact' => 'optional', 'comments' => 'open', 'access comments' => 1, 'post comments' => 0, 'skip comment approval' => 1, 'edit own comments' => 0, )DebugCommentLinksTest.php194Drupal\comment\Tests\CommentLinksTest->setEnvironment()
Changed environment:array ( 'authenticated' => true, 'comment count' => false, 'form' => 'separate page', 'user_register' => 'admin_only', 'contact' => 'optional', 'comments' => 'open', 'access comments' => 1, 'post comments' => 0, 'skip comment approval' => 1, 'edit own comments' => 0, )DebugCommentLinksTest.php194Drupal\comment\Tests\CommentLinksTest->setEnvironment()
Changed environment:array ( 'authenticated' => false, 'comment count' => true, 'form' => 'separate page', 'user_register' => 'admin_only', 'contact' => 'optional', 'comments' => 'open', 'access comments' => 1, 'post comments' => 0, 'skip comment approval' => 1, 'edit own comments' => 0, )DebugCommentLinksTest.php194Drupal\comment\Tests\CommentLinksTest->setEnvironment()
Changed environment:array ( 'authenticated' => true, 'comment count' => true, 'form' => 'separate page', 'user_register' => 'admin_only', 'contact' => 'optional', 'comments' => 'open', 'access comments' => 1, 'post comments' => 0, 'skip comment approval' => 1, 'edit own comments' => 0, )DebugCommentLinksTest.php194Drupal\comment\Tests\CommentLinksTest->setEnvironment()
Changed environment:array ( 'authenticated' => false, 'comment count' => false, 'form' => 'separate page', 'user_register' => 'admin_only', 'contact' => 'optional', 'comments' => 'open', 'access comments' => 0, 'post comments' => 1, 'skip comment approval' => 1, 'edit own comments' => 0, )DebugCommentLinksTest.php194Drupal\comment\Tests\CommentLinksTest->setEnvironment()
Changed environment:array ( 'authenticated' => true, 'comment count' => false, 'form' => 'separate page', 'user_register' => 'admin_only', 'contact' => 'optional', 'comments' => 'open', 'access comments' => 0, 'post comments' => 1, 'skip comment approval' => 1, 'edit own comments' => 0, )DebugCommentLinksTest.php194Drupal\comment\Tests\CommentLinksTest->setEnvironment()
Changed environment:array ( 'authenticated' => false, 'comment count' => true, 'form' => 'separate page', 'user_register' => 'admin_only', 'contact' => 'optional', 'comments' => 'open', 'access comments' => 0, 'post comments' => 1, 'skip comment approval' => 1, 'edit own comments' => 0, )DebugCommentLinksTest.php194Drupal\comment\Tests\CommentLinksTest->setEnvironment()
Changed environment:array ( 'authenticated' => true, 'comment count' => true, 'form' => 'separate page', 'user_register' => 'admin_only', 'contact' => 'optional', 'comments' => 'open', 'access comments' => 0, 'post comments' => 1, 'skip comment approval' => 1, 'edit own comments' => 0, )DebugCommentLinksTest.php194Drupal\comment\Tests\CommentLinksTest->setEnvironment()
Changed environment:array ( 'authenticated' => false, 'comment count' => false, 'form' => 'separate page', 'user_register' => 'admin_only', 'contact' => 'optional', 'comments' => 'open', 'access comments' => 1, 'post comments' => 1, 'skip comment approval' => 1, 'edit own comments' => 0, )DebugCommentLinksTest.php194Drupal\comment\Tests\CommentLinksTest->setEnvironment()
Changed environment:array ( 'authenticated' => true, 'comment count' => false, 'form' => 'separate page', 'user_register' => 'admin_only', 'contact' => 'optional', 'comments' => 'open', 'access comments' => 1, 'post comments' => 1, 'skip comment approval' => 1, 'edit own comments' => 0, )DebugCommentLinksTest.php194Drupal\comment\Tests\CommentLinksTest->setEnvironment()
Changed environment:array ( 'authenticated' => false, 'comment count' => true, 'form' => 'separate page', 'user_register' => 'admin_only', 'contact' => 'optional', 'comments' => 'open', 'access comments' => 1, 'post comments' => 1, 'skip comment approval' => 1, 'edit own comments' => 0, )DebugCommentLinksTest.php194Drupal\comment\Tests\CommentLinksTest->setEnvironment()
Changed environment:array ( 'authenticated' => true, 'comment count' => true, 'form' => 'separate page', 'user_register' => 'admin_only', 'contact' => 'optional', 'comments' => 'open', 'access comments' => 1, 'post comments' => 1, 'skip comment approval' => 1, 'edit own comments' => 0, )DebugCommentLinksTest.php194Drupal\comment\Tests\CommentLinksTest->setEnvironment()
LeafDrupal\comment\Tests\CommentNewIndicatorTest4200
LeafDrupal\comment\Tests\CommentNodeAccessTest5700
LeafDrupal\comment\Tests\CommentNodeChangesTest2400
LeafDrupal\comment\Tests\CommentPagerTest21300
LeafDrupal\comment\Tests\CommentPreviewTest9800
LeafDrupal\comment\Tests\CommentRssTest2600
LeafDrupal\comment\Tests\CommentStatisticsTest9800
LeafDrupal\comment\Tests\CommentThreadingTest15900
LeafDrupal\comment\Tests\CommentTokenReplaceTest6600
LeafDrupal\comment\Tests\CommentTranslationUITest9600
LeafDrupal\comment\Tests\Views\ArgumentUserUIDTest900
LeafDrupal\comment\Tests\Views\DefaultViewRecentComments800
LeafDrupal\comment\Tests\Views\FilterUserUIDTest900
LeafDrupal\comment\Tests\Views\RowRssTest1200
LeafDrupal\comment\Tests\Views\WizardTest3300
LeafDrupal\config\Tests\ConfigCRUDTest2000
LeafDrupal\config\Tests\ConfigEntityListTest6800
LeafDrupal\config\Tests\ConfigEntityTest13700
LeafDrupal\config\Tests\ConfigEntityUnitTest100
LeafDrupal\config\Tests\ConfigFileContentTest3100
LeafDrupal\config\Tests\ConfigImportTest3800
LeafDrupal\config\Tests\ConfigImportUITest4600
LeafDrupal\config\Tests\ConfigInstallTest1100
LeafDrupal\config\Tests\ConfigOverrideTest1800
LeafDrupal\config\Tests\ConfigUpgradeTest1200
LeafDrupal\config\Tests\LocaleConfigOverride300
LeafDrupal\config\Tests\Storage\DatabaseStorageTest2100
LeafDrupal\config\Tests\Storage\FileStorageTest2300
LeafDrupal\contact\Tests\ContactAuthenticatedUserTest1300
LeafDrupal\contact\Tests\ContactPersonalTest16200
LeafDrupal\contact\Tests\ContactSitewideTest24500
LeafDrupal\contact\Tests\ContactUpgradePathTest4500
LeafDrupal\contextual\Tests\ContextualDynamicContextTest1600
LeafDrupal\dblog\Tests\DBLogTest37700
LeafDrupal\edit\Tests\EditorSelectionTest1000
LeafDrupal\email\Tests\EmailFieldTest1900
LeafDrupal\entity\Tests\EntityDisplayTest2900
LeafDrupal\entity_reference\Tests\EntityReferenceAdminTest3400
LeafDrupal\entity_reference\Tests\EntityReferenceAutoCreateTest1800
LeafDrupal\entity_reference\Tests\EntityReferenceItemTest1000
LeafDrupal\entity_reference\Tests\EntityReferenceSelectionAccessTest6900
LeafDrupal\entity_reference\Tests\EntityReferenceSelectionSortTest700
LeafDrupal\field\Tests\BulkDeleteTest7500
LeafDrupal\field\Tests\CrudTest7500
LeafDrupal\field\Tests\DisplayApiTest4600
LeafDrupal\field\Tests\EntityPropertiesTest400
LeafDrupal\field\Tests\FieldAccessTest2100
LeafDrupal\field\Tests\FieldAttachOtherTest10300
LeafDrupal\field\Tests\FieldAttachStorageTest9200
LeafDrupal\field\Tests\FieldInfoTest7000
LeafDrupal\field\Tests\FieldInstanceCrudTest2800
LeafDrupal\field\Tests\FormTest26500
LeafDrupal\field\Tests\TranslationTest9200
LeafDrupal\field\Tests\Views\ApiDataTest1500
LeafDrupal\field\Tests\Views\HandlerFieldFieldTest2400
LeafDrupal\field_sql_storage\Tests\FieldSqlStorageTest9200
LeafDrupal\field_ui\Tests\AlterTest2100
LeafDrupal\field_ui\Tests\ManageDisplayTest14900
ExpandDrupal\field_ui\Tests\ManageFieldsTest1210
MessageGroupFilenameLineFunctionStatus
The test did not complete due to a fatal error.Completion checkManageFieldsTest.php66Drupal\field_ui\Tests\ManageFieldsTest->testCRUDFields()
LeafDrupal\file\Tests\CopyTest11000
LeafDrupal\file\Tests\DeleteTest2400
LeafDrupal\file\Tests\DownloadTest4500
LeafDrupal\file\Tests\FileFieldDisplayTest5000
LeafDrupal\file\Tests\FileFieldPathTest2700
LeafDrupal\file\Tests\FileFieldRevisionTest6700
LeafDrupal\file\Tests\FileFieldRSSContentTest2300
LeafDrupal\file\Tests\FileFieldValidateTest11800
LeafDrupal\file\Tests\FileFieldWidgetTest29900
LeafDrupal\file\Tests\FileManagedFileElementTest26800
LeafDrupal\file\Tests\FilePrivateTest3700
LeafDrupal\file\Tests\FileTokenReplaceTest3500
LeafDrupal\file\Tests\LoadTest3400
LeafDrupal\file\Tests\MoveTest11000
LeafDrupal\file\Tests\RemoteFileSaveUploadTest27000
LeafDrupal\file\Tests\SaveDataTest9300
LeafDrupal\file\Tests\SaveTest1600
LeafDrupal\file\Tests\SaveUploadTest27000
LeafDrupal\file\Tests\SpaceUsedTest1200
LeafDrupal\file\Tests\UsageTest3400
LeafDrupal\file\Tests\ValidateTest1200
LeafDrupal\file\Tests\ValidatorTest2900
LeafDrupal\filter\Tests\FilterAdminTest17800
LeafDrupal\filter\Tests\FilterAPITest500
LeafDrupal\filter\Tests\FilterCrudTest23900
LeafDrupal\filter\Tests\FilterDefaultFormatTest3300
LeafDrupal\filter\Tests\FilterFormatAccessTest27200
LeafDrupal\filter\Tests\FilterHooksTest3300
LeafDrupal\filter\Tests\FilterHtmlImageSecureTest4600
LeafDrupal\filter\Tests\FilterNoFormatTest100
LeafDrupal\filter\Tests\FilterSecurityTest4000
LeafDrupal\filter\Tests\FilterSettingsTest1200
LeafDrupal\filter\Tests\FilterUnitTest21500
ExpandDrupal\forum\Tests\ForumBlockTest010
MessageGroupFilenameLineFunctionStatus
The test did not complete due to a fatal error.Completion checkForumBlockTest.php54Drupal\forum\Tests\ForumBlockTest->testNewForumTopicsBlock()
ExpandDrupal\forum\Tests\ForumIndexTest010
MessageGroupFilenameLineFunctionStatus
The test did not complete due to a fatal error.Completion checkForumIndexTest.php43Drupal\forum\Tests\ForumIndexTest->testForumIndexStatus()
ExpandDrupal\forum\Tests\ForumNodeAccessTest010
MessageGroupFilenameLineFunctionStatus
The test did not complete due to a fatal error.Completion checkForumNodeAccessTest.php48Drupal\forum\Tests\ForumNodeAccessTest->testForumNodeAccess()
ExpandDrupal\forum\Tests\ForumTest010
MessageGroupFilenameLineFunctionStatus
The test did not complete due to a fatal error.Completion checkForumTest.php103Drupal\forum\Tests\ForumTest->testEnableForumField()
LeafDrupal\help\Tests\HelpTest38400
LeafDrupal\help\Tests\NoHelpTest1200
LeafDrupal\image\Tests\ImageAdminStylesTest31100
LeafDrupal\image\Tests\ImageDimensionsScaleUnitTest1500
LeafDrupal\image\Tests\ImageDimensionsTest8700
LeafDrupal\image\Tests\ImageEffectsTest5700
LeafDrupal\image\Tests\ImageFieldDefaultImagesTest7900
LeafDrupal\image\Tests\ImageFieldDisplayTest18800
LeafDrupal\image\Tests\ImageFieldValidateTest5900
LeafDrupal\image\Tests\ImageStylesPathAndUrlTest7000
LeafDrupal\image\Tests\ImageThemeFunctionTest800
LeafDrupal\jsonld\Tests\NormalizeDenormalizeTest1400
LeafDrupal\jsonld\Tests\RdfSchemaSerializationTest400
LeafDrupal\jsonld\Tests\SupportsSerializationTest1000
LeafDrupal\language\Tests\LanguageBrowserDetectionUnitTest10700
LeafDrupal\language\Tests\LanguageConfigurationElementTest5400
LeafDrupal\language\Tests\LanguageConfigurationTest4600
LeafDrupal\language\Tests\LanguageCustomLanguageConfigurationTest3600
LeafDrupal\language\Tests\LanguageDependencyInjectionTest1700
LeafDrupal\language\Tests\LanguageListTest10000
LeafDrupal\language\Tests\LanguageNegotiationInfoTest4900
LeafDrupal\language\Tests\LanguagePathMonolingualTest3500
LeafDrupal\language\Tests\LanguageSwitchingTest2600
LeafDrupal\language\Tests\LanguageUILanguageNegotiationTest14900
LeafDrupal\language\Tests\LanguageUrlRewritingTest4400
LeafDrupal\language\Tests\Views\ArgumentLanguageTest200
LeafDrupal\language\Tests\Views\FieldLanguageTest200
LeafDrupal\language\Tests\Views\FilterLanguageTest200
LeafDrupal\layout\Tests\DisplayInternalLogicTest1100
LeafDrupal\layout\Tests\LayoutDerivativesTest2400
LeafDrupal\link\Tests\LinkFieldTest14000
LeafDrupal\link\Tests\LinkFieldUITest2100
LeafDrupal\locale\Tests\LocaleContentTest17000
LeafDrupal\locale\Tests\LocaleExportTest5700
LeafDrupal\locale\Tests\LocaleImportFunctionalTest16600
LeafDrupal\locale\Tests\LocaleInstallTest200
LeafDrupal\locale\Tests\LocaleJavascriptTranslation6600
LeafDrupal\locale\Tests\LocaleLibraryInfoAlterTest200
LeafDrupal\locale\Tests\LocalePathTest5100
LeafDrupal\locale\Tests\LocalePluralFormatTest16000
LeafDrupal\locale\Tests\LocaleStringTest2600
LeafDrupal\locale\Tests\LocaleTranslationTest32600
LeafDrupal\locale\Tests\LocaleUninstallFrenchTest3600
LeafDrupal\locale\Tests\LocaleUninstallTest3600
LeafDrupal\locale\Tests\LocaleUpdateInterfaceTest4600
LeafDrupal\locale\Tests\LocaleUpdateTest46300
LeafDrupal\menu\Tests\MenuNodeTest6100
LeafDrupal\menu\Tests\MenuTest316900
LeafDrupal\node\Tests\MultiStepNodeFormBasicOptionsTest1600
ExpandDrupal\node\Tests\NodeAccessBaseTableTest101220
MessageGroupFilenameLineFunctionStatus
Failed to set field field_tags[und] to publicOtherNodeAccessBaseTableTest.php87Drupal\node\Tests\NodeAccessBaseTableTest->testNodeAccessBasic()
Found the requested form fields at node/add/articleOtherNodeAccessBaseTableTest.php87Drupal\node\Tests\NodeAccessBaseTableTest->testNodeAccessBasic()
Failed to set field field_tags[und] to privateOtherNodeAccessBaseTableTest.php87Drupal\node\Tests\NodeAccessBaseTableTest->testNodeAccessBasic()
Found the requested form fields at node/add/articleOtherNodeAccessBaseTableTest.php87Drupal\node\Tests\NodeAccessBaseTableTest->testNodeAccessBasic()
The private status of the node was properly set in the node_access_test table.OtherNodeAccessBaseTableTest.php90Drupal\node\Tests\NodeAccessBaseTableTest->testNodeAccessBasic()
Failed to set field field_tags[und] to publicOtherNodeAccessBaseTableTest.php87Drupal\node\Tests\NodeAccessBaseTableTest->testNodeAccessBasic()
Found the requested form fields at node/add/articleOtherNodeAccessBaseTableTest.php87Drupal\node\Tests\NodeAccessBaseTableTest->testNodeAccessBasic()
Failed to set field field_tags[und] to privateOtherNodeAccessBaseTableTest.php87Drupal\node\Tests\NodeAccessBaseTableTest->testNodeAccessBasic()
Found the requested form fields at node/add/articleOtherNodeAccessBaseTableTest.php87Drupal\node\Tests\NodeAccessBaseTableTest->testNodeAccessBasic()
The private status of the node was properly set in the node_access_test table.OtherNodeAccessBaseTableTest.php90Drupal\node\Tests\NodeAccessBaseTableTest->testNodeAccessBasic()
Public tid was foundOtherNodeAccessBaseTableTest.php100Drupal\node\Tests\NodeAccessBaseTableTest->testNodeAccessBasic()
Private tid was foundOtherNodeAccessBaseTableTest.php101Drupal\node\Tests\NodeAccessBaseTableTest->testNodeAccessBasic()
A private node by user 2 is visible for user 2.BrowserNodeAccessBaseTableTest.php119Drupal\node\Tests\NodeAccessBaseTableTest->testNodeAccessBasic()
A private node by user 3 is not visible for user 2.BrowserNodeAccessBaseTableTest.php119Drupal\node\Tests\NodeAccessBaseTableTest->testNodeAccessBasic()
A private node by user 2 is not visible for user 2 on the private page.OtherNodeAccessBaseTableTest.php125Drupal\node\Tests\NodeAccessBaseTableTest->testNodeAccessBasic()
A private node by user 2 is not visible for user 3.BrowserNodeAccessBaseTableTest.php119Drupal\node\Tests\NodeAccessBaseTableTest->testNodeAccessBasic()
A private node by user 3 is visible for user 3.BrowserNodeAccessBaseTableTest.php119Drupal\node\Tests\NodeAccessBaseTableTest->testNodeAccessBasic()
A private node by user 3 is not visible for user 3 on the private page.OtherNodeAccessBaseTableTest.php125Drupal\node\Tests\NodeAccessBaseTableTest->testNodeAccessBasic()
HTTP response expected 200, actual 404BrowserNodeAccessBaseTableTest.php135Drupal\node\Tests\NodeAccessBaseTableTest->testNodeAccessBasic()
HTTP response expected 200, actual 404BrowserNodeAccessBaseTableTest.php135Drupal\node\Tests\NodeAccessBaseTableTest->testNodeAccessBasic()
A private node by user 2 is not visible for user 3 on the private page.OtherNodeAccessBaseTableTest.php141Drupal\node\Tests\NodeAccessBaseTableTest->testNodeAccessBasic()
A private node by user 3 is not visible for user 3 on the private page.OtherNodeAccessBaseTableTest.php141Drupal\node\Tests\NodeAccessBaseTableTest->testNodeAccessBasic()
LeafDrupal\node\Tests\NodeAccessFieldTest5000
LeafDrupal\node\Tests\NodeAccessLanguageTest2500
ExpandDrupal\node\Tests\NodeAccessPagerTest010
MessageGroupFilenameLineFunctionStatus
The test did not complete due to a fatal error.Completion checkNodeAccessPagerTest.php42Drupal\node\Tests\NodeAccessPagerTest->testCommentPager()
LeafDrupal\node\Tests\NodeAccessRebuildTest1900
LeafDrupal\node\Tests\NodeAccessRecordsTest2600
LeafDrupal\node\Tests\NodeAccessTest3400
LeafDrupal\node\Tests\NodeAdminTest14500
LeafDrupal\node\Tests\NodeBlockFunctionalTest8400
LeafDrupal\node\Tests\NodeBlockTest2100
LeafDrupal\node\Tests\NodeBuildContentTest400
LeafDrupal\node\Tests\NodeCreationTest4900
LeafDrupal\node\Tests\NodeEntityFieldQueryAlterTest3200
LeafDrupal\node\Tests\NodeEntityViewModeAlterTest2000
LeafDrupal\node\Tests\NodeFeedTest100
LeafDrupal\node\Tests\NodeFieldMultilingualTestCase6400
LeafDrupal\node\Tests\NodeLoadHooksTest700
LeafDrupal\node\Tests\NodeLoadMultipleTest2700
LeafDrupal\node\Tests\NodePostSettingsTest4000
LeafDrupal\node\Tests\NodeQueryAlterTest9900
LeafDrupal\node\Tests\NodeRevisionPermissionsTest3800
LeafDrupal\node\Tests\NodeRevisionsTest6400
LeafDrupal\node\Tests\NodeRSSContentTest2100
LeafDrupal\node\Tests\NodeSaveTest7100
LeafDrupal\node\Tests\NodeTitleTest2300
LeafDrupal\node\Tests\NodeTitleXSSTest2300
LeafDrupal\node\Tests\NodeTokenReplaceTest4000
LeafDrupal\node\Tests\NodeTranslationUITest16400
LeafDrupal\node\Tests\NodeTypeInitialLanguageTest10900
LeafDrupal\node\Tests\NodeTypePersistenceTest9400
LeafDrupal\node\Tests\NodeTypeTest13600
LeafDrupal\node\Tests\PageEditTest9700
LeafDrupal\node\Tests\PagePreviewTest4100
LeafDrupal\node\Tests\PageViewTest3400
LeafDrupal\node\Tests\SummaryLengthTest1200
LeafDrupal\node\Tests\Views\FieldTypeTest200
LeafDrupal\node\Tests\Views\FilterUidRevisionTest400
LeafDrupal\node\Tests\Views\RevisionRelationships300
LeafDrupal\node\Tests\Views\StatusExtraTest6800
LeafDrupal\number\Tests\NumberFieldTest8800
LeafDrupal\openid\Tests\OpenIDFunctionalTest30600
LeafDrupal\openid\Tests\OpenIDRegistrationTest13400
LeafDrupal\openid\Tests\OpenIDTest4500
LeafDrupal\openid\Tests\Upgrade\OpenIDAuthmapUpgradePathTest2500
LeafDrupal\options\Tests\OptionsDynamicValuesValidationTest900
LeafDrupal\options\Tests\OptionsFieldTest1600
LeafDrupal\options\Tests\OptionsFieldUITest20700
LeafDrupal\options\Tests\OptionsSelectDynamicValuesTest1600
LeafDrupal\options\Tests\OptionsWidgetsTest26100
LeafDrupal\path\Tests\PathAliasTest13800
LeafDrupal\path\Tests\PathLanguageTest7500
LeafDrupal\path\Tests\PathLanguageUiTest9000
LeafDrupal\path\Tests\PathTaxonomyTermTest3700
LeafDrupal\php\Tests\PhpAccessTest3800
LeafDrupal\php\Tests\PhpFilterTest4200
LeafDrupal\picture\Tests\PictureAdminUITest5400
LeafDrupal\picture\Tests\PictureFieldDisplayTest11500
LeafDrupal\poll\Tests\PollBlockTest17200
LeafDrupal\poll\Tests\PollCreateTest26900
LeafDrupal\poll\Tests\PollDeleteChoiceTest5400
LeafDrupal\poll\Tests\PollExpirationTest5200
LeafDrupal\poll\Tests\PollJsAddChoiceTest1600
LeafDrupal\poll\Tests\PollTokenReplaceTest12500
LeafDrupal\poll\Tests\PollTranslateTest7300
LeafDrupal\poll\Tests\PollVoteCheckHostnameTest14000
LeafDrupal\poll\Tests\PollVoteTest14600
LeafDrupal\rdf\Tests\CommentAttributesTest20300
LeafDrupal\rdf\Tests\CrudTest1000
LeafDrupal\rdf\Tests\GetNamespacesTest700
LeafDrupal\rdf\Tests\GetRdfNamespacesTest500
LeafDrupal\rdf\Tests\MappingDefinitionTest5900
LeafDrupal\rdf\Tests\MappingHookTest600
ExpandDrupal\rdf\Tests\RdfaMarkupTest2640
MessageGroupFilenameLineFunctionStatus
Failed to set field field_tags[und] to ocfY3Zzi, o3JqKXprOtherRdfaMarkupTest.php174Drupal\rdf\Tests\RdfaMarkupTest->testAttributesInMarkupFile()
Found the requested form fields at node/1/editOtherRdfaMarkupTest.php174Drupal\rdf\Tests\RdfaMarkupTest->testAttributesInMarkupFile()
Property dc:subject is present for the tag1 field item.OtherRdfaMarkupTest.php181Drupal\rdf\Tests\RdfaMarkupTest->testAttributesInMarkupFile()
Property dc:subject is present for the tag2 field item.OtherRdfaMarkupTest.php186Drupal\rdf\Tests\RdfaMarkupTest->testAttributesInMarkupFile()
LeafDrupal\rdf\Tests\RdfMappingEventTest300
LeafDrupal\rdf\Tests\SiteSchemaTest300
LeafDrupal\rdf\Tests\TrackerAttributesTest3300
LeafDrupal\rest\Tests\CreateTest2900
LeafDrupal\rest\Tests\DBLogTest1800
LeafDrupal\rest\Tests\DeleteTest7900
LeafDrupal\rest\Tests\ReadTest3500
LeafDrupal\rest\Tests\UpdateTest6500
LeafDrupal\search\Tests\SearchAdvancedSearchFormTest3400
LeafDrupal\search\Tests\SearchBlockTest6400
LeafDrupal\search\Tests\SearchCommentCountToggleTest3100
LeafDrupal\search\Tests\SearchCommentTest19300
LeafDrupal\search\Tests\SearchConfigSettingsFormTest13200
LeafDrupal\search\Tests\SearchEmbedFormTest3200
LeafDrupal\search\Tests\SearchExactTest2500
LeafDrupal\search\Tests\SearchExcerptTest1800
LeafDrupal\search\Tests\SearchExpressionInsertExtractTest2400
LeafDrupal\search\Tests\SearchKeywordsConditionsTest2800
LeafDrupal\search\Tests\SearchLanguageTest4100
LeafDrupal\search\Tests\SearchMatchTest14700
LeafDrupal\search\Tests\SearchMultilingualEntityTest1000
LeafDrupal\search\Tests\SearchNodeAccessTest1600
LeafDrupal\search\Tests\SearchNumberMatchingTest29500
LeafDrupal\search\Tests\SearchNumbersTest17500
LeafDrupal\search\Tests\SearchPageOverrideTest1500
LeafDrupal\search\Tests\SearchPageTextTest3700
LeafDrupal\search\Tests\SearchPreprocessLangcodeTest3900
LeafDrupal\search\Tests\SearchRankingTest5900
LeafDrupal\search\Tests\SearchSimplifyTest65700
LeafDrupal\search\Tests\SearchTokenizerTest800
LeafDrupal\shortcut\Tests\ShortcutLinksTest14800
LeafDrupal\shortcut\Tests\ShortcutSetsTest23400
LeafDrupal\simpletest\Tests\BrokenSetUpTest2100
LeafDrupal\simpletest\Tests\BrowserTest1600
LeafDrupal\simpletest\Tests\DrupalUnitTestBaseTest3000
LeafDrupal\simpletest\Tests\FolderTest200
LeafDrupal\simpletest\Tests\InstallationProfileModuleTestsTest1900
LeafDrupal\simpletest\Tests\MailCaptureTest1200
LeafDrupal\simpletest\Tests\MissingCheckedRequirementsTest1900
LeafDrupal\simpletest\Tests\OtherInstallationProfileModuleTestsTest1200
LeafDrupal\simpletest\Tests\SimpleTestTest11400
LeafDrupal\standard\Tests\StandardTest700
LeafDrupal\statistics\Tests\StatisticsAdminTest11000
LeafDrupal\statistics\Tests\StatisticsBlockVisitorsTest4600
LeafDrupal\statistics\Tests\StatisticsLoggingTest3500
LeafDrupal\statistics\Tests\StatisticsReportsTest9200
LeafDrupal\statistics\Tests\StatisticsTokenReplaceTest3000
LeafDrupal\syslog\Tests\SyslogTest1700
LeafDrupal\system\Tests\Ajax\AjaxCommandsUnitTest1600
LeafDrupal\system\Tests\Ajax\CommandsTest7300
LeafDrupal\system\Tests\Ajax\DialogTest300
LeafDrupal\system\Tests\Ajax\ElementValidationTest700
LeafDrupal\system\Tests\Ajax\FormValuesTest2900
LeafDrupal\system\Tests\Ajax\FrameworkTest3400
LeafDrupal\system\Tests\Ajax\MultiFormTest3600
LeafDrupal\system\Tests\Batch\PageTest1600
LeafDrupal\system\Tests\Batch\PercentagesUnitTest1800
LeafDrupal\system\Tests\Batch\ProcessingTest16100
LeafDrupal\system\Tests\Bootstrap\GetFilenameUnitTest600
LeafDrupal\system\Tests\Bootstrap\HookBootExitTest1900
LeafDrupal\system\Tests\Bootstrap\IpAddressTest1100
LeafDrupal\system\Tests\Bootstrap\MiscUnitTest400
LeafDrupal\system\Tests\Bootstrap\OverrideServerVariablesUnitTest600
LeafDrupal\system\Tests\Bootstrap\PageCacheTest7900
LeafDrupal\system\Tests\Bootstrap\ResettableStaticUnitTest500
LeafDrupal\system\Tests\Bootstrap\TimerUnitTest500
LeafDrupal\system\Tests\Bootstrap\VariableTest900
LeafDrupal\system\Tests\Bundle\BundleTest900
LeafDrupal\system\Tests\Cache\BackendChainImplementationUnitTest4800
LeafDrupal\system\Tests\Cache\BackendChainUnitTest12600
LeafDrupal\system\Tests\Cache\ClearTest900
LeafDrupal\system\Tests\Cache\DatabaseBackendUnitTest12600
LeafDrupal\system\Tests\Cache\InstallTest1500
LeafDrupal\system\Tests\Cache\MemoryBackendUnitTest12600
LeafDrupal\system\Tests\Cache\NullBackendTest200
LeafDrupal\system\Tests\Common\AddFeedTest700
LeafDrupal\system\Tests\Common\AlterTest700
LeafDrupal\system\Tests\Common\AttributesUnitTest700
LeafDrupal\system\Tests\Common\AutocompleteTagsUnitTest800
LeafDrupal\system\Tests\Common\CascadingStylesheetsTest3600
LeafDrupal\system\Tests\Common\CascadingStylesheetsUnitTest1200
LeafDrupal\system\Tests\Common\ColorTest8500
LeafDrupal\system\Tests\Common\FormatDateTest7300
LeafDrupal\system\Tests\Common\GotoTest2700
LeafDrupal\system\Tests\Common\HtmlIdentifierUnitTest1000
LeafDrupal\system\Tests\Common\HttpRequestTest3600
LeafDrupal\system\Tests\Common\InstallerLanguageTest800
LeafDrupal\system\Tests\Common\JavaScriptTest9600
LeafDrupal\system\Tests\Common\JsonUnitTest2100
LeafDrupal\system\Tests\Common\ParseInfoFileUnitTest300
LeafDrupal\system\Tests\Common\RegionContentTest1800
LeafDrupal\system\Tests\Common\RenderTest5400
LeafDrupal\system\Tests\Common\SchemaTest58800
LeafDrupal\system\Tests\Common\SimpleTestErrorCollectorTest1600
LeafDrupal\system\Tests\Common\SizeUnitTest3500
LeafDrupal\system\Tests\Common\SystemListingTest600
LeafDrupal\system\Tests\Common\TableSortExtenderUnitTest600
LeafDrupal\system\Tests\Common\UrlTest7000
LeafDrupal\system\Tests\Common\ValidNumberStepUnitTest2400
LeafDrupal\system\Tests\Common\ValidUrlUnitTest7900
LeafDrupal\system\Tests\Common\WriteRecordTest3400
LeafDrupal\system\Tests\Common\XssUnitTest1700
LeafDrupal\system\Tests\Database\AlterTest6200
LeafDrupal\system\Tests\Database\BasicSyntaxTest3000
LeafDrupal\system\Tests\Database\CaseSensitivityTest800
LeafDrupal\system\Tests\Database\ConnectionTest3800
LeafDrupal\system\Tests\Database\ConnectionUnitTest1200
LeafDrupal\system\Tests\Database\DeleteTruncateTest2300
LeafDrupal\system\Tests\Database\EmptyStatementTest400
LeafDrupal\system\Tests\Database\FetchTest8600
LeafDrupal\system\Tests\Database\InsertDefaultsTest2900
LeafDrupal\system\Tests\Database\InsertLobTest1500
LeafDrupal\system\Tests\Database\InsertTest8400
LeafDrupal\system\Tests\Database\InvalidDataTest800
LeafDrupal\system\Tests\Database\LoggingTest7300
LeafDrupal\system\Tests\Database\MergeTest13400
LeafDrupal\system\Tests\Database\NextIdTest400
LeafDrupal\system\Tests\Database\QueryTest1400
LeafDrupal\system\Tests\Database\RangeQueryTest1600
LeafDrupal\system\Tests\Database\RegressionTest6200
LeafDrupal\system\Tests\Database\SelectComplexTest22000
LeafDrupal\system\Tests\Database\SelectOrderedTest5800
LeafDrupal\system\Tests\Database\SelectPagerDefaultTest7100
LeafDrupal\system\Tests\Database\SelectSubqueryTest5100
LeafDrupal\system\Tests\Database\SelectTableSortDefaultTest5900
LeafDrupal\system\Tests\Database\SelectTest15300
LeafDrupal\system\Tests\Database\SerializeQueryTest700
LeafDrupal\system\Tests\Database\TaggingTest3200
LeafDrupal\system\Tests\Database\TemporaryQueryTest1100
LeafDrupal\system\Tests\Database\TransactionTest7400
LeafDrupal\system\Tests\Database\UpdateComplexTest6700
LeafDrupal\system\Tests\Database\UpdateLobTest1500
LeafDrupal\system\Tests\Database\UpdateTest5600
LeafDrupal\system\Tests\Datetime\DateTimePlusTest5400
LeafDrupal\system\Tests\Datetime\DrupalDateTimeTest1400
LeafDrupal\system\Tests\DrupalKernel\ContentNegotiationTest4000
LeafDrupal\system\Tests\DrupalKernel\DrupalKernelTest800
LeafDrupal\system\Tests\Entity\EntityAccessTest3400
LeafDrupal\system\Tests\Entity\EntityApiInfoTest600
LeafDrupal\system\Tests\Entity\EntityApiTest800
LeafDrupal\system\Tests\Entity\EntityCrudHookTest11400
LeafDrupal\system\Tests\Entity\EntityFieldTest14900
LeafDrupal\system\Tests\Entity\EntityFormTest2600
ExpandDrupal\system\Tests\Entity\EntityQueryRelationshipTest110
MessageGroupFilenameLineFunctionStatus
The test did not complete due to a fatal error.Completion checkEntityQueryRelationshipTest.php136Drupal\system\Tests\Entity\EntityQueryRelationshipTest->testQuery()
LeafDrupal\system\Tests\Entity\EntityQueryTest6200
LeafDrupal\system\Tests\Entity\EntityRevisionsTest3100
LeafDrupal\system\Tests\Entity\EntityTranslationFormTest3600
LeafDrupal\system\Tests\Entity\EntityTranslationTest5100
LeafDrupal\system\Tests\Entity\EntityUUIDTest2100
LeafDrupal\system\Tests\FileTransfer\FileTransferTest200
LeafDrupal\system\Tests\File\DirectoryTest2000
LeafDrupal\system\Tests\File\MimeTypeTest4200
LeafDrupal\system\Tests\File\NameMungingTest600
LeafDrupal\system\Tests\File\RemoteFileDirectoryTest2400
LeafDrupal\system\Tests\File\RemoteFileScanDirectoryTest2900
LeafDrupal\system\Tests\File\RemoteFileUnmanagedCopyTest3200
LeafDrupal\system\Tests\File\RemoteFileUnmanagedDeleteRecursiveTest2100
LeafDrupal\system\Tests\File\RemoteFileUnmanagedDeleteTest1000
LeafDrupal\system\Tests\File\RemoteFileUnmanagedMoveTest2300
LeafDrupal\system\Tests\File\RemoteFileUnmanagedSaveDataTest800
LeafDrupal\system\Tests\File\ScanDirectoryTest2900
LeafDrupal\system\Tests\File\StreamWrapperTest1900
LeafDrupal\system\Tests\File\UnmanagedCopyTest2900
LeafDrupal\system\Tests\File\UnmanagedDeleteRecursiveTest1700
LeafDrupal\system\Tests\File\UnmanagedDeleteTest700
LeafDrupal\system\Tests\File\UnmanagedMoveTest2000
LeafDrupal\system\Tests\File\UnmanagedSaveDataTest700
LeafDrupal\system\Tests\File\UrlRewritingTest1400
LeafDrupal\system\Tests\Form\AlterTest400
LeafDrupal\system\Tests\Form\ArbitraryRebuildTest1600
LeafDrupal\system\Tests\Form\CheckboxTest9700
LeafDrupal\system\Tests\Form\ElementsLabelsTest2000
LeafDrupal\system\Tests\Form\ElementsTableSelectTest6900
LeafDrupal\system\Tests\Form\ElementsVerticalTabsTest3900
LeafDrupal\system\Tests\Form\ElementTest4200
LeafDrupal\system\Tests\Form\EmailTest1700
LeafDrupal\system\Tests\Form\FileInclusionTest1100
LeafDrupal\system\Tests\Form\FormTest75600
LeafDrupal\system\Tests\Form\HTMLIdTest700
LeafDrupal\system\Tests\Form\LanguageSelectElementTest4400
LeafDrupal\system\Tests\Form\ProgrammaticTest2400
LeafDrupal\system\Tests\Form\RebuildTest5300
LeafDrupal\system\Tests\Form\RedirectTest3100
LeafDrupal\system\Tests\Form\StateValuesCleanAdvancedTest700
LeafDrupal\system\Tests\Form\StateValuesCleanTest1400
LeafDrupal\system\Tests\Form\StorageTest16000
LeafDrupal\system\Tests\Form\TriggeringElementTest5000
LeafDrupal\system\Tests\Form\UrlTest1700
LeafDrupal\system\Tests\Form\ValidationTest11200
LeafDrupal\system\Tests\Form\WrapperTest500
LeafDrupal\system\Tests\Graph\GraphUnitTest2800
LeafDrupal\system\Tests\Image\FileMoveTest400
LeafDrupal\system\Tests\Image\ToolkitGdTest20400
LeafDrupal\system\Tests\Image\ToolkitTest5300
LeafDrupal\system\Tests\KeyValueStore\DatabaseStorageExpirableTest6800
LeafDrupal\system\Tests\KeyValueStore\DatabaseStorageTest3600
LeafDrupal\system\Tests\KeyValueStore\GarbageCollectionTest200
LeafDrupal\system\Tests\KeyValueStore\MemoryStorageTest3600
LeafDrupal\system\Tests\Lock\LockFunctionalTest2900
LeafDrupal\system\Tests\Mail\HtmlToTextTest8600
LeafDrupal\system\Tests\Mail\MailTest400
LeafDrupal\system\Tests\Mail\WrapMailUnitTest200
ExpandDrupal\system\Tests\Menu\BreadcrumbTest3921217
MessageGroupFilenameLineFunctionStatus
Undefined index: taxonomy_autocompleteNoticeFieldOverview.php143Drupal\field_ui\FieldOverview->form()
Failed to set field field_tags[und] to Drupal,BreadcrumbsOtherBreadcrumbTest.php309Drupal\system\Tests\Menu\BreadcrumbTest->testBreadCrumbs()
Found the requested form fields at node/4/editOtherBreadcrumbTest.php309Drupal\system\Tests\Menu\BreadcrumbTest->testBreadCrumbs()
Trying to get property of non-objectDrupal\system\Tests\Menu\BreadcrumbTest->testBreadCrumbs() Drupal\simpletest\TestBase->run() simpletest_script_run_one_test('345', 'Drupal\system\Tests\Menu\BreadcrumbTest') NoticeBreadcrumbTest.php325Drupal\system\Tests\Menu\BreadcrumbTest->testBreadCrumbs()
Trying to get property of non-objectDrupal\system\Tests\Menu\BreadcrumbTest->testBreadCrumbs() Drupal\simpletest\TestBase->run() simpletest_script_run_one_test('345', 'Drupal\system\Tests\Menu\BreadcrumbTest') NoticeBreadcrumbTest.php325Drupal\system\Tests\Menu\BreadcrumbTest->testBreadCrumbs()
Trying to get property of non-objectDrupal\system\Tests\Menu\BreadcrumbTest->testBreadCrumbs() Drupal\simpletest\TestBase->run() simpletest_script_run_one_test('345', 'Drupal\system\Tests\Menu\BreadcrumbTest') NoticeBreadcrumbTest.php332Drupal\system\Tests\Menu\BreadcrumbTest->testBreadCrumbs()
Undefined index: mlidDrupal\system\Tests\Menu\BreadcrumbTest->testBreadCrumbs() Drupal\simpletest\TestBase->run() simpletest_script_run_one_test('345', 'Drupal\system\Tests\Menu\BreadcrumbTest') NoticeBreadcrumbTest.php341Drupal\system\Tests\Menu\BreadcrumbTest->testBreadCrumbs()
Trying to get property of non-objectDrupal\system\Tests\Menu\BreadcrumbTest->testBreadCrumbs() Drupal\simpletest\TestBase->run() simpletest_script_run_one_test('345', 'Drupal\system\Tests\Menu\BreadcrumbTest') NoticeBreadcrumbTest.php332Drupal\system\Tests\Menu\BreadcrumbTest->testBreadCrumbs()
Failed to set field parent to tools:OtherBreadcrumbTest.php335Drupal\system\Tests\Menu\BreadcrumbTest->testBreadCrumbs()
Found the requested form fields at admin/structure/menu/manage/tools/addOtherBreadcrumbTest.php335Drupal\system\Tests\Menu\BreadcrumbTest->testBreadCrumbs()
Undefined index: mlidDrupal\system\Tests\Menu\BreadcrumbTest->testBreadCrumbs() Drupal\simpletest\TestBase->run() simpletest_script_run_one_test('345', 'Drupal\system\Tests\Menu\BreadcrumbTest') NoticeBreadcrumbTest.php341Drupal\system\Tests\Menu\BreadcrumbTest->testBreadCrumbs()
Undefined index: link_titleDrupal\system\Tests\Menu\BreadcrumbTest->testBreadCrumbs() Drupal\simpletest\TestBase->run() simpletest_script_run_one_test('345', 'Drupal\system\Tests\Menu\BreadcrumbTest') NoticeBreadcrumbTest.php352Drupal\system\Tests\Menu\BreadcrumbTest->testBreadCrumbs()
Trying to get property of non-objectDrupal\system\Tests\Menu\BreadcrumbTest->testBreadCrumbs() Drupal\simpletest\TestBase->run() simpletest_script_run_one_test('345', 'Drupal\system\Tests\Menu\BreadcrumbTest') NoticeBreadcrumbTest.php354Drupal\system\Tests\Menu\BreadcrumbTest->testBreadCrumbs()
Breadcrumb Home found on http://drupaltestbot953-mysql.osuosl.test/checkout/taxonomy/term/.OtherBreadcrumbTest.php354Drupal\system\Tests\Menu\BreadcrumbTest->testBreadCrumbs()
SimpleXMLElement::xpath(): Invalid expressionSimpleXMLElement->xpath('//li[contains(@class, "active-trail")]/a[contains(@href, "/checkout/taxonomy/term/") and contains(@class, "active")and contains(text(), )]') Drupal\simpletest\WebTestBase->xpath('//li[contains(@class, :class-trail)]/a[contains(@href, :href) and contains(@class, :class-active)and contains(text(), :title)]', Array) Drupal\system\Tests\Menu\MenuTestBase->assertBreadcrumb('taxonomy/term/', Array, NULL, Array) Drupal\system\Tests\Menu\BreadcrumbTest->testBreadCrumbs() Drupal\simpletest\TestBase->run() simpletest_script_run_one_test('345', 'Drupal\system\Tests\Menu\BreadcrumbTest') WarningWebTestBase.php1708Drupal\simpletest\WebTestBase->xpath()
SimpleXMLElement::xpath(): xmlXPathEval: evaluation failedSimpleXMLElement->xpath('//li[contains(@class, "active-trail")]/a[contains(@href, "/checkout/taxonomy/term/") and contains(@class, "active")and contains(text(), )]') Drupal\simpletest\WebTestBase->xpath('//li[contains(@class, :class-trail)]/a[contains(@href, :href) and contains(@class, :class-active)and contains(text(), :title)]', Array) Drupal\system\Tests\Menu\MenuTestBase->assertBreadcrumb('taxonomy/term/', Array, NULL, Array) Drupal\system\Tests\Menu\BreadcrumbTest->testBreadCrumbs() Drupal\simpletest\TestBase->run() simpletest_script_run_one_test('345', 'Drupal\system\Tests\Menu\BreadcrumbTest') WarningWebTestBase.php1708Drupal\simpletest\WebTestBase->xpath()
Active link was found in menu tree, including active trail links .OtherBreadcrumbTest.php354Drupal\system\Tests\Menu\BreadcrumbTest->testBreadCrumbs()
Tagged node found.OtherBreadcrumbTest.php355Drupal\system\Tests\Menu\BreadcrumbTest->testBreadCrumbs()
Link to taxonomy/term/ appears only once.OtherBreadcrumbTest.php365Drupal\system\Tests\Menu\BreadcrumbTest->testBreadCrumbs()
Trying to get property of non-objectDrupal\system\Tests\Menu\BreadcrumbTest->testBreadCrumbs() Drupal\simpletest\TestBase->run() simpletest_script_run_one_test('345', 'Drupal\system\Tests\Menu\BreadcrumbTest') NoticeBreadcrumbTest.php370Drupal\system\Tests\Menu\BreadcrumbTest->testBreadCrumbs()
Undefined index: link_titleDrupal\system\Tests\Menu\BreadcrumbTest->testBreadCrumbs() Drupal\simpletest\TestBase->run() simpletest_script_run_one_test('345', 'Drupal\system\Tests\Menu\BreadcrumbTest') NoticeBreadcrumbTest.php352Drupal\system\Tests\Menu\BreadcrumbTest->testBreadCrumbs()
Trying to get property of non-objectDrupal\system\Tests\Menu\BreadcrumbTest->testBreadCrumbs() Drupal\simpletest\TestBase->run() simpletest_script_run_one_test('345', 'Drupal\system\Tests\Menu\BreadcrumbTest') NoticeBreadcrumbTest.php354Drupal\system\Tests\Menu\BreadcrumbTest->testBreadCrumbs()
Breadcrumb Home » found on http://drupaltestbot953-mysql.osuosl.test/checkout/taxonomy/term/.OtherBreadcrumbTest.php354Drupal\system\Tests\Menu\BreadcrumbTest->testBreadCrumbs()
SimpleXMLElement::xpath(): Invalid expressionSimpleXMLElement->xpath('//li[contains(@class, "active-trail")]/a[contains(@href, "/checkout/taxonomy/term/") and contains(@class, "active")and contains(text(), )]') Drupal\simpletest\WebTestBase->xpath('//li[contains(@class, :class-trail)]/a[contains(@href, :href) and contains(@class, :class-active)and contains(text(), :title)]', Array) Drupal\system\Tests\Menu\MenuTestBase->assertBreadcrumb('taxonomy/term/', Array, NULL, Array) Drupal\system\Tests\Menu\BreadcrumbTest->testBreadCrumbs() Drupal\simpletest\TestBase->run() simpletest_script_run_one_test('345', 'Drupal\system\Tests\Menu\BreadcrumbTest') WarningWebTestBase.php1708Drupal\simpletest\WebTestBase->xpath()
SimpleXMLElement::xpath(): xmlXPathEval: evaluation failedSimpleXMLElement->xpath('//li[contains(@class, "active-trail")]/a[contains(@href, "/checkout/taxonomy/term/") and contains(@class, "active")and contains(text(), )]') Drupal\simpletest\WebTestBase->xpath('//li[contains(@class, :class-trail)]/a[contains(@href, :href) and contains(@class, :class-active)and contains(text(), :title)]', Array) Drupal\system\Tests\Menu\MenuTestBase->assertBreadcrumb('taxonomy/term/', Array, NULL, Array) Drupal\system\Tests\Menu\BreadcrumbTest->testBreadCrumbs() Drupal\simpletest\TestBase->run() simpletest_script_run_one_test('345', 'Drupal\system\Tests\Menu\BreadcrumbTest') WarningWebTestBase.php1708Drupal\simpletest\WebTestBase->xpath()
Active link was found in menu tree, including active trail links .OtherBreadcrumbTest.php354Drupal\system\Tests\Menu\BreadcrumbTest->testBreadCrumbs()
Tagged node found.OtherBreadcrumbTest.php355Drupal\system\Tests\Menu\BreadcrumbTest->testBreadCrumbs()
Link to taxonomy/term/ appears only once.OtherBreadcrumbTest.php365Drupal\system\Tests\Menu\BreadcrumbTest->testBreadCrumbs()
Trying to get property of non-objectDrupal\system\Tests\Menu\BreadcrumbTest->testBreadCrumbs() Drupal\simpletest\TestBase->run() simpletest_script_run_one_test('345', 'Drupal\system\Tests\Menu\BreadcrumbTest') NoticeBreadcrumbTest.php370Drupal\system\Tests\Menu\BreadcrumbTest->testBreadCrumbs()
LeafDrupal\system\Tests\Menu\LinksTest5000
LeafDrupal\system\Tests\Menu\RebuildTest500
LeafDrupal\system\Tests\Menu\RouterTest22500
LeafDrupal\system\Tests\Menu\TrailTest6800
LeafDrupal\system\Tests\Menu\TreeDataUnitTest400
LeafDrupal\system\Tests\Menu\TreeOutputTest700
LeafDrupal\system\Tests\Module\ClassLoaderTest1000
ExpandDrupal\system\Tests\Module\DependencyTest15910
MessageGroupFilenameLineFunctionStatus
Value array ( 0 => 'module_test', ) is identical to value array ( 0 => 'comment', 1 => 'history', 2 => 'options', 3 => 'taxonomy', 4 => 'php', 5 => 'poll', 6 => 'forum', ).OtherDependencyTest.php161Drupal\system\Tests\Module\DependencyTest->testModuleEnableOrder()
ExpandDrupal\system\Tests\Module\EnableDisableTest1923120
MessageGroupFilenameLineFunctionStatus
Modules status has been updated.OtherEnableDisableTest.php98Drupal\system\Tests\Module\EnableDisableTest->testEnableDisable()
"hook_modules_installed fired for forum" foundOtherEnableDisableTest.php105Drupal\system\Tests\Module\EnableDisableTest->testEnableDisable()
"hook_modules_enabled fired for forum" foundOtherEnableDisableTest.php106Drupal\system\Tests\Module\EnableDisableTest->testEnableDisable()
watchdog table contains 0 rows for %module module enabled.OtherEnableDisableTest.php111Drupal\system\Tests\Module\EnableDisableTest->testEnableDisable()
"hook_modules_installed fired for history" foundOtherEnableDisableTest.php105Drupal\system\Tests\Module\EnableDisableTest->testEnableDisable()
"hook_modules_enabled fired for history" foundOtherEnableDisableTest.php106Drupal\system\Tests\Module\EnableDisableTest->testEnableDisable()
"hook_modules_installed fired for taxonomy" foundOtherEnableDisableTest.php105Drupal\system\Tests\Module\EnableDisableTest->testEnableDisable()
"hook_modules_enabled fired for taxonomy" foundOtherEnableDisableTest.php106Drupal\system\Tests\Module\EnableDisableTest->testEnableDisable()
"hook_modules_installed fired for options" foundOtherEnableDisableTest.php105Drupal\system\Tests\Module\EnableDisableTest->testEnableDisable()
"hook_modules_enabled fired for options" foundOtherEnableDisableTest.php106Drupal\system\Tests\Module\EnableDisableTest->testEnableDisable()
"hook_modules_installed fired for comment" foundOtherEnableDisableTest.php105Drupal\system\Tests\Module\EnableDisableTest->testEnableDisable()
"hook_modules_enabled fired for comment" foundOtherEnableDisableTest.php106Drupal\system\Tests\Module\EnableDisableTest->testEnableDisable()
LeafDrupal\system\Tests\Module\HookRequirementsTest1600
LeafDrupal\system\Tests\Module\InstallTest300
LeafDrupal\system\Tests\Module\ModuleApiTest7400
LeafDrupal\system\Tests\Module\ModuleEnable300
LeafDrupal\system\Tests\Module\RequiredTest1900
LeafDrupal\system\Tests\Module\UninstallTest200
LeafDrupal\system\Tests\Module\VersionTest5100
LeafDrupal\system\Tests\Pager\PagerTest12300
LeafDrupal\system\Tests\Path\AliasTest2700
LeafDrupal\system\Tests\Path\MatchPathTest4100
ExpandDrupal\system\Tests\Path\UrlAlterFunctionalTest010
MessageGroupFilenameLineFunctionStatus
The test did not complete due to a fatal error.Completion checkUrlAlterFunctionalTest.php35Drupal\system\Tests\Path\UrlAlterFunctionalTest->testUrlAlter()
LeafDrupal\system\Tests\PhpStorage\FileStorageTest1200
LeafDrupal\system\Tests\PhpStorage\MTimeProtectedFastFileStorageTest1900
LeafDrupal\system\Tests\PhpStorage\MTimeProtectedFileStorageTest1900
LeafDrupal\system\Tests\Plugin\AlterDecoratorTest300
LeafDrupal\system\Tests\Plugin\CacheDecoratorTest1400
LeafDrupal\system\Tests\Plugin\DerivativeTest900
LeafDrupal\system\Tests\Plugin\Discovery\AnnotatedClassDiscoveryTest700
LeafDrupal\system\Tests\Plugin\Discovery\StaticDiscoveryTest600
LeafDrupal\system\Tests\Plugin\FactoryTest900
LeafDrupal\system\Tests\Plugin\InspectionTest1000
LeafDrupal\system\Tests\Queue\QueueTest1400
LeafDrupal\system\Tests\Routing\ChainMatcherTest300
LeafDrupal\system\Tests\Routing\ControllerResolverTest100
LeafDrupal\system\Tests\Routing\FirstEntryFinalMatcherTest800
LeafDrupal\system\Tests\Routing\HttpMethodMatcherTest800
LeafDrupal\system\Tests\Routing\MatcherDumperTest800
LeafDrupal\system\Tests\Routing\MimeTypeMatcherTest1100
LeafDrupal\system\Tests\Routing\NestedMatcherTest100
LeafDrupal\system\Tests\Routing\PathMatcherTest2900
LeafDrupal\system\Tests\Routing\RouterPermissionTest1900
LeafDrupal\system\Tests\Routing\RouterTest3000
LeafDrupal\system\Tests\Routing\RouteTest600
LeafDrupal\system\Tests\Serialization\EntitySerializationTest1300
LeafDrupal\system\Tests\Serialization\SerializationTest200
LeafDrupal\system\Tests\Session\SessionHttpsTest8300
LeafDrupal\system\Tests\Session\SessionTest19000
LeafDrupal\system\Tests\System\AccessDeniedTest6800
LeafDrupal\system\Tests\System\AdminMetaTagTest300
LeafDrupal\system\Tests\System\AdminTest18100
LeafDrupal\system\Tests\System\CronRunTest5200
LeafDrupal\system\Tests\System\DateFormatsLanguageTest5600
LeafDrupal\system\Tests\System\DateTimeTest7600
LeafDrupal\system\Tests\System\DefaultMobileMetaTagsTest1200
LeafDrupal\system\Tests\System\ErrorHandlerTest4000
LeafDrupal\system\Tests\System\ExceptionControllerTest200
LeafDrupal\system\Tests\System\FloodTest1000
LeafDrupal\system\Tests\System\FrontPageTest3700
LeafDrupal\system\Tests\System\IndexPhpTest600
LeafDrupal\system\Tests\System\InfoAlterTest1000
LeafDrupal\system\Tests\System\InfoFileParserUnitTest900
LeafDrupal\system\Tests\System\MainContentFallbackTest6000
LeafDrupal\system\Tests\System\PageNotFoundTest1800
LeafDrupal\system\Tests\System\PageTitleFilteringTest4400
LeafDrupal\system\Tests\System\PasswordHashingTest1000
LeafDrupal\system\Tests\System\RetrieveFileTest700
LeafDrupal\system\Tests\System\ShutdownFunctionsTest500
LeafDrupal\system\Tests\System\SiteMaintenanceTest7700
LeafDrupal\system\Tests\System\SystemAuthorizeTest1600
LeafDrupal\system\Tests\System\ThemeTest24900
LeafDrupal\system\Tests\System\TokenReplaceTest4300
LeafDrupal\system\Tests\System\UnicodeUnitTest18200
ExpandDrupal\system\Tests\Theme\EntityFilteringThemeTest821
MessageGroupFilenameLineFunctionStatus
The test did not complete due to a fatal error.Completion checkEntityFilteringThemeTest.php122Drupal\system\Tests\Theme\EntityFilteringThemeTest->testThemedEntity()
The test did not complete due to a fatal error.Completion checkEntityFilteringThemeTest.php122Drupal\system\Tests\Theme\EntityFilteringThemeTest->testThemedEntity()
Undefined index: target_identity_reference_field_presave('node', Object, Array, Object, 'und', Array, NULL, NULL) _field_invoke('presave', 'node', Object) field_attach_presave('node', Object) Drupal\Core\Entity\DatabaseStorageController->invokeHook('presave', Object) Drupal\node\NodeStorageController->invokeHook('presave', Object) Drupal\Core\Entity\DatabaseStorageController->save(Object) Drupal\Core\Entity\Entity->save() Drupal\simpletest\WebTestBase->drupalCreateNode(Array) Drupal\system\Tests\Theme\EntityFilteringThemeTest->setUp() Drupal\simpletest\TestBase->run() simpletest_script_run_one_test('548', 'Drupal\system\Tests\Theme\EntityFilteringThemeTest') Noticeentity_reference.module126entity_reference_field_presave()
LeafDrupal\system\Tests\Theme\FastTest1200
LeafDrupal\system\Tests\Theme\FunctionsTest2500
LeafDrupal\system\Tests\Theme\HookInitTest500
LeafDrupal\system\Tests\Theme\HtmlTagUnitTest200
LeafDrupal\system\Tests\Theme\HtmlTplPhpAttributesTest500
LeafDrupal\system\Tests\Theme\RegistryTest600
LeafDrupal\system\Tests\Theme\TableTest600
LeafDrupal\system\Tests\Theme\ThemeInfoStylesTest1300
LeafDrupal\system\Tests\Theme\ThemeTest4800
LeafDrupal\system\Tests\Theme\ThemeTestTwig1000
LeafDrupal\system\Tests\Theme\TwigReferenceUnitTest1500
LeafDrupal\system\Tests\Transliteration\TransliterationTest2600
LeafDrupal\system\Tests\TypedData\TypedDataTest6100
LeafDrupal\system\Tests\Update\DependencyHookInvocationTest400
LeafDrupal\system\Tests\Update\DependencyMissingTest400
LeafDrupal\system\Tests\Update\DependencyOrderingTest500
LeafDrupal\system\Tests\Update\UpdateScriptTest20100
LeafDrupal\system\Tests\Upgrade\BareMinimalUpgradePathTest6500
LeafDrupal\system\Tests\Upgrade\BareStandardUpgradePathTest7000
LeafDrupal\system\Tests\Upgrade\BlockUpgradePathTest3600
LeafDrupal\system\Tests\Upgrade\DateUpgradePathTest5400
LeafDrupal\system\Tests\Upgrade\FieldUpgradePathTest3900
LeafDrupal\system\Tests\Upgrade\FilledMinimalUpgradePathTest6600
ExpandDrupal\system\Tests\Upgrade\FilledStandardUpgradePathTest8250
MessageGroupFilenameLineFunctionStatus
HTTP response expected 200, actual 500BrowserFilledStandardUpgradePathTest.php45Drupal\system\Tests\Upgrade\FilledStandardUpgradePathTest->testFilledStandardUpgrade()
"Tools" foundOtherFilledStandardUpgradePathTest.php48Drupal\system\Tests\Upgrade\FilledStandardUpgradePathTest->testFilledStandardUpgrade()
"My account" foundOtherFilledStandardUpgradePathTest.php51Drupal\system\Tests\Upgrade\FilledStandardUpgradePathTest->testFilledStandardUpgrade()
"Log out" foundOtherFilledStandardUpgradePathTest.php52Drupal\system\Tests\Upgrade\FilledStandardUpgradePathTest->testFilledStandardUpgrade()
Link with label Home found.OtherFilledStandardUpgradePathTest.php55Drupal\system\Tests\Upgrade\FilledStandardUpgradePathTest->testFilledStandardUpgrade()
LeafDrupal\system\Tests\Upgrade\ImageUpgradePathTest3400
LeafDrupal\system\Tests\Upgrade\LanguageUpgradePathTest16500
ExpandDrupal\system\Tests\Upgrade\ModulesDisabledUpgradePathTest3401
MessageGroupFilenameLineFunctionStatus
Drupal\field\FieldException: Attempt to create field name <em class="placeholder">taxonomy_forums</em> which already exists, although it is inactive. in field_create_field() (line 86 of /var/lib/drupaltestbot/sites/default/files/checkout/core/modules/field/field.crud.inc). field_create_field(Array) forum_enable() call_user_func_array('forum_enable', Array) module_invoke('forum', 'enable') module_enable(Array) Drupal\system\Tests\Upgrade\ModulesDisabledUpgradePathTest->testDisabledUpgrade() Drupal\simpletest\TestBase->run() simpletest_script_run_one_test('583', 'Drupal\system\Tests\Upgrade\ModulesDisabledUpgradePathTest') Uncaught exceptionfield.crud.inc86field_create_field()
LeafDrupal\system\Tests\Upgrade\StateSystemUpgradePathTest5400
LeafDrupal\system\Tests\Upgrade\SystemUpgradePathTest6500
LeafDrupal\system\Tests\Upgrade\UserPictureUpgradePathTest4700
LeafDrupal\system\Tests\Upgrade\UserRoleUpgradePathTest5100
LeafDrupal\system\Tests\Upgrade\UuidUpgradePathTest3300
LeafDrupal\system\Tests\Uuid\UuidUnitTest700
LeafDrupal\taxonomy\Tests\EfqTest1400
LeafDrupal\taxonomy\Tests\HooksTest2300
ExpandDrupal\taxonomy\Tests\LegacyTest2462
MessageGroupFilenameLineFunctionStatus
Failed to set field field_tags[und] to bkR1ItzmOtherLegacyTest.php42Drupal\taxonomy\Tests\LegacyTest->testTaxonomyLegacyNode()
Found the requested form fields at node/add/articleOtherLegacyTest.php42Drupal\taxonomy\Tests\LegacyTest->testTaxonomyLegacyNode()
Trying to get property of non-objectDrupal\taxonomy\Tests\LegacyTest->testTaxonomyLegacyNode() Drupal\simpletest\TestBase->run() simpletest_script_run_one_test('532', 'Drupal\taxonomy\Tests\LegacyTest') NoticeLegacyTest.php45Drupal\taxonomy\Tests\LegacyTest->testTaxonomyLegacyNode()
Legacy node was saved with the right date.OtherLegacyTest.php45Drupal\taxonomy\Tests\LegacyTest->testTaxonomyLegacyNode()
Failed to set field field_tags[und] to bkR1ItzmOtherLegacyTest.php42Drupal\taxonomy\Tests\LegacyTest->testTaxonomyLegacyNode()
Found the requested form fields at node/add/articleOtherLegacyTest.php42Drupal\taxonomy\Tests\LegacyTest->testTaxonomyLegacyNode()
Trying to get property of non-objectDrupal\taxonomy\Tests\LegacyTest->testTaxonomyLegacyNode() Drupal\simpletest\TestBase->run() simpletest_script_run_one_test('532', 'Drupal\taxonomy\Tests\LegacyTest') NoticeLegacyTest.php45Drupal\taxonomy\Tests\LegacyTest->testTaxonomyLegacyNode()
Legacy node was saved with the right date.OtherLegacyTest.php45Drupal\taxonomy\Tests\LegacyTest->testTaxonomyLegacyNode()
LeafDrupal\taxonomy\Tests\LoadMultipleTest1800
ExpandDrupal\taxonomy\Tests\RssTest1010
MessageGroupFilenameLineFunctionStatus
The test did not complete due to a fatal error.Completion checkRssTest.php77Drupal\taxonomy\Tests\RssTest->testTaxonomyRss()
ExpandDrupal\taxonomy\Tests\TermFieldMultipleVocabularyTest1010
MessageGroupFilenameLineFunctionStatus
The test did not complete due to a fatal error.Completion checkTermFieldMultipleVocabularyTest.php82Drupal\taxonomy\Tests\TermFieldMultipleVocabularyTest->testTaxonomyTermFieldMultipleVocabularies()
ExpandDrupal\taxonomy\Tests\TermFieldTest1010
MessageGroupFilenameLineFunctionStatus
The test did not complete due to a fatal error.Completion checkTermFieldTest.php80Drupal\taxonomy\Tests\TermFieldTest->testTaxonomyTermFieldValidation()
ExpandDrupal\taxonomy\Tests\TermIndexTest1510
MessageGroupFilenameLineFunctionStatus
The test did not complete due to a fatal error.Completion checkTermIndexTest.php105Drupal\taxonomy\Tests\TermIndexTest->testTaxonomyIndex()
LeafDrupal\taxonomy\Tests\TermLanguageTest10800
ExpandDrupal\taxonomy\Tests\TermTest2010
MessageGroupFilenameLineFunctionStatus
The test did not complete due to a fatal error.Completion checkTermTest.php67Drupal\taxonomy\Tests\TermTest->testTaxonomyTermHierarchy()
LeafDrupal\taxonomy\Tests\TermTranslationUITest16600
LeafDrupal\taxonomy\Tests\TermUnitTest2200
LeafDrupal\taxonomy\Tests\ThemeTest3800
ExpandDrupal\taxonomy\Tests\TokenReplaceTest2020
MessageGroupFilenameLineFunctionStatus
The test did not complete due to a fatal error.Completion checkTokenReplaceTest.php68Drupal\taxonomy\Tests\TokenReplaceTest->testTaxonomyTokenReplacement()
The test did not complete due to a fatal error.Completion checkTokenReplaceTest.php68Drupal\taxonomy\Tests\TokenReplaceTest->testTaxonomyTokenReplacement()
ExpandDrupal\taxonomy\Tests\Views\RelationshipNodeTermDataTest110
MessageGroupFilenameLineFunctionStatus
The test did not complete due to a fatal error.Completion checkRelationshipNodeTermDataTest.php30Drupal\taxonomy\Tests\Views\RelationshipNodeTermDataTest->testViewsHandlerRelationshipNodeTermData()
ExpandDrupal\taxonomy\Tests\Views\RelationshipRepresentativeNode110
MessageGroupFilenameLineFunctionStatus
The test did not complete due to a fatal error.Completion checkRelationshipRepresentativeNode.php33Drupal\taxonomy\Tests\Views\RelationshipRepresentativeNode->testRelationship()
LeafDrupal\taxonomy\Tests\VocabularyLanguageTest6400
LeafDrupal\taxonomy\Tests\VocabularyTest11600
LeafDrupal\taxonomy\Tests\VocabularyUnitTest6900
LeafDrupal\text\Tests\TextFieldTest18600
LeafDrupal\text\Tests\TextSummaryTest13800
ExpandDrupal\text\Tests\TextTranslationTest10402
MessageGroupFilenameLineFunctionStatus
Undefined index: taxonomy_autocompleteNoticeFieldOverview.php143Drupal\field_ui\FieldOverview->form()
Undefined index: taxonomy_autocompleteNoticeFieldOverview.php143Drupal\field_ui\FieldOverview->form()
LeafDrupal\toolbar\Tests\ToolbarHookToolbarTest1500
LeafDrupal\tracker\Tests\TrackerNodeAccessTest2800
LeafDrupal\tracker\Tests\TrackerTest22800
LeafDrupal\translation\Tests\TranslationTest59000
LeafDrupal\translation_entity\Tests\ConfigTestTranslationUITest1300
LeafDrupal\translation_entity\Tests\EntityTestTranslationUITest6800
LeafDrupal\translation_entity\Tests\EntityTranslationSettingsTest4900
LeafDrupal\update\Tests\UpdateContribTest18700
LeafDrupal\update\Tests\UpdateCoreTest21400
LeafDrupal\update\Tests\UpdateCoreUnitTest400
LeafDrupal\update\Tests\UpdateUploadTest6400
LeafDrupal\user\Tests\TempStoreDatabaseTest3800
LeafDrupal\user\Tests\UserAccountLinksTests6100
LeafDrupal\user\Tests\UserAdminSettingsFormTest400
LeafDrupal\user\Tests\UserAdminTest6100
LeafDrupal\user\Tests\UserAutocompleteTest2500
LeafDrupal\user\Tests\UserBlocksTests4000
LeafDrupal\user\Tests\UserCancelTest25400
LeafDrupal\user\Tests\UserCreateTest3300
LeafDrupal\user\Tests\UserDeleteTest1500
LeafDrupal\user\Tests\UserEditedOwnAccountTest2200
LeafDrupal\user\Tests\UserEditTest7300
LeafDrupal\user\Tests\UserEntityCallbacksTest700
LeafDrupal\user\Tests\UserLanguageCreationTest6800
LeafDrupal\user\Tests\UserLanguageTest3900
LeafDrupal\user\Tests\UserLoginTest15900
LeafDrupal\user\Tests\UserPasswordResetTest3000
LeafDrupal\user\Tests\UserPermissionsTest5000
LeafDrupal\user\Tests\UserPictureTest4700
LeafDrupal\user\Tests\UserRegistrationTest12900
LeafDrupal\user\Tests\UserRoleAdminTest5400
LeafDrupal\user\Tests\UserRolesAssignmentTest5100
LeafDrupal\user\Tests\UserSaveTest200
LeafDrupal\user\Tests\UserSearchTest5800
LeafDrupal\user\Tests\UserSignatureTest4600
LeafDrupal\user\Tests\UserTimeZoneTest2900
LeafDrupal\user\Tests\UserTokenReplaceTest4700
LeafDrupal\user\Tests\UserTranslationUITest8900
LeafDrupal\user\Tests\UserValidateCurrentPassCustomFormTest1700
LeafDrupal\user\Tests\UserValidationTest1600
LeafDrupal\user\Tests\Views\AccessPermissionTest1400
LeafDrupal\user\Tests\Views\AccessRoleTest1400
LeafDrupal\user\Tests\Views\ArgumentDefaultTest900
LeafDrupal\user\Tests\Views\ArgumentValidateTest1900
LeafDrupal\user\Tests\Views\HandlerArgumentUserUidTest500
LeafDrupal\user\Tests\Views\HandlerFieldUserNameTest700
LeafDrupal\user\Tests\Views\HandlerFilterUserNameTest5700
LeafDrupal\user\Tests\Views\RelationshipRepresentativeNode300
LeafDrupal\views\Tests\AnalyzeTest1800
LeafDrupal\views\Tests\BasicTest800
ExpandDrupal\views\Tests\DefaultViewsTest110
MessageGroupFilenameLineFunctionStatus
The test did not complete due to a fatal error.Completion checkDefaultViewsTest.php123Drupal\views\Tests\DefaultViewsTest->testDefaultViews()
LeafDrupal\views\Tests\EntityReference\SelectionTest300
LeafDrupal\views\Tests\Entity\FieldEntityTest400
LeafDrupal\views\Tests\GlossaryTest800
LeafDrupal\views\Tests\Handler\AreaTest9000
LeafDrupal\views\Tests\Handler\AreaTextTest400
LeafDrupal\views\Tests\Handler\ArgumentNullTest400
LeafDrupal\views\Tests\Handler\ArgumentStringTest400
LeafDrupal\views\Tests\Handler\FieldBooleanTest1000
LeafDrupal\views\Tests\Handler\FieldCounterTest600
LeafDrupal\views\Tests\Handler\FieldCustomTest100
LeafDrupal\views\Tests\Handler\FieldDateTest1400
LeafDrupal\views\Tests\Handler\FieldDropButtonTest1300
LeafDrupal\views\Tests\Handler\FieldFileSizeTest800
LeafDrupal\views\Tests\Handler\FieldUnitTest9000
LeafDrupal\views\Tests\Handler\FieldUrlTest200
LeafDrupal\views\Tests\Handler\FieldWebTest10900
LeafDrupal\views\Tests\Handler\FieldXssTest300
LeafDrupal\views\Tests\Handler\FilterCombineTest100
LeafDrupal\views\Tests\Handler\FilterDateTest2200
LeafDrupal\views\Tests\Handler\FilterEqualityTest400
LeafDrupal\views\Tests\Handler\FilterInOperatorTest800
LeafDrupal\views\Tests\Handler\FilterNumericTest1400
LeafDrupal\views\Tests\Handler\FilterStringTest2600
LeafDrupal\views\Tests\Handler\HandlerAliasTest800
LeafDrupal\views\Tests\Handler\HandlerAllTest26000
ExpandDrupal\views\Tests\Handler\HandlerTest11600
MessageGroupFilenameLineFunctionStatus
'Missing handler: mgIdUGM4 zOgDZq2x relationship'Debugviews.module1113views_get_handler()
'Missing handler: mgIdUGM4 zOgDZq2x relationship'Debugviews.module1113views_get_handler()
LeafDrupal\views\Tests\Handler\RelationshipTest400
LeafDrupal\views\Tests\Handler\SortDateTest2400
LeafDrupal\views\Tests\Handler\SortRandomTest600
LeafDrupal\views\Tests\Handler\SortTest800
ExpandDrupal\views\Tests\ModuleTest4800
MessageGroupFilenameLineFunctionStatus
'Missing handler: jy6OFeKU gYiW9u8j field'Debugviews.module1113views_get_handler()
'Missing handler: gkRbc8b6 qt2uSSqA area'Debugviews.module1113views_get_handler()
'Missing handler: opYL0cmW jTrcXRFP filter'Debugviews.module1113views_get_handler()
LeafDrupal\views\Tests\PluginBaseUnitTest1200
LeafDrupal\views\Tests\PluginInstanceTest26000
LeafDrupal\views\Tests\PluginTypeListTest100
LeafDrupal\views\Tests\Plugin\AccessTest3900
LeafDrupal\views\Tests\Plugin\ArgumentDefaultTest2400
LeafDrupal\views\Tests\Plugin\ArgumentValidatorTest400
LeafDrupal\views\Tests\Plugin\CacheTest1200
LeafDrupal\views\Tests\Plugin\DisplayAttachmentTest600
LeafDrupal\views\Tests\Plugin\DisplayExtenderTest600
LeafDrupal\views\Tests\Plugin\DisplayFeedTest2800
LeafDrupal\views\Tests\Plugin\DisplayPageTest700
LeafDrupal\views\Tests\Plugin\DisplayTest5000
LeafDrupal\views\Tests\Plugin\ExposedFormTest11400
LeafDrupal\views\Tests\Plugin\FilterTest1300
ExpandDrupal\views\Tests\Plugin\JoinTest1600
MessageGroupFilenameLineFunctionStatus
array ( 'join type' => 'LEFT', 'table' => 'users', 'alias' => 'users', 'condition' => 'node.uid = users.uid AND (node.uid = 861)', 'arguments' => array ( ), )DebugJoinTest.php70Drupal\views\Tests\Plugin\JoinTest->testExamplePlugin()
LeafDrupal\views\Tests\Plugin\PagerTest9200
LeafDrupal\views\Tests\Plugin\QueryTest200
LeafDrupal\views\Tests\Plugin\StyleMappingTest4200
LeafDrupal\views\Tests\Plugin\StyleTest2400
LeafDrupal\views\Tests\Plugin\StyleUnformattedTest1700
LeafDrupal\views\Tests\QueryGroupByTest4000
LeafDrupal\views\Tests\TokenReplaceTest1100
LeafDrupal\views\Tests\UI\DefaultViewsTest11000
LeafDrupal\views\Tests\UI\DisplayExtenderUITest2300
LeafDrupal\views\Tests\UI\DisplayPath2200
LeafDrupal\views\Tests\UI\DisplayTest19500
LeafDrupal\views\Tests\UI\GroupByTest2600
LeafDrupal\views\Tests\UI\HandlerTest11000
LeafDrupal\views\Tests\UI\OverrideDisplaysTest16700
LeafDrupal\views\Tests\UI\PreviewTest4200
LeafDrupal\views\Tests\UI\QueryTest1900
LeafDrupal\views\Tests\UI\RedirectTest2600
LeafDrupal\views\Tests\UI\RowUITest3000
LeafDrupal\views\Tests\UI\SettingsTest8800
LeafDrupal\views\Tests\UI\StorageTest2100
LeafDrupal\views\Tests\UI\StyleUITest3000
LeafDrupal\views\Tests\UI\TagTest1100
LeafDrupal\views\Tests\ViewElementTest1500
LeafDrupal\views\Tests\ViewExecutableTest11500
LeafDrupal\views\Tests\ViewRenderTest200
LeafDrupal\views\Tests\ViewsDataTest1000
ExpandDrupal\views\Tests\ViewStorageTest10900
MessageGroupFilenameLineFunctionStatus
'Missing handler: views_test_data id field'Debugviews.module1113views_get_handler()
'Missing handler: views_test_data name field'Debugviews.module1113views_get_handler()
LeafDrupal\views\Tests\Wizard\BasicTest8300
LeafDrupal\views\Tests\Wizard\ItemsPerPageTest4200
LeafDrupal\views\Tests\Wizard\MenuTest1900
LeafDrupal\views\Tests\Wizard\SortingTest3500
ExpandDrupal\views\Tests\Wizard\TaggedWithTest1110
MessageGroupFilenameLineFunctionStatus
The test did not complete due to a fatal error.Completion checkTaggedWithTest.php104Drupal\views\Tests\Wizard\TaggedWithTest->testTaggedWith()
LeafDrupal\xmlrpc\Tests\XmlRpcBasicTest900
LeafDrupal\xmlrpc\Tests\XmlRpcMessagesTest700
LeafDrupal\xmlrpc\Tests\XmlRpcValidatorTest1000