731724-222.patch

Test status
StatusResult
Last receivedWed, 12/05/2012 - 03:09:56
Last requestedWed, 12/05/2012 - 03:10:03
Last testedWed, 12/05/2012 - 03:52:27
Test count1
Environment status
MySQLfail
File information
File731724-222.patch
BranchDrupal core - 8.x
LinkIssue Link
SummaryFAILED: [[SimpleTest]]: [MySQL] 49,095 pass(es), 5 fail(s), and 4 exception(s).
Details

MySQL

  1. Setup environment
  2. Detect an invalid patch URL
  3. Detect invalid repository information
  4. Detect invalid patch format
  5. Detect a non-applicable patch
  6. Detect invalid PHP syntax
  7. Detect a Drupal installation failure
  8. Detect a test run failure
  9. Detect a failing test
    Review the test failures below then if necessary run them locally until the problem has been fixed.
  10. Complete test suite with all tests passing
49,095 pass(es), 5 fail(s), and 4 exception(s)

Non-pass

Test namePassFailException
ExpandDrupal\comment\Tests\CommentTranslationUITest9510
MessageGroupFilenameLineFunctionStatus
No link containing href comment/2/translations found.OtherCommentTranslationUITest.php127Drupal\comment\Tests\CommentTranslationUITest->testTranslateLinkCommentAdminPage()
ExpandDrupal\user\Tests\UserPictureTest4440
MessageGroupFilenameLineFunctionStatus
Failed to set field comment_body[und][0][value] to R0IKyS6lOtherUserPictureTest.php120Drupal\user\Tests\UserPictureTest->testPictureOnNodeComment()
Found the Save buttonOtherUserPictureTest.php120Drupal\user\Tests\UserPictureTest->testPictureOnNodeComment()
Found the requested form fields at comment/reply/1OtherUserPictureTest.php120Drupal\user\Tests\UserPictureTest->testPictureOnNodeComment()
User picture found on comment.OtherUserPictureTest.php121Drupal\user\Tests\UserPictureTest->testPictureOnNodeComment()
ExpandDrupal\views\Tests\ViewExecutableTest4804
MessageGroupFilenameLineFunctionStatus
'Missing handler: node comment_cid relationship'Debugviews.module1202views_get_handler()
'Missing handler: node comment_cid relationship'Debugviews.module1202views_get_handler()
Undefined index: baseDrupal\views\Plugin\views\query\Sql->get_entity_tables() Drupal\views\Plugin\views\query\Sql->query() Drupal\views\Plugin\views\query\Sql->build(Object) Drupal\views\ViewExecutable->build(NULL) Drupal\views\ViewExecutable->execute(NULL) Drupal\views\ViewExecutable->render() Drupal\views\Plugin\views\display\DisplayPluginBase->preview() Drupal\views\ViewExecutable->preview() Drupal\views\Tests\ViewExecutableTest->testDestroy() Drupal\simpletest\TestBase->run() simpletest_script_run_one_test('611', 'Drupal\views\Tests\ViewExecutableTest') NoticeSql.php1554Drupal\views\Plugin\views\query\Sql->get_entity_tables()
Undefined index: baseDrupal\views\Plugin\views\query\Sql->get_entity_tables() Drupal\views\Plugin\views\query\Sql->query(1) Drupal\views\Plugin\views\query\Sql->build(Object) Drupal\views\ViewExecutable->build(NULL) Drupal\views\ViewExecutable->execute(NULL) Drupal\views\ViewExecutable->render() Drupal\views\Plugin\views\display\DisplayPluginBase->preview() Drupal\views\ViewExecutable->preview() Drupal\views\Tests\ViewExecutableTest->testDestroy() Drupal\simpletest\TestBase->run() simpletest_script_run_one_test('611', 'Drupal\views\Tests\ViewExecutableTest') NoticeSql.php1554Drupal\views\Plugin\views\query\Sql->get_entity_tables()
htmlspecialchars() expects parameter 1 to be string, array givenhtmlspecialchars(Array, 3, 'UTF-8') check_plain(Array) drupal_placeholder(Array) format_string('%type: !message in %function (line %line of %file). !backtrace', Array) Drupal\simpletest\TestBase->exceptionHandler(Object) Drupal\simpletest\TestBase->run() simpletest_script_run_one_test('611', 'Drupal\views\Tests\ViewExecutableTest') Warningbootstrap.inc1586check_plain()
Drupal\Core\Database\IntegrityConstraintViolationException: SQLSTATE[23000]: Integrity constraint violation: 1052 Column 'uid' in on clause is ambiguous: SELECT COUNT(*) AS expression FROM (SELECT 1 AS expression FROM {node} node LEFT JOIN {comment} comment_comment ON pid = comment_comment.cid LEFT JOIN {users} users_comment ON uid = users_comment.uid WHERE (( (node.nid = :db_condition_placeholder_0) AND (node.status = :db_condition_placeholder_1) AND (node.title LIKE :db_condition_placeholder_2 ESCAPE '\\') ))) subquery; Array ( [:db_condition_placeholder_0] => [:db_condition_placeholder_1] => 0 [:db_condition_placeholder_2] => ) in Drupal\Core\Database\Connection->query() (line 551 of /var/lib/drupaltestbot/sites/default/files/checkout/core/lib/Drupal/Core/Database/Connection.php). ">Drupal\Core\Database\Connection->query('SELECT COUNT(*) AS expression FROM (SELECT 1 AS expression FROM {node} node LEFT JOIN {comment} comment_comment ON pid = comment_comment.cid LEFT JOIN {users} users_comment ON uid = users_comment.uid WHERE (( (node.nid = :db_condition_placeholder_0) AND (node.status = :db_condition_placeholder_1) AND (node.title LIKE :db_condition_placeholder_2 ESCAPE '\\') ))) subquery', Array, Array) Drupal\Core\Database\Query\Select->execute() Drupal\views\Plugin\views\pager\PagerPluginBase->execute_count_query(Object) Drupal\views\Plugin\views\query\Sql->execute(Object) Drupal\views\ViewExecutable->execute(NULL) Drupal\views\ViewExecutable->render() Drupal\views\Plugin\views\display\DisplayPluginBase->preview() Drupal\views\ViewExecutable->preview() Drupal\views\Tests\ViewExecutableTest->testDestroy() Drupal\simpletest\TestBase->run() simpletest_script_run_one_test('611', 'Drupal\views\Tests\ViewExecutableTest') Uncaught exceptionConnection.php551Drupal\Core\Database\Connection->query()
'Missing handler: node comment_cid relationship'Debugviews.module1202views_get_handler()
'Missing handler: node comment_cid relationship'Debugviews.module1202views_get_handler()
'Missing handler: node comment_cid relationship'Debugviews.module1202views_get_handler()
'Missing handler: node comment_cid relationship'Debugviews.module1202views_get_handler()

All

Test namePassFailException
LeafDrupal\action\Tests\BulkFormTest3300
LeafDrupal\action\Tests\ConfigurationTest3900
LeafDrupal\action\Tests\LoopTest2100
LeafDrupal\aggregator\Tests\AddFeedTest7100
LeafDrupal\aggregator\Tests\AggregatorConfigurationTest2000
LeafDrupal\aggregator\Tests\AggregatorCronTest5500
LeafDrupal\aggregator\Tests\AggregatorRenderingTest22800
LeafDrupal\aggregator\Tests\CategorizeFeedItemTest6100
LeafDrupal\aggregator\Tests\CategorizeFeedTest2100
LeafDrupal\aggregator\Tests\FeedParserTest7200
LeafDrupal\aggregator\Tests\ImportOpmlTest5500
LeafDrupal\aggregator\Tests\RemoveFeedItemTest27000
LeafDrupal\aggregator\Tests\RemoveFeedTest2500
LeafDrupal\aggregator\Tests\UpdateFeedItemTest6500
LeafDrupal\aggregator\Tests\UpdateFeedTest7600
LeafDrupal\ban\Tests\IpAddressBlockingTest4300
LeafDrupal\block\Tests\BlockAdminThemeTest1900
LeafDrupal\block\Tests\BlockCacheTest20500
LeafDrupal\block\Tests\BlockHiddenRegionTest1800
LeafDrupal\block\Tests\BlockHtmlIdTest1600
LeafDrupal\block\Tests\BlockInvalidRegionTest2400
LeafDrupal\block\Tests\BlockLanguageTest9100
LeafDrupal\block\Tests\BlockTemplateSuggestionsUnitTest300
LeafDrupal\block\Tests\BlockTest36000
LeafDrupal\block\Tests\BlockUserAccountSettingsTest1200
LeafDrupal\block\Tests\NewDefaultThemeBlocksTest2300
LeafDrupal\block\Tests\NonDefaultBlockAdminTest1100
LeafDrupal\book\Tests\BookTest51700
LeafDrupal\breakpoint\Tests\BreakpointAPITest600
LeafDrupal\breakpoint\Tests\BreakpointCRUDTest2100
LeafDrupal\breakpoint\Tests\BreakpointGroupAPITest400
LeafDrupal\breakpoint\Tests\BreakpointGroupCRUDTest1200
LeafDrupal\breakpoint\Tests\BreakpointMediaQueryTest6300
LeafDrupal\breakpoint\Tests\BreakpointThemeTest2300
LeafDrupal\color\Tests\ColorTest8700
LeafDrupal\comment\Tests\CommentActionsTest3000
LeafDrupal\comment\Tests\CommentAnonymousTest16300
LeafDrupal\comment\Tests\CommentApprovalTest15200
LeafDrupal\comment\Tests\CommentBlockTest11800
LeafDrupal\comment\Tests\CommentContentRebuildTest3300
LeafDrupal\comment\Tests\CommentCSSTest50100
LeafDrupal\comment\Tests\CommentFieldsTest4100
LeafDrupal\comment\Tests\CommentInterfaceTest25100
LeafDrupal\comment\Tests\CommentLanguageTest7200
ExpandDrupal\comment\Tests\CommentLinksTest122100
MessageGroupFilenameLineFunctionStatus
Changed environment:array ( 'authenticated' => false, 'comment count' => false, 'form' => 'below', 'user_register' => 'visitors', 'contact' => 'optional', 'comments' => 'open', 'access comments' => 0, 'post comments' => 0, 'skip comment approval' => 1, 'edit own comments' => 0, )DebugCommentLinksTest.php195Drupal\comment\Tests\CommentLinksTest->setEnvironment()
Changed environment:array ( 'authenticated' => true, 'comment count' => false, 'form' => 'below', 'user_register' => 'visitors', 'contact' => 'optional', 'comments' => 'open', 'access comments' => 0, 'post comments' => 0, 'skip comment approval' => 1, 'edit own comments' => 0, )DebugCommentLinksTest.php195Drupal\comment\Tests\CommentLinksTest->setEnvironment()
Changed environment:array ( 'authenticated' => false, 'comment count' => true, 'form' => 'below', 'user_register' => 'visitors', 'contact' => 'optional', 'comments' => 'open', 'access comments' => 0, 'post comments' => 0, 'skip comment approval' => 1, 'edit own comments' => 0, )DebugCommentLinksTest.php195Drupal\comment\Tests\CommentLinksTest->setEnvironment()
Changed environment:array ( 'authenticated' => true, 'comment count' => true, 'form' => 'below', 'user_register' => 'visitors', 'contact' => 'optional', 'comments' => 'open', 'access comments' => 0, 'post comments' => 0, 'skip comment approval' => 1, 'edit own comments' => 0, )DebugCommentLinksTest.php195Drupal\comment\Tests\CommentLinksTest->setEnvironment()
Changed environment:array ( 'authenticated' => false, 'comment count' => false, 'form' => 'below', 'user_register' => 'visitors', 'contact' => 'optional', 'comments' => 'open', 'access comments' => 1, 'post comments' => 0, 'skip comment approval' => 1, 'edit own comments' => 0, )DebugCommentLinksTest.php195Drupal\comment\Tests\CommentLinksTest->setEnvironment()
Changed environment:array ( 'authenticated' => true, 'comment count' => false, 'form' => 'below', 'user_register' => 'visitors', 'contact' => 'optional', 'comments' => 'open', 'access comments' => 1, 'post comments' => 0, 'skip comment approval' => 1, 'edit own comments' => 0, )DebugCommentLinksTest.php195Drupal\comment\Tests\CommentLinksTest->setEnvironment()
Changed environment:array ( 'authenticated' => false, 'comment count' => true, 'form' => 'below', 'user_register' => 'visitors', 'contact' => 'optional', 'comments' => 'open', 'access comments' => 1, 'post comments' => 0, 'skip comment approval' => 1, 'edit own comments' => 0, )DebugCommentLinksTest.php195Drupal\comment\Tests\CommentLinksTest->setEnvironment()
Changed environment:array ( 'authenticated' => true, 'comment count' => true, 'form' => 'below', 'user_register' => 'visitors', 'contact' => 'optional', 'comments' => 'open', 'access comments' => 1, 'post comments' => 0, 'skip comment approval' => 1, 'edit own comments' => 0, )DebugCommentLinksTest.php195Drupal\comment\Tests\CommentLinksTest->setEnvironment()
Changed environment:array ( 'authenticated' => false, 'comment count' => false, 'form' => 'below', 'user_register' => 'visitors', 'contact' => 'optional', 'comments' => 'open', 'access comments' => 0, 'post comments' => 1, 'skip comment approval' => 1, 'edit own comments' => 0, )DebugCommentLinksTest.php195Drupal\comment\Tests\CommentLinksTest->setEnvironment()
Changed environment:array ( 'authenticated' => true, 'comment count' => false, 'form' => 'below', 'user_register' => 'visitors', 'contact' => 'optional', 'comments' => 'open', 'access comments' => 0, 'post comments' => 1, 'skip comment approval' => 1, 'edit own comments' => 0, )DebugCommentLinksTest.php195Drupal\comment\Tests\CommentLinksTest->setEnvironment()
Changed environment:array ( 'authenticated' => false, 'comment count' => true, 'form' => 'below', 'user_register' => 'visitors', 'contact' => 'optional', 'comments' => 'open', 'access comments' => 0, 'post comments' => 1, 'skip comment approval' => 1, 'edit own comments' => 0, )DebugCommentLinksTest.php195Drupal\comment\Tests\CommentLinksTest->setEnvironment()
Changed environment:array ( 'authenticated' => true, 'comment count' => true, 'form' => 'below', 'user_register' => 'visitors', 'contact' => 'optional', 'comments' => 'open', 'access comments' => 0, 'post comments' => 1, 'skip comment approval' => 1, 'edit own comments' => 0, )DebugCommentLinksTest.php195Drupal\comment\Tests\CommentLinksTest->setEnvironment()
Changed environment:array ( 'authenticated' => false, 'comment count' => false, 'form' => 'below', 'user_register' => 'visitors', 'contact' => 'optional', 'comments' => 'open', 'access comments' => 1, 'post comments' => 1, 'skip comment approval' => 1, 'edit own comments' => 0, )DebugCommentLinksTest.php195Drupal\comment\Tests\CommentLinksTest->setEnvironment()
Changed environment:array ( 'authenticated' => true, 'comment count' => false, 'form' => 'below', 'user_register' => 'visitors', 'contact' => 'optional', 'comments' => 'open', 'access comments' => 1, 'post comments' => 1, 'skip comment approval' => 1, 'edit own comments' => 0, )DebugCommentLinksTest.php195Drupal\comment\Tests\CommentLinksTest->setEnvironment()
Changed environment:array ( 'authenticated' => false, 'comment count' => true, 'form' => 'below', 'user_register' => 'visitors', 'contact' => 'optional', 'comments' => 'open', 'access comments' => 1, 'post comments' => 1, 'skip comment approval' => 1, 'edit own comments' => 0, )DebugCommentLinksTest.php195Drupal\comment\Tests\CommentLinksTest->setEnvironment()
Changed environment:array ( 'authenticated' => true, 'comment count' => true, 'form' => 'below', 'user_register' => 'visitors', 'contact' => 'optional', 'comments' => 'open', 'access comments' => 1, 'post comments' => 1, 'skip comment approval' => 1, 'edit own comments' => 0, )DebugCommentLinksTest.php195Drupal\comment\Tests\CommentLinksTest->setEnvironment()
Changed environment:array ( 'authenticated' => false, 'comment count' => false, 'form' => 'separate page', 'user_register' => 'visitors', 'contact' => 'optional', 'comments' => 'open', 'access comments' => 0, 'post comments' => 0, 'skip comment approval' => 1, 'edit own comments' => 0, )DebugCommentLinksTest.php195Drupal\comment\Tests\CommentLinksTest->setEnvironment()
Changed environment:array ( 'authenticated' => true, 'comment count' => false, 'form' => 'separate page', 'user_register' => 'visitors', 'contact' => 'optional', 'comments' => 'open', 'access comments' => 0, 'post comments' => 0, 'skip comment approval' => 1, 'edit own comments' => 0, )DebugCommentLinksTest.php195Drupal\comment\Tests\CommentLinksTest->setEnvironment()
Changed environment:array ( 'authenticated' => false, 'comment count' => true, 'form' => 'separate page', 'user_register' => 'visitors', 'contact' => 'optional', 'comments' => 'open', 'access comments' => 0, 'post comments' => 0, 'skip comment approval' => 1, 'edit own comments' => 0, )DebugCommentLinksTest.php195Drupal\comment\Tests\CommentLinksTest->setEnvironment()
Changed environment:array ( 'authenticated' => true, 'comment count' => true, 'form' => 'separate page', 'user_register' => 'visitors', 'contact' => 'optional', 'comments' => 'open', 'access comments' => 0, 'post comments' => 0, 'skip comment approval' => 1, 'edit own comments' => 0, )DebugCommentLinksTest.php195Drupal\comment\Tests\CommentLinksTest->setEnvironment()
Changed environment:array ( 'authenticated' => false, 'comment count' => false, 'form' => 'separate page', 'user_register' => 'visitors', 'contact' => 'optional', 'comments' => 'open', 'access comments' => 1, 'post comments' => 0, 'skip comment approval' => 1, 'edit own comments' => 0, )DebugCommentLinksTest.php195Drupal\comment\Tests\CommentLinksTest->setEnvironment()
Changed environment:array ( 'authenticated' => true, 'comment count' => false, 'form' => 'separate page', 'user_register' => 'visitors', 'contact' => 'optional', 'comments' => 'open', 'access comments' => 1, 'post comments' => 0, 'skip comment approval' => 1, 'edit own comments' => 0, )DebugCommentLinksTest.php195Drupal\comment\Tests\CommentLinksTest->setEnvironment()
Changed environment:array ( 'authenticated' => false, 'comment count' => true, 'form' => 'separate page', 'user_register' => 'visitors', 'contact' => 'optional', 'comments' => 'open', 'access comments' => 1, 'post comments' => 0, 'skip comment approval' => 1, 'edit own comments' => 0, )DebugCommentLinksTest.php195Drupal\comment\Tests\CommentLinksTest->setEnvironment()
Changed environment:array ( 'authenticated' => true, 'comment count' => true, 'form' => 'separate page', 'user_register' => 'visitors', 'contact' => 'optional', 'comments' => 'open', 'access comments' => 1, 'post comments' => 0, 'skip comment approval' => 1, 'edit own comments' => 0, )DebugCommentLinksTest.php195Drupal\comment\Tests\CommentLinksTest->setEnvironment()
Changed environment:array ( 'authenticated' => false, 'comment count' => false, 'form' => 'separate page', 'user_register' => 'visitors', 'contact' => 'optional', 'comments' => 'open', 'access comments' => 0, 'post comments' => 1, 'skip comment approval' => 1, 'edit own comments' => 0, )DebugCommentLinksTest.php195Drupal\comment\Tests\CommentLinksTest->setEnvironment()
Changed environment:array ( 'authenticated' => true, 'comment count' => false, 'form' => 'separate page', 'user_register' => 'visitors', 'contact' => 'optional', 'comments' => 'open', 'access comments' => 0, 'post comments' => 1, 'skip comment approval' => 1, 'edit own comments' => 0, )DebugCommentLinksTest.php195Drupal\comment\Tests\CommentLinksTest->setEnvironment()
Changed environment:array ( 'authenticated' => false, 'comment count' => true, 'form' => 'separate page', 'user_register' => 'visitors', 'contact' => 'optional', 'comments' => 'open', 'access comments' => 0, 'post comments' => 1, 'skip comment approval' => 1, 'edit own comments' => 0, )DebugCommentLinksTest.php195Drupal\comment\Tests\CommentLinksTest->setEnvironment()
Changed environment:array ( 'authenticated' => true, 'comment count' => true, 'form' => 'separate page', 'user_register' => 'visitors', 'contact' => 'optional', 'comments' => 'open', 'access comments' => 0, 'post comments' => 1, 'skip comment approval' => 1, 'edit own comments' => 0, )DebugCommentLinksTest.php195Drupal\comment\Tests\CommentLinksTest->setEnvironment()
Changed environment:array ( 'authenticated' => false, 'comment count' => false, 'form' => 'separate page', 'user_register' => 'visitors', 'contact' => 'optional', 'comments' => 'open', 'access comments' => 1, 'post comments' => 1, 'skip comment approval' => 1, 'edit own comments' => 0, )DebugCommentLinksTest.php195Drupal\comment\Tests\CommentLinksTest->setEnvironment()
Changed environment:array ( 'authenticated' => true, 'comment count' => false, 'form' => 'separate page', 'user_register' => 'visitors', 'contact' => 'optional', 'comments' => 'open', 'access comments' => 1, 'post comments' => 1, 'skip comment approval' => 1, 'edit own comments' => 0, )DebugCommentLinksTest.php195Drupal\comment\Tests\CommentLinksTest->setEnvironment()
Changed environment:array ( 'authenticated' => false, 'comment count' => true, 'form' => 'separate page', 'user_register' => 'visitors', 'contact' => 'optional', 'comments' => 'open', 'access comments' => 1, 'post comments' => 1, 'skip comment approval' => 1, 'edit own comments' => 0, )DebugCommentLinksTest.php195Drupal\comment\Tests\CommentLinksTest->setEnvironment()
Changed environment:array ( 'authenticated' => true, 'comment count' => true, 'form' => 'separate page', 'user_register' => 'visitors', 'contact' => 'optional', 'comments' => 'open', 'access comments' => 1, 'post comments' => 1, 'skip comment approval' => 1, 'edit own comments' => 0, )DebugCommentLinksTest.php195Drupal\comment\Tests\CommentLinksTest->setEnvironment()
Changed environment:array ( 'authenticated' => false, 'comment count' => false, 'form' => 'below', 'user_register' => 'admin_only', 'contact' => 'optional', 'comments' => 'open', 'access comments' => 0, 'post comments' => 0, 'skip comment approval' => 1, 'edit own comments' => 0, )DebugCommentLinksTest.php195Drupal\comment\Tests\CommentLinksTest->setEnvironment()
Changed environment:array ( 'authenticated' => true, 'comment count' => false, 'form' => 'below', 'user_register' => 'admin_only', 'contact' => 'optional', 'comments' => 'open', 'access comments' => 0, 'post comments' => 0, 'skip comment approval' => 1, 'edit own comments' => 0, )DebugCommentLinksTest.php195Drupal\comment\Tests\CommentLinksTest->setEnvironment()
Changed environment:array ( 'authenticated' => false, 'comment count' => true, 'form' => 'below', 'user_register' => 'admin_only', 'contact' => 'optional', 'comments' => 'open', 'access comments' => 0, 'post comments' => 0, 'skip comment approval' => 1, 'edit own comments' => 0, )DebugCommentLinksTest.php195Drupal\comment\Tests\CommentLinksTest->setEnvironment()
Changed environment:array ( 'authenticated' => true, 'comment count' => true, 'form' => 'below', 'user_register' => 'admin_only', 'contact' => 'optional', 'comments' => 'open', 'access comments' => 0, 'post comments' => 0, 'skip comment approval' => 1, 'edit own comments' => 0, )DebugCommentLinksTest.php195Drupal\comment\Tests\CommentLinksTest->setEnvironment()
Changed environment:array ( 'authenticated' => false, 'comment count' => false, 'form' => 'below', 'user_register' => 'admin_only', 'contact' => 'optional', 'comments' => 'open', 'access comments' => 1, 'post comments' => 0, 'skip comment approval' => 1, 'edit own comments' => 0, )DebugCommentLinksTest.php195Drupal\comment\Tests\CommentLinksTest->setEnvironment()
Changed environment:array ( 'authenticated' => true, 'comment count' => false, 'form' => 'below', 'user_register' => 'admin_only', 'contact' => 'optional', 'comments' => 'open', 'access comments' => 1, 'post comments' => 0, 'skip comment approval' => 1, 'edit own comments' => 0, )DebugCommentLinksTest.php195Drupal\comment\Tests\CommentLinksTest->setEnvironment()
Changed environment:array ( 'authenticated' => false, 'comment count' => true, 'form' => 'below', 'user_register' => 'admin_only', 'contact' => 'optional', 'comments' => 'open', 'access comments' => 1, 'post comments' => 0, 'skip comment approval' => 1, 'edit own comments' => 0, )DebugCommentLinksTest.php195Drupal\comment\Tests\CommentLinksTest->setEnvironment()
Changed environment:array ( 'authenticated' => true, 'comment count' => true, 'form' => 'below', 'user_register' => 'admin_only', 'contact' => 'optional', 'comments' => 'open', 'access comments' => 1, 'post comments' => 0, 'skip comment approval' => 1, 'edit own comments' => 0, )DebugCommentLinksTest.php195Drupal\comment\Tests\CommentLinksTest->setEnvironment()
Changed environment:array ( 'authenticated' => false, 'comment count' => false, 'form' => 'below', 'user_register' => 'admin_only', 'contact' => 'optional', 'comments' => 'open', 'access comments' => 0, 'post comments' => 1, 'skip comment approval' => 1, 'edit own comments' => 0, )DebugCommentLinksTest.php195Drupal\comment\Tests\CommentLinksTest->setEnvironment()
Changed environment:array ( 'authenticated' => true, 'comment count' => false, 'form' => 'below', 'user_register' => 'admin_only', 'contact' => 'optional', 'comments' => 'open', 'access comments' => 0, 'post comments' => 1, 'skip comment approval' => 1, 'edit own comments' => 0, )DebugCommentLinksTest.php195Drupal\comment\Tests\CommentLinksTest->setEnvironment()
Changed environment:array ( 'authenticated' => false, 'comment count' => true, 'form' => 'below', 'user_register' => 'admin_only', 'contact' => 'optional', 'comments' => 'open', 'access comments' => 0, 'post comments' => 1, 'skip comment approval' => 1, 'edit own comments' => 0, )DebugCommentLinksTest.php195Drupal\comment\Tests\CommentLinksTest->setEnvironment()
Changed environment:array ( 'authenticated' => true, 'comment count' => true, 'form' => 'below', 'user_register' => 'admin_only', 'contact' => 'optional', 'comments' => 'open', 'access comments' => 0, 'post comments' => 1, 'skip comment approval' => 1, 'edit own comments' => 0, )DebugCommentLinksTest.php195Drupal\comment\Tests\CommentLinksTest->setEnvironment()
Changed environment:array ( 'authenticated' => false, 'comment count' => false, 'form' => 'below', 'user_register' => 'admin_only', 'contact' => 'optional', 'comments' => 'open', 'access comments' => 1, 'post comments' => 1, 'skip comment approval' => 1, 'edit own comments' => 0, )DebugCommentLinksTest.php195Drupal\comment\Tests\CommentLinksTest->setEnvironment()
Changed environment:array ( 'authenticated' => true, 'comment count' => false, 'form' => 'below', 'user_register' => 'admin_only', 'contact' => 'optional', 'comments' => 'open', 'access comments' => 1, 'post comments' => 1, 'skip comment approval' => 1, 'edit own comments' => 0, )DebugCommentLinksTest.php195Drupal\comment\Tests\CommentLinksTest->setEnvironment()
Changed environment:array ( 'authenticated' => false, 'comment count' => true, 'form' => 'below', 'user_register' => 'admin_only', 'contact' => 'optional', 'comments' => 'open', 'access comments' => 1, 'post comments' => 1, 'skip comment approval' => 1, 'edit own comments' => 0, )DebugCommentLinksTest.php195Drupal\comment\Tests\CommentLinksTest->setEnvironment()
Changed environment:array ( 'authenticated' => true, 'comment count' => true, 'form' => 'below', 'user_register' => 'admin_only', 'contact' => 'optional', 'comments' => 'open', 'access comments' => 1, 'post comments' => 1, 'skip comment approval' => 1, 'edit own comments' => 0, )DebugCommentLinksTest.php195Drupal\comment\Tests\CommentLinksTest->setEnvironment()
Changed environment:array ( 'authenticated' => false, 'comment count' => false, 'form' => 'separate page', 'user_register' => 'admin_only', 'contact' => 'optional', 'comments' => 'open', 'access comments' => 0, 'post comments' => 0, 'skip comment approval' => 1, 'edit own comments' => 0, )DebugCommentLinksTest.php195Drupal\comment\Tests\CommentLinksTest->setEnvironment()
Changed environment:array ( 'authenticated' => true, 'comment count' => false, 'form' => 'separate page', 'user_register' => 'admin_only', 'contact' => 'optional', 'comments' => 'open', 'access comments' => 0, 'post comments' => 0, 'skip comment approval' => 1, 'edit own comments' => 0, )DebugCommentLinksTest.php195Drupal\comment\Tests\CommentLinksTest->setEnvironment()
Changed environment:array ( 'authenticated' => false, 'comment count' => true, 'form' => 'separate page', 'user_register' => 'admin_only', 'contact' => 'optional', 'comments' => 'open', 'access comments' => 0, 'post comments' => 0, 'skip comment approval' => 1, 'edit own comments' => 0, )DebugCommentLinksTest.php195Drupal\comment\Tests\CommentLinksTest->setEnvironment()
Changed environment:array ( 'authenticated' => true, 'comment count' => true, 'form' => 'separate page', 'user_register' => 'admin_only', 'contact' => 'optional', 'comments' => 'open', 'access comments' => 0, 'post comments' => 0, 'skip comment approval' => 1, 'edit own comments' => 0, )DebugCommentLinksTest.php195Drupal\comment\Tests\CommentLinksTest->setEnvironment()
Changed environment:array ( 'authenticated' => false, 'comment count' => false, 'form' => 'separate page', 'user_register' => 'admin_only', 'contact' => 'optional', 'comments' => 'open', 'access comments' => 1, 'post comments' => 0, 'skip comment approval' => 1, 'edit own comments' => 0, )DebugCommentLinksTest.php195Drupal\comment\Tests\CommentLinksTest->setEnvironment()
Changed environment:array ( 'authenticated' => true, 'comment count' => false, 'form' => 'separate page', 'user_register' => 'admin_only', 'contact' => 'optional', 'comments' => 'open', 'access comments' => 1, 'post comments' => 0, 'skip comment approval' => 1, 'edit own comments' => 0, )DebugCommentLinksTest.php195Drupal\comment\Tests\CommentLinksTest->setEnvironment()
Changed environment:array ( 'authenticated' => false, 'comment count' => true, 'form' => 'separate page', 'user_register' => 'admin_only', 'contact' => 'optional', 'comments' => 'open', 'access comments' => 1, 'post comments' => 0, 'skip comment approval' => 1, 'edit own comments' => 0, )DebugCommentLinksTest.php195Drupal\comment\Tests\CommentLinksTest->setEnvironment()
Changed environment:array ( 'authenticated' => true, 'comment count' => true, 'form' => 'separate page', 'user_register' => 'admin_only', 'contact' => 'optional', 'comments' => 'open', 'access comments' => 1, 'post comments' => 0, 'skip comment approval' => 1, 'edit own comments' => 0, )DebugCommentLinksTest.php195Drupal\comment\Tests\CommentLinksTest->setEnvironment()
Changed environment:array ( 'authenticated' => false, 'comment count' => false, 'form' => 'separate page', 'user_register' => 'admin_only', 'contact' => 'optional', 'comments' => 'open', 'access comments' => 0, 'post comments' => 1, 'skip comment approval' => 1, 'edit own comments' => 0, )DebugCommentLinksTest.php195Drupal\comment\Tests\CommentLinksTest->setEnvironment()
Changed environment:array ( 'authenticated' => true, 'comment count' => false, 'form' => 'separate page', 'user_register' => 'admin_only', 'contact' => 'optional', 'comments' => 'open', 'access comments' => 0, 'post comments' => 1, 'skip comment approval' => 1, 'edit own comments' => 0, )DebugCommentLinksTest.php195Drupal\comment\Tests\CommentLinksTest->setEnvironment()
Changed environment:array ( 'authenticated' => false, 'comment count' => true, 'form' => 'separate page', 'user_register' => 'admin_only', 'contact' => 'optional', 'comments' => 'open', 'access comments' => 0, 'post comments' => 1, 'skip comment approval' => 1, 'edit own comments' => 0, )DebugCommentLinksTest.php195Drupal\comment\Tests\CommentLinksTest->setEnvironment()
Changed environment:array ( 'authenticated' => true, 'comment count' => true, 'form' => 'separate page', 'user_register' => 'admin_only', 'contact' => 'optional', 'comments' => 'open', 'access comments' => 0, 'post comments' => 1, 'skip comment approval' => 1, 'edit own comments' => 0, )DebugCommentLinksTest.php195Drupal\comment\Tests\CommentLinksTest->setEnvironment()
Changed environment:array ( 'authenticated' => false, 'comment count' => false, 'form' => 'separate page', 'user_register' => 'admin_only', 'contact' => 'optional', 'comments' => 'open', 'access comments' => 1, 'post comments' => 1, 'skip comment approval' => 1, 'edit own comments' => 0, )DebugCommentLinksTest.php195Drupal\comment\Tests\CommentLinksTest->setEnvironment()
Changed environment:array ( 'authenticated' => true, 'comment count' => false, 'form' => 'separate page', 'user_register' => 'admin_only', 'contact' => 'optional', 'comments' => 'open', 'access comments' => 1, 'post comments' => 1, 'skip comment approval' => 1, 'edit own comments' => 0, )DebugCommentLinksTest.php195Drupal\comment\Tests\CommentLinksTest->setEnvironment()
Changed environment:array ( 'authenticated' => false, 'comment count' => true, 'form' => 'separate page', 'user_register' => 'admin_only', 'contact' => 'optional', 'comments' => 'open', 'access comments' => 1, 'post comments' => 1, 'skip comment approval' => 1, 'edit own comments' => 0, )DebugCommentLinksTest.php195Drupal\comment\Tests\CommentLinksTest->setEnvironment()
Changed environment:array ( 'authenticated' => true, 'comment count' => true, 'form' => 'separate page', 'user_register' => 'admin_only', 'contact' => 'optional', 'comments' => 'open', 'access comments' => 1, 'post comments' => 1, 'skip comment approval' => 1, 'edit own comments' => 0, )DebugCommentLinksTest.php195Drupal\comment\Tests\CommentLinksTest->setEnvironment()
LeafDrupal\comment\Tests\CommentNewIndicatorTest4200
LeafDrupal\comment\Tests\CommentNodeAccessTest5700
LeafDrupal\comment\Tests\CommentNodeChangesTest2400
LeafDrupal\comment\Tests\CommentPagerTest21300
LeafDrupal\comment\Tests\CommentPreviewTest9800
LeafDrupal\comment\Tests\CommentRssTest2600
LeafDrupal\comment\Tests\CommentStatisticsTest9800
LeafDrupal\comment\Tests\CommentThreadingTest15900
LeafDrupal\comment\Tests\CommentTokenReplaceTest6600
ExpandDrupal\comment\Tests\CommentTranslationUITest9510
MessageGroupFilenameLineFunctionStatus
No link containing href comment/2/translations found.OtherCommentTranslationUITest.php127Drupal\comment\Tests\CommentTranslationUITest->testTranslateLinkCommentAdminPage()
LeafDrupal\comment\Tests\CommentUserTest8900
LeafDrupal\config\Tests\ConfigCRUDTest2000
LeafDrupal\config\Tests\ConfigEntityListTest6800
LeafDrupal\config\Tests\ConfigEntityTest13700
LeafDrupal\config\Tests\ConfigFileContentTest3100
LeafDrupal\config\Tests\ConfigImportTest3800
LeafDrupal\config\Tests\ConfigImportUITest4600
LeafDrupal\config\Tests\ConfigInstallTest1100
LeafDrupal\config\Tests\ConfigOverrideTest1800
LeafDrupal\config\Tests\ConfigUpgradeTest1200
LeafDrupal\config\Tests\LocaleConfigOverride300
LeafDrupal\config\Tests\Storage\DatabaseStorageTest1900
LeafDrupal\config\Tests\Storage\FileStorageTest2100
LeafDrupal\contact\Tests\ContactAuthenticatedUserTest1300
LeafDrupal\contact\Tests\ContactPersonalTest16200
LeafDrupal\contact\Tests\ContactSitewideTest24400
LeafDrupal\contextual\Tests\ContextualDynamicContextTest1600
LeafDrupal\dblog\Tests\DBLogTest37700
LeafDrupal\email\Tests\EmailFieldTest1900
LeafDrupal\field\Tests\BulkDeleteTest7500
LeafDrupal\field\Tests\CrudTest7500
LeafDrupal\field\Tests\DisplayApiTest4600
LeafDrupal\field\Tests\EntityPropertiesTest400
LeafDrupal\field\Tests\FieldAccessTest2100
LeafDrupal\field\Tests\FieldAttachOtherTest10300
LeafDrupal\field\Tests\FieldAttachStorageTest9200
LeafDrupal\field\Tests\FieldInfoTest7100
LeafDrupal\field\Tests\FieldInstanceCrudTest3800
LeafDrupal\field\Tests\FormTest26500
LeafDrupal\field\Tests\TranslationTest10200
LeafDrupal\field_sql_storage\Tests\FieldSqlStorageTest9200
LeafDrupal\field_ui\Tests\AlterTest2100
LeafDrupal\field_ui\Tests\ManageDisplayTest14900
LeafDrupal\field_ui\Tests\ManageFieldsTest23100
LeafDrupal\file\Tests\CopyTest11000
LeafDrupal\file\Tests\DeleteTest2400
LeafDrupal\file\Tests\DownloadTest4500
LeafDrupal\file\Tests\FileFieldDisplayTest5000
LeafDrupal\file\Tests\FileFieldPathTest2700
LeafDrupal\file\Tests\FileFieldRevisionTest6700
LeafDrupal\file\Tests\FileFieldRSSContentTest2300
LeafDrupal\file\Tests\FileFieldValidateTest11800
LeafDrupal\file\Tests\FileFieldWidgetTest29900
LeafDrupal\file\Tests\FileManagedFileElementTest26800
LeafDrupal\file\Tests\FilePrivateTest3700
LeafDrupal\file\Tests\FileTokenReplaceTest3500
LeafDrupal\file\Tests\LoadTest3400
LeafDrupal\file\Tests\MoveTest11000
LeafDrupal\file\Tests\RemoteFileSaveUploadTest27000
LeafDrupal\file\Tests\SaveDataTest9300
LeafDrupal\file\Tests\SaveTest1600
LeafDrupal\file\Tests\SaveUploadTest27000
LeafDrupal\file\Tests\SpaceUsedTest1200
LeafDrupal\file\Tests\UsageTest3400
LeafDrupal\file\Tests\ValidateTest1200
LeafDrupal\file\Tests\ValidatorTest2900
LeafDrupal\filter\Tests\FilterAdminTest18900
LeafDrupal\filter\Tests\FilterAPITest500
LeafDrupal\filter\Tests\FilterCrudTest23900
LeafDrupal\filter\Tests\FilterDefaultFormatTest3300
LeafDrupal\filter\Tests\FilterFormatAccessTest27200
LeafDrupal\filter\Tests\FilterHooksTest3300
LeafDrupal\filter\Tests\FilterHtmlImageSecureTest4600
LeafDrupal\filter\Tests\FilterNoFormatTest100
LeafDrupal\filter\Tests\FilterSecurityTest4000
LeafDrupal\filter\Tests\FilterSettingsTest1200
LeafDrupal\filter\Tests\FilterUnitTest21500
LeafDrupal\forum\Tests\ForumBlockTest23800
LeafDrupal\forum\Tests\ForumIndexTest4800
LeafDrupal\forum\Tests\ForumNodeAccessTest12200
LeafDrupal\forum\Tests\ForumTest58100
LeafDrupal\help\Tests\HelpTest30500
LeafDrupal\help\Tests\NoHelpTest2400
LeafDrupal\image\Tests\ImageAdminStylesTest22100
LeafDrupal\image\Tests\ImageDimensionsScaleUnitTest3000
LeafDrupal\image\Tests\ImageDimensionsTest10300
LeafDrupal\image\Tests\ImageEffectsTest4300
LeafDrupal\image\Tests\ImageFieldDefaultImagesTest3600
LeafDrupal\image\Tests\ImageFieldDisplayTest16000
LeafDrupal\image\Tests\ImageFieldValidateTest3800
LeafDrupal\image\Tests\ImageStylesPathAndUrlTest6500
LeafDrupal\image\Tests\ImageThemeFunctionTest500
LeafDrupal\jsonld\Tests\DrupalJsonldNormalizerTest1200
LeafDrupal\language\Tests\LanguageBrowserDetectionUnitTest10700
LeafDrupal\language\Tests\LanguageConfigurationElementTest5400
LeafDrupal\language\Tests\LanguageConfigurationTest4600
LeafDrupal\language\Tests\LanguageCustomLanguageConfigurationTest3600
LeafDrupal\language\Tests\LanguageDependencyInjectionTest1700
LeafDrupal\language\Tests\LanguageListTest10000
LeafDrupal\language\Tests\LanguageNegotiationInfoTest4900
LeafDrupal\language\Tests\LanguagePathMonolingualTest3500
LeafDrupal\language\Tests\LanguageSwitchingTest2600
LeafDrupal\language\Tests\LanguageUILanguageNegotiationTest14900
LeafDrupal\language\Tests\LanguageUrlRewritingTest4400
LeafDrupal\layout\Tests\DisplayInternalLogicTest1100
LeafDrupal\layout\Tests\LayoutDerivativesTest2400
LeafDrupal\link\Tests\LinkFieldTest14000
LeafDrupal\link\Tests\LinkFieldUITest2100
LeafDrupal\locale\Tests\LocaleCompareTest6800
LeafDrupal\locale\Tests\LocaleContentTest15000
LeafDrupal\locale\Tests\LocaleExportTest5700
LeafDrupal\locale\Tests\LocaleFileImportStatus9100
LeafDrupal\locale\Tests\LocaleImportFunctionalTest20100
LeafDrupal\locale\Tests\LocaleInstallTest200
LeafDrupal\locale\Tests\LocaleJavascriptTranslation6600
LeafDrupal\locale\Tests\LocaleLibraryInfoAlterTest200
LeafDrupal\locale\Tests\LocalePathTest4700
LeafDrupal\locale\Tests\LocalePluralFormatTest16000
LeafDrupal\locale\Tests\LocaleStringTest2600
LeafDrupal\locale\Tests\LocaleTranslationTest30600
LeafDrupal\locale\Tests\LocaleUninstallFrenchTest3600
LeafDrupal\locale\Tests\LocaleUninstallTest3600
LeafDrupal\menu\Tests\MenuNodeTest6100
LeafDrupal\menu\Tests\MenuTest318400
LeafDrupal\node\Tests\MultiStepNodeFormBasicOptionsTest1600
LeafDrupal\node\Tests\NodeAccessBaseTableTest15900
LeafDrupal\node\Tests\NodeAccessFieldTest5000
LeafDrupal\node\Tests\NodeAccessLanguageTest2500
LeafDrupal\node\Tests\NodeAccessPagerTest3000
LeafDrupal\node\Tests\NodeAccessRebuildTest1900
LeafDrupal\node\Tests\NodeAccessRecordsTest2600
LeafDrupal\node\Tests\NodeAccessTest3400
LeafDrupal\node\Tests\NodeAdminTest14500
LeafDrupal\node\Tests\NodeBlockFunctionalTest8400
LeafDrupal\node\Tests\NodeBlockTest2100
LeafDrupal\node\Tests\NodeBuildContentTest400
LeafDrupal\node\Tests\NodeCreationTest4900
LeafDrupal\node\Tests\NodeEntityFieldQueryAlterTest3200
LeafDrupal\node\Tests\NodeEntityViewModeAlterTest2000
LeafDrupal\node\Tests\NodeFeedTest100
LeafDrupal\node\Tests\NodeFieldMultilingualTestCase6400
LeafDrupal\node\Tests\NodeLoadHooksTest700
LeafDrupal\node\Tests\NodeLoadMultipleTest2700
LeafDrupal\node\Tests\NodePostSettingsTest4000
LeafDrupal\node\Tests\NodeQueryAlterTest9900
LeafDrupal\node\Tests\NodeRevisionPermissionsTest3800
LeafDrupal\node\Tests\NodeRevisionsTest6400
LeafDrupal\node\Tests\NodeRSSContentTest2100
LeafDrupal\node\Tests\NodeSaveTest7300
LeafDrupal\node\Tests\NodeTitleTest2300
LeafDrupal\node\Tests\NodeTitleXSSTest2300
LeafDrupal\node\Tests\NodeTokenReplaceTest4000
LeafDrupal\node\Tests\NodeTranslationUITest16300
LeafDrupal\node\Tests\NodeTypeInitialLanguageTest9500
LeafDrupal\node\Tests\NodeTypePersistenceTest7600
LeafDrupal\node\Tests\NodeTypeTest13600
LeafDrupal\node\Tests\PageEditTest9700
LeafDrupal\node\Tests\PagePreviewTest4100
LeafDrupal\node\Tests\PageViewTest3400
LeafDrupal\node\Tests\SummaryLengthTest1200
LeafDrupal\number\Tests\NumberFieldTest8800
LeafDrupal\openid\Tests\OpenIDFunctionalTest30600
LeafDrupal\openid\Tests\OpenIDRegistrationTest13400
LeafDrupal\openid\Tests\OpenIDTest4500
LeafDrupal\options\Tests\OptionsDynamicValuesValidationTest900
LeafDrupal\options\Tests\OptionsFieldTest1600
LeafDrupal\options\Tests\OptionsFieldUITest20700
LeafDrupal\options\Tests\OptionsSelectDynamicValuesTest1600
LeafDrupal\options\Tests\OptionsWidgetsTest26100
LeafDrupal\path\Tests\PathAliasTest13800
LeafDrupal\path\Tests\PathLanguageTest7100
LeafDrupal\path\Tests\PathLanguageUiTest7800
LeafDrupal\path\Tests\PathTaxonomyTermTest3700
LeafDrupal\php\Tests\PhpAccessTest3800
LeafDrupal\php\Tests\PhpFilterTest4200
LeafDrupal\picture\Tests\PictureAdminUITest5400
LeafDrupal\picture\Tests\PictureFieldDisplayTest11600
LeafDrupal\poll\Tests\PollBlockTest17200
LeafDrupal\poll\Tests\PollCreateTest26900
LeafDrupal\poll\Tests\PollDeleteChoiceTest5400
LeafDrupal\poll\Tests\PollExpirationTest5200
LeafDrupal\poll\Tests\PollJsAddChoiceTest1600
LeafDrupal\poll\Tests\PollTokenReplaceTest12500
LeafDrupal\poll\Tests\PollTranslateTest7300
LeafDrupal\poll\Tests\PollVoteCheckHostnameTest14000
LeafDrupal\poll\Tests\PollVoteTest14600
LeafDrupal\rdf\Tests\CommentAttributesTest20300
LeafDrupal\rdf\Tests\CrudTest1000
LeafDrupal\rdf\Tests\GetNamespacesTest700
LeafDrupal\rdf\Tests\GetRdfNamespacesTest500
LeafDrupal\rdf\Tests\MappingDefinitionTest5900
LeafDrupal\rdf\Tests\MappingHookTest600
LeafDrupal\rdf\Tests\RdfaMarkupTest2900
LeafDrupal\rdf\Tests\TrackerAttributesTest3300
LeafDrupal\rest\Tests\DBLogTest1800
LeafDrupal\rest\Tests\DeleteTest7900
LeafDrupal\rest\Tests\ReadTest3300
LeafDrupal\search\Tests\SearchAdvancedSearchFormTest3400
LeafDrupal\search\Tests\SearchBlockTest6400
LeafDrupal\search\Tests\SearchCommentCountToggleTest3100
LeafDrupal\search\Tests\SearchCommentTest19500
LeafDrupal\search\Tests\SearchConfigSettingsFormTest13200
LeafDrupal\search\Tests\SearchEmbedFormTest3200
LeafDrupal\search\Tests\SearchExactTest2500
LeafDrupal\search\Tests\SearchExcerptTest1800
LeafDrupal\search\Tests\SearchExpressionInsertExtractTest2400
LeafDrupal\search\Tests\SearchKeywordsConditionsTest2800
LeafDrupal\search\Tests\SearchLanguageTest4100
LeafDrupal\search\Tests\SearchMatchTest14700
LeafDrupal\search\Tests\SearchMultilingualEntityTest1000
LeafDrupal\search\Tests\SearchNodeAccessTest1600
LeafDrupal\search\Tests\SearchNumberMatchingTest29500
LeafDrupal\search\Tests\SearchNumbersTest17500
LeafDrupal\search\Tests\SearchPageOverrideTest1500
LeafDrupal\search\Tests\SearchPageTextTest3700
LeafDrupal\search\Tests\SearchPreprocessLangcodeTest3900
LeafDrupal\search\Tests\SearchRankingTest5900
LeafDrupal\search\Tests\SearchSimplifyTest65700
LeafDrupal\search\Tests\SearchTokenizerTest800
LeafDrupal\shortcut\Tests\ShortcutLinksTest14800
LeafDrupal\shortcut\Tests\ShortcutSetsTest23500
LeafDrupal\simpletest\Tests\BrokenSetUpTest2100
LeafDrupal\simpletest\Tests\BrowserTest1600
LeafDrupal\simpletest\Tests\DrupalUnitTestBaseTest3000
LeafDrupal\simpletest\Tests\FolderTest200
LeafDrupal\simpletest\Tests\InstallationProfileModuleTestsTest1900
LeafDrupal\simpletest\Tests\MailCaptureTest1200
LeafDrupal\simpletest\Tests\MissingCheckedRequirementsTest1900
LeafDrupal\simpletest\Tests\OtherInstallationProfileModuleTestsTest1200
LeafDrupal\simpletest\Tests\SimpleTestTest11400
LeafDrupal\standard\Tests\StandardTest700
LeafDrupal\statistics\Tests\StatisticsAdminTest11000
LeafDrupal\statistics\Tests\StatisticsBlockVisitorsTest4600
LeafDrupal\statistics\Tests\StatisticsLoggingTest3500
LeafDrupal\statistics\Tests\StatisticsReportsTest9200
LeafDrupal\statistics\Tests\StatisticsTokenReplaceTest3000
LeafDrupal\syslog\Tests\SyslogTest1700
LeafDrupal\system\Tests\Ajax\AjaxCommandsUnitTest1600
LeafDrupal\system\Tests\Ajax\CommandsTest7300
LeafDrupal\system\Tests\Ajax\DialogTest300
LeafDrupal\system\Tests\Ajax\ElementValidationTest700
LeafDrupal\system\Tests\Ajax\FormValuesTest2900
LeafDrupal\system\Tests\Ajax\FrameworkTest3400
LeafDrupal\system\Tests\Ajax\MultiFormTest3600
LeafDrupal\system\Tests\Batch\PageTest1600
LeafDrupal\system\Tests\Batch\PercentagesUnitTest1800
LeafDrupal\system\Tests\Batch\ProcessingTest16100
LeafDrupal\system\Tests\Bootstrap\GetFilenameUnitTest600
LeafDrupal\system\Tests\Bootstrap\HookBootExitTest1900
LeafDrupal\system\Tests\Bootstrap\IpAddressTest1100
LeafDrupal\system\Tests\Bootstrap\MiscUnitTest500
LeafDrupal\system\Tests\Bootstrap\OverrideServerVariablesUnitTest600
LeafDrupal\system\Tests\Bootstrap\PageCacheTest7900
LeafDrupal\system\Tests\Bootstrap\ResettableStaticUnitTest500
LeafDrupal\system\Tests\Bootstrap\TimerUnitTest500
LeafDrupal\system\Tests\Bootstrap\VariableTest900
LeafDrupal\system\Tests\Bundle\BundleTest900
LeafDrupal\system\Tests\Cache\BackendChainImplementationUnitTest4800
LeafDrupal\system\Tests\Cache\BackendChainUnitTest12600
LeafDrupal\system\Tests\Cache\ClearTest900
LeafDrupal\system\Tests\Cache\DatabaseBackendUnitTest12600
LeafDrupal\system\Tests\Cache\InstallTest1500
LeafDrupal\system\Tests\Cache\MemoryBackendUnitTest12600
LeafDrupal\system\Tests\Cache\NullBackendTest200
LeafDrupal\system\Tests\Common\AddFeedTest700
LeafDrupal\system\Tests\Common\AlterTest700
LeafDrupal\system\Tests\Common\ArrayUnitTest1300
LeafDrupal\system\Tests\Common\AttributesUnitTest700
LeafDrupal\system\Tests\Common\AutocompleteTagsUnitTest800
LeafDrupal\system\Tests\Common\CascadingStylesheetsTest4100
LeafDrupal\system\Tests\Common\CascadingStylesheetsUnitTest1200
LeafDrupal\system\Tests\Common\ColorTest8500
LeafDrupal\system\Tests\Common\FormatDateTest6700
LeafDrupal\system\Tests\Common\GotoTest2700
LeafDrupal\system\Tests\Common\HtmlIdentifierUnitTest1000
LeafDrupal\system\Tests\Common\HttpRequestTest3500
LeafDrupal\system\Tests\Common\InstallerLanguageTest800
LeafDrupal\system\Tests\Common\JavaScriptTest9500
LeafDrupal\system\Tests\Common\JsonUnitTest2100
LeafDrupal\system\Tests\Common\ParseInfoFileUnitTest300
LeafDrupal\system\Tests\Common\RegionContentTest1800
LeafDrupal\system\Tests\Common\RenderTest5400
LeafDrupal\system\Tests\Common\SchemaTest58800
LeafDrupal\system\Tests\Common\SimpleTestErrorCollectorTest1600
LeafDrupal\system\Tests\Common\SizeUnitTest3500
LeafDrupal\system\Tests\Common\SystemListingTest600
LeafDrupal\system\Tests\Common\TableSortExtenderUnitTest600
LeafDrupal\system\Tests\Common\UrlTest7000
LeafDrupal\system\Tests\Common\ValidNumberStepUnitTest2400
LeafDrupal\system\Tests\Common\ValidUrlUnitTest7900
LeafDrupal\system\Tests\Common\WriteRecordTest3400
LeafDrupal\system\Tests\Common\XssUnitTest1700
LeafDrupal\system\Tests\Database\AlterTest6200
LeafDrupal\system\Tests\Database\BasicSyntaxTest3000
LeafDrupal\system\Tests\Database\CaseSensitivityTest800
LeafDrupal\system\Tests\Database\ConnectionTest3800
LeafDrupal\system\Tests\Database\ConnectionUnitTest1200
LeafDrupal\system\Tests\Database\DeleteTruncateTest2300
LeafDrupal\system\Tests\Database\EmptyStatementTest400
LeafDrupal\system\Tests\Database\FetchTest10400
LeafDrupal\system\Tests\Database\InsertDefaultsTest3700
LeafDrupal\system\Tests\Database\InsertLobTest2200
LeafDrupal\system\Tests\Database\InsertTest9500
LeafDrupal\system\Tests\Database\InvalidDataTest1600
LeafDrupal\system\Tests\Database\LoggingTest8300
LeafDrupal\system\Tests\Database\MergeTest12600
LeafDrupal\system\Tests\Database\NextIdTest400
LeafDrupal\system\Tests\Database\QueryTest1400
LeafDrupal\system\Tests\Database\RangeQueryTest1600
LeafDrupal\system\Tests\Database\RegressionTest5400
LeafDrupal\system\Tests\Database\SelectComplexTest21000
LeafDrupal\system\Tests\Database\SelectOrderedTest4700
LeafDrupal\system\Tests\Database\SelectPagerDefaultTest5700
LeafDrupal\system\Tests\Database\SelectSubqueryTest4300
LeafDrupal\system\Tests\Database\SelectTableSortDefaultTest4500
LeafDrupal\system\Tests\Database\SelectTest15300
LeafDrupal\system\Tests\Database\SerializeQueryTest700
LeafDrupal\system\Tests\Database\TaggingTest3200
LeafDrupal\system\Tests\Database\TemporaryQueryTest1100
LeafDrupal\system\Tests\Database\TransactionTest7400
LeafDrupal\system\Tests\Database\UpdateComplexTest6700
LeafDrupal\system\Tests\Database\UpdateLobTest1500
LeafDrupal\system\Tests\Database\UpdateTest5600
LeafDrupal\system\Tests\Datetime\DateTimePlusTest5400
LeafDrupal\system\Tests\Datetime\DrupalDateTimeTest1400
LeafDrupal\system\Tests\DrupalKernel\ContentNegotiationTest4000
LeafDrupal\system\Tests\DrupalKernel\DrupalKernelTest800
LeafDrupal\system\Tests\Entity\EntityAccessTest3400
LeafDrupal\system\Tests\Entity\EntityApiInfoTest600
LeafDrupal\system\Tests\Entity\EntityApiTest800
LeafDrupal\system\Tests\Entity\EntityCrudHookTest11400
LeafDrupal\system\Tests\Entity\EntityFieldTest14500
LeafDrupal\system\Tests\Entity\EntityFormTest2600
LeafDrupal\system\Tests\Entity\EntityQueryRelationshipTest2000
LeafDrupal\system\Tests\Entity\EntityQueryTest6200
LeafDrupal\system\Tests\Entity\EntityRevisionsTest3100
LeafDrupal\system\Tests\Entity\EntityTranslationFormTest3600
LeafDrupal\system\Tests\Entity\EntityTranslationTest5100
LeafDrupal\system\Tests\Entity\EntityUUIDTest2100
LeafDrupal\system\Tests\FileTransfer\FileTransferTest200
LeafDrupal\system\Tests\File\DirectoryTest2000
LeafDrupal\system\Tests\File\MimeTypeTest4200
LeafDrupal\system\Tests\File\NameMungingTest500
LeafDrupal\system\Tests\File\RemoteFileDirectoryTest2400
LeafDrupal\system\Tests\File\RemoteFileScanDirectoryTest2900
LeafDrupal\system\Tests\File\RemoteFileUnmanagedCopyTest3200
LeafDrupal\system\Tests\File\RemoteFileUnmanagedDeleteRecursiveTest2100
LeafDrupal\system\Tests\File\RemoteFileUnmanagedDeleteTest1000
LeafDrupal\system\Tests\File\RemoteFileUnmanagedMoveTest2300
LeafDrupal\system\Tests\File\RemoteFileUnmanagedSaveDataTest800
LeafDrupal\system\Tests\File\ScanDirectoryTest2900
LeafDrupal\system\Tests\File\StreamWrapperTest1900
LeafDrupal\system\Tests\File\UnmanagedCopyTest2900
LeafDrupal\system\Tests\File\UnmanagedDeleteRecursiveTest1700
LeafDrupal\system\Tests\File\UnmanagedDeleteTest700
LeafDrupal\system\Tests\File\UnmanagedMoveTest2000
LeafDrupal\system\Tests\File\UnmanagedSaveDataTest700
LeafDrupal\system\Tests\File\UrlRewritingTest1400
LeafDrupal\system\Tests\Form\AlterTest400
LeafDrupal\system\Tests\Form\ArbitraryRebuildTest1600
LeafDrupal\system\Tests\Form\CheckboxTest9700
LeafDrupal\system\Tests\Form\ElementsLabelsTest2000
LeafDrupal\system\Tests\Form\ElementsTableSelectTest7100
LeafDrupal\system\Tests\Form\ElementsVerticalTabsTest3900
LeafDrupal\system\Tests\Form\ElementTest4200
LeafDrupal\system\Tests\Form\EmailTest1700
LeafDrupal\system\Tests\Form\FileInclusionTest1100
LeafDrupal\system\Tests\Form\FormTest71000
LeafDrupal\system\Tests\Form\HTMLIdTest700
LeafDrupal\system\Tests\Form\LanguageSelectElementTest4700
LeafDrupal\system\Tests\Form\ProgrammaticTest2400
LeafDrupal\system\Tests\Form\RebuildTest5300
LeafDrupal\system\Tests\Form\RedirectTest3100
LeafDrupal\system\Tests\Form\StateValuesCleanAdvancedTest700
LeafDrupal\system\Tests\Form\StateValuesCleanTest1400
LeafDrupal\system\Tests\Form\StorageTest17900
LeafDrupal\system\Tests\Form\TriggeringElementTest5000
LeafDrupal\system\Tests\Form\UrlTest1700
LeafDrupal\system\Tests\Form\ValidationTest13500
LeafDrupal\system\Tests\Form\WrapperTest500
LeafDrupal\system\Tests\Graph\GraphUnitTest5600
LeafDrupal\system\Tests\Image\FileMoveTest400
LeafDrupal\system\Tests\Image\ToolkitGdTest20400
LeafDrupal\system\Tests\Image\ToolkitTest5300
LeafDrupal\system\Tests\KeyValueStore\DatabaseStorageExpirableTest6800
LeafDrupal\system\Tests\KeyValueStore\DatabaseStorageTest3600
LeafDrupal\system\Tests\KeyValueStore\GarbageCollectionTest200
LeafDrupal\system\Tests\KeyValueStore\MemoryStorageTest3600
LeafDrupal\system\Tests\Lock\LockFunctionalTest2900
LeafDrupal\system\Tests\Mail\HtmlToTextTest8600
LeafDrupal\system\Tests\Mail\MailTest400
LeafDrupal\system\Tests\Menu\BreadcrumbTest40300
LeafDrupal\system\Tests\Menu\LinksTest5000
LeafDrupal\system\Tests\Menu\RebuildTest500
LeafDrupal\system\Tests\Menu\RouterTest25100
LeafDrupal\system\Tests\Menu\TrailTest6800
LeafDrupal\system\Tests\Menu\TreeDataUnitTest400
LeafDrupal\system\Tests\Menu\TreeOutputTest700
LeafDrupal\system\Tests\Module\ClassLoaderTest1000
LeafDrupal\system\Tests\Module\DependencyTest17000
LeafDrupal\system\Tests\Module\EnableDisableTest200400
LeafDrupal\system\Tests\Module\HookRequirementsTest1600
LeafDrupal\system\Tests\Module\InstallTest300
LeafDrupal\system\Tests\Module\ModuleApiTest7100
LeafDrupal\system\Tests\Module\ModuleEnable300
LeafDrupal\system\Tests\Module\RequiredTest1800
LeafDrupal\system\Tests\Module\UninstallTest200
LeafDrupal\system\Tests\Module\VersionTest5100
LeafDrupal\system\Tests\Pager\PagerTest12300
LeafDrupal\system\Tests\Path\AliasTest2700
LeafDrupal\system\Tests\Path\MatchPathTest4100
LeafDrupal\system\Tests\Path\UrlAlterFunctionalTest3700
LeafDrupal\system\Tests\PhpStorage\FileStorageTest1200
LeafDrupal\system\Tests\PhpStorage\MTimeProtectedFastFileStorageTest1900
LeafDrupal\system\Tests\PhpStorage\MTimeProtectedFileStorageTest1900
LeafDrupal\system\Tests\Plugin\AlterDecoratorTest300
LeafDrupal\system\Tests\Plugin\CacheDecoratorTest1400
LeafDrupal\system\Tests\Plugin\DerivativeTest900
LeafDrupal\system\Tests\Plugin\Discovery\AnnotatedClassDiscoveryTest700
LeafDrupal\system\Tests\Plugin\Discovery\StaticDiscoveryTest600
LeafDrupal\system\Tests\Plugin\FactoryTest900
LeafDrupal\system\Tests\Plugin\InspectionTest1000
LeafDrupal\system\Tests\Queue\QueueTest1400
LeafDrupal\system\Tests\Routing\ChainMatcherTest300
LeafDrupal\system\Tests\Routing\ControllerResolverTest100
LeafDrupal\system\Tests\Routing\FirstEntryFinalMatcherTest800
LeafDrupal\system\Tests\Routing\HttpMethodMatcherTest800
LeafDrupal\system\Tests\Routing\MatcherDumperTest800
LeafDrupal\system\Tests\Routing\MimeTypeMatcherTest1100
LeafDrupal\system\Tests\Routing\NestedMatcherTest100
LeafDrupal\system\Tests\Routing\PathMatcherTest2900
LeafDrupal\system\Tests\Routing\RouterPermissionTest1900
LeafDrupal\system\Tests\Routing\RouterTest3000
LeafDrupal\system\Tests\Routing\RouteTest600
LeafDrupal\system\Tests\Serialization\SerializationTest200
LeafDrupal\system\Tests\Session\SessionHttpsTest8300
LeafDrupal\system\Tests\Session\SessionTest19000
LeafDrupal\system\Tests\System\AccessDeniedTest6800
LeafDrupal\system\Tests\System\AdminMetaTagTest300
LeafDrupal\system\Tests\System\AdminTest18100
LeafDrupal\system\Tests\System\CronRunTest5200
LeafDrupal\system\Tests\System\DateFormatsLanguageTest5200
LeafDrupal\system\Tests\System\DateTimeTest7600
LeafDrupal\system\Tests\System\DefaultMobileMetaTagsTest1200
LeafDrupal\system\Tests\System\ErrorHandlerTest4000
LeafDrupal\system\Tests\System\ExceptionControllerTest200
LeafDrupal\system\Tests\System\FloodTest1000
LeafDrupal\system\Tests\System\FrontPageTest3700
LeafDrupal\system\Tests\System\IndexPhpTest600
LeafDrupal\system\Tests\System\InfoAlterTest1000
LeafDrupal\system\Tests\System\InfoFileParserUnitTest900
LeafDrupal\system\Tests\System\MainContentFallbackTest6900
LeafDrupal\system\Tests\System\PageNotFoundTest1800
LeafDrupal\system\Tests\System\PageTitleFilteringTest6800
LeafDrupal\system\Tests\System\PasswordHashingTest1000
LeafDrupal\system\Tests\System\RetrieveFileTest700
LeafDrupal\system\Tests\System\ShutdownFunctionsTest500
LeafDrupal\system\Tests\System\SiteMaintenanceTest15200
LeafDrupal\system\Tests\System\SystemAuthorizeTest3200
LeafDrupal\system\Tests\System\ThemeTest21500
LeafDrupal\system\Tests\System\TokenReplaceTest4200
LeafDrupal\system\Tests\System\UnicodeUnitTest28500
LeafDrupal\system\Tests\Theme\EntityFilteringThemeTest5600
LeafDrupal\system\Tests\Theme\FastTest1200
LeafDrupal\system\Tests\Theme\FunctionsTest2500
LeafDrupal\system\Tests\Theme\HookInitTest500
LeafDrupal\system\Tests\Theme\HtmlTagUnitTest200
LeafDrupal\system\Tests\Theme\HtmlTplPhpAttributesTest500
LeafDrupal\system\Tests\Theme\RegistryTest600
LeafDrupal\system\Tests\Theme\TableTest600
LeafDrupal\system\Tests\Theme\ThemeTest4800
LeafDrupal\system\Tests\Theme\ThemeTestTwig1000
LeafDrupal\system\Tests\Theme\TwigReferenceUnitTest1500
LeafDrupal\system\Tests\Transliteration\TransliterationTest2600
LeafDrupal\system\Tests\TypedData\TypedDataTest6100
LeafDrupal\system\Tests\Update\DependencyHookInvocationTest400
LeafDrupal\system\Tests\Update\DependencyMissingTest400
LeafDrupal\system\Tests\Update\DependencyOrderingTest500
LeafDrupal\system\Tests\Update\UpdateScriptTest20100
LeafDrupal\system\Tests\Upgrade\BareMinimalUpgradePathTest6200
LeafDrupal\system\Tests\Upgrade\BareStandardUpgradePathTest6800
LeafDrupal\system\Tests\Upgrade\BlockUpgradePathTest3400
LeafDrupal\system\Tests\Upgrade\CommentUpgradePathTest4100
LeafDrupal\system\Tests\Upgrade\FilledMinimalUpgradePathTest6200
LeafDrupal\system\Tests\Upgrade\FilledStandardUpgradePathTest8300
LeafDrupal\system\Tests\Upgrade\ImageUpgradePathTest3000
LeafDrupal\system\Tests\Upgrade\LanguageUpgradePathTest16200
LeafDrupal\system\Tests\Upgrade\ModulesDisabledUpgradePathTest3100
LeafDrupal\system\Tests\Upgrade\StateSystemUpgradePathTest5000
LeafDrupal\system\Tests\Upgrade\SystemUpgradePathTest5300
LeafDrupal\system\Tests\Upgrade\UserPictureUpgradePathTest4300
LeafDrupal\system\Tests\Upgrade\UserRoleUpgradePathTest4900
LeafDrupal\system\Tests\Upgrade\UuidUpgradePathTest3500
LeafDrupal\system\Tests\Uuid\UuidUnitTest700
LeafDrupal\taxonomy\Tests\EfqTest2600
LeafDrupal\taxonomy\Tests\HooksTest2400
LeafDrupal\taxonomy\Tests\LegacyTest1400
LeafDrupal\taxonomy\Tests\LoadMultipleTest1800
LeafDrupal\taxonomy\Tests\RssTest2600
LeafDrupal\taxonomy\Tests\TaxonomyTermReferenceItemTest1000
LeafDrupal\taxonomy\Tests\TermFieldMultipleVocabularyTest2600
LeafDrupal\taxonomy\Tests\TermFieldTest4500
LeafDrupal\taxonomy\Tests\TermIndexTest4600
LeafDrupal\taxonomy\Tests\TermLanguageTest6400
LeafDrupal\taxonomy\Tests\TermTest26400
LeafDrupal\taxonomy\Tests\TermTranslationUITest9900
LeafDrupal\taxonomy\Tests\TermUnitTest1100
LeafDrupal\taxonomy\Tests\ThemeTest1900
LeafDrupal\taxonomy\Tests\TokenReplaceTest5500
LeafDrupal\taxonomy\Tests\VocabularyLanguageTest6100
LeafDrupal\taxonomy\Tests\VocabularyTest11000
LeafDrupal\taxonomy\Tests\VocabularyUnitTest8300
LeafDrupal\text\Tests\TextFieldTest18600
LeafDrupal\text\Tests\TextSummaryTest13800
LeafDrupal\text\Tests\TextTranslationTest10400
LeafDrupal\toolbar\Tests\ToolbarHookToolbarTest1500
LeafDrupal\tracker\Tests\TrackerNodeAccessTest2800
LeafDrupal\tracker\Tests\TrackerTest22800
LeafDrupal\translation\Tests\TranslationTest59000
LeafDrupal\translation_entity\Tests\ConfigTestTranslationUITest1300
LeafDrupal\translation_entity\Tests\EntityTestTranslationUITest6800
LeafDrupal\update\Tests\UpdateContribTest18700
LeafDrupal\update\Tests\UpdateCoreTest21400
LeafDrupal\update\Tests\UpdateCoreUnitTest400
LeafDrupal\update\Tests\UpdateUploadTest6400
LeafDrupal\user\Tests\TempStoreDatabaseTest1900
LeafDrupal\user\Tests\UserAccountLinksTests6100
LeafDrupal\user\Tests\UserAdminSettingsFormTest400
LeafDrupal\user\Tests\UserAdminTest6100
LeafDrupal\user\Tests\UserAuthmapAssignmentTest600
LeafDrupal\user\Tests\UserAutocompleteTest2500
LeafDrupal\user\Tests\UserBlocksTests4000
LeafDrupal\user\Tests\UserCancelTest26400
LeafDrupal\user\Tests\UserCreateTest3300
LeafDrupal\user\Tests\UserDeleteTest1500
LeafDrupal\user\Tests\UserEditedOwnAccountTest2200
LeafDrupal\user\Tests\UserEditTest7300
LeafDrupal\user\Tests\UserEntityCallbacksTest700
LeafDrupal\user\Tests\UserLanguageCreationTest6800
LeafDrupal\user\Tests\UserLanguageTest3900
LeafDrupal\user\Tests\UserLoginTest15900
LeafDrupal\user\Tests\UserPasswordResetTest3000
LeafDrupal\user\Tests\UserPermissionsTest5000
ExpandDrupal\user\Tests\UserPictureTest4440
MessageGroupFilenameLineFunctionStatus
Failed to set field comment_body[und][0][value] to R0IKyS6lOtherUserPictureTest.php120Drupal\user\Tests\UserPictureTest->testPictureOnNodeComment()
Found the Save buttonOtherUserPictureTest.php120Drupal\user\Tests\UserPictureTest->testPictureOnNodeComment()
Found the requested form fields at comment/reply/1OtherUserPictureTest.php120Drupal\user\Tests\UserPictureTest->testPictureOnNodeComment()
User picture found on comment.OtherUserPictureTest.php121Drupal\user\Tests\UserPictureTest->testPictureOnNodeComment()
LeafDrupal\user\Tests\UserRegistrationTest12900
LeafDrupal\user\Tests\UserRoleAdminTest5400
LeafDrupal\user\Tests\UserRolesAssignmentTest5100
LeafDrupal\user\Tests\UserSaveTest200
LeafDrupal\user\Tests\UserSearchTest3700
LeafDrupal\user\Tests\UserSignatureTest4600
LeafDrupal\user\Tests\UserTimeZoneTest2900
LeafDrupal\user\Tests\UserTokenReplaceTest4700
LeafDrupal\user\Tests\UserTranslationUITest8900
LeafDrupal\user\Tests\UserValidateCurrentPassCustomFormTest1700
LeafDrupal\user\Tests\UserValidationTest1600
LeafDrupal\views\Tests\AnalyzeTest1800
LeafDrupal\views\Tests\BasicTest800
LeafDrupal\views\Tests\Comment\ArgumentUserUIDTest900
LeafDrupal\views\Tests\Comment\DefaultViewRecentComments800
LeafDrupal\views\Tests\Comment\FilterUserUIDTest900
ExpandDrupal\views\Tests\Comment\WizardTest3500
MessageGroupFilenameLineFunctionStatus
'Missing handler: comment node relationship'Debugviews.module1202views_get_handler()
'Missing handler: comment node relationship'Debugviews.module1202views_get_handler()
'Missing handler: comment node relationship'Debugviews.module1202views_get_handler()
'Missing handler: comment node relationship'Debugviews.module1202views_get_handler()
'Missing handler: comment node relationship'Debugviews.module1202views_get_handler()
'Missing handler: comment node relationship'Debugviews.module1202views_get_handler()
'Missing handler: comment node relationship'Debugviews.module1202views_get_handler()
'Missing handler: comment node relationship'Debugviews.module1202views_get_handler()
'Missing handler: comment node relationship'Debugviews.module1202views_get_handler()
'Missing handler: comment node relationship'Debugviews.module1202views_get_handler()
'Missing handler: comment node relationship'Debugviews.module1202views_get_handler()
'Missing handler: comment node relationship'Debugviews.module1202views_get_handler()
'Missing handler: comment node relationship'Debugviews.module1202views_get_handler()
'Missing handler: comment node relationship'Debugviews.module1202views_get_handler()
ExpandDrupal\views\Tests\DefaultViewsTest7200
MessageGroupFilenameLineFunctionStatus
'Missing handler: search_node_links_to nid argument'Debugviews.module1202views_get_handler()
'Missing handler: search_node_links_to nid argument'Debugviews.module1202views_get_handler()
'Missing handler: search_node_links_to nid argument'Debugviews.module1202views_get_handler()
'Missing handler: history timestamp field'Debugviews.module1202views_get_handler()
'Missing handler: history timestamp field'Debugviews.module1202views_get_handler()
LeafDrupal\views\Tests\Entity\FieldEntityTest400
LeafDrupal\views\Tests\Field\ApiDataTest1500
LeafDrupal\views\Tests\Field\HandlerFieldFieldTest2400
LeafDrupal\views\Tests\GlossaryTest800
LeafDrupal\views\Tests\Handler\AreaTest9000
LeafDrupal\views\Tests\Handler\AreaTextTest400
LeafDrupal\views\Tests\Handler\ArgumentNullTest400
LeafDrupal\views\Tests\Handler\ArgumentStringTest400
LeafDrupal\views\Tests\Handler\FieldBooleanTest1000
LeafDrupal\views\Tests\Handler\FieldCounterTest600
LeafDrupal\views\Tests\Handler\FieldCustomTest100
LeafDrupal\views\Tests\Handler\FieldDateTest1400
LeafDrupal\views\Tests\Handler\FieldFileSizeTest800
LeafDrupal\views\Tests\Handler\FieldUnitTest9000
LeafDrupal\views\Tests\Handler\FieldUrlTest200
LeafDrupal\views\Tests\Handler\FieldWebTest10900
LeafDrupal\views\Tests\Handler\FieldXssTest300
LeafDrupal\views\Tests\Handler\FilterCombineTest100
LeafDrupal\views\Tests\Handler\FilterDateTest2200
LeafDrupal\views\Tests\Handler\FilterEqualityTest400
LeafDrupal\views\Tests\Handler\FilterInOperatorTest800
LeafDrupal\views\Tests\Handler\FilterNumericTest1400
LeafDrupal\views\Tests\Handler\FilterStringTest2600
LeafDrupal\views\Tests\Handler\HandlerAliasTest800
ExpandDrupal\views\Tests\Handler\HandlerAllTest26700
MessageGroupFilenameLineFunctionStatus
'Missing handler: comment entity_type sort'Debugviews.module1202views_get_handler()
'Missing handler: comment field_name sort'Debugviews.module1202views_get_handler()
'Missing handler: comment entity_type sort'Debugviews.module1202views_get_handler()
'Missing handler: comment field_name sort'Debugviews.module1202views_get_handler()
ExpandDrupal\views\Tests\Handler\HandlerTest11600
MessageGroupFilenameLineFunctionStatus
'Missing handler: lTq7Nn9p hbkQ4b4u relationship'Debugviews.module1202views_get_handler()
'Missing handler: lTq7Nn9p hbkQ4b4u relationship'Debugviews.module1202views_get_handler()
LeafDrupal\views\Tests\Handler\RelationshipTest400
LeafDrupal\views\Tests\Handler\SortDateTest2400
LeafDrupal\views\Tests\Handler\SortRandomTest600
LeafDrupal\views\Tests\Handler\SortTest800
LeafDrupal\views\Tests\Language\ArgumentLanguageTest200
LeafDrupal\views\Tests\Language\FieldLanguageTest200
LeafDrupal\views\Tests\Language\FilterLanguageTest200
ExpandDrupal\views\Tests\ModuleTest4800
MessageGroupFilenameLineFunctionStatus
'Missing handler: uEJGQXFg yvKKRVfl field'Debugviews.module1202views_get_handler()
'Missing handler: m57a1GGh uwo8q8it area'Debugviews.module1202views_get_handler()
'Missing handler: zNFPDEfI eSecgdFQ filter'Debugviews.module1202views_get_handler()
LeafDrupal\views\Tests\Node\FieldTypeTest200
LeafDrupal\views\Tests\Node\FilterUidRevisionTest400
LeafDrupal\views\Tests\Node\RevisionRelationships300
LeafDrupal\views\Tests\Node\StatusExtraTest6800
LeafDrupal\views\Tests\PluginInstanceTest25800
LeafDrupal\views\Tests\PluginTypeListTest100
LeafDrupal\views\Tests\Plugin\AccessTest3900
LeafDrupal\views\Tests\Plugin\ArgumentDefaultTest2400
LeafDrupal\views\Tests\Plugin\ArgumentValidatorTest400
LeafDrupal\views\Tests\Plugin\CacheTest1200
LeafDrupal\views\Tests\Plugin\DisplayExtenderTest600
LeafDrupal\views\Tests\Plugin\DisplayFeedTest2800
LeafDrupal\views\Tests\Plugin\DisplayPageTest700
LeafDrupal\views\Tests\Plugin\DisplayTest3900
LeafDrupal\views\Tests\Plugin\ExposedFormTest11400
LeafDrupal\views\Tests\Plugin\FilterTest1300
ExpandDrupal\views\Tests\Plugin\JoinTest1600
MessageGroupFilenameLineFunctionStatus
array ( 'join type' => 'LEFT', 'table' => 'users', 'alias' => 'users', 'condition' => 'node.uid = users.uid AND (node.uid = 246)', 'arguments' => array ( ), )DebugJoinTest.php70Drupal\views\Tests\Plugin\JoinTest->testExamplePlugin()
LeafDrupal\views\Tests\Plugin\PagerTest9200
LeafDrupal\views\Tests\Plugin\QueryTest200
LeafDrupal\views\Tests\Plugin\StyleMappingTest4200
LeafDrupal\views\Tests\Plugin\StyleTest2400
LeafDrupal\views\Tests\Plugin\StyleUnformattedTest1700
LeafDrupal\views\Tests\QueryGroupByTest4000
ExpandDrupal\views\Tests\Taxonomy\RelationshipNodeTermDataTest200
MessageGroupFilenameLineFunctionStatus
'Missing handler: nid nid sort'Debugviews.module1202views_get_handler()
LeafDrupal\views\Tests\Taxonomy\RelationshipRepresentativeNode200
LeafDrupal\views\Tests\TokenReplaceTest1100
LeafDrupal\views\Tests\UI\DefaultViewsTest11000
LeafDrupal\views\Tests\UI\DisplayExtenderUITest2300
LeafDrupal\views\Tests\UI\DisplayPath2200
LeafDrupal\views\Tests\UI\DisplayTest20100
LeafDrupal\views\Tests\UI\GroupByTest2600
LeafDrupal\views\Tests\UI\HandlerTest11000
LeafDrupal\views\Tests\UI\OverrideDisplaysTest16700
LeafDrupal\views\Tests\UI\PreviewTest2400
LeafDrupal\views\Tests\UI\QueryTest1900
LeafDrupal\views\Tests\UI\RedirectTest2600
LeafDrupal\views\Tests\UI\RowUITest3000
LeafDrupal\views\Tests\UI\SettingsTest9000
LeafDrupal\views\Tests\UI\StorageTest2100
LeafDrupal\views\Tests\UI\StyleUITest3000
LeafDrupal\views\Tests\UI\TagTest1100
LeafDrupal\views\Tests\User\AccessPermissionTest1400
LeafDrupal\views\Tests\User\AccessRoleTest1400
LeafDrupal\views\Tests\User\ArgumentDefaultTest900
LeafDrupal\views\Tests\User\ArgumentValidateTest1900
LeafDrupal\views\Tests\User\HandlerArgumentUserUidTest500
LeafDrupal\views\Tests\User\HandlerFieldUserNameTest700
LeafDrupal\views\Tests\User\HandlerFilterUserNameTest5700
LeafDrupal\views\Tests\User\RelationshipRepresentativeNode300
LeafDrupal\views\Tests\ViewElementTest1500
ExpandDrupal\views\Tests\ViewExecutableTest4804
MessageGroupFilenameLineFunctionStatus
'Missing handler: node comment_cid relationship'Debugviews.module1202views_get_handler()
'Missing handler: node comment_cid relationship'Debugviews.module1202views_get_handler()
Undefined index: baseDrupal\views\Plugin\views\query\Sql->get_entity_tables() Drupal\views\Plugin\views\query\Sql->query() Drupal\views\Plugin\views\query\Sql->build(Object) Drupal\views\ViewExecutable->build(NULL) Drupal\views\ViewExecutable->execute(NULL) Drupal\views\ViewExecutable->render() Drupal\views\Plugin\views\display\DisplayPluginBase->preview() Drupal\views\ViewExecutable->preview() Drupal\views\Tests\ViewExecutableTest->testDestroy() Drupal\simpletest\TestBase->run() simpletest_script_run_one_test('611', 'Drupal\views\Tests\ViewExecutableTest') NoticeSql.php1554Drupal\views\Plugin\views\query\Sql->get_entity_tables()
Undefined index: baseDrupal\views\Plugin\views\query\Sql->get_entity_tables() Drupal\views\Plugin\views\query\Sql->query(1) Drupal\views\Plugin\views\query\Sql->build(Object) Drupal\views\ViewExecutable->build(NULL) Drupal\views\ViewExecutable->execute(NULL) Drupal\views\ViewExecutable->render() Drupal\views\Plugin\views\display\DisplayPluginBase->preview() Drupal\views\ViewExecutable->preview() Drupal\views\Tests\ViewExecutableTest->testDestroy() Drupal\simpletest\TestBase->run() simpletest_script_run_one_test('611', 'Drupal\views\Tests\ViewExecutableTest') NoticeSql.php1554Drupal\views\Plugin\views\query\Sql->get_entity_tables()
htmlspecialchars() expects parameter 1 to be string, array givenhtmlspecialchars(Array, 3, 'UTF-8') check_plain(Array) drupal_placeholder(Array) format_string('%type: !message in %function (line %line of %file). !backtrace', Array) Drupal\simpletest\TestBase->exceptionHandler(Object) Drupal\simpletest\TestBase->run() simpletest_script_run_one_test('611', 'Drupal\views\Tests\ViewExecutableTest') Warningbootstrap.inc1586check_plain()
Drupal\Core\Database\IntegrityConstraintViolationException: SQLSTATE[23000]: Integrity constraint violation: 1052 Column 'uid' in on clause is ambiguous: SELECT COUNT(*) AS expression FROM (SELECT 1 AS expression FROM {node} node LEFT JOIN {comment} comment_comment ON pid = comment_comment.cid LEFT JOIN {users} users_comment ON uid = users_comment.uid WHERE (( (node.nid = :db_condition_placeholder_0) AND (node.status = :db_condition_placeholder_1) AND (node.title LIKE :db_condition_placeholder_2 ESCAPE '\\') ))) subquery; Array ( [:db_condition_placeholder_0] => [:db_condition_placeholder_1] => 0 [:db_condition_placeholder_2] => ) in Drupal\Core\Database\Connection->query() (line 551 of /var/lib/drupaltestbot/sites/default/files/checkout/core/lib/Drupal/Core/Database/Connection.php). ">Drupal\Core\Database\Connection->query('SELECT COUNT(*) AS expression FROM (SELECT 1 AS expression FROM {node} node LEFT JOIN {comment} comment_comment ON pid = comment_comment.cid LEFT JOIN {users} users_comment ON uid = users_comment.uid WHERE (( (node.nid = :db_condition_placeholder_0) AND (node.status = :db_condition_placeholder_1) AND (node.title LIKE :db_condition_placeholder_2 ESCAPE '\\') ))) subquery', Array, Array) Drupal\Core\Database\Query\Select->execute() Drupal\views\Plugin\views\pager\PagerPluginBase->execute_count_query(Object) Drupal\views\Plugin\views\query\Sql->execute(Object) Drupal\views\ViewExecutable->execute(NULL) Drupal\views\ViewExecutable->render() Drupal\views\Plugin\views\display\DisplayPluginBase->preview() Drupal\views\ViewExecutable->preview() Drupal\views\Tests\ViewExecutableTest->testDestroy() Drupal\simpletest\TestBase->run() simpletest_script_run_one_test('611', 'Drupal\views\Tests\ViewExecutableTest') Uncaught exceptionConnection.php551Drupal\Core\Database\Connection->query()
'Missing handler: node comment_cid relationship'Debugviews.module1202views_get_handler()
'Missing handler: node comment_cid relationship'Debugviews.module1202views_get_handler()
'Missing handler: node comment_cid relationship'Debugviews.module1202views_get_handler()
'Missing handler: node comment_cid relationship'Debugviews.module1202views_get_handler()
LeafDrupal\views\Tests\ViewsDataTest1200
ExpandDrupal\views\Tests\ViewStorageTest10900
MessageGroupFilenameLineFunctionStatus
'Missing handler: views_test_data id field'Debugviews.module1202views_get_handler()
'Missing handler: views_test_data name field'Debugviews.module1202views_get_handler()
LeafDrupal\views\Tests\Wizard\BasicTest7800
LeafDrupal\views\Tests\Wizard\ItemsPerPageTest4000
LeafDrupal\views\Tests\Wizard\MenuTest2000
LeafDrupal\views\Tests\Wizard\SortingTest3100
LeafDrupal\views\Tests\Wizard\TaggedWithTest7800
LeafDrupal\xmlrpc\Tests\XmlRpcBasicTest900
LeafDrupal\xmlrpc\Tests\XmlRpcMessagesTest700
LeafDrupal\xmlrpc\Tests\XmlRpcValidatorTest1000