framework.themes.86.patch

Test status
StatusResult
Last receivedSat, 12/01/2012 - 01:46:55
Last requestedSat, 12/01/2012 - 01:47:51
Last testedSat, 12/01/2012 - 02:39:53
Test count1
Environment status
MySQLfail
File information
Fileframework.themes.86.patch
BranchDrupal core - 8.x
LinkIssue Link
SummaryFAILED: [[SimpleTest]]: [MySQL] 48,439 pass(es), 66 fail(s), and 82 exception(s).
Details

MySQL

  1. Setup environment
  2. Detect an invalid patch URL
  3. Detect invalid repository information
  4. Detect invalid patch format
  5. Detect a non-applicable patch
  6. Detect invalid PHP syntax
  7. Detect a Drupal installation failure
  8. Detect a test run failure
  9. Detect a failing test
    Review the test failures below then if necessary run them locally until the problem has been fixed.
  10. Complete test suite with all tests passing
48,439 pass(es), 66 fail(s), and 82 exception(s)

Non-pass

Test namePassFailException
ExpandDrupal\color\Tests\ColorTest654472
MessageGroupFilenameLineFunctionStatus
Illegal offset type in isset or emptyWarningcolor.module114color_get_info()
Illegal offset type in isset or emptyWarningbootstrap.inc895drupal_get_filename()
Illegal offset type in isset or emptyWarningbootstrap.inc905drupal_get_filename()
Illegal offset type in isset or emptyWarningbootstrap.inc917drupal_get_filename()
Illegal offset type in isset or emptyWarningbootstrap.inc954drupal_get_filename()
Illegal offset type in isset or emptyWarningcolor.module114color_get_info()
Illegal offset type in isset or emptyWarningbootstrap.inc895drupal_get_filename()
Illegal offset type in isset or emptyWarningbootstrap.inc905drupal_get_filename()
Illegal offset type in isset or emptyWarningbootstrap.inc917drupal_get_filename()
Illegal offset type in isset or emptyWarningbootstrap.inc954drupal_get_filename()
Failed to set field scheme to OtherColorTest.php87Drupal\color\Tests\ColorTest->_testColor()
Failed to set field palette[bg] to #123456OtherColorTest.php87Drupal\color\Tests\ColorTest->_testColor()
Found the requested form fields at admin/appearance/settings/bartikOtherColorTest.php87Drupal\color\Tests\ColorTest->_testColor()
Undefined offset: 0Drupal\color\Tests\ColorTest->_testColor('bartik', Array) Drupal\color\Tests\ColorTest->testColor() Drupal\simpletest\TestBase->run() simpletest_script_run_one_test('62', 'Drupal\color\Tests\ColorTest') NoticeColorTest.php91Drupal\color\Tests\ColorTest->_testColor()
Undefined offset: 0Drupal\color\Tests\ColorTest->_testColor('bartik', Array) Drupal\color\Tests\ColorTest->testColor() Drupal\simpletest\TestBase->run() simpletest_script_run_one_test('62', 'Drupal\color\Tests\ColorTest') NoticeColorTest.php93Drupal\color\Tests\ColorTest->_testColor()
file(): Filename cannot be emptyfile('') Drupal\color\Tests\ColorTest->_testColor('bartik', Array) Drupal\color\Tests\ColorTest->testColor() Drupal\simpletest\TestBase->run() simpletest_script_run_one_test('62', 'Drupal\color\Tests\ColorTest') WarningColorTest.php93Drupal\color\Tests\ColorTest->_testColor()
join(): Invalid arguments passedjoin(' ', ) Drupal\color\Tests\ColorTest->_testColor('bartik', Array) Drupal\color\Tests\ColorTest->testColor() Drupal\simpletest\TestBase->run() simpletest_script_run_one_test('62', 'Drupal\color\Tests\ColorTest') WarningColorTest.php93Drupal\color\Tests\ColorTest->_testColor()
Make sure the color we changed is in the color stylesheet. (bartik)OtherColorTest.php94Drupal\color\Tests\ColorTest->_testColor()
Illegal offset type in isset or emptyWarningcolor.module114color_get_info()
Illegal offset type in isset or emptyWarningbootstrap.inc895drupal_get_filename()
Illegal offset type in isset or emptyWarningbootstrap.inc905drupal_get_filename()
Illegal offset type in isset or emptyWarningbootstrap.inc917drupal_get_filename()
Illegal offset type in isset or emptyWarningbootstrap.inc954drupal_get_filename()
Illegal offset type in isset or emptyWarningcolor.module114color_get_info()
Illegal offset type in isset or emptyWarningbootstrap.inc895drupal_get_filename()
Illegal offset type in isset or emptyWarningbootstrap.inc905drupal_get_filename()
Illegal offset type in isset or emptyWarningbootstrap.inc917drupal_get_filename()
Illegal offset type in isset or emptyWarningbootstrap.inc954drupal_get_filename()
Failed to set field scheme to slateOtherColorTest.php99Drupal\color\Tests\ColorTest->_testColor()
Failed to set field palette[bg] to #123456OtherColorTest.php99Drupal\color\Tests\ColorTest->_testColor()
Found the requested form fields at admin/appearance/settings/bartikOtherColorTest.php99Drupal\color\Tests\ColorTest->_testColor()
Undefined offset: 0Drupal\color\Tests\ColorTest->_testColor('bartik', Array) Drupal\color\Tests\ColorTest->testColor() Drupal\simpletest\TestBase->run() simpletest_script_run_one_test('62', 'Drupal\color\Tests\ColorTest') NoticeColorTest.php103Drupal\color\Tests\ColorTest->_testColor()
file(): Filename cannot be emptyfile('') Drupal\color\Tests\ColorTest->_testColor('bartik', Array) Drupal\color\Tests\ColorTest->testColor() Drupal\simpletest\TestBase->run() simpletest_script_run_one_test('62', 'Drupal\color\Tests\ColorTest') WarningColorTest.php103Drupal\color\Tests\ColorTest->_testColor()
join(): Invalid arguments passedjoin(' ', ) Drupal\color\Tests\ColorTest->_testColor('bartik', Array) Drupal\color\Tests\ColorTest->testColor() Drupal\simpletest\TestBase->run() simpletest_script_run_one_test('62', 'Drupal\color\Tests\ColorTest') WarningColorTest.php103Drupal\color\Tests\ColorTest->_testColor()
Make sure the color we changed is in the color stylesheet. (bartik)OtherColorTest.php104Drupal\color\Tests\ColorTest->_testColor()
Illegal offset type in isset or emptyWarningcolor.module114color_get_info()
Illegal offset type in isset or emptyWarningbootstrap.inc895drupal_get_filename()
Illegal offset type in isset or emptyWarningbootstrap.inc905drupal_get_filename()
Illegal offset type in isset or emptyWarningbootstrap.inc917drupal_get_filename()
Illegal offset type in isset or emptyWarningbootstrap.inc954drupal_get_filename()
Failed to set field scheme to OtherColorTest.php133Drupal\color\Tests\ColorTest->testValidColor()
Failed to set field palette[bg] to #000OtherColorTest.php133Drupal\color\Tests\ColorTest->testValidColor()
Found the requested form fields at admin/appearance/settings/bartikOtherColorTest.php133Drupal\color\Tests\ColorTest->testValidColor()
"The configuration options have been saved." foundOtherColorTest.php136Drupal\color\Tests\ColorTest->testValidColor()
Illegal offset type in isset or emptyWarningcolor.module114color_get_info()
Illegal offset type in isset or emptyWarningbootstrap.inc895drupal_get_filename()
Illegal offset type in isset or emptyWarningbootstrap.inc905drupal_get_filename()
Illegal offset type in isset or emptyWarningbootstrap.inc917drupal_get_filename()
Illegal offset type in isset or emptyWarningbootstrap.inc954drupal_get_filename()
Failed to set field scheme to OtherColorTest.php133Drupal\color\Tests\ColorTest->testValidColor()
Failed to set field palette[bg] to #123456OtherColorTest.php133Drupal\color\Tests\ColorTest->testValidColor()
Found the requested form fields at admin/appearance/settings/bartikOtherColorTest.php133Drupal\color\Tests\ColorTest->testValidColor()
"The configuration options have been saved." foundOtherColorTest.php136Drupal\color\Tests\ColorTest->testValidColor()
Illegal offset type in isset or emptyWarningcolor.module114color_get_info()
Illegal offset type in isset or emptyWarningbootstrap.inc895drupal_get_filename()
Illegal offset type in isset or emptyWarningbootstrap.inc905drupal_get_filename()
Illegal offset type in isset or emptyWarningbootstrap.inc917drupal_get_filename()
Illegal offset type in isset or emptyWarningbootstrap.inc954drupal_get_filename()
Failed to set field scheme to OtherColorTest.php133Drupal\color\Tests\ColorTest->testValidColor()
Failed to set field palette[bg] to #abcdefOtherColorTest.php133Drupal\color\Tests\ColorTest->testValidColor()
Found the requested form fields at admin/appearance/settings/bartikOtherColorTest.php133Drupal\color\Tests\ColorTest->testValidColor()
"The configuration options have been saved." foundOtherColorTest.php136Drupal\color\Tests\ColorTest->testValidColor()
Illegal offset type in isset or emptyWarningcolor.module114color_get_info()
Illegal offset type in isset or emptyWarningbootstrap.inc895drupal_get_filename()
Illegal offset type in isset or emptyWarningbootstrap.inc905drupal_get_filename()
Illegal offset type in isset or emptyWarningbootstrap.inc917drupal_get_filename()
Illegal offset type in isset or emptyWarningbootstrap.inc954drupal_get_filename()
Failed to set field scheme to OtherColorTest.php133Drupal\color\Tests\ColorTest->testValidColor()
Failed to set field palette[bg] to #0OtherColorTest.php133Drupal\color\Tests\ColorTest->testValidColor()
Found the requested form fields at admin/appearance/settings/bartikOtherColorTest.php133Drupal\color\Tests\ColorTest->testValidColor()
"You must enter a valid hexadecimal color value for Main background." foundOtherColorTest.php139Drupal\color\Tests\ColorTest->testValidColor()
Illegal offset type in isset or emptyWarningcolor.module114color_get_info()
Illegal offset type in isset or emptyWarningbootstrap.inc895drupal_get_filename()
Illegal offset type in isset or emptyWarningbootstrap.inc905drupal_get_filename()
Illegal offset type in isset or emptyWarningbootstrap.inc917drupal_get_filename()
Illegal offset type in isset or emptyWarningbootstrap.inc954drupal_get_filename()
Failed to set field scheme to OtherColorTest.php133Drupal\color\Tests\ColorTest->testValidColor()
Failed to set field palette[bg] to #00OtherColorTest.php133Drupal\color\Tests\ColorTest->testValidColor()
Found the requested form fields at admin/appearance/settings/bartikOtherColorTest.php133Drupal\color\Tests\ColorTest->testValidColor()
"You must enter a valid hexadecimal color value for Main background." foundOtherColorTest.php139Drupal\color\Tests\ColorTest->testValidColor()
Illegal offset type in isset or emptyWarningcolor.module114color_get_info()
Illegal offset type in isset or emptyWarningbootstrap.inc895drupal_get_filename()
Illegal offset type in isset or emptyWarningbootstrap.inc905drupal_get_filename()
Illegal offset type in isset or emptyWarningbootstrap.inc917drupal_get_filename()
Illegal offset type in isset or emptyWarningbootstrap.inc954drupal_get_filename()
Failed to set field scheme to OtherColorTest.php133Drupal\color\Tests\ColorTest->testValidColor()
Failed to set field palette[bg] to #0000OtherColorTest.php133Drupal\color\Tests\ColorTest->testValidColor()
Found the requested form fields at admin/appearance/settings/bartikOtherColorTest.php133Drupal\color\Tests\ColorTest->testValidColor()
"You must enter a valid hexadecimal color value for Main background." foundOtherColorTest.php139Drupal\color\Tests\ColorTest->testValidColor()
Illegal offset type in isset or emptyWarningcolor.module114color_get_info()
Illegal offset type in isset or emptyWarningbootstrap.inc895drupal_get_filename()
Illegal offset type in isset or emptyWarningbootstrap.inc905drupal_get_filename()
Illegal offset type in isset or emptyWarningbootstrap.inc917drupal_get_filename()
Illegal offset type in isset or emptyWarningbootstrap.inc954drupal_get_filename()
Failed to set field scheme to OtherColorTest.php133Drupal\color\Tests\ColorTest->testValidColor()
Failed to set field palette[bg] to #00000OtherColorTest.php133Drupal\color\Tests\ColorTest->testValidColor()
Found the requested form fields at admin/appearance/settings/bartikOtherColorTest.php133Drupal\color\Tests\ColorTest->testValidColor()
"You must enter a valid hexadecimal color value for Main background." foundOtherColorTest.php139Drupal\color\Tests\ColorTest->testValidColor()
Illegal offset type in isset or emptyWarningcolor.module114color_get_info()
Illegal offset type in isset or emptyWarningbootstrap.inc895drupal_get_filename()
Illegal offset type in isset or emptyWarningbootstrap.inc905drupal_get_filename()
Illegal offset type in isset or emptyWarningbootstrap.inc917drupal_get_filename()
Illegal offset type in isset or emptyWarningbootstrap.inc954drupal_get_filename()
Failed to set field scheme to OtherColorTest.php133Drupal\color\Tests\ColorTest->testValidColor()
Failed to set field palette[bg] to 123456OtherColorTest.php133Drupal\color\Tests\ColorTest->testValidColor()
Found the requested form fields at admin/appearance/settings/bartikOtherColorTest.php133Drupal\color\Tests\ColorTest->testValidColor()
"You must enter a valid hexadecimal color value for Main background." foundOtherColorTest.php139Drupal\color\Tests\ColorTest->testValidColor()
Illegal offset type in isset or emptyWarningcolor.module114color_get_info()
Illegal offset type in isset or emptyWarningbootstrap.inc895drupal_get_filename()
Illegal offset type in isset or emptyWarningbootstrap.inc905drupal_get_filename()
Illegal offset type in isset or emptyWarningbootstrap.inc917drupal_get_filename()
Illegal offset type in isset or emptyWarningbootstrap.inc954drupal_get_filename()
Failed to set field scheme to OtherColorTest.php133Drupal\color\Tests\ColorTest->testValidColor()
Failed to set field palette[bg] to #00000gOtherColorTest.php133Drupal\color\Tests\ColorTest->testValidColor()
Found the requested form fields at admin/appearance/settings/bartikOtherColorTest.php133Drupal\color\Tests\ColorTest->testValidColor()
"You must enter a valid hexadecimal color value for Main background." foundOtherColorTest.php139Drupal\color\Tests\ColorTest->testValidColor()
ExpandDrupal\config\Tests\ConfigCRUDTest010
MessageGroupFilenameLineFunctionStatus
The test did not complete due to a fatal error.Completion checkConfigCRUDTest.php27Drupal\config\Tests\ConfigCRUDTest->testCRUD()
ExpandDrupal\config\Tests\ConfigFileContentTest010
MessageGroupFilenameLineFunctionStatus
The test did not complete due to a fatal error.Completion checkConfigFileContentTest.php28Drupal\config\Tests\ConfigFileContentTest->testReadWriteConfig()
ExpandDrupal\config\Tests\ConfigImportTest010
MessageGroupFilenameLineFunctionStatus
The test did not complete due to a fatal error.Completion checkConfigImportTest.php45Drupal\config\Tests\ConfigImportTest->testNoImport()
ExpandDrupal\config\Tests\ConfigInstallTest010
MessageGroupFilenameLineFunctionStatus
The test did not complete due to a fatal error.Completion checkConfigInstallTest.php35Drupal\config\Tests\ConfigInstallTest->testModuleInstallation()
ExpandDrupal\config\Tests\ConfigOverrideTest010
MessageGroupFilenameLineFunctionStatus
The test did not complete due to a fatal error.Completion checkConfigOverrideTest.php41Drupal\config\Tests\ConfigOverrideTest->testConfOverride()
ExpandDrupal\config\Tests\Storage\DatabaseStorageTest010
MessageGroupFilenameLineFunctionStatus
The test did not complete due to a fatal error.Completion checkConfigStorageTestBase.php32Drupal\config\Tests\Storage\DatabaseStorageTest->testCRUD()
ExpandDrupal\config\Tests\Storage\FileStorageTest010
MessageGroupFilenameLineFunctionStatus
The test did not complete due to a fatal error.Completion checkConfigStorageTestBase.php32Drupal\config\Tests\Storage\FileStorageTest->testCRUD()
ExpandDrupal\filter\Tests\FilterUnitTest010
MessageGroupFilenameLineFunctionStatus
The test did not complete due to a fatal error.Completion checkFilterUnitTest.php41Drupal\filter\Tests\FilterUnitTest->testLineBreakFilter()
ExpandDrupal\layout\Tests\DisplayInternalLogicTest304
MessageGroupFilenameLineFunctionStatus
htmlspecialchars() expects parameter 1 to be string, array givenhtmlspecialchars(Array, 3, 'UTF-8') check_plain(Array) drupal_placeholder(Array) format_string('%type: !message in %function (line %line of %file). !backtrace', Array) Drupal\simpletest\TestBase->exceptionHandler(Object) Drupal\simpletest\TestBase->run() simpletest_script_run_one_test('158', 'Drupal\layout\Tests\DisplayInternalLogicTest') Warningbootstrap.inc1586check_plain()
Drupal\Component\Plugin\Exception\PluginException: The plugin (static_layout:layout_test_theme__two-col) did not specify an instance class. in Drupal\Component\Plugin\Factory\DefaultFactory->getPluginClass() (line 60 of /var/lib/drupaltestbot/sites/default/files/checkout/core/lib/Drupal/Component/Plugin/Factory/DefaultFactory.php). ">Drupal\Component\Plugin\Factory\DefaultFactory->getPluginClass('static_layout:layout_test_theme__two-col') Drupal\Component\Plugin\Factory\ReflectionFactory->createInstance('static_layout:layout_test_theme__two-col', Array) Drupal\Component\Plugin\PluginManagerBase->createInstance('static_layout:layout_test_theme__two-col', Array) Drupal\layout\Plugin\Core\Entity\Display->getLayoutInstance() Drupal\layout\Plugin\Core\Entity\Display->sortBlocks() Drupal\layout\Plugin\Core\Entity\Display->getSortedBlocksByRegion('left') Drupal\layout\Tests\DisplayInternalLogicTest->testBlockSorting() Drupal\simpletest\TestBase->run() simpletest_script_run_one_test('158', 'Drupal\layout\Tests\DisplayInternalLogicTest') Uncaught exceptionDefaultFactory.php60Drupal\Component\Plugin\Factory\DefaultFactory->getPluginClass()
htmlspecialchars() expects parameter 1 to be string, array givenhtmlspecialchars(Array, 3, 'UTF-8') check_plain(Array) drupal_placeholder(Array) format_string('%type: !message in %function (line %line of %file). !backtrace', Array) Drupal\simpletest\TestBase->exceptionHandler(Object) Drupal\simpletest\TestBase->run() simpletest_script_run_one_test('158', 'Drupal\layout\Tests\DisplayInternalLogicTest') Warningbootstrap.inc1586check_plain()
Drupal\Component\Plugin\Exception\PluginException: The plugin (static_layout:layout_test_theme__two-col) did not specify an instance class. in Drupal\Component\Plugin\Factory\DefaultFactory->getPluginClass() (line 60 of /var/lib/drupaltestbot/sites/default/files/checkout/core/lib/Drupal/Component/Plugin/Factory/DefaultFactory.php). ">Drupal\Component\Plugin\Factory\DefaultFactory->getPluginClass('static_layout:layout_test_theme__two-col') Drupal\Component\Plugin\Factory\ReflectionFactory->createInstance('static_layout:layout_test_theme__two-col', Array) Drupal\Component\Plugin\PluginManagerBase->createInstance('static_layout:layout_test_theme__two-col', Array) Drupal\layout\Plugin\Core\Entity\Display->getLayoutInstance() Drupal\layout\Tests\DisplayInternalLogicTest->testBlockMapping() Drupal\simpletest\TestBase->run() simpletest_script_run_one_test('158', 'Drupal\layout\Tests\DisplayInternalLogicTest') Uncaught exceptionDefaultFactory.php60Drupal\Component\Plugin\Factory\DefaultFactory->getPluginClass()
ExpandDrupal\layout\Tests\LayoutDerivativesTest1522
MessageGroupFilenameLineFunctionStatus
Four definitions available.OtherLayoutDerivativesTest.php40Drupal\layout\Tests\LayoutDerivativesTest->testDerivatives()
Two column layout found.OtherLayoutDerivativesTest.php42Drupal\layout\Tests\LayoutDerivativesTest->testDerivatives()
htmlspecialchars() expects parameter 1 to be string, array givenhtmlspecialchars(Array, 3, 'UTF-8') check_plain(Array) drupal_placeholder(Array) format_string('%type: !message in %function (line %line of %file). !backtrace', Array) Drupal\simpletest\TestBase->exceptionHandler(Object) Drupal\simpletest\TestBase->run() simpletest_script_run_one_test('311', 'Drupal\layout\Tests\LayoutDerivativesTest') Warningbootstrap.inc1586check_plain()
Drupal\Component\Plugin\Exception\PluginException: The plugin (static_layout:layout_test_theme__two-col) did not specify an instance class. in Drupal\Component\Plugin\Factory\DefaultFactory->getPluginClass() (line 60 of /var/lib/drupaltestbot/sites/default/files/checkout/core/lib/Drupal/Component/Plugin/Factory/DefaultFactory.php). ">Drupal\Component\Plugin\Factory\DefaultFactory->getPluginClass('static_layout:layout_test_theme__two-col') Drupal\Component\Plugin\Factory\ReflectionFactory->createInstance('static_layout:layout_test_theme__two-col', Array) Drupal\Component\Plugin\PluginManagerBase->createInstance('static_layout:layout_test_theme__two-col', Array) Drupal\layout\Tests\LayoutDerivativesTest->testDerivatives() Drupal\simpletest\TestBase->run() simpletest_script_run_one_test('311', 'Drupal\layout\Tests\LayoutDerivativesTest') Uncaught exceptionDefaultFactory.php60Drupal\Component\Plugin\Factory\DefaultFactory->getPluginClass()
ExpandDrupal\simpletest\Tests\DrupalUnitTestBaseTest010
MessageGroupFilenameLineFunctionStatus
The test did not complete due to a fatal error.Completion checkDrupalUnitTestBaseTest.php35Drupal\simpletest\Tests\DrupalUnitTestBaseTest->testSetUp()
ExpandDrupal\system\Tests\Common\XssUnitTest010
MessageGroupFilenameLineFunctionStatus
The test did not complete due to a fatal error.Completion checkXssUnitTest.php40Drupal\system\Tests\Common\XssUnitTest->testInvalidMultiByte()
ExpandDrupal\system\Tests\Path\AliasTest010
MessageGroupFilenameLineFunctionStatus
The test did not complete due to a fatal error.Completion checkAliasTest.php40Drupal\system\Tests\Path\AliasTest->testCRUD()
ExpandDrupal\system\Tests\System\InfoAlterTest464
MessageGroupFilenameLineFunctionStatus
Altered theme info was returned by system_get_info().OtherInfoAlterTest.php39Drupal\system\Tests\System\InfoAlterTest->testSystemInfoAlter()
Altered theme info was returned by system_region_list().OtherInfoAlterTest.php41Drupal\system\Tests\System\InfoAlterTest->testSystemInfoAlter()
Undefined index: sevenDrupal\system\Tests\System\InfoAlterTest->testSystemInfoAlter() Drupal\simpletest\TestBase->run() simpletest_script_run_one_test('498', 'Drupal\system\Tests\System\InfoAlterTest') NoticeInfoAlterTest.php43Drupal\system\Tests\System\InfoAlterTest->testSystemInfoAlter()
Trying to get property of non-objectDrupal\system\Tests\System\InfoAlterTest->testSystemInfoAlter() Drupal\simpletest\TestBase->run() simpletest_script_run_one_test('498', 'Drupal\system\Tests\System\InfoAlterTest') NoticeInfoAlterTest.php43Drupal\system\Tests\System\InfoAlterTest->testSystemInfoAlter()
Altered theme info was returned by system_list().OtherInfoAlterTest.php44Drupal\system\Tests\System\InfoAlterTest->testSystemInfoAlter()
Altered theme info was returned by list_themes().OtherInfoAlterTest.php46Drupal\system\Tests\System\InfoAlterTest->testSystemInfoAlter()
Altered theme info was not returned by system_region_list().OtherInfoAlterTest.php55Drupal\system\Tests\System\InfoAlterTest->testSystemInfoAlter()
Undefined index: sevenDrupal\system\Tests\System\InfoAlterTest->testSystemInfoAlter() Drupal\simpletest\TestBase->run() simpletest_script_run_one_test('498', 'Drupal\system\Tests\System\InfoAlterTest') NoticeInfoAlterTest.php57Drupal\system\Tests\System\InfoAlterTest->testSystemInfoAlter()
Trying to get property of non-objectDrupal\system\Tests\System\InfoAlterTest->testSystemInfoAlter() Drupal\simpletest\TestBase->run() simpletest_script_run_one_test('498', 'Drupal\system\Tests\System\InfoAlterTest') NoticeInfoAlterTest.php57Drupal\system\Tests\System\InfoAlterTest->testSystemInfoAlter()
Altered theme info was not returned by list_themes().OtherInfoAlterTest.php60Drupal\system\Tests\System\InfoAlterTest->testSystemInfoAlter()
ExpandDrupal\system\Tests\Theme\ThemeTest4420
MessageGroupFilenameLineFunctionStatus
Subtheme's object includes list of base themes.OtherThemeTest.php153Drupal\system\Tests\Theme\ThemeTest->testListThemes()
The test did not complete due to a fatal error.Completion checkThemeTest.php190Drupal\system\Tests\Theme\ThemeTest->testClassLoading()
ExpandDrupal\system\Tests\Transliteration\TransliterationTest010
MessageGroupFilenameLineFunctionStatus
The test did not complete due to a fatal error.Completion checkTransliterationTest.php35Drupal\system\Tests\Transliteration\TransliterationTest->testPHPTransliteration()

All

Test namePassFailException
LeafDrupal\action\Tests\BulkFormTest3300
LeafDrupal\action\Tests\ConfigurationTest3900
LeafDrupal\action\Tests\LoopTest2100
LeafDrupal\aggregator\Tests\AddFeedTest7100
LeafDrupal\aggregator\Tests\AggregatorConfigurationTest2000
LeafDrupal\aggregator\Tests\AggregatorCronTest5500
LeafDrupal\aggregator\Tests\AggregatorRenderingTest22800
LeafDrupal\aggregator\Tests\CategorizeFeedItemTest6100
LeafDrupal\aggregator\Tests\CategorizeFeedTest2100
LeafDrupal\aggregator\Tests\FeedParserTest7200
LeafDrupal\aggregator\Tests\ImportOpmlTest5500
LeafDrupal\aggregator\Tests\RemoveFeedItemTest27000
LeafDrupal\aggregator\Tests\RemoveFeedTest2500
LeafDrupal\aggregator\Tests\UpdateFeedItemTest6500
LeafDrupal\aggregator\Tests\UpdateFeedTest7600
LeafDrupal\ban\Tests\IpAddressBlockingTest4300
LeafDrupal\block\Tests\BlockAdminThemeTest1900
LeafDrupal\block\Tests\BlockCacheTest20500
LeafDrupal\block\Tests\BlockHiddenRegionTest1800
LeafDrupal\block\Tests\BlockHtmlIdTest1600
LeafDrupal\block\Tests\BlockInvalidRegionTest2400
LeafDrupal\block\Tests\BlockLanguageTest9100
LeafDrupal\block\Tests\BlockTemplateSuggestionsUnitTest300
LeafDrupal\block\Tests\BlockTest36000
LeafDrupal\block\Tests\BlockUserAccountSettingsTest1200
LeafDrupal\block\Tests\NewDefaultThemeBlocksTest2300
LeafDrupal\block\Tests\NonDefaultBlockAdminTest1100
LeafDrupal\book\Tests\BookTest51700
LeafDrupal\breakpoint\Tests\BreakpointAPITest600
LeafDrupal\breakpoint\Tests\BreakpointCRUDTest2100
LeafDrupal\breakpoint\Tests\BreakpointGroupAPITest400
LeafDrupal\breakpoint\Tests\BreakpointGroupCRUDTest1200
LeafDrupal\breakpoint\Tests\BreakpointMediaQueryTest6300
LeafDrupal\breakpoint\Tests\BreakpointThemeTest2300
ExpandDrupal\color\Tests\ColorTest654472
MessageGroupFilenameLineFunctionStatus
Illegal offset type in isset or emptyWarningcolor.module114color_get_info()
Illegal offset type in isset or emptyWarningbootstrap.inc895drupal_get_filename()
Illegal offset type in isset or emptyWarningbootstrap.inc905drupal_get_filename()
Illegal offset type in isset or emptyWarningbootstrap.inc917drupal_get_filename()
Illegal offset type in isset or emptyWarningbootstrap.inc954drupal_get_filename()
Illegal offset type in isset or emptyWarningcolor.module114color_get_info()
Illegal offset type in isset or emptyWarningbootstrap.inc895drupal_get_filename()
Illegal offset type in isset or emptyWarningbootstrap.inc905drupal_get_filename()
Illegal offset type in isset or emptyWarningbootstrap.inc917drupal_get_filename()
Illegal offset type in isset or emptyWarningbootstrap.inc954drupal_get_filename()
Failed to set field scheme to OtherColorTest.php87Drupal\color\Tests\ColorTest->_testColor()
Failed to set field palette[bg] to #123456OtherColorTest.php87Drupal\color\Tests\ColorTest->_testColor()
Found the requested form fields at admin/appearance/settings/bartikOtherColorTest.php87Drupal\color\Tests\ColorTest->_testColor()
Undefined offset: 0Drupal\color\Tests\ColorTest->_testColor('bartik', Array) Drupal\color\Tests\ColorTest->testColor() Drupal\simpletest\TestBase->run() simpletest_script_run_one_test('62', 'Drupal\color\Tests\ColorTest') NoticeColorTest.php91Drupal\color\Tests\ColorTest->_testColor()
Undefined offset: 0Drupal\color\Tests\ColorTest->_testColor('bartik', Array) Drupal\color\Tests\ColorTest->testColor() Drupal\simpletest\TestBase->run() simpletest_script_run_one_test('62', 'Drupal\color\Tests\ColorTest') NoticeColorTest.php93Drupal\color\Tests\ColorTest->_testColor()
file(): Filename cannot be emptyfile('') Drupal\color\Tests\ColorTest->_testColor('bartik', Array) Drupal\color\Tests\ColorTest->testColor() Drupal\simpletest\TestBase->run() simpletest_script_run_one_test('62', 'Drupal\color\Tests\ColorTest') WarningColorTest.php93Drupal\color\Tests\ColorTest->_testColor()
join(): Invalid arguments passedjoin(' ', ) Drupal\color\Tests\ColorTest->_testColor('bartik', Array) Drupal\color\Tests\ColorTest->testColor() Drupal\simpletest\TestBase->run() simpletest_script_run_one_test('62', 'Drupal\color\Tests\ColorTest') WarningColorTest.php93Drupal\color\Tests\ColorTest->_testColor()
Make sure the color we changed is in the color stylesheet. (bartik)OtherColorTest.php94Drupal\color\Tests\ColorTest->_testColor()
Illegal offset type in isset or emptyWarningcolor.module114color_get_info()
Illegal offset type in isset or emptyWarningbootstrap.inc895drupal_get_filename()
Illegal offset type in isset or emptyWarningbootstrap.inc905drupal_get_filename()
Illegal offset type in isset or emptyWarningbootstrap.inc917drupal_get_filename()
Illegal offset type in isset or emptyWarningbootstrap.inc954drupal_get_filename()
Illegal offset type in isset or emptyWarningcolor.module114color_get_info()
Illegal offset type in isset or emptyWarningbootstrap.inc895drupal_get_filename()
Illegal offset type in isset or emptyWarningbootstrap.inc905drupal_get_filename()
Illegal offset type in isset or emptyWarningbootstrap.inc917drupal_get_filename()
Illegal offset type in isset or emptyWarningbootstrap.inc954drupal_get_filename()
Failed to set field scheme to slateOtherColorTest.php99Drupal\color\Tests\ColorTest->_testColor()
Failed to set field palette[bg] to #123456OtherColorTest.php99Drupal\color\Tests\ColorTest->_testColor()
Found the requested form fields at admin/appearance/settings/bartikOtherColorTest.php99Drupal\color\Tests\ColorTest->_testColor()
Undefined offset: 0Drupal\color\Tests\ColorTest->_testColor('bartik', Array) Drupal\color\Tests\ColorTest->testColor() Drupal\simpletest\TestBase->run() simpletest_script_run_one_test('62', 'Drupal\color\Tests\ColorTest') NoticeColorTest.php103Drupal\color\Tests\ColorTest->_testColor()
file(): Filename cannot be emptyfile('') Drupal\color\Tests\ColorTest->_testColor('bartik', Array) Drupal\color\Tests\ColorTest->testColor() Drupal\simpletest\TestBase->run() simpletest_script_run_one_test('62', 'Drupal\color\Tests\ColorTest') WarningColorTest.php103Drupal\color\Tests\ColorTest->_testColor()
join(): Invalid arguments passedjoin(' ', ) Drupal\color\Tests\ColorTest->_testColor('bartik', Array) Drupal\color\Tests\ColorTest->testColor() Drupal\simpletest\TestBase->run() simpletest_script_run_one_test('62', 'Drupal\color\Tests\ColorTest') WarningColorTest.php103Drupal\color\Tests\ColorTest->_testColor()
Make sure the color we changed is in the color stylesheet. (bartik)OtherColorTest.php104Drupal\color\Tests\ColorTest->_testColor()
Illegal offset type in isset or emptyWarningcolor.module114color_get_info()
Illegal offset type in isset or emptyWarningbootstrap.inc895drupal_get_filename()
Illegal offset type in isset or emptyWarningbootstrap.inc905drupal_get_filename()
Illegal offset type in isset or emptyWarningbootstrap.inc917drupal_get_filename()
Illegal offset type in isset or emptyWarningbootstrap.inc954drupal_get_filename()
Failed to set field scheme to OtherColorTest.php133Drupal\color\Tests\ColorTest->testValidColor()
Failed to set field palette[bg] to #000OtherColorTest.php133Drupal\color\Tests\ColorTest->testValidColor()
Found the requested form fields at admin/appearance/settings/bartikOtherColorTest.php133Drupal\color\Tests\ColorTest->testValidColor()
"The configuration options have been saved." foundOtherColorTest.php136Drupal\color\Tests\ColorTest->testValidColor()
Illegal offset type in isset or emptyWarningcolor.module114color_get_info()
Illegal offset type in isset or emptyWarningbootstrap.inc895drupal_get_filename()
Illegal offset type in isset or emptyWarningbootstrap.inc905drupal_get_filename()
Illegal offset type in isset or emptyWarningbootstrap.inc917drupal_get_filename()
Illegal offset type in isset or emptyWarningbootstrap.inc954drupal_get_filename()
Failed to set field scheme to OtherColorTest.php133Drupal\color\Tests\ColorTest->testValidColor()
Failed to set field palette[bg] to #123456OtherColorTest.php133Drupal\color\Tests\ColorTest->testValidColor()
Found the requested form fields at admin/appearance/settings/bartikOtherColorTest.php133Drupal\color\Tests\ColorTest->testValidColor()
"The configuration options have been saved." foundOtherColorTest.php136Drupal\color\Tests\ColorTest->testValidColor()
Illegal offset type in isset or emptyWarningcolor.module114color_get_info()
Illegal offset type in isset or emptyWarningbootstrap.inc895drupal_get_filename()
Illegal offset type in isset or emptyWarningbootstrap.inc905drupal_get_filename()
Illegal offset type in isset or emptyWarningbootstrap.inc917drupal_get_filename()
Illegal offset type in isset or emptyWarningbootstrap.inc954drupal_get_filename()
Failed to set field scheme to OtherColorTest.php133Drupal\color\Tests\ColorTest->testValidColor()
Failed to set field palette[bg] to #abcdefOtherColorTest.php133Drupal\color\Tests\ColorTest->testValidColor()
Found the requested form fields at admin/appearance/settings/bartikOtherColorTest.php133Drupal\color\Tests\ColorTest->testValidColor()
"The configuration options have been saved." foundOtherColorTest.php136Drupal\color\Tests\ColorTest->testValidColor()
Illegal offset type in isset or emptyWarningcolor.module114color_get_info()
Illegal offset type in isset or emptyWarningbootstrap.inc895drupal_get_filename()
Illegal offset type in isset or emptyWarningbootstrap.inc905drupal_get_filename()
Illegal offset type in isset or emptyWarningbootstrap.inc917drupal_get_filename()
Illegal offset type in isset or emptyWarningbootstrap.inc954drupal_get_filename()
Failed to set field scheme to OtherColorTest.php133Drupal\color\Tests\ColorTest->testValidColor()
Failed to set field palette[bg] to #0OtherColorTest.php133Drupal\color\Tests\ColorTest->testValidColor()
Found the requested form fields at admin/appearance/settings/bartikOtherColorTest.php133Drupal\color\Tests\ColorTest->testValidColor()
"You must enter a valid hexadecimal color value for Main background." foundOtherColorTest.php139Drupal\color\Tests\ColorTest->testValidColor()
Illegal offset type in isset or emptyWarningcolor.module114color_get_info()
Illegal offset type in isset or emptyWarningbootstrap.inc895drupal_get_filename()
Illegal offset type in isset or emptyWarningbootstrap.inc905drupal_get_filename()
Illegal offset type in isset or emptyWarningbootstrap.inc917drupal_get_filename()
Illegal offset type in isset or emptyWarningbootstrap.inc954drupal_get_filename()
Failed to set field scheme to OtherColorTest.php133Drupal\color\Tests\ColorTest->testValidColor()
Failed to set field palette[bg] to #00OtherColorTest.php133Drupal\color\Tests\ColorTest->testValidColor()
Found the requested form fields at admin/appearance/settings/bartikOtherColorTest.php133Drupal\color\Tests\ColorTest->testValidColor()
"You must enter a valid hexadecimal color value for Main background." foundOtherColorTest.php139Drupal\color\Tests\ColorTest->testValidColor()
Illegal offset type in isset or emptyWarningcolor.module114color_get_info()
Illegal offset type in isset or emptyWarningbootstrap.inc895drupal_get_filename()
Illegal offset type in isset or emptyWarningbootstrap.inc905drupal_get_filename()
Illegal offset type in isset or emptyWarningbootstrap.inc917drupal_get_filename()
Illegal offset type in isset or emptyWarningbootstrap.inc954drupal_get_filename()
Failed to set field scheme to OtherColorTest.php133Drupal\color\Tests\ColorTest->testValidColor()
Failed to set field palette[bg] to #0000OtherColorTest.php133Drupal\color\Tests\ColorTest->testValidColor()
Found the requested form fields at admin/appearance/settings/bartikOtherColorTest.php133Drupal\color\Tests\ColorTest->testValidColor()
"You must enter a valid hexadecimal color value for Main background." foundOtherColorTest.php139Drupal\color\Tests\ColorTest->testValidColor()
Illegal offset type in isset or emptyWarningcolor.module114color_get_info()
Illegal offset type in isset or emptyWarningbootstrap.inc895drupal_get_filename()
Illegal offset type in isset or emptyWarningbootstrap.inc905drupal_get_filename()
Illegal offset type in isset or emptyWarningbootstrap.inc917drupal_get_filename()
Illegal offset type in isset or emptyWarningbootstrap.inc954drupal_get_filename()
Failed to set field scheme to OtherColorTest.php133Drupal\color\Tests\ColorTest->testValidColor()
Failed to set field palette[bg] to #00000OtherColorTest.php133Drupal\color\Tests\ColorTest->testValidColor()
Found the requested form fields at admin/appearance/settings/bartikOtherColorTest.php133Drupal\color\Tests\ColorTest->testValidColor()
"You must enter a valid hexadecimal color value for Main background." foundOtherColorTest.php139Drupal\color\Tests\ColorTest->testValidColor()
Illegal offset type in isset or emptyWarningcolor.module114color_get_info()
Illegal offset type in isset or emptyWarningbootstrap.inc895drupal_get_filename()
Illegal offset type in isset or emptyWarningbootstrap.inc905drupal_get_filename()
Illegal offset type in isset or emptyWarningbootstrap.inc917drupal_get_filename()
Illegal offset type in isset or emptyWarningbootstrap.inc954drupal_get_filename()
Failed to set field scheme to OtherColorTest.php133Drupal\color\Tests\ColorTest->testValidColor()
Failed to set field palette[bg] to 123456OtherColorTest.php133Drupal\color\Tests\ColorTest->testValidColor()
Found the requested form fields at admin/appearance/settings/bartikOtherColorTest.php133Drupal\color\Tests\ColorTest->testValidColor()
"You must enter a valid hexadecimal color value for Main background." foundOtherColorTest.php139Drupal\color\Tests\ColorTest->testValidColor()
Illegal offset type in isset or emptyWarningcolor.module114color_get_info()
Illegal offset type in isset or emptyWarningbootstrap.inc895drupal_get_filename()
Illegal offset type in isset or emptyWarningbootstrap.inc905drupal_get_filename()
Illegal offset type in isset or emptyWarningbootstrap.inc917drupal_get_filename()
Illegal offset type in isset or emptyWarningbootstrap.inc954drupal_get_filename()
Failed to set field scheme to OtherColorTest.php133Drupal\color\Tests\ColorTest->testValidColor()
Failed to set field palette[bg] to #00000gOtherColorTest.php133Drupal\color\Tests\ColorTest->testValidColor()
Found the requested form fields at admin/appearance/settings/bartikOtherColorTest.php133Drupal\color\Tests\ColorTest->testValidColor()
"You must enter a valid hexadecimal color value for Main background." foundOtherColorTest.php139Drupal\color\Tests\ColorTest->testValidColor()
LeafDrupal\comment\Tests\CommentActionsTest3000
LeafDrupal\comment\Tests\CommentAnonymousTest16300
LeafDrupal\comment\Tests\CommentApprovalTest15200
LeafDrupal\comment\Tests\CommentBlockTest11800
LeafDrupal\comment\Tests\CommentContentRebuildTest3300
LeafDrupal\comment\Tests\CommentCSSTest50100
LeafDrupal\comment\Tests\CommentFieldsTest10700
LeafDrupal\comment\Tests\CommentInterfaceTest25100
LeafDrupal\comment\Tests\CommentLanguageTest7200
ExpandDrupal\comment\Tests\CommentLinksTest109300
MessageGroupFilenameLineFunctionStatus
Changed environment:array ( 'authenticated' => false, 'comment count' => false, 'form' => 'below', 'user_register' => 'visitors', 'contact' => 'optional', 'comments' => 'open', 'access comments' => 0, 'post comments' => 0, 'skip comment approval' => 1, 'edit own comments' => 0, )DebugCommentLinksTest.php194Drupal\comment\Tests\CommentLinksTest->setEnvironment()
Changed environment:array ( 'authenticated' => true, 'comment count' => false, 'form' => 'below', 'user_register' => 'visitors', 'contact' => 'optional', 'comments' => 'open', 'access comments' => 0, 'post comments' => 0, 'skip comment approval' => 1, 'edit own comments' => 0, )DebugCommentLinksTest.php194Drupal\comment\Tests\CommentLinksTest->setEnvironment()
Changed environment:array ( 'authenticated' => false, 'comment count' => true, 'form' => 'below', 'user_register' => 'visitors', 'contact' => 'optional', 'comments' => 'open', 'access comments' => 0, 'post comments' => 0, 'skip comment approval' => 1, 'edit own comments' => 0, )DebugCommentLinksTest.php194Drupal\comment\Tests\CommentLinksTest->setEnvironment()
Changed environment:array ( 'authenticated' => true, 'comment count' => true, 'form' => 'below', 'user_register' => 'visitors', 'contact' => 'optional', 'comments' => 'open', 'access comments' => 0, 'post comments' => 0, 'skip comment approval' => 1, 'edit own comments' => 0, )DebugCommentLinksTest.php194Drupal\comment\Tests\CommentLinksTest->setEnvironment()
Changed environment:array ( 'authenticated' => false, 'comment count' => false, 'form' => 'below', 'user_register' => 'visitors', 'contact' => 'optional', 'comments' => 'open', 'access comments' => 1, 'post comments' => 0, 'skip comment approval' => 1, 'edit own comments' => 0, )DebugCommentLinksTest.php194Drupal\comment\Tests\CommentLinksTest->setEnvironment()
Changed environment:array ( 'authenticated' => true, 'comment count' => false, 'form' => 'below', 'user_register' => 'visitors', 'contact' => 'optional', 'comments' => 'open', 'access comments' => 1, 'post comments' => 0, 'skip comment approval' => 1, 'edit own comments' => 0, )DebugCommentLinksTest.php194Drupal\comment\Tests\CommentLinksTest->setEnvironment()
Changed environment:array ( 'authenticated' => false, 'comment count' => true, 'form' => 'below', 'user_register' => 'visitors', 'contact' => 'optional', 'comments' => 'open', 'access comments' => 1, 'post comments' => 0, 'skip comment approval' => 1, 'edit own comments' => 0, )DebugCommentLinksTest.php194Drupal\comment\Tests\CommentLinksTest->setEnvironment()
Changed environment:array ( 'authenticated' => true, 'comment count' => true, 'form' => 'below', 'user_register' => 'visitors', 'contact' => 'optional', 'comments' => 'open', 'access comments' => 1, 'post comments' => 0, 'skip comment approval' => 1, 'edit own comments' => 0, )DebugCommentLinksTest.php194Drupal\comment\Tests\CommentLinksTest->setEnvironment()
Changed environment:array ( 'authenticated' => false, 'comment count' => false, 'form' => 'below', 'user_register' => 'visitors', 'contact' => 'optional', 'comments' => 'open', 'access comments' => 0, 'post comments' => 1, 'skip comment approval' => 1, 'edit own comments' => 0, )DebugCommentLinksTest.php194Drupal\comment\Tests\CommentLinksTest->setEnvironment()
Changed environment:array ( 'authenticated' => true, 'comment count' => false, 'form' => 'below', 'user_register' => 'visitors', 'contact' => 'optional', 'comments' => 'open', 'access comments' => 0, 'post comments' => 1, 'skip comment approval' => 1, 'edit own comments' => 0, )DebugCommentLinksTest.php194Drupal\comment\Tests\CommentLinksTest->setEnvironment()
Changed environment:array ( 'authenticated' => false, 'comment count' => true, 'form' => 'below', 'user_register' => 'visitors', 'contact' => 'optional', 'comments' => 'open', 'access comments' => 0, 'post comments' => 1, 'skip comment approval' => 1, 'edit own comments' => 0, )DebugCommentLinksTest.php194Drupal\comment\Tests\CommentLinksTest->setEnvironment()
Changed environment:array ( 'authenticated' => true, 'comment count' => true, 'form' => 'below', 'user_register' => 'visitors', 'contact' => 'optional', 'comments' => 'open', 'access comments' => 0, 'post comments' => 1, 'skip comment approval' => 1, 'edit own comments' => 0, )DebugCommentLinksTest.php194Drupal\comment\Tests\CommentLinksTest->setEnvironment()
Changed environment:array ( 'authenticated' => false, 'comment count' => false, 'form' => 'below', 'user_register' => 'visitors', 'contact' => 'optional', 'comments' => 'open', 'access comments' => 1, 'post comments' => 1, 'skip comment approval' => 1, 'edit own comments' => 0, )DebugCommentLinksTest.php194Drupal\comment\Tests\CommentLinksTest->setEnvironment()
Changed environment:array ( 'authenticated' => true, 'comment count' => false, 'form' => 'below', 'user_register' => 'visitors', 'contact' => 'optional', 'comments' => 'open', 'access comments' => 1, 'post comments' => 1, 'skip comment approval' => 1, 'edit own comments' => 0, )DebugCommentLinksTest.php194Drupal\comment\Tests\CommentLinksTest->setEnvironment()
Changed environment:array ( 'authenticated' => false, 'comment count' => true, 'form' => 'below', 'user_register' => 'visitors', 'contact' => 'optional', 'comments' => 'open', 'access comments' => 1, 'post comments' => 1, 'skip comment approval' => 1, 'edit own comments' => 0, )DebugCommentLinksTest.php194Drupal\comment\Tests\CommentLinksTest->setEnvironment()
Changed environment:array ( 'authenticated' => true, 'comment count' => true, 'form' => 'below', 'user_register' => 'visitors', 'contact' => 'optional', 'comments' => 'open', 'access comments' => 1, 'post comments' => 1, 'skip comment approval' => 1, 'edit own comments' => 0, )DebugCommentLinksTest.php194Drupal\comment\Tests\CommentLinksTest->setEnvironment()
Changed environment:array ( 'authenticated' => false, 'comment count' => false, 'form' => 'separate page', 'user_register' => 'visitors', 'contact' => 'optional', 'comments' => 'open', 'access comments' => 0, 'post comments' => 0, 'skip comment approval' => 1, 'edit own comments' => 0, )DebugCommentLinksTest.php194Drupal\comment\Tests\CommentLinksTest->setEnvironment()
Changed environment:array ( 'authenticated' => true, 'comment count' => false, 'form' => 'separate page', 'user_register' => 'visitors', 'contact' => 'optional', 'comments' => 'open', 'access comments' => 0, 'post comments' => 0, 'skip comment approval' => 1, 'edit own comments' => 0, )DebugCommentLinksTest.php194Drupal\comment\Tests\CommentLinksTest->setEnvironment()
Changed environment:array ( 'authenticated' => false, 'comment count' => true, 'form' => 'separate page', 'user_register' => 'visitors', 'contact' => 'optional', 'comments' => 'open', 'access comments' => 0, 'post comments' => 0, 'skip comment approval' => 1, 'edit own comments' => 0, )DebugCommentLinksTest.php194Drupal\comment\Tests\CommentLinksTest->setEnvironment()
Changed environment:array ( 'authenticated' => true, 'comment count' => true, 'form' => 'separate page', 'user_register' => 'visitors', 'contact' => 'optional', 'comments' => 'open', 'access comments' => 0, 'post comments' => 0, 'skip comment approval' => 1, 'edit own comments' => 0, )DebugCommentLinksTest.php194Drupal\comment\Tests\CommentLinksTest->setEnvironment()
Changed environment:array ( 'authenticated' => false, 'comment count' => false, 'form' => 'separate page', 'user_register' => 'visitors', 'contact' => 'optional', 'comments' => 'open', 'access comments' => 1, 'post comments' => 0, 'skip comment approval' => 1, 'edit own comments' => 0, )DebugCommentLinksTest.php194Drupal\comment\Tests\CommentLinksTest->setEnvironment()
Changed environment:array ( 'authenticated' => true, 'comment count' => false, 'form' => 'separate page', 'user_register' => 'visitors', 'contact' => 'optional', 'comments' => 'open', 'access comments' => 1, 'post comments' => 0, 'skip comment approval' => 1, 'edit own comments' => 0, )DebugCommentLinksTest.php194Drupal\comment\Tests\CommentLinksTest->setEnvironment()
Changed environment:array ( 'authenticated' => false, 'comment count' => true, 'form' => 'separate page', 'user_register' => 'visitors', 'contact' => 'optional', 'comments' => 'open', 'access comments' => 1, 'post comments' => 0, 'skip comment approval' => 1, 'edit own comments' => 0, )DebugCommentLinksTest.php194Drupal\comment\Tests\CommentLinksTest->setEnvironment()
Changed environment:array ( 'authenticated' => true, 'comment count' => true, 'form' => 'separate page', 'user_register' => 'visitors', 'contact' => 'optional', 'comments' => 'open', 'access comments' => 1, 'post comments' => 0, 'skip comment approval' => 1, 'edit own comments' => 0, )DebugCommentLinksTest.php194Drupal\comment\Tests\CommentLinksTest->setEnvironment()
Changed environment:array ( 'authenticated' => false, 'comment count' => false, 'form' => 'separate page', 'user_register' => 'visitors', 'contact' => 'optional', 'comments' => 'open', 'access comments' => 0, 'post comments' => 1, 'skip comment approval' => 1, 'edit own comments' => 0, )DebugCommentLinksTest.php194Drupal\comment\Tests\CommentLinksTest->setEnvironment()
Changed environment:array ( 'authenticated' => true, 'comment count' => false, 'form' => 'separate page', 'user_register' => 'visitors', 'contact' => 'optional', 'comments' => 'open', 'access comments' => 0, 'post comments' => 1, 'skip comment approval' => 1, 'edit own comments' => 0, )DebugCommentLinksTest.php194Drupal\comment\Tests\CommentLinksTest->setEnvironment()
Changed environment:array ( 'authenticated' => false, 'comment count' => true, 'form' => 'separate page', 'user_register' => 'visitors', 'contact' => 'optional', 'comments' => 'open', 'access comments' => 0, 'post comments' => 1, 'skip comment approval' => 1, 'edit own comments' => 0, )DebugCommentLinksTest.php194Drupal\comment\Tests\CommentLinksTest->setEnvironment()
Changed environment:array ( 'authenticated' => true, 'comment count' => true, 'form' => 'separate page', 'user_register' => 'visitors', 'contact' => 'optional', 'comments' => 'open', 'access comments' => 0, 'post comments' => 1, 'skip comment approval' => 1, 'edit own comments' => 0, )DebugCommentLinksTest.php194Drupal\comment\Tests\CommentLinksTest->setEnvironment()
Changed environment:array ( 'authenticated' => false, 'comment count' => false, 'form' => 'separate page', 'user_register' => 'visitors', 'contact' => 'optional', 'comments' => 'open', 'access comments' => 1, 'post comments' => 1, 'skip comment approval' => 1, 'edit own comments' => 0, )DebugCommentLinksTest.php194Drupal\comment\Tests\CommentLinksTest->setEnvironment()
Changed environment:array ( 'authenticated' => true, 'comment count' => false, 'form' => 'separate page', 'user_register' => 'visitors', 'contact' => 'optional', 'comments' => 'open', 'access comments' => 1, 'post comments' => 1, 'skip comment approval' => 1, 'edit own comments' => 0, )DebugCommentLinksTest.php194Drupal\comment\Tests\CommentLinksTest->setEnvironment()
Changed environment:array ( 'authenticated' => false, 'comment count' => true, 'form' => 'separate page', 'user_register' => 'visitors', 'contact' => 'optional', 'comments' => 'open', 'access comments' => 1, 'post comments' => 1, 'skip comment approval' => 1, 'edit own comments' => 0, )DebugCommentLinksTest.php194Drupal\comment\Tests\CommentLinksTest->setEnvironment()
Changed environment:array ( 'authenticated' => true, 'comment count' => true, 'form' => 'separate page', 'user_register' => 'visitors', 'contact' => 'optional', 'comments' => 'open', 'access comments' => 1, 'post comments' => 1, 'skip comment approval' => 1, 'edit own comments' => 0, )DebugCommentLinksTest.php194Drupal\comment\Tests\CommentLinksTest->setEnvironment()
Changed environment:array ( 'authenticated' => false, 'comment count' => false, 'form' => 'below', 'user_register' => 'admin_only', 'contact' => 'optional', 'comments' => 'open', 'access comments' => 0, 'post comments' => 0, 'skip comment approval' => 1, 'edit own comments' => 0, )DebugCommentLinksTest.php194Drupal\comment\Tests\CommentLinksTest->setEnvironment()
Changed environment:array ( 'authenticated' => true, 'comment count' => false, 'form' => 'below', 'user_register' => 'admin_only', 'contact' => 'optional', 'comments' => 'open', 'access comments' => 0, 'post comments' => 0, 'skip comment approval' => 1, 'edit own comments' => 0, )DebugCommentLinksTest.php194Drupal\comment\Tests\CommentLinksTest->setEnvironment()
Changed environment:array ( 'authenticated' => false, 'comment count' => true, 'form' => 'below', 'user_register' => 'admin_only', 'contact' => 'optional', 'comments' => 'open', 'access comments' => 0, 'post comments' => 0, 'skip comment approval' => 1, 'edit own comments' => 0, )DebugCommentLinksTest.php194Drupal\comment\Tests\CommentLinksTest->setEnvironment()
Changed environment:array ( 'authenticated' => true, 'comment count' => true, 'form' => 'below', 'user_register' => 'admin_only', 'contact' => 'optional', 'comments' => 'open', 'access comments' => 0, 'post comments' => 0, 'skip comment approval' => 1, 'edit own comments' => 0, )DebugCommentLinksTest.php194Drupal\comment\Tests\CommentLinksTest->setEnvironment()
Changed environment:array ( 'authenticated' => false, 'comment count' => false, 'form' => 'below', 'user_register' => 'admin_only', 'contact' => 'optional', 'comments' => 'open', 'access comments' => 1, 'post comments' => 0, 'skip comment approval' => 1, 'edit own comments' => 0, )DebugCommentLinksTest.php194Drupal\comment\Tests\CommentLinksTest->setEnvironment()
Changed environment:array ( 'authenticated' => true, 'comment count' => false, 'form' => 'below', 'user_register' => 'admin_only', 'contact' => 'optional', 'comments' => 'open', 'access comments' => 1, 'post comments' => 0, 'skip comment approval' => 1, 'edit own comments' => 0, )DebugCommentLinksTest.php194Drupal\comment\Tests\CommentLinksTest->setEnvironment()
Changed environment:array ( 'authenticated' => false, 'comment count' => true, 'form' => 'below', 'user_register' => 'admin_only', 'contact' => 'optional', 'comments' => 'open', 'access comments' => 1, 'post comments' => 0, 'skip comment approval' => 1, 'edit own comments' => 0, )DebugCommentLinksTest.php194Drupal\comment\Tests\CommentLinksTest->setEnvironment()
Changed environment:array ( 'authenticated' => true, 'comment count' => true, 'form' => 'below', 'user_register' => 'admin_only', 'contact' => 'optional', 'comments' => 'open', 'access comments' => 1, 'post comments' => 0, 'skip comment approval' => 1, 'edit own comments' => 0, )DebugCommentLinksTest.php194Drupal\comment\Tests\CommentLinksTest->setEnvironment()
Changed environment:array ( 'authenticated' => false, 'comment count' => false, 'form' => 'below', 'user_register' => 'admin_only', 'contact' => 'optional', 'comments' => 'open', 'access comments' => 0, 'post comments' => 1, 'skip comment approval' => 1, 'edit own comments' => 0, )DebugCommentLinksTest.php194Drupal\comment\Tests\CommentLinksTest->setEnvironment()
Changed environment:array ( 'authenticated' => true, 'comment count' => false, 'form' => 'below', 'user_register' => 'admin_only', 'contact' => 'optional', 'comments' => 'open', 'access comments' => 0, 'post comments' => 1, 'skip comment approval' => 1, 'edit own comments' => 0, )DebugCommentLinksTest.php194Drupal\comment\Tests\CommentLinksTest->setEnvironment()
Changed environment:array ( 'authenticated' => false, 'comment count' => true, 'form' => 'below', 'user_register' => 'admin_only', 'contact' => 'optional', 'comments' => 'open', 'access comments' => 0, 'post comments' => 1, 'skip comment approval' => 1, 'edit own comments' => 0, )DebugCommentLinksTest.php194Drupal\comment\Tests\CommentLinksTest->setEnvironment()
Changed environment:array ( 'authenticated' => true, 'comment count' => true, 'form' => 'below', 'user_register' => 'admin_only', 'contact' => 'optional', 'comments' => 'open', 'access comments' => 0, 'post comments' => 1, 'skip comment approval' => 1, 'edit own comments' => 0, )DebugCommentLinksTest.php194Drupal\comment\Tests\CommentLinksTest->setEnvironment()
Changed environment:array ( 'authenticated' => false, 'comment count' => false, 'form' => 'below', 'user_register' => 'admin_only', 'contact' => 'optional', 'comments' => 'open', 'access comments' => 1, 'post comments' => 1, 'skip comment approval' => 1, 'edit own comments' => 0, )DebugCommentLinksTest.php194Drupal\comment\Tests\CommentLinksTest->setEnvironment()
Changed environment:array ( 'authenticated' => true, 'comment count' => false, 'form' => 'below', 'user_register' => 'admin_only', 'contact' => 'optional', 'comments' => 'open', 'access comments' => 1, 'post comments' => 1, 'skip comment approval' => 1, 'edit own comments' => 0, )DebugCommentLinksTest.php194Drupal\comment\Tests\CommentLinksTest->setEnvironment()
Changed environment:array ( 'authenticated' => false, 'comment count' => true, 'form' => 'below', 'user_register' => 'admin_only', 'contact' => 'optional', 'comments' => 'open', 'access comments' => 1, 'post comments' => 1, 'skip comment approval' => 1, 'edit own comments' => 0, )DebugCommentLinksTest.php194Drupal\comment\Tests\CommentLinksTest->setEnvironment()
Changed environment:array ( 'authenticated' => true, 'comment count' => true, 'form' => 'below', 'user_register' => 'admin_only', 'contact' => 'optional', 'comments' => 'open', 'access comments' => 1, 'post comments' => 1, 'skip comment approval' => 1, 'edit own comments' => 0, )DebugCommentLinksTest.php194Drupal\comment\Tests\CommentLinksTest->setEnvironment()
Changed environment:array ( 'authenticated' => false, 'comment count' => false, 'form' => 'separate page', 'user_register' => 'admin_only', 'contact' => 'optional', 'comments' => 'open', 'access comments' => 0, 'post comments' => 0, 'skip comment approval' => 1, 'edit own comments' => 0, )DebugCommentLinksTest.php194Drupal\comment\Tests\CommentLinksTest->setEnvironment()
Changed environment:array ( 'authenticated' => true, 'comment count' => false, 'form' => 'separate page', 'user_register' => 'admin_only', 'contact' => 'optional', 'comments' => 'open', 'access comments' => 0, 'post comments' => 0, 'skip comment approval' => 1, 'edit own comments' => 0, )DebugCommentLinksTest.php194Drupal\comment\Tests\CommentLinksTest->setEnvironment()
Changed environment:array ( 'authenticated' => false, 'comment count' => true, 'form' => 'separate page', 'user_register' => 'admin_only', 'contact' => 'optional', 'comments' => 'open', 'access comments' => 0, 'post comments' => 0, 'skip comment approval' => 1, 'edit own comments' => 0, )DebugCommentLinksTest.php194Drupal\comment\Tests\CommentLinksTest->setEnvironment()
Changed environment:array ( 'authenticated' => true, 'comment count' => true, 'form' => 'separate page', 'user_register' => 'admin_only', 'contact' => 'optional', 'comments' => 'open', 'access comments' => 0, 'post comments' => 0, 'skip comment approval' => 1, 'edit own comments' => 0, )DebugCommentLinksTest.php194Drupal\comment\Tests\CommentLinksTest->setEnvironment()
Changed environment:array ( 'authenticated' => false, 'comment count' => false, 'form' => 'separate page', 'user_register' => 'admin_only', 'contact' => 'optional', 'comments' => 'open', 'access comments' => 1, 'post comments' => 0, 'skip comment approval' => 1, 'edit own comments' => 0, )DebugCommentLinksTest.php194Drupal\comment\Tests\CommentLinksTest->setEnvironment()
Changed environment:array ( 'authenticated' => true, 'comment count' => false, 'form' => 'separate page', 'user_register' => 'admin_only', 'contact' => 'optional', 'comments' => 'open', 'access comments' => 1, 'post comments' => 0, 'skip comment approval' => 1, 'edit own comments' => 0, )DebugCommentLinksTest.php194Drupal\comment\Tests\CommentLinksTest->setEnvironment()
Changed environment:array ( 'authenticated' => false, 'comment count' => true, 'form' => 'separate page', 'user_register' => 'admin_only', 'contact' => 'optional', 'comments' => 'open', 'access comments' => 1, 'post comments' => 0, 'skip comment approval' => 1, 'edit own comments' => 0, )DebugCommentLinksTest.php194Drupal\comment\Tests\CommentLinksTest->setEnvironment()
Changed environment:array ( 'authenticated' => true, 'comment count' => true, 'form' => 'separate page', 'user_register' => 'admin_only', 'contact' => 'optional', 'comments' => 'open', 'access comments' => 1, 'post comments' => 0, 'skip comment approval' => 1, 'edit own comments' => 0, )DebugCommentLinksTest.php194Drupal\comment\Tests\CommentLinksTest->setEnvironment()
Changed environment:array ( 'authenticated' => false, 'comment count' => false, 'form' => 'separate page', 'user_register' => 'admin_only', 'contact' => 'optional', 'comments' => 'open', 'access comments' => 0, 'post comments' => 1, 'skip comment approval' => 1, 'edit own comments' => 0, )DebugCommentLinksTest.php194Drupal\comment\Tests\CommentLinksTest->setEnvironment()
Changed environment:array ( 'authenticated' => true, 'comment count' => false, 'form' => 'separate page', 'user_register' => 'admin_only', 'contact' => 'optional', 'comments' => 'open', 'access comments' => 0, 'post comments' => 1, 'skip comment approval' => 1, 'edit own comments' => 0, )DebugCommentLinksTest.php194Drupal\comment\Tests\CommentLinksTest->setEnvironment()
Changed environment:array ( 'authenticated' => false, 'comment count' => true, 'form' => 'separate page', 'user_register' => 'admin_only', 'contact' => 'optional', 'comments' => 'open', 'access comments' => 0, 'post comments' => 1, 'skip comment approval' => 1, 'edit own comments' => 0, )DebugCommentLinksTest.php194Drupal\comment\Tests\CommentLinksTest->setEnvironment()
Changed environment:array ( 'authenticated' => true, 'comment count' => true, 'form' => 'separate page', 'user_register' => 'admin_only', 'contact' => 'optional', 'comments' => 'open', 'access comments' => 0, 'post comments' => 1, 'skip comment approval' => 1, 'edit own comments' => 0, )DebugCommentLinksTest.php194Drupal\comment\Tests\CommentLinksTest->setEnvironment()
Changed environment:array ( 'authenticated' => false, 'comment count' => false, 'form' => 'separate page', 'user_register' => 'admin_only', 'contact' => 'optional', 'comments' => 'open', 'access comments' => 1, 'post comments' => 1, 'skip comment approval' => 1, 'edit own comments' => 0, )DebugCommentLinksTest.php194Drupal\comment\Tests\CommentLinksTest->setEnvironment()
Changed environment:array ( 'authenticated' => true, 'comment count' => false, 'form' => 'separate page', 'user_register' => 'admin_only', 'contact' => 'optional', 'comments' => 'open', 'access comments' => 1, 'post comments' => 1, 'skip comment approval' => 1, 'edit own comments' => 0, )DebugCommentLinksTest.php194Drupal\comment\Tests\CommentLinksTest->setEnvironment()
Changed environment:array ( 'authenticated' => false, 'comment count' => true, 'form' => 'separate page', 'user_register' => 'admin_only', 'contact' => 'optional', 'comments' => 'open', 'access comments' => 1, 'post comments' => 1, 'skip comment approval' => 1, 'edit own comments' => 0, )DebugCommentLinksTest.php194Drupal\comment\Tests\CommentLinksTest->setEnvironment()
Changed environment:array ( 'authenticated' => true, 'comment count' => true, 'form' => 'separate page', 'user_register' => 'admin_only', 'contact' => 'optional', 'comments' => 'open', 'access comments' => 1, 'post comments' => 1, 'skip comment approval' => 1, 'edit own comments' => 0, )DebugCommentLinksTest.php194Drupal\comment\Tests\CommentLinksTest->setEnvironment()
LeafDrupal\comment\Tests\CommentNewIndicatorTest4200
LeafDrupal\comment\Tests\CommentNodeAccessTest5700
LeafDrupal\comment\Tests\CommentNodeChangesTest2400
LeafDrupal\comment\Tests\CommentPagerTest21300
LeafDrupal\comment\Tests\CommentPreviewTest9800
LeafDrupal\comment\Tests\CommentRssTest2600
LeafDrupal\comment\Tests\CommentStatisticsTest9800
LeafDrupal\comment\Tests\CommentThreadingTest15900
LeafDrupal\comment\Tests\CommentTokenReplaceTest6600
LeafDrupal\comment\Tests\CommentTranslationUITest9600
ExpandDrupal\config\Tests\ConfigCRUDTest010
MessageGroupFilenameLineFunctionStatus
The test did not complete due to a fatal error.Completion checkConfigCRUDTest.php27Drupal\config\Tests\ConfigCRUDTest->testCRUD()
LeafDrupal\config\Tests\ConfigEntityListTest6800
LeafDrupal\config\Tests\ConfigEntityTest13700
ExpandDrupal\config\Tests\ConfigFileContentTest010
MessageGroupFilenameLineFunctionStatus
The test did not complete due to a fatal error.Completion checkConfigFileContentTest.php28Drupal\config\Tests\ConfigFileContentTest->testReadWriteConfig()
ExpandDrupal\config\Tests\ConfigImportTest010
MessageGroupFilenameLineFunctionStatus
The test did not complete due to a fatal error.Completion checkConfigImportTest.php45Drupal\config\Tests\ConfigImportTest->testNoImport()
LeafDrupal\config\Tests\ConfigImportUITest4600
ExpandDrupal\config\Tests\ConfigInstallTest010
MessageGroupFilenameLineFunctionStatus
The test did not complete due to a fatal error.Completion checkConfigInstallTest.php35Drupal\config\Tests\ConfigInstallTest->testModuleInstallation()
ExpandDrupal\config\Tests\ConfigOverrideTest010
MessageGroupFilenameLineFunctionStatus
The test did not complete due to a fatal error.Completion checkConfigOverrideTest.php41Drupal\config\Tests\ConfigOverrideTest->testConfOverride()
LeafDrupal\config\Tests\ConfigUpgradeTest1200
LeafDrupal\config\Tests\LocaleConfigOverride300
ExpandDrupal\config\Tests\Storage\DatabaseStorageTest010
MessageGroupFilenameLineFunctionStatus
The test did not complete due to a fatal error.Completion checkConfigStorageTestBase.php32Drupal\config\Tests\Storage\DatabaseStorageTest->testCRUD()
ExpandDrupal\config\Tests\Storage\FileStorageTest010
MessageGroupFilenameLineFunctionStatus
The test did not complete due to a fatal error.Completion checkConfigStorageTestBase.php32Drupal\config\Tests\Storage\FileStorageTest->testCRUD()
LeafDrupal\contact\Tests\ContactAuthenticatedUserTest1300
LeafDrupal\contact\Tests\ContactPersonalTest16200
LeafDrupal\contact\Tests\ContactSitewideTest24400
LeafDrupal\contextual\Tests\ContextualDynamicContextTest1600
LeafDrupal\dblog\Tests\DBLogTest37700
LeafDrupal\email\Tests\EmailFieldTest1900
LeafDrupal\field\Tests\BulkDeleteTest7500
LeafDrupal\field\Tests\CrudTest7500
LeafDrupal\field\Tests\DisplayApiTest4600
LeafDrupal\field\Tests\EntityPropertiesTest400
LeafDrupal\field\Tests\FieldAccessTest2100
LeafDrupal\field\Tests\FieldAttachOtherTest10300
LeafDrupal\field\Tests\FieldAttachStorageTest9200
LeafDrupal\field\Tests\FieldInfoTest7100
LeafDrupal\field\Tests\FieldInstanceCrudTest3800
LeafDrupal\field\Tests\FormTest26500
LeafDrupal\field\Tests\TranslationTest10200
LeafDrupal\field_sql_storage\Tests\FieldSqlStorageTest9200
LeafDrupal\field_ui\Tests\AlterTest2100
LeafDrupal\field_ui\Tests\ManageDisplayTest14900
LeafDrupal\field_ui\Tests\ManageFieldsTest23100
LeafDrupal\file\Tests\CopyTest11000
LeafDrupal\file\Tests\DeleteTest2400
LeafDrupal\file\Tests\DownloadTest4500
LeafDrupal\file\Tests\FileFieldDisplayTest5000
LeafDrupal\file\Tests\FileFieldPathTest2700
LeafDrupal\file\Tests\FileFieldRevisionTest6700
LeafDrupal\file\Tests\FileFieldRSSContentTest2300
LeafDrupal\file\Tests\FileFieldValidateTest11800
LeafDrupal\file\Tests\FileFieldWidgetTest29900
LeafDrupal\file\Tests\FileManagedFileElementTest26800
LeafDrupal\file\Tests\FilePrivateTest3700
LeafDrupal\file\Tests\FileTokenReplaceTest3500
LeafDrupal\file\Tests\LoadTest3400
LeafDrupal\file\Tests\MoveTest11000
LeafDrupal\file\Tests\RemoteFileSaveUploadTest27000
LeafDrupal\file\Tests\SaveDataTest9300
LeafDrupal\file\Tests\SaveTest1600
LeafDrupal\file\Tests\SaveUploadTest27000
LeafDrupal\file\Tests\SpaceUsedTest1200
LeafDrupal\file\Tests\UsageTest3400
LeafDrupal\file\Tests\ValidateTest1200
LeafDrupal\file\Tests\ValidatorTest2900
LeafDrupal\filter\Tests\FilterAdminTest17800
LeafDrupal\filter\Tests\FilterAPITest500
LeafDrupal\filter\Tests\FilterCrudTest23900
LeafDrupal\filter\Tests\FilterDefaultFormatTest3300
LeafDrupal\filter\Tests\FilterFormatAccessTest27200
LeafDrupal\filter\Tests\FilterHooksTest3300
LeafDrupal\filter\Tests\FilterHtmlImageSecureTest4600
LeafDrupal\filter\Tests\FilterNoFormatTest100
LeafDrupal\filter\Tests\FilterSecurityTest4000
LeafDrupal\filter\Tests\FilterSettingsTest1200
ExpandDrupal\filter\Tests\FilterUnitTest010
MessageGroupFilenameLineFunctionStatus
The test did not complete due to a fatal error.Completion checkFilterUnitTest.php41Drupal\filter\Tests\FilterUnitTest->testLineBreakFilter()
LeafDrupal\forum\Tests\ForumBlockTest14800
LeafDrupal\forum\Tests\ForumIndexTest2700
LeafDrupal\forum\Tests\ForumNodeAccessTest6300
LeafDrupal\forum\Tests\ForumTest68000
LeafDrupal\help\Tests\HelpTest36000
LeafDrupal\help\Tests\NoHelpTest1200
LeafDrupal\image\Tests\ImageAdminStylesTest27900
LeafDrupal\image\Tests\ImageDimensionsScaleUnitTest1500
LeafDrupal\image\Tests\ImageDimensionsTest7700
LeafDrupal\image\Tests\ImageEffectsTest5400
LeafDrupal\image\Tests\ImageFieldDefaultImagesTest7200
LeafDrupal\image\Tests\ImageFieldDisplayTest18800
LeafDrupal\image\Tests\ImageFieldValidateTest5900
LeafDrupal\image\Tests\ImageStylesPathAndUrlTest6500
LeafDrupal\image\Tests\ImageThemeFunctionTest500
LeafDrupal\jsonld\Tests\DrupalJsonldNormalizerTest1200
LeafDrupal\language\Tests\LanguageBrowserDetectionUnitTest10700
LeafDrupal\language\Tests\LanguageConfigurationElementTest5400
LeafDrupal\language\Tests\LanguageConfigurationTest4600
LeafDrupal\language\Tests\LanguageCustomLanguageConfigurationTest3600
LeafDrupal\language\Tests\LanguageDependencyInjectionTest1700
LeafDrupal\language\Tests\LanguageListTest10000
LeafDrupal\language\Tests\LanguageNegotiationInfoTest4900
LeafDrupal\language\Tests\LanguagePathMonolingualTest3500
LeafDrupal\language\Tests\LanguageSwitchingTest2600
LeafDrupal\language\Tests\LanguageUILanguageNegotiationTest14900
LeafDrupal\language\Tests\LanguageUrlRewritingTest4400
ExpandDrupal\layout\Tests\DisplayInternalLogicTest304
MessageGroupFilenameLineFunctionStatus
htmlspecialchars() expects parameter 1 to be string, array givenhtmlspecialchars(Array, 3, 'UTF-8') check_plain(Array) drupal_placeholder(Array) format_string('%type: !message in %function (line %line of %file). !backtrace', Array) Drupal\simpletest\TestBase->exceptionHandler(Object) Drupal\simpletest\TestBase->run() simpletest_script_run_one_test('158', 'Drupal\layout\Tests\DisplayInternalLogicTest') Warningbootstrap.inc1586check_plain()
Drupal\Component\Plugin\Exception\PluginException: The plugin (static_layout:layout_test_theme__two-col) did not specify an instance class. in Drupal\Component\Plugin\Factory\DefaultFactory->getPluginClass() (line 60 of /var/lib/drupaltestbot/sites/default/files/checkout/core/lib/Drupal/Component/Plugin/Factory/DefaultFactory.php). ">Drupal\Component\Plugin\Factory\DefaultFactory->getPluginClass('static_layout:layout_test_theme__two-col') Drupal\Component\Plugin\Factory\ReflectionFactory->createInstance('static_layout:layout_test_theme__two-col', Array) Drupal\Component\Plugin\PluginManagerBase->createInstance('static_layout:layout_test_theme__two-col', Array) Drupal\layout\Plugin\Core\Entity\Display->getLayoutInstance() Drupal\layout\Plugin\Core\Entity\Display->sortBlocks() Drupal\layout\Plugin\Core\Entity\Display->getSortedBlocksByRegion('left') Drupal\layout\Tests\DisplayInternalLogicTest->testBlockSorting() Drupal\simpletest\TestBase->run() simpletest_script_run_one_test('158', 'Drupal\layout\Tests\DisplayInternalLogicTest') Uncaught exceptionDefaultFactory.php60Drupal\Component\Plugin\Factory\DefaultFactory->getPluginClass()
htmlspecialchars() expects parameter 1 to be string, array givenhtmlspecialchars(Array, 3, 'UTF-8') check_plain(Array) drupal_placeholder(Array) format_string('%type: !message in %function (line %line of %file). !backtrace', Array) Drupal\simpletest\TestBase->exceptionHandler(Object) Drupal\simpletest\TestBase->run() simpletest_script_run_one_test('158', 'Drupal\layout\Tests\DisplayInternalLogicTest') Warningbootstrap.inc1586check_plain()
Drupal\Component\Plugin\Exception\PluginException: The plugin (static_layout:layout_test_theme__two-col) did not specify an instance class. in Drupal\Component\Plugin\Factory\DefaultFactory->getPluginClass() (line 60 of /var/lib/drupaltestbot/sites/default/files/checkout/core/lib/Drupal/Component/Plugin/Factory/DefaultFactory.php). ">Drupal\Component\Plugin\Factory\DefaultFactory->getPluginClass('static_layout:layout_test_theme__two-col') Drupal\Component\Plugin\Factory\ReflectionFactory->createInstance('static_layout:layout_test_theme__two-col', Array) Drupal\Component\Plugin\PluginManagerBase->createInstance('static_layout:layout_test_theme__two-col', Array) Drupal\layout\Plugin\Core\Entity\Display->getLayoutInstance() Drupal\layout\Tests\DisplayInternalLogicTest->testBlockMapping() Drupal\simpletest\TestBase->run() simpletest_script_run_one_test('158', 'Drupal\layout\Tests\DisplayInternalLogicTest') Uncaught exceptionDefaultFactory.php60Drupal\Component\Plugin\Factory\DefaultFactory->getPluginClass()
ExpandDrupal\layout\Tests\LayoutDerivativesTest1522
MessageGroupFilenameLineFunctionStatus
Four definitions available.OtherLayoutDerivativesTest.php40Drupal\layout\Tests\LayoutDerivativesTest->testDerivatives()
Two column layout found.OtherLayoutDerivativesTest.php42Drupal\layout\Tests\LayoutDerivativesTest->testDerivatives()
htmlspecialchars() expects parameter 1 to be string, array givenhtmlspecialchars(Array, 3, 'UTF-8') check_plain(Array) drupal_placeholder(Array) format_string('%type: !message in %function (line %line of %file). !backtrace', Array) Drupal\simpletest\TestBase->exceptionHandler(Object) Drupal\simpletest\TestBase->run() simpletest_script_run_one_test('311', 'Drupal\layout\Tests\LayoutDerivativesTest') Warningbootstrap.inc1586check_plain()
Drupal\Component\Plugin\Exception\PluginException: The plugin (static_layout:layout_test_theme__two-col) did not specify an instance class. in Drupal\Component\Plugin\Factory\DefaultFactory->getPluginClass() (line 60 of /var/lib/drupaltestbot/sites/default/files/checkout/core/lib/Drupal/Component/Plugin/Factory/DefaultFactory.php). ">Drupal\Component\Plugin\Factory\DefaultFactory->getPluginClass('static_layout:layout_test_theme__two-col') Drupal\Component\Plugin\Factory\ReflectionFactory->createInstance('static_layout:layout_test_theme__two-col', Array) Drupal\Component\Plugin\PluginManagerBase->createInstance('static_layout:layout_test_theme__two-col', Array) Drupal\layout\Tests\LayoutDerivativesTest->testDerivatives() Drupal\simpletest\TestBase->run() simpletest_script_run_one_test('311', 'Drupal\layout\Tests\LayoutDerivativesTest') Uncaught exceptionDefaultFactory.php60Drupal\Component\Plugin\Factory\DefaultFactory->getPluginClass()
LeafDrupal\link\Tests\LinkFieldTest14000
LeafDrupal\link\Tests\LinkFieldUITest2100
LeafDrupal\locale\Tests\LocaleCompareTest6800
LeafDrupal\locale\Tests\LocaleContentTest15000
LeafDrupal\locale\Tests\LocaleExportTest5700
LeafDrupal\locale\Tests\LocaleFileImportStatus9100
LeafDrupal\locale\Tests\LocaleImportFunctionalTest20100
LeafDrupal\locale\Tests\LocaleInstallTest200
LeafDrupal\locale\Tests\LocaleJavascriptTranslation6600
LeafDrupal\locale\Tests\LocaleLibraryInfoAlterTest200
LeafDrupal\locale\Tests\LocalePathTest4700
LeafDrupal\locale\Tests\LocalePluralFormatTest16000
LeafDrupal\locale\Tests\LocaleStringTest2600
LeafDrupal\locale\Tests\LocaleTranslationTest30600
LeafDrupal\locale\Tests\LocaleUninstallFrenchTest3600
LeafDrupal\locale\Tests\LocaleUninstallTest3600
LeafDrupal\menu\Tests\MenuNodeTest6100
LeafDrupal\menu\Tests\MenuTest318500
LeafDrupal\node\Tests\MultiStepNodeFormBasicOptionsTest1600
LeafDrupal\node\Tests\NodeAccessBaseTableTest15900
LeafDrupal\node\Tests\NodeAccessFieldTest5000
LeafDrupal\node\Tests\NodeAccessLanguageTest2500
LeafDrupal\node\Tests\NodeAccessPagerTest3000
LeafDrupal\node\Tests\NodeAccessRebuildTest1900
LeafDrupal\node\Tests\NodeAccessRecordsTest2600
LeafDrupal\node\Tests\NodeAccessTest3400
LeafDrupal\node\Tests\NodeAdminTest14500
LeafDrupal\node\Tests\NodeBlockFunctionalTest8400
LeafDrupal\node\Tests\NodeBlockTest2100
LeafDrupal\node\Tests\NodeBuildContentTest400
LeafDrupal\node\Tests\NodeCreationTest4900
LeafDrupal\node\Tests\NodeEntityFieldQueryAlterTest3200
LeafDrupal\node\Tests\NodeEntityViewModeAlterTest2000
LeafDrupal\node\Tests\NodeFeedTest100
LeafDrupal\node\Tests\NodeFieldMultilingualTestCase6400
LeafDrupal\node\Tests\NodeLoadHooksTest700
LeafDrupal\node\Tests\NodeLoadMultipleTest2700
LeafDrupal\node\Tests\NodePostSettingsTest4000
LeafDrupal\node\Tests\NodeQueryAlterTest9900
LeafDrupal\node\Tests\NodeRevisionPermissionsTest3800
LeafDrupal\node\Tests\NodeRevisionsTest6400
LeafDrupal\node\Tests\NodeRSSContentTest2100
LeafDrupal\node\Tests\NodeSaveTest6000
LeafDrupal\node\Tests\NodeTitleTest2300
LeafDrupal\node\Tests\NodeTitleXSSTest2300
LeafDrupal\node\Tests\NodeTokenReplaceTest4000
LeafDrupal\node\Tests\NodeTranslationUITest11500
LeafDrupal\node\Tests\NodeTypeInitialLanguageTest10900
LeafDrupal\node\Tests\NodeTypePersistenceTest10100
LeafDrupal\node\Tests\NodeTypeTest14600
LeafDrupal\node\Tests\PageEditTest9700
LeafDrupal\node\Tests\PagePreviewTest4100
LeafDrupal\node\Tests\PageViewTest3400
LeafDrupal\node\Tests\SummaryLengthTest1200
LeafDrupal\number\Tests\NumberFieldTest8800
LeafDrupal\openid\Tests\OpenIDFunctionalTest30600
LeafDrupal\openid\Tests\OpenIDRegistrationTest13400
LeafDrupal\openid\Tests\OpenIDTest4500
LeafDrupal\options\Tests\OptionsDynamicValuesValidationTest900
LeafDrupal\options\Tests\OptionsFieldTest1600
LeafDrupal\options\Tests\OptionsFieldUITest20700
LeafDrupal\options\Tests\OptionsSelectDynamicValuesTest1600
LeafDrupal\options\Tests\OptionsWidgetsTest26100
LeafDrupal\path\Tests\PathAliasTest13800
LeafDrupal\path\Tests\PathLanguageTest7100
LeafDrupal\path\Tests\PathLanguageUiTest7800
LeafDrupal\path\Tests\PathTaxonomyTermTest3700
LeafDrupal\php\Tests\PhpAccessTest3800
LeafDrupal\php\Tests\PhpFilterTest4200
LeafDrupal\picture\Tests\PictureAdminUITest5400
LeafDrupal\picture\Tests\PictureFieldDisplayTest11600
LeafDrupal\poll\Tests\PollBlockTest17200
LeafDrupal\poll\Tests\PollCreateTest26900
LeafDrupal\poll\Tests\PollDeleteChoiceTest5400
LeafDrupal\poll\Tests\PollExpirationTest5200
LeafDrupal\poll\Tests\PollJsAddChoiceTest1600
LeafDrupal\poll\Tests\PollTokenReplaceTest12500
LeafDrupal\poll\Tests\PollTranslateTest7300
LeafDrupal\poll\Tests\PollVoteCheckHostnameTest14000
LeafDrupal\poll\Tests\PollVoteTest14600
LeafDrupal\rdf\Tests\CommentAttributesTest20300
LeafDrupal\rdf\Tests\CrudTest1000
LeafDrupal\rdf\Tests\GetNamespacesTest700
LeafDrupal\rdf\Tests\GetRdfNamespacesTest500
LeafDrupal\rdf\Tests\MappingDefinitionTest5900
LeafDrupal\rdf\Tests\MappingHookTest600
LeafDrupal\rdf\Tests\RdfaMarkupTest2900
LeafDrupal\rdf\Tests\TrackerAttributesTest3300
LeafDrupal\rest\Tests\DBLogTest1800
LeafDrupal\rest\Tests\DeleteTest7900
LeafDrupal\rest\Tests\ReadTest3300
LeafDrupal\search\Tests\SearchAdvancedSearchFormTest3400
LeafDrupal\search\Tests\SearchBlockTest6400
LeafDrupal\search\Tests\SearchCommentCountToggleTest3100
LeafDrupal\search\Tests\SearchCommentTest19300
LeafDrupal\search\Tests\SearchConfigSettingsFormTest13200
LeafDrupal\search\Tests\SearchEmbedFormTest3200
LeafDrupal\search\Tests\SearchExactTest2500
LeafDrupal\search\Tests\SearchExcerptTest1800
LeafDrupal\search\Tests\SearchExpressionInsertExtractTest2400
LeafDrupal\search\Tests\SearchKeywordsConditionsTest2800
LeafDrupal\search\Tests\SearchLanguageTest4100
LeafDrupal\search\Tests\SearchMatchTest14700
LeafDrupal\search\Tests\SearchMultilingualEntityTest1000
LeafDrupal\search\Tests\SearchNodeAccessTest1600
LeafDrupal\search\Tests\SearchNumberMatchingTest29500
LeafDrupal\search\Tests\SearchNumbersTest17500
LeafDrupal\search\Tests\SearchPageOverrideTest1500
LeafDrupal\search\Tests\SearchPageTextTest3700
LeafDrupal\search\Tests\SearchPreprocessLangcodeTest3900
LeafDrupal\search\Tests\SearchRankingTest5900
LeafDrupal\search\Tests\SearchSimplifyTest65700
LeafDrupal\search\Tests\SearchTokenizerTest800
LeafDrupal\shortcut\Tests\ShortcutLinksTest14800
LeafDrupal\shortcut\Tests\ShortcutSetsTest23300
LeafDrupal\simpletest\Tests\BrokenSetUpTest2100
LeafDrupal\simpletest\Tests\BrowserTest1600
ExpandDrupal\simpletest\Tests\DrupalUnitTestBaseTest010
MessageGroupFilenameLineFunctionStatus
The test did not complete due to a fatal error.Completion checkDrupalUnitTestBaseTest.php35Drupal\simpletest\Tests\DrupalUnitTestBaseTest->testSetUp()
LeafDrupal\simpletest\Tests\FolderTest200
LeafDrupal\simpletest\Tests\InstallationProfileModuleTestsTest1900
LeafDrupal\simpletest\Tests\MailCaptureTest1200
LeafDrupal\simpletest\Tests\MissingCheckedRequirementsTest1900
LeafDrupal\simpletest\Tests\OtherInstallationProfileModuleTestsTest1200
LeafDrupal\simpletest\Tests\SimpleTestTest11400
LeafDrupal\standard\Tests\StandardTest700
LeafDrupal\statistics\Tests\StatisticsAdminTest11000
LeafDrupal\statistics\Tests\StatisticsBlockVisitorsTest4600
LeafDrupal\statistics\Tests\StatisticsLoggingTest3500
LeafDrupal\statistics\Tests\StatisticsReportsTest9200
LeafDrupal\statistics\Tests\StatisticsTokenReplaceTest3000
LeafDrupal\syslog\Tests\SyslogTest1700
LeafDrupal\system\Tests\Ajax\AjaxCommandsUnitTest1600
LeafDrupal\system\Tests\Ajax\CommandsTest7300
LeafDrupal\system\Tests\Ajax\DialogTest300
LeafDrupal\system\Tests\Ajax\ElementValidationTest700
LeafDrupal\system\Tests\Ajax\FormValuesTest2900
LeafDrupal\system\Tests\Ajax\FrameworkTest3400
LeafDrupal\system\Tests\Ajax\MultiFormTest3600
LeafDrupal\system\Tests\Batch\PageTest1600
LeafDrupal\system\Tests\Batch\PercentagesUnitTest1800
LeafDrupal\system\Tests\Batch\ProcessingTest16100
LeafDrupal\system\Tests\Bootstrap\GetFilenameUnitTest600
LeafDrupal\system\Tests\Bootstrap\HookBootExitTest1900
LeafDrupal\system\Tests\Bootstrap\IpAddressTest1100
LeafDrupal\system\Tests\Bootstrap\MiscUnitTest500
LeafDrupal\system\Tests\Bootstrap\OverrideServerVariablesUnitTest600
LeafDrupal\system\Tests\Bootstrap\PageCacheTest7900
LeafDrupal\system\Tests\Bootstrap\ResettableStaticUnitTest500
LeafDrupal\system\Tests\Bootstrap\TimerUnitTest500
LeafDrupal\system\Tests\Bootstrap\VariableTest900
LeafDrupal\system\Tests\Bundle\BundleTest900
LeafDrupal\system\Tests\Cache\BackendChainImplementationUnitTest4800
LeafDrupal\system\Tests\Cache\BackendChainUnitTest12600
LeafDrupal\system\Tests\Cache\ClearTest900
LeafDrupal\system\Tests\Cache\DatabaseBackendUnitTest12600
LeafDrupal\system\Tests\Cache\InstallTest1500
LeafDrupal\system\Tests\Cache\MemoryBackendUnitTest12600
LeafDrupal\system\Tests\Cache\NullBackendTest200
LeafDrupal\system\Tests\Common\AddFeedTest700
LeafDrupal\system\Tests\Common\AlterTest700
LeafDrupal\system\Tests\Common\ArrayUnitTest1300
LeafDrupal\system\Tests\Common\AttributesUnitTest700
LeafDrupal\system\Tests\Common\AutocompleteTagsUnitTest800
LeafDrupal\system\Tests\Common\CascadingStylesheetsTest4100
LeafDrupal\system\Tests\Common\CascadingStylesheetsUnitTest1200
LeafDrupal\system\Tests\Common\ColorTest8500
LeafDrupal\system\Tests\Common\FormatDateTest6700
LeafDrupal\system\Tests\Common\GotoTest2700
LeafDrupal\system\Tests\Common\HtmlIdentifierUnitTest1000
LeafDrupal\system\Tests\Common\HttpRequestTest3500
LeafDrupal\system\Tests\Common\InstallerLanguageTest800
LeafDrupal\system\Tests\Common\JavaScriptTest9600
LeafDrupal\system\Tests\Common\JsonUnitTest2100
LeafDrupal\system\Tests\Common\ParseInfoFileUnitTest300
LeafDrupal\system\Tests\Common\RegionContentTest1800
LeafDrupal\system\Tests\Common\RenderTest5400
LeafDrupal\system\Tests\Common\SchemaTest58800
LeafDrupal\system\Tests\Common\SimpleTestErrorCollectorTest1600
LeafDrupal\system\Tests\Common\SizeUnitTest3500
LeafDrupal\system\Tests\Common\SystemListingTest600
LeafDrupal\system\Tests\Common\TableSortExtenderUnitTest600
LeafDrupal\system\Tests\Common\UrlTest7000
LeafDrupal\system\Tests\Common\ValidNumberStepUnitTest2400
LeafDrupal\system\Tests\Common\ValidUrlUnitTest7900
LeafDrupal\system\Tests\Common\WriteRecordTest3400
ExpandDrupal\system\Tests\Common\XssUnitTest010
MessageGroupFilenameLineFunctionStatus
The test did not complete due to a fatal error.Completion checkXssUnitTest.php40Drupal\system\Tests\Common\XssUnitTest->testInvalidMultiByte()
LeafDrupal\system\Tests\Database\AlterTest6200
LeafDrupal\system\Tests\Database\BasicSyntaxTest3000
LeafDrupal\system\Tests\Database\CaseSensitivityTest800
LeafDrupal\system\Tests\Database\ConnectionTest3800
LeafDrupal\system\Tests\Database\ConnectionUnitTest1200
LeafDrupal\system\Tests\Database\DeleteTruncateTest2300
LeafDrupal\system\Tests\Database\EmptyStatementTest400
LeafDrupal\system\Tests\Database\FetchTest7200
LeafDrupal\system\Tests\Database\InsertDefaultsTest2200
LeafDrupal\system\Tests\Database\InsertLobTest1500
LeafDrupal\system\Tests\Database\InsertTest6500
LeafDrupal\system\Tests\Database\InvalidDataTest800
LeafDrupal\system\Tests\Database\LoggingTest6100
LeafDrupal\system\Tests\Database\MergeTest13600
LeafDrupal\system\Tests\Database\NextIdTest200
LeafDrupal\system\Tests\Database\QueryTest700
LeafDrupal\system\Tests\Database\RangeQueryTest800
LeafDrupal\system\Tests\Database\RegressionTest5500
LeafDrupal\system\Tests\Database\SelectComplexTest21300
LeafDrupal\system\Tests\Database\SelectOrderedTest4700
LeafDrupal\system\Tests\Database\SelectPagerDefaultTest8500
LeafDrupal\system\Tests\Database\SelectSubqueryTest6500
LeafDrupal\system\Tests\Database\SelectTableSortDefaultTest8500
LeafDrupal\system\Tests\Database\SelectTest17600
LeafDrupal\system\Tests\Database\SerializeQueryTest1400
LeafDrupal\system\Tests\Database\TaggingTest4000
LeafDrupal\system\Tests\Database\TemporaryQueryTest1100
LeafDrupal\system\Tests\Database\TransactionTest7400
LeafDrupal\system\Tests\Database\UpdateComplexTest6700
LeafDrupal\system\Tests\Database\UpdateLobTest1500
LeafDrupal\system\Tests\Database\UpdateTest5600
LeafDrupal\system\Tests\Datetime\DateTimePlusTest5400
LeafDrupal\system\Tests\Datetime\DrupalDateTimeTest1400
LeafDrupal\system\Tests\DrupalKernel\ContentNegotiationTest4000
LeafDrupal\system\Tests\DrupalKernel\DrupalKernelTest700
LeafDrupal\system\Tests\Entity\EntityAccessTest3400
LeafDrupal\system\Tests\Entity\EntityApiInfoTest600
LeafDrupal\system\Tests\Entity\EntityApiTest800
LeafDrupal\system\Tests\Entity\EntityCrudHookTest11400
LeafDrupal\system\Tests\Entity\EntityFieldTest14500
LeafDrupal\system\Tests\Entity\EntityFormTest2600
LeafDrupal\system\Tests\Entity\EntityQueryTest6200
LeafDrupal\system\Tests\Entity\EntityRevisionsTest3100
LeafDrupal\system\Tests\Entity\EntityTranslationFormTest3600
LeafDrupal\system\Tests\Entity\EntityTranslationTest5100
LeafDrupal\system\Tests\Entity\EntityUUIDTest2100
LeafDrupal\system\Tests\FileTransfer\FileTransferTest200
LeafDrupal\system\Tests\File\DirectoryTest2000
LeafDrupal\system\Tests\File\MimeTypeTest4200
LeafDrupal\system\Tests\File\NameMungingTest500
LeafDrupal\system\Tests\File\RemoteFileDirectoryTest2400
LeafDrupal\system\Tests\File\RemoteFileScanDirectoryTest2900
LeafDrupal\system\Tests\File\RemoteFileUnmanagedCopyTest3200
LeafDrupal\system\Tests\File\RemoteFileUnmanagedDeleteRecursiveTest2100
LeafDrupal\system\Tests\File\RemoteFileUnmanagedDeleteTest1000
LeafDrupal\system\Tests\File\RemoteFileUnmanagedMoveTest2300
LeafDrupal\system\Tests\File\RemoteFileUnmanagedSaveDataTest800
LeafDrupal\system\Tests\File\ScanDirectoryTest2900
LeafDrupal\system\Tests\File\StreamWrapperTest1900
LeafDrupal\system\Tests\File\UnmanagedCopyTest2900
LeafDrupal\system\Tests\File\UnmanagedDeleteRecursiveTest1700
LeafDrupal\system\Tests\File\UnmanagedDeleteTest700
LeafDrupal\system\Tests\File\UnmanagedMoveTest2000
LeafDrupal\system\Tests\File\UnmanagedSaveDataTest700
LeafDrupal\system\Tests\File\UrlRewritingTest1400
LeafDrupal\system\Tests\Form\AlterTest400
LeafDrupal\system\Tests\Form\ArbitraryRebuildTest1600
LeafDrupal\system\Tests\Form\CheckboxTest9700
LeafDrupal\system\Tests\Form\ElementsLabelsTest2000
LeafDrupal\system\Tests\Form\ElementsTableSelectTest6900
LeafDrupal\system\Tests\Form\ElementsVerticalTabsTest3900
LeafDrupal\system\Tests\Form\ElementTest4200
LeafDrupal\system\Tests\Form\EmailTest1700
LeafDrupal\system\Tests\Form\FileInclusionTest1100
LeafDrupal\system\Tests\Form\FormTest72600
LeafDrupal\system\Tests\Form\HTMLIdTest700
LeafDrupal\system\Tests\Form\LanguageSelectElementTest4700
LeafDrupal\system\Tests\Form\ProgrammaticTest2400
LeafDrupal\system\Tests\Form\RebuildTest5300
LeafDrupal\system\Tests\Form\RedirectTest3100
LeafDrupal\system\Tests\Form\StateValuesCleanAdvancedTest700
LeafDrupal\system\Tests\Form\StateValuesCleanTest1400
LeafDrupal\system\Tests\Form\StorageTest12000
LeafDrupal\system\Tests\Form\TriggeringElementTest5000
LeafDrupal\system\Tests\Form\UrlTest1700
LeafDrupal\system\Tests\Form\ValidationTest11200
LeafDrupal\system\Tests\Form\WrapperTest500
LeafDrupal\system\Tests\Graph\GraphUnitTest2800
LeafDrupal\system\Tests\Image\FileMoveTest400
LeafDrupal\system\Tests\Image\ToolkitGdTest20400
LeafDrupal\system\Tests\Image\ToolkitTest5300
LeafDrupal\system\Tests\KeyValueStore\DatabaseStorageExpirableTest6800
LeafDrupal\system\Tests\KeyValueStore\DatabaseStorageTest3600
LeafDrupal\system\Tests\KeyValueStore\GarbageCollectionTest200
LeafDrupal\system\Tests\KeyValueStore\MemoryStorageTest3600
LeafDrupal\system\Tests\Lock\LockFunctionalTest2900
LeafDrupal\system\Tests\Mail\HtmlToTextTest8600
LeafDrupal\system\Tests\Mail\MailTest400
LeafDrupal\system\Tests\Menu\BreadcrumbTest40900
LeafDrupal\system\Tests\Menu\LinksTest5000
LeafDrupal\system\Tests\Menu\RebuildTest500
LeafDrupal\system\Tests\Menu\RouterTest22800
LeafDrupal\system\Tests\Menu\TrailTest6800
LeafDrupal\system\Tests\Menu\TreeDataUnitTest400
LeafDrupal\system\Tests\Menu\TreeOutputTest700
LeafDrupal\system\Tests\Module\ClassLoaderTest1000
LeafDrupal\system\Tests\Module\DependencyTest16000
LeafDrupal\system\Tests\Module\EnableDisableTest200200
LeafDrupal\system\Tests\Module\HookRequirementsTest1600
LeafDrupal\system\Tests\Module\InstallTest300
LeafDrupal\system\Tests\Module\ModuleApiTest7200
LeafDrupal\system\Tests\Module\ModuleEnable300
LeafDrupal\system\Tests\Module\RequiredTest1800
LeafDrupal\system\Tests\Module\UninstallTest200
LeafDrupal\system\Tests\Module\VersionTest5100
LeafDrupal\system\Tests\Pager\PagerTest12300
ExpandDrupal\system\Tests\Path\AliasTest010
MessageGroupFilenameLineFunctionStatus
The test did not complete due to a fatal error.Completion checkAliasTest.php40Drupal\system\Tests\Path\AliasTest->testCRUD()
LeafDrupal\system\Tests\Path\MatchPathTest4100
LeafDrupal\system\Tests\Path\UrlAlterFunctionalTest3700
LeafDrupal\system\Tests\PhpStorage\FileStorageTest1200
LeafDrupal\system\Tests\PhpStorage\MTimeProtectedFastFileStorageTest1900
LeafDrupal\system\Tests\PhpStorage\MTimeProtectedFileStorageTest1900
LeafDrupal\system\Tests\Plugin\AlterDecoratorTest300
LeafDrupal\system\Tests\Plugin\CacheDecoratorTest1400
LeafDrupal\system\Tests\Plugin\DerivativeTest900
LeafDrupal\system\Tests\Plugin\Discovery\AnnotatedClassDiscoveryTest700
LeafDrupal\system\Tests\Plugin\Discovery\StaticDiscoveryTest600
LeafDrupal\system\Tests\Plugin\FactoryTest900
LeafDrupal\system\Tests\Plugin\InspectionTest1000
LeafDrupal\system\Tests\Queue\QueueTest1400
LeafDrupal\system\Tests\Routing\ChainMatcherTest300
LeafDrupal\system\Tests\Routing\ControllerResolverTest100
LeafDrupal\system\Tests\Routing\FirstEntryFinalMatcherTest800
LeafDrupal\system\Tests\Routing\HttpMethodMatcherTest800
LeafDrupal\system\Tests\Routing\MatcherDumperTest800
LeafDrupal\system\Tests\Routing\MimeTypeMatcherTest1100
LeafDrupal\system\Tests\Routing\NestedMatcherTest100
LeafDrupal\system\Tests\Routing\PathMatcherTest2900
LeafDrupal\system\Tests\Routing\RouterPermissionTest1900
LeafDrupal\system\Tests\Routing\RouterTest3000
LeafDrupal\system\Tests\Routing\RouteTest600
LeafDrupal\system\Tests\Serialization\SerializationTest200
LeafDrupal\system\Tests\Session\SessionHttpsTest8300
LeafDrupal\system\Tests\Session\SessionTest19000
LeafDrupal\system\Tests\System\AccessDeniedTest6800
LeafDrupal\system\Tests\System\AdminMetaTagTest300
LeafDrupal\system\Tests\System\AdminTest18100
LeafDrupal\system\Tests\System\CronRunTest5200
LeafDrupal\system\Tests\System\DateFormatsLanguageTest5200
LeafDrupal\system\Tests\System\DateTimeTest7600
LeafDrupal\system\Tests\System\DefaultMobileMetaTagsTest1200
LeafDrupal\system\Tests\System\ErrorHandlerTest4000
LeafDrupal\system\Tests\System\ExceptionControllerTest200
LeafDrupal\system\Tests\System\FloodTest1000
LeafDrupal\system\Tests\System\FrontPageTest3700
LeafDrupal\system\Tests\System\IndexPhpTest600
ExpandDrupal\system\Tests\System\InfoAlterTest464
MessageGroupFilenameLineFunctionStatus
Altered theme info was returned by system_get_info().OtherInfoAlterTest.php39Drupal\system\Tests\System\InfoAlterTest->testSystemInfoAlter()
Altered theme info was returned by system_region_list().OtherInfoAlterTest.php41Drupal\system\Tests\System\InfoAlterTest->testSystemInfoAlter()
Undefined index: sevenDrupal\system\Tests\System\InfoAlterTest->testSystemInfoAlter() Drupal\simpletest\TestBase->run() simpletest_script_run_one_test('498', 'Drupal\system\Tests\System\InfoAlterTest') NoticeInfoAlterTest.php43Drupal\system\Tests\System\InfoAlterTest->testSystemInfoAlter()
Trying to get property of non-objectDrupal\system\Tests\System\InfoAlterTest->testSystemInfoAlter() Drupal\simpletest\TestBase->run() simpletest_script_run_one_test('498', 'Drupal\system\Tests\System\InfoAlterTest') NoticeInfoAlterTest.php43Drupal\system\Tests\System\InfoAlterTest->testSystemInfoAlter()
Altered theme info was returned by system_list().OtherInfoAlterTest.php44Drupal\system\Tests\System\InfoAlterTest->testSystemInfoAlter()
Altered theme info was returned by list_themes().OtherInfoAlterTest.php46Drupal\system\Tests\System\InfoAlterTest->testSystemInfoAlter()
Altered theme info was not returned by system_region_list().OtherInfoAlterTest.php55Drupal\system\Tests\System\InfoAlterTest->testSystemInfoAlter()
Undefined index: sevenDrupal\system\Tests\System\InfoAlterTest->testSystemInfoAlter() Drupal\simpletest\TestBase->run() simpletest_script_run_one_test('498', 'Drupal\system\Tests\System\InfoAlterTest') NoticeInfoAlterTest.php57Drupal\system\Tests\System\InfoAlterTest->testSystemInfoAlter()
Trying to get property of non-objectDrupal\system\Tests\System\InfoAlterTest->testSystemInfoAlter() Drupal\simpletest\TestBase->run() simpletest_script_run_one_test('498', 'Drupal\system\Tests\System\InfoAlterTest') NoticeInfoAlterTest.php57Drupal\system\Tests\System\InfoAlterTest->testSystemInfoAlter()
Altered theme info was not returned by list_themes().OtherInfoAlterTest.php60Drupal\system\Tests\System\InfoAlterTest->testSystemInfoAlter()
LeafDrupal\system\Tests\System\InfoFileParserUnitTest900
LeafDrupal\system\Tests\System\MainContentFallbackTest6000
LeafDrupal\system\Tests\System\PageNotFoundTest1800
LeafDrupal\system\Tests\System\PageTitleFilteringTest4400
LeafDrupal\system\Tests\System\PasswordHashingTest1000
LeafDrupal\system\Tests\System\RetrieveFileTest700
LeafDrupal\system\Tests\System\ShutdownFunctionsTest500
LeafDrupal\system\Tests\System\SiteMaintenanceTest7700
LeafDrupal\system\Tests\System\SystemAuthorizeTest1600
LeafDrupal\system\Tests\System\ThemeTest24500
LeafDrupal\system\Tests\System\TokenReplaceTest3600
LeafDrupal\system\Tests\System\UnicodeUnitTest18200
LeafDrupal\system\Tests\Theme\EntityFilteringThemeTest4000
LeafDrupal\system\Tests\Theme\FastTest1200
LeafDrupal\system\Tests\Theme\FunctionsTest2500
LeafDrupal\system\Tests\Theme\HookInitTest500
LeafDrupal\system\Tests\Theme\HtmlTagUnitTest200
LeafDrupal\system\Tests\Theme\HtmlTplPhpAttributesTest500
LeafDrupal\system\Tests\Theme\RegistryTest600
LeafDrupal\system\Tests\Theme\TableTest600
ExpandDrupal\system\Tests\Theme\ThemeTest4420
MessageGroupFilenameLineFunctionStatus
Subtheme's object includes list of base themes.OtherThemeTest.php153Drupal\system\Tests\Theme\ThemeTest->testListThemes()
The test did not complete due to a fatal error.Completion checkThemeTest.php190Drupal\system\Tests\Theme\ThemeTest->testClassLoading()
LeafDrupal\system\Tests\Theme\ThemeTestTwig1000
LeafDrupal\system\Tests\Theme\TwigReferenceUnitTest1500
ExpandDrupal\system\Tests\Transliteration\TransliterationTest010
MessageGroupFilenameLineFunctionStatus
The test did not complete due to a fatal error.Completion checkTransliterationTest.php35Drupal\system\Tests\Transliteration\TransliterationTest->testPHPTransliteration()
LeafDrupal\system\Tests\TypedData\TypedDataTest6100
LeafDrupal\system\Tests\Update\DependencyHookInvocationTest400
LeafDrupal\system\Tests\Update\DependencyMissingTest400
LeafDrupal\system\Tests\Update\DependencyOrderingTest500
LeafDrupal\system\Tests\Update\UpdateScriptTest20100
LeafDrupal\system\Tests\Upgrade\BareMinimalUpgradePathTest6200
LeafDrupal\system\Tests\Upgrade\BareStandardUpgradePathTest6600
LeafDrupal\system\Tests\Upgrade\BlockUpgradePathTest3400
LeafDrupal\system\Tests\Upgrade\FilledMinimalUpgradePathTest6400
LeafDrupal\system\Tests\Upgrade\FilledStandardUpgradePathTest8100
LeafDrupal\system\Tests\Upgrade\ImageUpgradePathTest3200
LeafDrupal\system\Tests\Upgrade\LanguageUpgradePathTest15800
LeafDrupal\system\Tests\Upgrade\ModulesDisabledUpgradePathTest2900
LeafDrupal\system\Tests\Upgrade\StateSystemUpgradePathTest5000
LeafDrupal\system\Tests\Upgrade\SystemUpgradePathTest5500
LeafDrupal\system\Tests\Upgrade\UserPictureUpgradePathTest4300
LeafDrupal\system\Tests\Upgrade\UserRoleUpgradePathTest5100
LeafDrupal\system\Tests\Upgrade\UuidUpgradePathTest3500
LeafDrupal\system\Tests\Uuid\UuidUnitTest700
LeafDrupal\taxonomy\Tests\EfqTest1400
LeafDrupal\taxonomy\Tests\HooksTest2300
LeafDrupal\taxonomy\Tests\LegacyTest2700
LeafDrupal\taxonomy\Tests\LoadMultipleTest1800
LeafDrupal\taxonomy\Tests\RssTest2600
LeafDrupal\taxonomy\Tests\TaxonomyTermReferenceItemTest1000
LeafDrupal\taxonomy\Tests\TermFieldMultipleVocabularyTest3800
LeafDrupal\taxonomy\Tests\TermFieldTest6600
LeafDrupal\taxonomy\Tests\TermIndexTest8700
LeafDrupal\taxonomy\Tests\TermLanguageTest9400
LeafDrupal\taxonomy\Tests\TermTest28300
LeafDrupal\taxonomy\Tests\TermTranslationUITest16000
LeafDrupal\taxonomy\Tests\TermUnitTest1400
LeafDrupal\taxonomy\Tests\ThemeTest3800
LeafDrupal\taxonomy\Tests\TokenReplaceTest5500
LeafDrupal\taxonomy\Tests\VocabularyLanguageTest6100
LeafDrupal\taxonomy\Tests\VocabularyTest11000
LeafDrupal\taxonomy\Tests\VocabularyUnitTest8300
LeafDrupal\text\Tests\TextFieldTest18600
LeafDrupal\text\Tests\TextSummaryTest13800
LeafDrupal\text\Tests\TextTranslationTest10400
LeafDrupal\toolbar\Tests\ToolbarHookToolbarTest1500
LeafDrupal\tracker\Tests\TrackerNodeAccessTest2800
LeafDrupal\tracker\Tests\TrackerTest22800
LeafDrupal\translation\Tests\TranslationTest59000
LeafDrupal\translation_entity\Tests\ConfigTestTranslationUITest1300
LeafDrupal\translation_entity\Tests\EntityTestTranslationUITest6800
LeafDrupal\update\Tests\UpdateContribTest18700
LeafDrupal\update\Tests\UpdateCoreTest21400
LeafDrupal\update\Tests\UpdateCoreUnitTest400
LeafDrupal\update\Tests\UpdateUploadTest6400
LeafDrupal\user\Tests\TempStoreDatabaseTest1900
LeafDrupal\user\Tests\UserAccountLinksTests6100
LeafDrupal\user\Tests\UserAdminSettingsFormTest400
LeafDrupal\user\Tests\UserAdminTest6100
LeafDrupal\user\Tests\UserAuthmapAssignmentTest600
LeafDrupal\user\Tests\UserAutocompleteTest2500
LeafDrupal\user\Tests\UserBlocksTests4000
LeafDrupal\user\Tests\UserCancelTest25400
LeafDrupal\user\Tests\UserCreateTest3300
LeafDrupal\user\Tests\UserDeleteTest1500
LeafDrupal\user\Tests\UserEditedOwnAccountTest2200
LeafDrupal\user\Tests\UserEditTest7300
LeafDrupal\user\Tests\UserEntityCallbacksTest700
LeafDrupal\user\Tests\UserLanguageCreationTest6800
LeafDrupal\user\Tests\UserLanguageTest3900
LeafDrupal\user\Tests\UserLoginTest15900
LeafDrupal\user\Tests\UserPasswordResetTest3000
LeafDrupal\user\Tests\UserPermissionsTest5000
LeafDrupal\user\Tests\UserPictureTest4700
LeafDrupal\user\Tests\UserRegistrationTest12900
LeafDrupal\user\Tests\UserRoleAdminTest5400
LeafDrupal\user\Tests\UserRolesAssignmentTest5100
LeafDrupal\user\Tests\UserSaveTest200
LeafDrupal\user\Tests\UserSearchTest3700
LeafDrupal\user\Tests\UserSignatureTest4600
LeafDrupal\user\Tests\UserTimeZoneTest2900
LeafDrupal\user\Tests\UserTokenReplaceTest4700
LeafDrupal\user\Tests\UserTranslationUITest8900
LeafDrupal\user\Tests\UserValidateCurrentPassCustomFormTest1700
LeafDrupal\user\Tests\UserValidationTest1600
ExpandDrupal\views\Tests\AnalyzeTest1800
MessageGroupFilenameLineFunctionStatus
'Missing handler: views_test_data age field'Debugviews.module1209views_get_handler()
'Missing handler: views_test_data id field'Debugviews.module1209views_get_handler()
'Missing handler: views_test_data name field'Debugviews.module1209views_get_handler()
LeafDrupal\views\Tests\BasicTest1100
ExpandDrupal\views\Tests\Comment\ArgumentUserUIDTest900
MessageGroupFilenameLineFunctionStatus
'Missing handler: views_test_data age field'Debugviews.module1209views_get_handler()
'Missing handler: views_test_data id field'Debugviews.module1209views_get_handler()
'Missing handler: views_test_data name field'Debugviews.module1209views_get_handler()
ExpandDrupal\views\Tests\Comment\DefaultViewRecentComments800
MessageGroupFilenameLineFunctionStatus
'Missing handler: views_test_data age field'Debugviews.module1209views_get_handler()
'Missing handler: views_test_data id field'Debugviews.module1209views_get_handler()
'Missing handler: views_test_data name field'Debugviews.module1209views_get_handler()
'Missing handler: views_test_data age field'Debugviews.module1209views_get_handler()
'Missing handler: views_test_data id field'Debugviews.module1209views_get_handler()
'Missing handler: views_test_data name field'Debugviews.module1209views_get_handler()
ExpandDrupal\views\Tests\Comment\FilterUserUIDTest900
MessageGroupFilenameLineFunctionStatus
'Missing handler: views_test_data age field'Debugviews.module1209views_get_handler()
'Missing handler: views_test_data id field'Debugviews.module1209views_get_handler()
'Missing handler: views_test_data name field'Debugviews.module1209views_get_handler()
ExpandDrupal\views\Tests\Comment\WizardTest3500
MessageGroupFilenameLineFunctionStatus
'Missing handler: views_test_data age field'Debugviews.module1209views_get_handler()
'Missing handler: views_test_data id field'Debugviews.module1209views_get_handler()
'Missing handler: views_test_data name field'Debugviews.module1209views_get_handler()
'Missing handler: views_test_data age field'Debugviews.module1209views_get_handler()
'Missing handler: views_test_data id field'Debugviews.module1209views_get_handler()
'Missing handler: views_test_data name field'Debugviews.module1209views_get_handler()
ExpandDrupal\views\Tests\DefaultViewsTest7200
MessageGroupFilenameLineFunctionStatus
'Missing handler: search_node_links_to nid argument'Debugviews.module1209views_get_handler()
'Missing handler: search_node_links_to nid argument'Debugviews.module1209views_get_handler()
'Missing handler: search_node_links_to nid argument'Debugviews.module1209views_get_handler()
'Missing handler: field_data_comment_body comment_body field'Debugviews.module1209views_get_handler()
'Missing handler: history timestamp field'Debugviews.module1209views_get_handler()
'Missing handler: history timestamp field'Debugviews.module1209views_get_handler()
LeafDrupal\views\Tests\Entity\FieldEntityTest400
LeafDrupal\views\Tests\Field\ApiDataTest1500
LeafDrupal\views\Tests\Field\HandlerFieldFieldTest2400
ExpandDrupal\views\Tests\GlossaryTest800
MessageGroupFilenameLineFunctionStatus
'Missing handler: views_test_data age field'Debugviews.module1209views_get_handler()
'Missing handler: views_test_data id field'Debugviews.module1209views_get_handler()
'Missing handler: views_test_data name field'Debugviews.module1209views_get_handler()
LeafDrupal\views\Tests\Handler\AreaTest9000
LeafDrupal\views\Tests\Handler\AreaTextTest500
LeafDrupal\views\Tests\Handler\ArgumentNullTest500
LeafDrupal\views\Tests\Handler\ArgumentStringTest400
LeafDrupal\views\Tests\Handler\FieldBooleanTest1100
LeafDrupal\views\Tests\Handler\FieldCounterTest800
LeafDrupal\views\Tests\Handler\FieldCustomTest200
LeafDrupal\views\Tests\Handler\FieldDateTest1500
LeafDrupal\views\Tests\Handler\FieldFileSizeTest900
LeafDrupal\views\Tests\Handler\FieldTest20600
LeafDrupal\views\Tests\Handler\FieldUrlTest300
LeafDrupal\views\Tests\Handler\FieldXssTest400
LeafDrupal\views\Tests\Handler\FilterCombineTest200
ExpandDrupal\views\Tests\Handler\FilterDateTest2400
MessageGroupFilenameLineFunctionStatus
'Missing handler: views_test_data age field'Debugviews.module1209views_get_handler()
'Missing handler: views_test_data id field'Debugviews.module1209views_get_handler()
'Missing handler: views_test_data name field'Debugviews.module1209views_get_handler()
'Missing handler: views_test_data age field'Debugviews.module1209views_get_handler()
'Missing handler: views_test_data id field'Debugviews.module1209views_get_handler()
'Missing handler: views_test_data name field'Debugviews.module1209views_get_handler()
LeafDrupal\views\Tests\Handler\FilterEqualityTest800
LeafDrupal\views\Tests\Handler\FilterInOperatorTest1100
LeafDrupal\views\Tests\Handler\FilterNumericTest2300
LeafDrupal\views\Tests\Handler\FilterStringTest5000
LeafDrupal\views\Tests\Handler\HandlerAliasTest1000
LeafDrupal\views\Tests\Handler\HandlerAllTest26000
ExpandDrupal\views\Tests\Handler\HandlerTest11600
MessageGroupFilenameLineFunctionStatus
'Missing handler: zyQT9sK5 fD4nxH5F relationship'Debugviews.module1209views_get_handler()
'Missing handler: zyQT9sK5 fD4nxH5F relationship'Debugviews.module1209views_get_handler()
LeafDrupal\views\Tests\Handler\RelationshipTest500
LeafDrupal\views\Tests\Handler\SortDateTest2500
LeafDrupal\views\Tests\Handler\SortRandomTest700
LeafDrupal\views\Tests\Handler\SortTest1000
LeafDrupal\views\Tests\Language\ArgumentLanguageTest300
LeafDrupal\views\Tests\Language\FieldLanguageTest300
LeafDrupal\views\Tests\Language\FilterLanguageTest300
ExpandDrupal\views\Tests\ModuleTest5200
MessageGroupFilenameLineFunctionStatus
'Missing handler: ajxidv7n v15yl2L1 field'Debugviews.module1209views_get_handler()
'Missing handler: cvK5sm7M kzo9OUMF area'Debugviews.module1209views_get_handler()
'Missing handler: zawVo7AV kmtNFKMt filter'Debugviews.module1209views_get_handler()
LeafDrupal\views\Tests\Node\FieldTypeTest200
LeafDrupal\views\Tests\Node\FilterUidRevisionTest400
LeafDrupal\views\Tests\Node\RevisionRelationships300
ExpandDrupal\views\Tests\Node\StatusExtraTest6800
MessageGroupFilenameLineFunctionStatus
'Missing handler: views_test_data age field'Debugviews.module1209views_get_handler()
'Missing handler: views_test_data id field'Debugviews.module1209views_get_handler()
'Missing handler: views_test_data name field'Debugviews.module1209views_get_handler()
LeafDrupal\views\Tests\PluginInstanceTest25900
LeafDrupal\views\Tests\PluginTypeListTest100
LeafDrupal\views\Tests\Plugin\AccessTest3900
LeafDrupal\views\Tests\Plugin\ArgumentDefaultTest2400
LeafDrupal\views\Tests\Plugin\ArgumentValidatorTest600
LeafDrupal\views\Tests\Plugin\CacheTest1200
LeafDrupal\views\Tests\Plugin\DisplayExtenderTest600
LeafDrupal\views\Tests\Plugin\DisplayFeedTest2800
LeafDrupal\views\Tests\Plugin\DisplayPageTest700
LeafDrupal\views\Tests\Plugin\DisplayTest3900
LeafDrupal\views\Tests\Plugin\ExposedFormTest11400
LeafDrupal\views\Tests\Plugin\FilterTest1300
ExpandDrupal\views\Tests\Plugin\JoinTest1600
MessageGroupFilenameLineFunctionStatus
array ( 'join type' => 'LEFT', 'table' => 'users', 'alias' => 'users', 'condition' => 'node.uid = users.uid AND (node.uid = 166)', 'arguments' => array ( ), )DebugJoinTest.php70Drupal\views\Tests\Plugin\JoinTest->testExamplePlugin()
ExpandDrupal\views\Tests\Plugin\PagerTest9200
MessageGroupFilenameLineFunctionStatus
'Missing handler: views_test_data age field'Debugviews.module1209views_get_handler()
'Missing handler: views_test_data id field'Debugviews.module1209views_get_handler()
'Missing handler: views_test_data name field'Debugviews.module1209views_get_handler()
'Missing handler: views_test_data age field'Debugviews.module1209views_get_handler()
'Missing handler: views_test_data id field'Debugviews.module1209views_get_handler()
'Missing handler: views_test_data name field'Debugviews.module1209views_get_handler()
LeafDrupal\views\Tests\Plugin\QueryTest300
LeafDrupal\views\Tests\Plugin\StyleMappingTest4300
LeafDrupal\views\Tests\Plugin\StyleTest2400
LeafDrupal\views\Tests\Plugin\StyleUnformattedTest1800
ExpandDrupal\views\Tests\QueryGroupByTest4000
MessageGroupFilenameLineFunctionStatus
'Missing handler: views_test_data age field'Debugviews.module1209views_get_handler()
'Missing handler: views_test_data id field'Debugviews.module1209views_get_handler()
'Missing handler: views_test_data name field'Debugviews.module1209views_get_handler()
'Missing handler: views_test_data age field'Debugviews.module1209views_get_handler()
'Missing handler: views_test_data id field'Debugviews.module1209views_get_handler()
'Missing handler: views_test_data name field'Debugviews.module1209views_get_handler()
'Missing handler: views_test_data age field'Debugviews.module1209views_get_handler()
'Missing handler: views_test_data id field'Debugviews.module1209views_get_handler()
'Missing handler: views_test_data name field'Debugviews.module1209views_get_handler()
'Missing handler: views_test_data age field'Debugviews.module1209views_get_handler()
'Missing handler: views_test_data id field'Debugviews.module1209views_get_handler()
'Missing handler: views_test_data name field'Debugviews.module1209views_get_handler()
'Missing handler: views_test_data age field'Debugviews.module1209views_get_handler()
'Missing handler: views_test_data id field'Debugviews.module1209views_get_handler()
'Missing handler: views_test_data name field'Debugviews.module1209views_get_handler()
'Missing handler: views_test_data age field'Debugviews.module1209views_get_handler()
'Missing handler: views_test_data id field'Debugviews.module1209views_get_handler()
'Missing handler: views_test_data name field'Debugviews.module1209views_get_handler()
'Missing handler: views_test_data age field'Debugviews.module1209views_get_handler()
'Missing handler: views_test_data id field'Debugviews.module1209views_get_handler()
'Missing handler: views_test_data name field'Debugviews.module1209views_get_handler()
'Missing handler: views_test_data age field'Debugviews.module1209views_get_handler()
'Missing handler: views_test_data id field'Debugviews.module1209views_get_handler()
'Missing handler: views_test_data name field'Debugviews.module1209views_get_handler()
'Missing handler: views_test_data age field'Debugviews.module1209views_get_handler()
'Missing handler: views_test_data id field'Debugviews.module1209views_get_handler()
'Missing handler: views_test_data name field'Debugviews.module1209views_get_handler()
'Missing handler: views_test_data age field'Debugviews.module1209views_get_handler()
'Missing handler: views_test_data id field'Debugviews.module1209views_get_handler()
'Missing handler: views_test_data name field'Debugviews.module1209views_get_handler()
'Missing handler: views_test_data age field'Debugviews.module1209views_get_handler()
'Missing handler: views_test_data id field'Debugviews.module1209views_get_handler()
'Missing handler: views_test_data name field'Debugviews.module1209views_get_handler()
'Missing handler: views_test_data age field'Debugviews.module1209views_get_handler()
'Missing handler: views_test_data id field'Debugviews.module1209views_get_handler()
'Missing handler: views_test_data name field'Debugviews.module1209views_get_handler()
'Missing handler: views_test_data age field'Debugviews.module1209views_get_handler()
'Missing handler: views_test_data id field'Debugviews.module1209views_get_handler()
'Missing handler: views_test_data name field'Debugviews.module1209views_get_handler()
ExpandDrupal\views\Tests\Taxonomy\RelationshipNodeTermDataTest200
MessageGroupFilenameLineFunctionStatus
'Missing handler: nid nid sort'Debugviews.module1209views_get_handler()
LeafDrupal\views\Tests\Taxonomy\RelationshipRepresentativeNode200
LeafDrupal\views\Tests\TokenReplaceTest1200
LeafDrupal\views\Tests\UI\DefaultViewsTest11000
LeafDrupal\views\Tests\UI\DisplayExtenderUITest2300
LeafDrupal\views\Tests\UI\DisplayPath2200
LeafDrupal\views\Tests\UI\DisplayTest20100
LeafDrupal\views\Tests\UI\GroupByTest2600
LeafDrupal\views\Tests\UI\HandlerTest11000
LeafDrupal\views\Tests\UI\OverrideDisplaysTest16700
LeafDrupal\views\Tests\UI\PreviewTest2400
LeafDrupal\views\Tests\UI\QueryTest1900
LeafDrupal\views\Tests\UI\RedirectTest2600
LeafDrupal\views\Tests\UI\RowUITest3000
LeafDrupal\views\Tests\UI\SettingsTest9000
LeafDrupal\views\Tests\UI\StorageTest2100
LeafDrupal\views\Tests\UI\StyleUITest3000
LeafDrupal\views\Tests\UI\TagTest2300
LeafDrupal\views\Tests\User\AccessPermissionTest1400
LeafDrupal\views\Tests\User\AccessRoleTest1400
ExpandDrupal\views\Tests\User\ArgumentDefaultTest900
MessageGroupFilenameLineFunctionStatus
'Missing handler: views_test_data age field'Debugviews.module1209views_get_handler()
'Missing handler: views_test_data id field'Debugviews.module1209views_get_handler()
'Missing handler: views_test_data name field'Debugviews.module1209views_get_handler()
LeafDrupal\views\Tests\User\ArgumentValidateTest1900
LeafDrupal\views\Tests\User\HandlerArgumentUserUidTest500
LeafDrupal\views\Tests\User\HandlerFieldUserNameTest700
LeafDrupal\views\Tests\User\HandlerFilterUserNameTest5700
LeafDrupal\views\Tests\User\RelationshipRepresentativeNode300
LeafDrupal\views\Tests\ViewElementTest1500
LeafDrupal\views\Tests\ViewExecutableTest11000
ExpandDrupal\views\Tests\ViewsDataTest1400
MessageGroupFilenameLineFunctionStatus
'Missing handler: views_test_data id field'Debugviews.module1209views_get_handler()
'Missing handler: views_test_data id field'Debugviews.module1209views_get_handler()
'Missing handler: views_test_data id field'Debugviews.module1209views_get_handler()
'Missing handler: views_test_data id field'Debugviews.module1209views_get_handler()
'Missing handler: views_test_data id field'Debugviews.module1209views_get_handler()
'Missing handler: views_test_data id field'Debugviews.module1209views_get_handler()
ExpandDrupal\views\Tests\ViewStorageTest10900
MessageGroupFilenameLineFunctionStatus
'Missing handler: views_test_data id field'Debugviews.module1209views_get_handler()
'Missing handler: views_test_data name field'Debugviews.module1209views_get_handler()
ExpandDrupal\views\Tests\Wizard\BasicTest7800
MessageGroupFilenameLineFunctionStatus
'Missing handler: views_test_data age field'Debugviews.module1209views_get_handler()
'Missing handler: views_test_data id field'Debugviews.module1209views_get_handler()
'Missing handler: views_test_data name field'Debugviews.module1209views_get_handler()
'Missing handler: views_test_data age field'Debugviews.module1209views_get_handler()
'Missing handler: views_test_data id field'Debugviews.module1209views_get_handler()
'Missing handler: views_test_data name field'Debugviews.module1209views_get_handler()
'Missing handler: views_test_data age field'Debugviews.module1209views_get_handler()
'Missing handler: views_test_data id field'Debugviews.module1209views_get_handler()
'Missing handler: views_test_data name field'Debugviews.module1209views_get_handler()
'Missing handler: views_test_data age field'Debugviews.module1209views_get_handler()
'Missing handler: views_test_data id field'Debugviews.module1209views_get_handler()
'Missing handler: views_test_data name field'Debugviews.module1209views_get_handler()
'Missing handler: views_test_data age field'Debugviews.module1209views_get_handler()
'Missing handler: views_test_data id field'Debugviews.module1209views_get_handler()
'Missing handler: views_test_data name field'Debugviews.module1209views_get_handler()
'Missing handler: views_test_data age field'Debugviews.module1209views_get_handler()
'Missing handler: views_test_data id field'Debugviews.module1209views_get_handler()
'Missing handler: views_test_data name field'Debugviews.module1209views_get_handler()
ExpandDrupal\views\Tests\Wizard\ItemsPerPageTest4000
MessageGroupFilenameLineFunctionStatus
'Missing handler: views_test_data age field'Debugviews.module1209views_get_handler()
'Missing handler: views_test_data id field'Debugviews.module1209views_get_handler()
'Missing handler: views_test_data name field'Debugviews.module1209views_get_handler()
'Missing handler: views_test_data age field'Debugviews.module1209views_get_handler()
'Missing handler: views_test_data id field'Debugviews.module1209views_get_handler()
'Missing handler: views_test_data name field'Debugviews.module1209views_get_handler()
'Missing handler: views_test_data age field'Debugviews.module1209views_get_handler()
'Missing handler: views_test_data id field'Debugviews.module1209views_get_handler()
'Missing handler: views_test_data name field'Debugviews.module1209views_get_handler()
ExpandDrupal\views\Tests\Wizard\MenuTest2000
MessageGroupFilenameLineFunctionStatus
'Missing handler: views_test_data age field'Debugviews.module1209views_get_handler()
'Missing handler: views_test_data id field'Debugviews.module1209views_get_handler()
'Missing handler: views_test_data name field'Debugviews.module1209views_get_handler()
'Missing handler: views_test_data age field'Debugviews.module1209views_get_handler()
'Missing handler: views_test_data id field'Debugviews.module1209views_get_handler()
'Missing handler: views_test_data name field'Debugviews.module1209views_get_handler()
ExpandDrupal\views\Tests\Wizard\SortingTest3100
MessageGroupFilenameLineFunctionStatus
'Missing handler: views_test_data age field'Debugviews.module1209views_get_handler()
'Missing handler: views_test_data id field'Debugviews.module1209views_get_handler()
'Missing handler: views_test_data name field'Debugviews.module1209views_get_handler()
'Missing handler: views_test_data age field'Debugviews.module1209views_get_handler()
'Missing handler: views_test_data id field'Debugviews.module1209views_get_handler()
'Missing handler: views_test_data name field'Debugviews.module1209views_get_handler()
'Missing handler: views_test_data age field'Debugviews.module1209views_get_handler()
'Missing handler: views_test_data id field'Debugviews.module1209views_get_handler()
'Missing handler: views_test_data name field'Debugviews.module1209views_get_handler()
ExpandDrupal\views\Tests\Wizard\TaggedWithTest7800
MessageGroupFilenameLineFunctionStatus
'Missing handler: views_test_data age field'Debugviews.module1209views_get_handler()
'Missing handler: views_test_data id field'Debugviews.module1209views_get_handler()
'Missing handler: views_test_data name field'Debugviews.module1209views_get_handler()
'Missing handler: views_test_data age field'Debugviews.module1209views_get_handler()
'Missing handler: views_test_data id field'Debugviews.module1209views_get_handler()
'Missing handler: views_test_data name field'Debugviews.module1209views_get_handler()
'Missing handler: views_test_data age field'Debugviews.module1209views_get_handler()
'Missing handler: views_test_data id field'Debugviews.module1209views_get_handler()
'Missing handler: views_test_data name field'Debugviews.module1209views_get_handler()
'Missing handler: views_test_data age field'Debugviews.module1209views_get_handler()
'Missing handler: views_test_data id field'Debugviews.module1209views_get_handler()
'Missing handler: views_test_data name field'Debugviews.module1209views_get_handler()
'Missing handler: views_test_data age field'Debugviews.module1209views_get_handler()
'Missing handler: views_test_data id field'Debugviews.module1209views_get_handler()
'Missing handler: views_test_data name field'Debugviews.module1209views_get_handler()
'Missing handler: views_test_data age field'Debugviews.module1209views_get_handler()
'Missing handler: views_test_data id field'Debugviews.module1209views_get_handler()
'Missing handler: views_test_data name field'Debugviews.module1209views_get_handler()
'Missing handler: views_test_data age field'Debugviews.module1209views_get_handler()
'Missing handler: views_test_data id field'Debugviews.module1209views_get_handler()
'Missing handler: views_test_data name field'Debugviews.module1209views_get_handler()
'Missing handler: views_test_data age field'Debugviews.module1209views_get_handler()
'Missing handler: views_test_data id field'Debugviews.module1209views_get_handler()
'Missing handler: views_test_data name field'Debugviews.module1209views_get_handler()
LeafDrupal\xmlrpc\Tests\XmlRpcBasicTest900
LeafDrupal\xmlrpc\Tests\XmlRpcMessagesTest700
LeafDrupal\xmlrpc\Tests\XmlRpcValidatorTest1000