1827038-language_cmi-9.patch

Test status
StatusResult
Last receivedSat, 11/17/2012 - 12:02:26
Last requestedSat, 11/17/2012 - 12:03:03
Last testedSat, 11/17/2012 - 12:51:36
Test count1
Environment status
MySQLfail
File information
File1827038-language_cmi-9.patch
BranchDrupal core - 8.x
LinkIssue Link
SummaryFAILED: [[SimpleTest]]: [MySQL] 42,522 pass(es), 142 fail(s), and 18 exception(s).
Details

MySQL

  1. Setup environment
  2. Detect an invalid patch URL
  3. Detect invalid repository information
  4. Detect invalid patch format
  5. Detect a non-applicable patch
  6. Detect invalid PHP syntax
  7. Detect a Drupal installation failure
  8. Detect a test run failure
  9. Detect a failing test
    Review the test failures below then if necessary run them locally until the problem has been fixed.
  10. Complete test suite with all tests passing
42,522 pass(es), 142 fail(s), and 18 exception(s)

Non-pass

Test namePassFailException
ExpandDrupal\block\Tests\BlockLanguageTest010
MessageGroupFilenameLineFunctionStatus
The test did not complete due to a fatal error.Completion checkBlockLanguageTest.php35Drupal\block\Tests\BlockLanguageTest->testLanguageBlockVisibility()
ExpandDrupal\comment\Tests\CommentLanguageTest010
MessageGroupFilenameLineFunctionStatus
The test did not complete due to a fatal error.Completion checkCommentLanguageTest.php89Drupal\comment\Tests\CommentLanguageTest->testCommentLanguage()
ExpandDrupal\comment\Tests\CommentTranslationUITest010
MessageGroupFilenameLineFunctionStatus
The test did not complete due to a fatal error.Completion checkEntityTranslationUITest.php146Drupal\comment\Tests\CommentTranslationUITest->testTranslationUI()
ExpandDrupal\config\Tests\LocaleConfigOverride010
MessageGroupFilenameLineFunctionStatus
The test did not complete due to a fatal error.Completion checkLocaleConfigOverride.php32Drupal\config\Tests\LocaleConfigOverride->testLocaleConfigOverride()
ExpandDrupal\field\Tests\TranslationTest010
MessageGroupFilenameLineFunctionStatus
The test did not complete due to a fatal error.Completion checkTranslationTest.php71Drupal\field\Tests\TranslationTest->testFieldAvailableLanguages()
ExpandDrupal\jsonld\Tests\DrupalJsonldNormalizerTest010
MessageGroupFilenameLineFunctionStatus
The test did not complete due to a fatal error.Completion checkDrupalJsonldNormalizerTest.php44Drupal\jsonld\Tests\DrupalJsonldNormalizerTest->testSupportsNormalization()
ExpandDrupal\jsonld\Tests\JsonldNormalizerTest010
MessageGroupFilenameLineFunctionStatus
The test did not complete due to a fatal error.Completion checkJsonldNormalizerTest.php43Drupal\jsonld\Tests\JsonldNormalizerTest->testSupportsNormalization()
ExpandDrupal\language\Tests\LanguageBrowserDetectionUnitTest010
MessageGroupFilenameLineFunctionStatus
The test did not complete due to a fatal error.Completion checkLanguageBrowserDetectionUnitTest.php33Drupal\language\Tests\LanguageBrowserDetectionUnitTest->testLanguageFromBrowser()
ExpandDrupal\language\Tests\LanguageConfigurationElementTest010
MessageGroupFilenameLineFunctionStatus
The test did not complete due to a fatal error.Completion checkLanguageConfigurationElementTest.php36Drupal\language\Tests\LanguageConfigurationElementTest->testLanguageConfigurationElement()
ExpandDrupal\language\Tests\LanguageConfigurationTest010
MessageGroupFilenameLineFunctionStatus
The test did not complete due to a fatal error.Completion checkLanguageConfigurationTest.php35Drupal\language\Tests\LanguageConfigurationTest->testLanguageConfiguration()
ExpandDrupal\language\Tests\LanguageCustomLanguageConfigurationTest010
MessageGroupFilenameLineFunctionStatus
The test did not complete due to a fatal error.Completion checkLanguageCustomLanguageConfigurationTest.php36Drupal\language\Tests\LanguageCustomLanguageConfigurationTest->testLanguageConfiguration()
ExpandDrupal\language\Tests\LanguageDependencyInjectionTest010
MessageGroupFilenameLineFunctionStatus
The test did not complete due to a fatal error.Completion checkLanguageDependencyInjectionTest.php47Drupal\language\Tests\LanguageDependencyInjectionTest->testDependencyInjectedNewLanguage()
ExpandDrupal\language\Tests\LanguageListTest010
MessageGroupFilenameLineFunctionStatus
The test did not complete due to a fatal error.Completion checkLanguageListTest.php36Drupal\language\Tests\LanguageListTest->testLanguageList()
ExpandDrupal\language\Tests\LanguageNegotiationInfoTest010
MessageGroupFilenameLineFunctionStatus
The test did not complete due to a fatal error.Completion checkLanguageNegotiationInfoTest.php43Drupal\language\Tests\LanguageNegotiationInfoTest->testInfoAlterations()
ExpandDrupal\language\Tests\LanguagePathMonolingualTest010
MessageGroupFilenameLineFunctionStatus
The test did not complete due to a fatal error.Completion checkLanguagePathMonolingualTest.php66Drupal\language\Tests\LanguagePathMonolingualTest->testPageLinks()
ExpandDrupal\language\Tests\LanguageSwitchingTest010
MessageGroupFilenameLineFunctionStatus
The test did not complete due to a fatal error.Completion checkLanguageSwitchingTest.php43Drupal\language\Tests\LanguageSwitchingTest->testLanguageBlock()
ExpandDrupal\language\Tests\LanguageUILanguageNegotiationTest010
MessageGroupFilenameLineFunctionStatus
The test did not complete due to a fatal error.Completion checkLanguageUILanguageNegotiationTest.php70Drupal\language\Tests\LanguageUILanguageNegotiationTest->testUILanguageNegotiation()
ExpandDrupal\language\Tests\LanguageUrlRewritingTest010
MessageGroupFilenameLineFunctionStatus
The test did not complete due to a fatal error.Completion checkLanguageUrlRewritingTest.php57Drupal\language\Tests\LanguageUrlRewritingTest->testUrlRewritingEdgeCases()
ExpandDrupal\locale\Tests\LocaleCompareTest010
MessageGroupFilenameLineFunctionStatus
The test did not complete due to a fatal error.Completion checkLocaleCompareTest.php109Drupal\locale\Tests\LocaleCompareTest->testLocaleCompare()
ExpandDrupal\locale\Tests\LocaleContentTest010
MessageGroupFilenameLineFunctionStatus
The test did not complete due to a fatal error.Completion checkLocaleContentTest.php35Drupal\locale\Tests\LocaleContentTest->testMachineNameLTR()
ExpandDrupal\locale\Tests\LocaleExportTest010
MessageGroupFilenameLineFunctionStatus
The test did not complete due to a fatal error.Completion checkLocaleExportTest.php51Drupal\locale\Tests\LocaleExportTest->testExportTranslation()
ExpandDrupal\locale\Tests\LocaleFileImportStatus010
MessageGroupFilenameLineFunctionStatus
The test did not complete due to a fatal error.Completion checkLocaleFileImportStatus.php107Drupal\locale\Tests\LocaleFileImportStatus->testBulkImport()
ExpandDrupal\locale\Tests\LocaleImportFunctionalTest010
MessageGroupFilenameLineFunctionStatus
The test did not complete due to a fatal error.Completion checkLocaleImportFunctionalTest.php51Drupal\locale\Tests\LocaleImportFunctionalTest->testStandalonePoFile()
ExpandDrupal\locale\Tests\LocaleInstallTest010
MessageGroupFilenameLineFunctionStatus
The test did not complete due to a fatal error.Completion checkLocaleInstallTest.php42Drupal\locale\Tests\LocaleInstallTest->testFunctionSignatures()
ExpandDrupal\locale\Tests\LocaleJavascriptTranslation010
MessageGroupFilenameLineFunctionStatus
The test did not complete due to a fatal error.Completion checkLocaleJavascriptTranslation.php32Drupal\locale\Tests\LocaleJavascriptTranslation->testFileParsing()
ExpandDrupal\locale\Tests\LocaleLibraryInfoAlterTest010
MessageGroupFilenameLineFunctionStatus
The test did not complete due to a fatal error.Completion checkLocaleLibraryInfoAlterTest.php38Drupal\locale\Tests\LocaleLibraryInfoAlterTest->testLibraryInfoAlter()
ExpandDrupal\locale\Tests\LocalePathTest010
MessageGroupFilenameLineFunctionStatus
The test did not complete due to a fatal error.Completion checkLocalePathTest.php42Drupal\locale\Tests\LocalePathTest->testPathLanguageConfiguration()
ExpandDrupal\locale\Tests\LocalePluralFormatTest010
MessageGroupFilenameLineFunctionStatus
The test did not complete due to a fatal error.Completion checkLocalePluralFormatTest.php42Drupal\locale\Tests\LocalePluralFormatTest->testGetPluralFormat()
ExpandDrupal\locale\Tests\LocaleStringTest010
MessageGroupFilenameLineFunctionStatus
The test did not complete due to a fatal error.Completion checkLocaleStringTest.php59Drupal\locale\Tests\LocaleStringTest->testStringCRUDAPI()
ExpandDrupal\locale\Tests\LocaleTranslationTest010
MessageGroupFilenameLineFunctionStatus
The test did not complete due to a fatal error.Completion checkLocaleTranslationTest.php35Drupal\locale\Tests\LocaleTranslationTest->testEnglishTranslation()
ExpandDrupal\locale\Tests\LocaleUninstallFrenchTest010
MessageGroupFilenameLineFunctionStatus
The test did not complete due to a fatal error.Completion checkLocaleUninstallTest.php50Drupal\locale\Tests\LocaleUninstallFrenchTest->testUninstallProcess()
ExpandDrupal\locale\Tests\LocaleUninstallTest010
MessageGroupFilenameLineFunctionStatus
The test did not complete due to a fatal error.Completion checkLocaleUninstallTest.php50Drupal\locale\Tests\LocaleUninstallTest->testUninstallProcess()
ExpandDrupal\node\Tests\NodeAccessLanguageTest010
MessageGroupFilenameLineFunctionStatus
The test did not complete due to a fatal error.Completion checkNodeAccessLanguageTest.php54Drupal\node\Tests\NodeAccessLanguageTest->testNodeAccess()
ExpandDrupal\node\Tests\NodeFieldMultilingualTestCase010
MessageGroupFilenameLineFunctionStatus
The test did not complete due to a fatal error.Completion checkNodeFieldMultilingualTestCase.php70Drupal\node\Tests\NodeFieldMultilingualTestCase->testMultilingualNodeForm()
ExpandDrupal\node\Tests\NodeTranslationUITest010
MessageGroupFilenameLineFunctionStatus
The test did not complete due to a fatal error.Completion checkNodeTranslationUITest.php73Drupal\node\Tests\NodeTranslationUITest->testDisabledBundle()
ExpandDrupal\node\Tests\NodeTypeInitialLanguageTest010
MessageGroupFilenameLineFunctionStatus
The test did not complete due to a fatal error.Completion checkNodeTypeInitialLanguageTest.php43Drupal\node\Tests\NodeTypeInitialLanguageTest->testNodeTypeInitialLanguageDefaults()
ExpandDrupal\openid\Tests\OpenIDRegistrationTest010
MessageGroupFilenameLineFunctionStatus
The test did not complete due to a fatal error.Completion checkOpenIDRegistrationTest.php42Drupal\openid\Tests\OpenIDRegistrationTest->testRegisterUserWithEmailVerification()
ExpandDrupal\path\Tests\PathLanguageTest010
MessageGroupFilenameLineFunctionStatus
The test did not complete due to a fatal error.Completion checkPathLanguageTest.php51Drupal\path\Tests\PathLanguageTest->testAliasTranslation()
ExpandDrupal\path\Tests\PathLanguageUiTest010
MessageGroupFilenameLineFunctionStatus
The test did not complete due to a fatal error.Completion checkPathLanguageUiTest.php51Drupal\path\Tests\PathLanguageUiTest->testLanguageNeutralUrl()
ExpandDrupal\poll\Tests\PollTranslateTest010
MessageGroupFilenameLineFunctionStatus
The test did not complete due to a fatal error.Completion checkPollTranslateTest.php36Drupal\poll\Tests\PollTranslateTest->testPollTranslate()
ExpandDrupal\search\Tests\SearchLanguageTest010
MessageGroupFilenameLineFunctionStatus
The test did not complete due to a fatal error.Completion checkSearchLanguageTest.php38Drupal\search\Tests\SearchLanguageTest->testLanguages()
ExpandDrupal\search\Tests\SearchMultilingualEntityTest010
MessageGroupFilenameLineFunctionStatus
The test did not complete due to a fatal error.Completion checkSearchMultilingualEntityTest.php92Drupal\search\Tests\SearchMultilingualEntityTest->testIndexingThrottle()
ExpandDrupal\search\Tests\SearchPreprocessLangcodeTest3634
MessageGroupFilenameLineFunctionStatus
Trying to get property of non-objectDrupal\Core\Entity\Entity->getTranslationLanguages() node_update_index() Drupal\search\Tests\SearchPreprocessLangcodeTest->testPreprocessLangcode() Drupal\simpletest\TestBase->run() simpletest_script_run_one_test('452', 'Drupal\search\Tests\SearchPreprocessLangcodeTest') NoticeEntity.php293Drupal\Core\Entity\Entity->getTranslationLanguages()
Trying to get property of non-objectDrupal\Core\Entity\Entity->getTranslationLanguages() _node_index_node(Object) node_update_index() Drupal\search\Tests\SearchPreprocessLangcodeTest->testPreprocessLangcode() Drupal\simpletest\TestBase->run() simpletest_script_run_one_test('452', 'Drupal\search\Tests\SearchPreprocessLangcodeTest') NoticeEntity.php293Drupal\Core\Entity\Entity->getTranslationLanguages()
"Langcode Preprocess Test: en" foundOtherSearchPreprocessLangcodeTest.php61Drupal\search\Tests\SearchPreprocessLangcodeTest->testPreprocessLangcode()
Trying to get property of non-objectDrupal\Core\Entity\Entity->getTranslationLanguages() node_update_index() Drupal\search\Tests\SearchPreprocessLangcodeTest->testPreprocessStemming() Drupal\simpletest\TestBase->run() simpletest_script_run_one_test('452', 'Drupal\search\Tests\SearchPreprocessLangcodeTest') NoticeEntity.php293Drupal\Core\Entity\Entity->getTranslationLanguages()
Trying to get property of non-objectDrupal\Core\Entity\Entity->getTranslationLanguages() _node_index_node(Object) node_update_index() Drupal\search\Tests\SearchPreprocessLangcodeTest->testPreprocessStemming() Drupal\simpletest\TestBase->run() simpletest_script_run_one_test('452', 'Drupal\search\Tests\SearchPreprocessLangcodeTest') NoticeEntity.php293Drupal\Core\Entity\Entity->getTranslationLanguages()
"Search results" foundOtherSearchPreprocessLangcodeTest.php96Drupal\search\Tests\SearchPreprocessLangcodeTest->testPreprocessStemming()
"we are testing" foundOtherSearchPreprocessLangcodeTest.php97Drupal\search\Tests\SearchPreprocessLangcodeTest->testPreprocessStemming()
ExpandDrupal\system\Tests\Common\CascadingStylesheetsTest010
MessageGroupFilenameLineFunctionStatus
The test did not complete due to a fatal error.Completion checkCascadingStylesheetsTest.php41Drupal\system\Tests\Common\CascadingStylesheetsTest->testDefault()
ExpandDrupal\system\Tests\Common\FormatDateTest010
MessageGroupFilenameLineFunctionStatus
The test did not complete due to a fatal error.Completion checkFormatDateTest.php53Drupal\system\Tests\Common\FormatDateTest->testAdminDefinedFormatDate()
ExpandDrupal\system\Tests\Common\HttpRequestTest010
MessageGroupFilenameLineFunctionStatus
The test did not complete due to a fatal error.Completion checkHttpRequestTest.php36Drupal\system\Tests\Common\HttpRequestTest->testDrupalHTTPRequest()
ExpandDrupal\system\Tests\Common\JavaScriptTest010
MessageGroupFilenameLineFunctionStatus
The test did not complete due to a fatal error.Completion checkJavaScriptTest.php62Drupal\system\Tests\Common\JavaScriptTest->testDefault()
ExpandDrupal\system\Tests\Entity\EntityFieldTest14120
MessageGroupFilenameLineFunctionStatus
Language object can be read.OtherEntityFieldTest.php146Drupal\system\Tests\Entity\EntityFieldTest->testReadWrite()
Language object can be read.OtherEntityFieldTest.php152Drupal\system\Tests\Entity\EntityFieldTest->testReadWrite()
ExpandDrupal\system\Tests\Entity\EntityFormTest010
MessageGroupFilenameLineFunctionStatus
The test did not complete due to a fatal error.Completion checkEntityFormTest.php41Drupal\system\Tests\Entity\EntityFormTest->testFormCRUD()
ExpandDrupal\system\Tests\Entity\EntityTranslationFormTest010
MessageGroupFilenameLineFunctionStatus
The test did not complete due to a fatal error.Completion checkEntityTranslationFormTest.php57Drupal\system\Tests\Entity\EntityTranslationFormTest->testEntityFormLanguage()
ExpandDrupal\system\Tests\Entity\EntityTranslationTest010
MessageGroupFilenameLineFunctionStatus
The test did not complete due to a fatal error.Completion checkEntityTranslationTest.php76Drupal\system\Tests\Entity\EntityTranslationTest->testEntityLanguageMethods()
ExpandDrupal\system\Tests\Form\LanguageSelectElementTest010
MessageGroupFilenameLineFunctionStatus
The test did not complete due to a fatal error.Completion checkLanguageSelectElementTest.php36Drupal\system\Tests\Form\LanguageSelectElementTest->testLanguageSelectElementOptions()
ExpandDrupal\system\Tests\Menu\RouterTest22040
MessageGroupFilenameLineFunctionStatus
Menu title is: Alternative example title - Case 1.MenuRouterTest.php518Drupal\system\Tests\Menu\RouterTest->menuItemTitlesCasesHelper()
Menu title is: Alternative example title - Case 2.MenuRouterTest.php518Drupal\system\Tests\Menu\RouterTest->menuItemTitlesCasesHelper()
Menu title is: Alternative example title - Case 3.MenuRouterTest.php518Drupal\system\Tests\Menu\RouterTest->menuItemTitlesCasesHelper()
Menu title is: Alternative example title - Case 4.MenuRouterTest.php518Drupal\system\Tests\Menu\RouterTest->menuItemTitlesCasesHelper()
ExpandDrupal\system\Tests\Module\DependencyTest15620
MessageGroupFilenameLineFunctionStatus
Modules status has been updated.OtherDependencyTest.php38Drupal\system\Tests\Module\DependencyTest->testEnableWithoutDependency()
Module "translation_entity" is enabled.OtherDependencyTest.php40Drupal\system\Tests\Module\DependencyTest->testEnableWithoutDependency()
ExpandDrupal\system\Tests\Module\EnableDisableTest1847432
MessageGroupFilenameLineFunctionStatus
Modules status has been updated.OtherEnableDisableTest.php98Drupal\system\Tests\Module\EnableDisableTest->testEnableDisable()
"hook_modules_installed fired for language" foundOtherEnableDisableTest.php105Drupal\system\Tests\Module\EnableDisableTest->testEnableDisable()
"hook_modules_enabled fired for language" foundOtherEnableDisableTest.php106Drupal\system\Tests\Module\EnableDisableTest->testEnableDisable()
watchdog table contains 0 rows for %module module installed.OtherEnableDisableTest.php110Drupal\system\Tests\Module\EnableDisableTest->testEnableDisable()
watchdog table contains 0 rows for %module module enabled.OtherEnableDisableTest.php111Drupal\system\Tests\Module\EnableDisableTest->testEnableDisable()
Modules status has been updated.OtherEnableDisableTest.php120Drupal\system\Tests\Module\EnableDisableTest->testEnableDisable()
Module "language" is not enabled.OtherEnableDisableTest.php120Drupal\system\Tests\Module\EnableDisableTest->testEnableDisable()
"hook_modules_disabled fired for language" foundOtherEnableDisableTest.php120Drupal\system\Tests\Module\EnableDisableTest->testEnableDisable()
watchdog table contains 0 rows for %module module disabled.OtherEnableDisableTest.php120Drupal\system\Tests\Module\EnableDisableTest->testEnableDisable()
Failed to set field uninstall[language] to languageOtherEnableDisableTest.php120Drupal\system\Tests\Module\EnableDisableTest->testEnableDisable()
Found the Uninstall buttonOtherEnableDisableTest.php120Drupal\system\Tests\Module\EnableDisableTest->testEnableDisable()
Found the requested form fields at admin/modules/uninstallOtherEnableDisableTest.php120Drupal\system\Tests\Module\EnableDisableTest->testEnableDisable()
Invalid argument supplied for foreach()Drupal\simpletest\WebTestBase->drupalPost(NULL, NULL, 'Uninstall') Drupal\system\Tests\Module\EnableDisableTest->assertSuccessfulDisableAndUninstall('language') Drupal\system\Tests\Module\EnableDisableTest->testEnableDisable() Drupal\simpletest\TestBase->run() simpletest_script_run_one_test('337', 'Drupal\system\Tests\Module\EnableDisableTest') WarningWebTestBase.php1230Drupal\simpletest\WebTestBase->drupalPost()
Found the Uninstall buttonOtherEnableDisableTest.php120Drupal\system\Tests\Module\EnableDisableTest->testEnableDisable()
Found the requested form fields at OtherEnableDisableTest.php120Drupal\system\Tests\Module\EnableDisableTest->testEnableDisable()
Modules status has been updated.OtherEnableDisableTest.php120Drupal\system\Tests\Module\EnableDisableTest->testEnableDisable()
Module "language" is not enabled.OtherEnableDisableTest.php120Drupal\system\Tests\Module\EnableDisableTest->testEnableDisable()
"hook_modules_uninstalled fired for language" foundOtherEnableDisableTest.php120Drupal\system\Tests\Module\EnableDisableTest->testEnableDisable()
watchdog table contains 0 rows for %module module uninstalled.OtherEnableDisableTest.php120Drupal\system\Tests\Module\EnableDisableTest->testEnableDisable()
None of the database tables defined by the language module exist.OtherEnableDisableTest.php120Drupal\system\Tests\Module\EnableDisableTest->testEnableDisable()
No configuration found for language module.OtherEnableDisableTest.php120Drupal\system\Tests\Module\EnableDisableTest->testEnableDisable()
Module "language" is not enabled.OtherEnableDisableTest.php85Drupal\system\Tests\Module\EnableDisableTest->testEnableDisable()
None of the database tables defined by the language module exist.OtherEnableDisableTest.php86Drupal\system\Tests\Module\EnableDisableTest->testEnableDisable()
Found the Continue buttonOtherEnableDisableTest.php96Drupal\system\Tests\Module\EnableDisableTest->testEnableDisable()
Found the requested form fields at OtherEnableDisableTest.php96Drupal\system\Tests\Module\EnableDisableTest->testEnableDisable()
"hook_modules_installed fired for language" foundOtherEnableDisableTest.php105Drupal\system\Tests\Module\EnableDisableTest->testEnableDisable()
"hook_modules_enabled fired for language" foundOtherEnableDisableTest.php106Drupal\system\Tests\Module\EnableDisableTest->testEnableDisable()
watchdog table contains 0 rows for %module module installed.OtherEnableDisableTest.php110Drupal\system\Tests\Module\EnableDisableTest->testEnableDisable()
watchdog table contains 0 rows for %module module enabled.OtherEnableDisableTest.php111Drupal\system\Tests\Module\EnableDisableTest->testEnableDisable()
Modules status has been updated.OtherEnableDisableTest.php136Drupal\system\Tests\Module\EnableDisableTest->testEnableDisable()
Module "language" is not enabled.OtherEnableDisableTest.php136Drupal\system\Tests\Module\EnableDisableTest->testEnableDisable()
"hook_modules_disabled fired for language" foundOtherEnableDisableTest.php136Drupal\system\Tests\Module\EnableDisableTest->testEnableDisable()
watchdog table contains 0 rows for %module module disabled.OtherEnableDisableTest.php136Drupal\system\Tests\Module\EnableDisableTest->testEnableDisable()
Failed to set field uninstall[language] to languageOtherEnableDisableTest.php136Drupal\system\Tests\Module\EnableDisableTest->testEnableDisable()
Found the Uninstall buttonOtherEnableDisableTest.php136Drupal\system\Tests\Module\EnableDisableTest->testEnableDisable()
Found the requested form fields at admin/modules/uninstallOtherEnableDisableTest.php136Drupal\system\Tests\Module\EnableDisableTest->testEnableDisable()
Invalid argument supplied for foreach()Drupal\simpletest\WebTestBase->drupalPost(NULL, NULL, 'Uninstall') Drupal\system\Tests\Module\EnableDisableTest->assertSuccessfulDisableAndUninstall('language') Drupal\system\Tests\Module\EnableDisableTest->testEnableDisable() Drupal\simpletest\TestBase->run() simpletest_script_run_one_test('337', 'Drupal\system\Tests\Module\EnableDisableTest') WarningWebTestBase.php1230Drupal\simpletest\WebTestBase->drupalPost()
Found the Uninstall buttonOtherEnableDisableTest.php136Drupal\system\Tests\Module\EnableDisableTest->testEnableDisable()
Found the requested form fields at OtherEnableDisableTest.php136Drupal\system\Tests\Module\EnableDisableTest->testEnableDisable()
Modules status has been updated.OtherEnableDisableTest.php136Drupal\system\Tests\Module\EnableDisableTest->testEnableDisable()
Module "language" is not enabled.OtherEnableDisableTest.php136Drupal\system\Tests\Module\EnableDisableTest->testEnableDisable()
"hook_modules_uninstalled fired for language" foundOtherEnableDisableTest.php136Drupal\system\Tests\Module\EnableDisableTest->testEnableDisable()
watchdog table contains 0 rows for %module module uninstalled.OtherEnableDisableTest.php136Drupal\system\Tests\Module\EnableDisableTest->testEnableDisable()
None of the database tables defined by the language module exist.OtherEnableDisableTest.php136Drupal\system\Tests\Module\EnableDisableTest->testEnableDisable()
No configuration found for language module.OtherEnableDisableTest.php136Drupal\system\Tests\Module\EnableDisableTest->testEnableDisable()
ExpandDrupal\system\Tests\Path\LookupTest760
MessageGroupFilenameLineFunctionStatus
English alias overrides language-neutral alias.OtherLookupTest.php49Drupal\system\Tests\Path\LookupTest->testDrupalLookupPath()
English source overrides language-neutral source.OtherLookupTest.php50Drupal\system\Tests\Path\LookupTest->testDrupalLookupPath()
English alias still returned after entering a language-neutral alias.OtherLookupTest.php58Drupal\system\Tests\Path\LookupTest->testDrupalLookupPath()
English alias still returned after entering a LOLspeak alias.OtherLookupTest.php67Drupal\system\Tests\Path\LookupTest->testDrupalLookupPath()
Recently created English alias returned.OtherLookupTest.php79Drupal\system\Tests\Path\LookupTest->testDrupalLookupPath()
Recently created English source returned.OtherLookupTest.php80Drupal\system\Tests\Path\LookupTest->testDrupalLookupPath()
ExpandDrupal\system\Tests\System\AdminTest010
MessageGroupFilenameLineFunctionStatus
The test did not complete due to a fatal error.Completion checkAdminTest.php50Drupal\system\Tests\System\AdminTest->testAdminPages()
ExpandDrupal\system\Tests\System\DateFormatsLanguageTest010
MessageGroupFilenameLineFunctionStatus
The test did not complete due to a fatal error.Completion checkDateFormatsLanguageTest.php46Drupal\system\Tests\System\DateFormatsLanguageTest->testLocalizeDateFormats()
ExpandDrupal\system\Tests\System\DateTimeTest010
MessageGroupFilenameLineFunctionStatus
The test did not complete due to a fatal error.Completion checkDateTimeTest.php45Drupal\system\Tests\System\DateTimeTest->testTimeZoneHandling()
ExpandDrupal\system\Tests\Upgrade\BareStandardUpgradePathTest211
MessageGroupFilenameLineFunctionStatus
HTTP response expected 200, actual 500BrowserUpgradePathTestBase.php193Drupal\system\Tests\Upgrade\UpgradePathTestBase->performUpgrade()
Exception: Initial GET to update.php did not return HTTP 200 status. in Drupal\system\Tests\Upgrade\UpgradePathTestBase->performUpgrade() (line 194 of /var/lib/drupaltestbot/sites/default/files/checkout/core/modules/system/lib/Drupal/system/Tests/Upgrade/UpgradePathTestBase.php). Drupal\system\Tests\Upgrade\UpgradePathTestBase->performUpgrade() Drupal\system\Tests\Upgrade\BareStandardUpgradePathTest->testBasicStandardUpgrade() Drupal\simpletest\TestBase->run() simpletest_script_run_one_test('546', 'Drupal\system\Tests\Upgrade\BareStandardUpgradePathTest') Uncaught exceptionUpgradePathTestBase.php194Drupal\system\Tests\Upgrade\UpgradePathTestBase->performUpgrade()
ExpandDrupal\system\Tests\Upgrade\FilledStandardUpgradePathTest211
MessageGroupFilenameLineFunctionStatus
HTTP response expected 200, actual 500BrowserUpgradePathTestBase.php193Drupal\system\Tests\Upgrade\UpgradePathTestBase->performUpgrade()
Exception: Initial GET to update.php did not return HTTP 200 status. in Drupal\system\Tests\Upgrade\UpgradePathTestBase->performUpgrade() (line 194 of /var/lib/drupaltestbot/sites/default/files/checkout/core/modules/system/lib/Drupal/system/Tests/Upgrade/UpgradePathTestBase.php). Drupal\system\Tests\Upgrade\UpgradePathTestBase->performUpgrade() Drupal\system\Tests\Upgrade\FilledStandardUpgradePathTest->testFilledStandardUpgrade() Drupal\simpletest\TestBase->run() simpletest_script_run_one_test('549', 'Drupal\system\Tests\Upgrade\FilledStandardUpgradePathTest') Uncaught exceptionUpgradePathTestBase.php194Drupal\system\Tests\Upgrade\UpgradePathTestBase->performUpgrade()
ExpandDrupal\system\Tests\Upgrade\ImageUpgradePathTest211
MessageGroupFilenameLineFunctionStatus
HTTP response expected 200, actual 500BrowserUpgradePathTestBase.php193Drupal\system\Tests\Upgrade\UpgradePathTestBase->performUpgrade()
Exception: Initial GET to update.php did not return HTTP 200 status. in Drupal\system\Tests\Upgrade\UpgradePathTestBase->performUpgrade() (line 194 of /var/lib/drupaltestbot/sites/default/files/checkout/core/modules/system/lib/Drupal/system/Tests/Upgrade/UpgradePathTestBase.php). Drupal\system\Tests\Upgrade\UpgradePathTestBase->performUpgrade() Drupal\system\Tests\Upgrade\ImageUpgradePathTest->testImageStyleUpgrade() Drupal\simpletest\TestBase->run() simpletest_script_run_one_test('550', 'Drupal\system\Tests\Upgrade\ImageUpgradePathTest') Uncaught exceptionUpgradePathTestBase.php194Drupal\system\Tests\Upgrade\UpgradePathTestBase->performUpgrade()
ExpandDrupal\system\Tests\Upgrade\LanguageUpgradePathTest844
MessageGroupFilenameLineFunctionStatus
HTTP response expected 200, actual 500BrowserUpgradePathTestBase.php193Drupal\system\Tests\Upgrade\UpgradePathTestBase->performUpgrade()
Exception: Initial GET to update.php did not return HTTP 200 status. in Drupal\system\Tests\Upgrade\UpgradePathTestBase->performUpgrade() (line 194 of /var/lib/drupaltestbot/sites/default/files/checkout/core/modules/system/lib/Drupal/system/Tests/Upgrade/UpgradePathTestBase.php). Drupal\system\Tests\Upgrade\UpgradePathTestBase->performUpgrade() Drupal\system\Tests\Upgrade\LanguageUpgradePathTest->testLanguageUpgrade() Drupal\simpletest\TestBase->run() simpletest_script_run_one_test('551', 'Drupal\system\Tests\Upgrade\LanguageUpgradePathTest') Uncaught exceptionUpgradePathTestBase.php194Drupal\system\Tests\Upgrade\UpgradePathTestBase->performUpgrade()
HTTP response expected 200, actual 500BrowserUpgradePathTestBase.php193Drupal\system\Tests\Upgrade\UpgradePathTestBase->performUpgrade()
Exception: Initial GET to update.php did not return HTTP 200 status. in Drupal\system\Tests\Upgrade\UpgradePathTestBase->performUpgrade() (line 194 of /var/lib/drupaltestbot/sites/default/files/checkout/core/modules/system/lib/Drupal/system/Tests/Upgrade/UpgradePathTestBase.php). Drupal\system\Tests\Upgrade\UpgradePathTestBase->performUpgrade() Drupal\system\Tests\Upgrade\LanguageUpgradePathTest->testLanguageUrlUpgrade() Drupal\simpletest\TestBase->run() simpletest_script_run_one_test('551', 'Drupal\system\Tests\Upgrade\LanguageUpgradePathTest') Uncaught exceptionUpgradePathTestBase.php194Drupal\system\Tests\Upgrade\UpgradePathTestBase->performUpgrade()
HTTP response expected 200, actual 500BrowserUpgradePathTestBase.php193Drupal\system\Tests\Upgrade\UpgradePathTestBase->performUpgrade()
Exception: Initial GET to update.php did not return HTTP 200 status. in Drupal\system\Tests\Upgrade\UpgradePathTestBase->performUpgrade() (line 194 of /var/lib/drupaltestbot/sites/default/files/checkout/core/modules/system/lib/Drupal/system/Tests/Upgrade/UpgradePathTestBase.php). Drupal\system\Tests\Upgrade\UpgradePathTestBase->performUpgrade() Drupal\system\Tests\Upgrade\LanguageUpgradePathTest->testLanguageNoPluralsUpgrade() Drupal\simpletest\TestBase->run() simpletest_script_run_one_test('551', 'Drupal\system\Tests\Upgrade\LanguageUpgradePathTest') Uncaught exceptionUpgradePathTestBase.php194Drupal\system\Tests\Upgrade\UpgradePathTestBase->performUpgrade()
HTTP response expected 200, actual 500BrowserUpgradePathTestBase.php193Drupal\system\Tests\Upgrade\UpgradePathTestBase->performUpgrade()
Exception: Initial GET to update.php did not return HTTP 200 status. in Drupal\system\Tests\Upgrade\UpgradePathTestBase->performUpgrade() (line 194 of /var/lib/drupaltestbot/sites/default/files/checkout/core/modules/system/lib/Drupal/system/Tests/Upgrade/UpgradePathTestBase.php). Drupal\system\Tests\Upgrade\UpgradePathTestBase->performUpgrade() Drupal\system\Tests\Upgrade\LanguageUpgradePathTest->testLanguagePermissionsUpgrade() Drupal\simpletest\TestBase->run() simpletest_script_run_one_test('551', 'Drupal\system\Tests\Upgrade\LanguageUpgradePathTest') Uncaught exceptionUpgradePathTestBase.php194Drupal\system\Tests\Upgrade\UpgradePathTestBase->performUpgrade()
ExpandDrupal\system\Tests\Upgrade\ModulesDisabledUpgradePathTest211
MessageGroupFilenameLineFunctionStatus
HTTP response expected 200, actual 500BrowserUpgradePathTestBase.php193Drupal\system\Tests\Upgrade\UpgradePathTestBase->performUpgrade()
Exception: Initial GET to update.php did not return HTTP 200 status. in Drupal\system\Tests\Upgrade\UpgradePathTestBase->performUpgrade() (line 194 of /var/lib/drupaltestbot/sites/default/files/checkout/core/modules/system/lib/Drupal/system/Tests/Upgrade/UpgradePathTestBase.php). Drupal\system\Tests\Upgrade\UpgradePathTestBase->performUpgrade() Drupal\system\Tests\Upgrade\ModulesDisabledUpgradePathTest->testDisabledUpgrade() Drupal\simpletest\TestBase->run() simpletest_script_run_one_test('552', 'Drupal\system\Tests\Upgrade\ModulesDisabledUpgradePathTest') Uncaught exceptionUpgradePathTestBase.php194Drupal\system\Tests\Upgrade\UpgradePathTestBase->performUpgrade()
ExpandDrupal\system\Tests\Upgrade\StateSystemUpgradePathTest211
MessageGroupFilenameLineFunctionStatus
HTTP response expected 200, actual 500BrowserUpgradePathTestBase.php193Drupal\system\Tests\Upgrade\UpgradePathTestBase->performUpgrade()
Exception: Initial GET to update.php did not return HTTP 200 status. in Drupal\system\Tests\Upgrade\UpgradePathTestBase->performUpgrade() (line 194 of /var/lib/drupaltestbot/sites/default/files/checkout/core/modules/system/lib/Drupal/system/Tests/Upgrade/UpgradePathTestBase.php). Drupal\system\Tests\Upgrade\UpgradePathTestBase->performUpgrade() Drupal\system\Tests\Upgrade\StateSystemUpgradePathTest->testSystemVariableUpgrade() Drupal\simpletest\TestBase->run() simpletest_script_run_one_test('553', 'Drupal\system\Tests\Upgrade\StateSystemUpgradePathTest') Uncaught exceptionUpgradePathTestBase.php194Drupal\system\Tests\Upgrade\UpgradePathTestBase->performUpgrade()
ExpandDrupal\system\Tests\Upgrade\SystemUpgradePathTest211
MessageGroupFilenameLineFunctionStatus
HTTP response expected 200, actual 500BrowserUpgradePathTestBase.php193Drupal\system\Tests\Upgrade\UpgradePathTestBase->performUpgrade()
Exception: Initial GET to update.php did not return HTTP 200 status. in Drupal\system\Tests\Upgrade\UpgradePathTestBase->performUpgrade() (line 194 of /var/lib/drupaltestbot/sites/default/files/checkout/core/modules/system/lib/Drupal/system/Tests/Upgrade/UpgradePathTestBase.php). Drupal\system\Tests\Upgrade\UpgradePathTestBase->performUpgrade() Drupal\system\Tests\Upgrade\SystemUpgradePathTest->testVariableUpgrade() Drupal\simpletest\TestBase->run() simpletest_script_run_one_test('554', 'Drupal\system\Tests\Upgrade\SystemUpgradePathTest') Uncaught exceptionUpgradePathTestBase.php194Drupal\system\Tests\Upgrade\UpgradePathTestBase->performUpgrade()
ExpandDrupal\system\Tests\Upgrade\UserRoleUpgradePathTest211
MessageGroupFilenameLineFunctionStatus
HTTP response expected 200, actual 500BrowserUpgradePathTestBase.php193Drupal\system\Tests\Upgrade\UpgradePathTestBase->performUpgrade()
Exception: Initial GET to update.php did not return HTTP 200 status. in Drupal\system\Tests\Upgrade\UpgradePathTestBase->performUpgrade() (line 194 of /var/lib/drupaltestbot/sites/default/files/checkout/core/modules/system/lib/Drupal/system/Tests/Upgrade/UpgradePathTestBase.php). Drupal\system\Tests\Upgrade\UpgradePathTestBase->performUpgrade() Drupal\system\Tests\Upgrade\UserRoleUpgradePathTest->testRoleUpgrade() Drupal\simpletest\TestBase->run() simpletest_script_run_one_test('555', 'Drupal\system\Tests\Upgrade\UserRoleUpgradePathTest') Uncaught exceptionUpgradePathTestBase.php194Drupal\system\Tests\Upgrade\UpgradePathTestBase->performUpgrade()
ExpandDrupal\system\Tests\Upgrade\UuidUpgradePathTest211
MessageGroupFilenameLineFunctionStatus
HTTP response expected 200, actual 500BrowserUpgradePathTestBase.php193Drupal\system\Tests\Upgrade\UpgradePathTestBase->performUpgrade()
Exception: Initial GET to update.php did not return HTTP 200 status. in Drupal\system\Tests\Upgrade\UpgradePathTestBase->performUpgrade() (line 194 of /var/lib/drupaltestbot/sites/default/files/checkout/core/modules/system/lib/Drupal/system/Tests/Upgrade/UpgradePathTestBase.php). Drupal\system\Tests\Upgrade\UpgradePathTestBase->performUpgrade() Drupal\system\Tests\Upgrade\UuidUpgradePathTest->testUuidUpgrade() Drupal\simpletest\TestBase->run() simpletest_script_run_one_test('556', 'Drupal\system\Tests\Upgrade\UuidUpgradePathTest') Uncaught exceptionUpgradePathTestBase.php194Drupal\system\Tests\Upgrade\UpgradePathTestBase->performUpgrade()
ExpandDrupal\taxonomy\Tests\TermLanguageTest010
MessageGroupFilenameLineFunctionStatus
The test did not complete due to a fatal error.Completion checkTermLanguageTest.php47Drupal\taxonomy\Tests\TermLanguageTest->testTermLanguage()
ExpandDrupal\taxonomy\Tests\TermTranslationUITest010
MessageGroupFilenameLineFunctionStatus
The test did not complete due to a fatal error.Completion checkTermTranslationUITest.php92Drupal\taxonomy\Tests\TermTranslationUITest->testTranslationUI()
ExpandDrupal\taxonomy\Tests\VocabularyLanguageTest010
MessageGroupFilenameLineFunctionStatus
The test did not complete due to a fatal error.Completion checkVocabularyLanguageTest.php51Drupal\taxonomy\Tests\VocabularyLanguageTest->testVocabularyLanguage()
ExpandDrupal\text\Tests\TextTranslationTest010
MessageGroupFilenameLineFunctionStatus
The test did not complete due to a fatal error.Completion checkTextTranslationTest.php62Drupal\text\Tests\TextTranslationTest->testTextField()
ExpandDrupal\translation\Tests\TranslationTest010
MessageGroupFilenameLineFunctionStatus
The test did not complete due to a fatal error.Completion checkTranslationTest.php72Drupal\translation\Tests\TranslationTest->testContentTranslation()
ExpandDrupal\translation_entity\Tests\ConfigTestTranslationUITest010
MessageGroupFilenameLineFunctionStatus
The test did not complete due to a fatal error.Completion checkConfigTestTranslationUITest.php64Drupal\translation_entity\Tests\ConfigTestTranslationUITest->testTranslationUI()
ExpandDrupal\translation_entity\Tests\EntityTestTranslationUITest010
MessageGroupFilenameLineFunctionStatus
The test did not complete due to a fatal error.Completion checkEntityTranslationUITest.php146Drupal\translation_entity\Tests\EntityTestTranslationUITest->testTranslationUI()
ExpandDrupal\user\Tests\UserLanguageCreationTest010
MessageGroupFilenameLineFunctionStatus
The test did not complete due to a fatal error.Completion checkUserLanguageCreationTest.php40Drupal\user\Tests\UserLanguageCreationTest->testLocalUserCreation()
ExpandDrupal\user\Tests\UserLanguageTest010
MessageGroupFilenameLineFunctionStatus
The test did not complete due to a fatal error.Completion checkUserLanguageTest.php35Drupal\user\Tests\UserLanguageTest->testUserLanguageConfiguration()
ExpandDrupal\user\Tests\UserSearchTest010
MessageGroupFilenameLineFunctionStatus
The test did not complete due to a fatal error.Completion checkUserSearchTest.php32Drupal\user\Tests\UserSearchTest->testUserSearch()
ExpandDrupal\user\Tests\UserTokenReplaceTest010
MessageGroupFilenameLineFunctionStatus
The test did not complete due to a fatal error.Completion checkUserTokenReplaceTest.php44Drupal\user\Tests\UserTokenReplaceTest->testUserTokenReplacement()
ExpandDrupal\user\Tests\UserTranslationUITest010
MessageGroupFilenameLineFunctionStatus
The test did not complete due to a fatal error.Completion checkEntityTranslationUITest.php146Drupal\user\Tests\UserTranslationUITest->testTranslationUI()
ExpandDrupal\views\Tests\Handler\HandlerAllTest020
MessageGroupFilenameLineFunctionStatus
The test did not complete due to a fatal error.Completion checkHandlerAllTest.php54Drupal\views\Tests\Handler\HandlerAllTest->testHandlers()
The test did not complete due to a fatal error.Completion checkHandlerAllTest.php54Drupal\views\Tests\Handler\HandlerAllTest->testHandlers()
ExpandDrupal\views\Tests\Language\ArgumentLanguageTest010
MessageGroupFilenameLineFunctionStatus
The test did not complete due to a fatal error.Completion checkArgumentLanguageTest.php30Drupal\views\Tests\Language\ArgumentLanguageTest->testArgument()
ExpandDrupal\views\Tests\Language\FieldLanguageTest010
MessageGroupFilenameLineFunctionStatus
The test did not complete due to a fatal error.Completion checkFieldLanguageTest.php30Drupal\views\Tests\Language\FieldLanguageTest->testField()
ExpandDrupal\views\Tests\Language\FilterLanguageTest010
MessageGroupFilenameLineFunctionStatus
The test did not complete due to a fatal error.Completion checkFilterLanguageTest.php30Drupal\views\Tests\Language\FilterLanguageTest->testFilter()

All

Test namePassFailException
LeafDrupal\action\Tests\ConfigurationTest3900
LeafDrupal\action\Tests\LoopTest2100
LeafDrupal\aggregator\Tests\AddFeedTest7100
LeafDrupal\aggregator\Tests\AggregatorConfigurationTest2000
LeafDrupal\aggregator\Tests\AggregatorCronTest5500
LeafDrupal\aggregator\Tests\AggregatorRenderingTest22800
LeafDrupal\aggregator\Tests\CategorizeFeedItemTest6100
LeafDrupal\aggregator\Tests\CategorizeFeedTest2100
LeafDrupal\aggregator\Tests\FeedParserTest7200
LeafDrupal\aggregator\Tests\ImportOpmlTest5500
LeafDrupal\aggregator\Tests\RemoveFeedItemTest27000
LeafDrupal\aggregator\Tests\RemoveFeedTest2500
LeafDrupal\aggregator\Tests\UpdateFeedItemTest6500
LeafDrupal\aggregator\Tests\UpdateFeedTest7600
LeafDrupal\ban\Tests\IpAddressBlockingTest4300
LeafDrupal\block\Tests\BlockAdminThemeTest1900
LeafDrupal\block\Tests\BlockCacheTest20500
LeafDrupal\block\Tests\BlockHiddenRegionTest1800
LeafDrupal\block\Tests\BlockHtmlIdTest1600
LeafDrupal\block\Tests\BlockInvalidRegionTest2400
ExpandDrupal\block\Tests\BlockLanguageTest010
MessageGroupFilenameLineFunctionStatus
The test did not complete due to a fatal error.Completion checkBlockLanguageTest.php35Drupal\block\Tests\BlockLanguageTest->testLanguageBlockVisibility()
LeafDrupal\block\Tests\BlockTemplateSuggestionsUnitTest300
LeafDrupal\block\Tests\BlockTest35800
LeafDrupal\block\Tests\BlockUserAccountSettingsTest1200
LeafDrupal\block\Tests\NewDefaultThemeBlocksTest2200
LeafDrupal\block\Tests\NonDefaultBlockAdminTest1100
LeafDrupal\book\Tests\BookTest51700
LeafDrupal\breakpoint\Tests\BreakpointAPITest600
LeafDrupal\breakpoint\Tests\BreakpointCRUDTest2100
LeafDrupal\breakpoint\Tests\BreakpointGroupAPITest400
LeafDrupal\breakpoint\Tests\BreakpointGroupCRUDTest1200
LeafDrupal\breakpoint\Tests\BreakpointMediaQueryTest6300
LeafDrupal\breakpoint\Tests\BreakpointThemeTest2300
LeafDrupal\color\Tests\ColorTest8700
LeafDrupal\comment\Tests\CommentActionsTest3000
LeafDrupal\comment\Tests\CommentAnonymousTest16300
LeafDrupal\comment\Tests\CommentApprovalTest15200
LeafDrupal\comment\Tests\CommentBlockTest11800
LeafDrupal\comment\Tests\CommentContentRebuildTest3300
LeafDrupal\comment\Tests\CommentCSSTest50100
LeafDrupal\comment\Tests\CommentFieldsTest10700
LeafDrupal\comment\Tests\CommentInterfaceTest25100
ExpandDrupal\comment\Tests\CommentLanguageTest010
MessageGroupFilenameLineFunctionStatus
The test did not complete due to a fatal error.Completion checkCommentLanguageTest.php89Drupal\comment\Tests\CommentLanguageTest->testCommentLanguage()
ExpandDrupal\comment\Tests\CommentLinksTest109300
MessageGroupFilenameLineFunctionStatus
Changed environment:array ( 'authenticated' => false, 'comment count' => false, 'form' => 'below', 'user_register' => 'visitors', 'contact' => 'optional', 'comments' => 'open', 'access comments' => 0, 'post comments' => 0, 'skip comment approval' => 1, 'edit own comments' => 0, )DebugCommentLinksTest.php194Drupal\comment\Tests\CommentLinksTest->setEnvironment()
Changed environment:array ( 'authenticated' => true, 'comment count' => false, 'form' => 'below', 'user_register' => 'visitors', 'contact' => 'optional', 'comments' => 'open', 'access comments' => 0, 'post comments' => 0, 'skip comment approval' => 1, 'edit own comments' => 0, )DebugCommentLinksTest.php194Drupal\comment\Tests\CommentLinksTest->setEnvironment()
Changed environment:array ( 'authenticated' => false, 'comment count' => true, 'form' => 'below', 'user_register' => 'visitors', 'contact' => 'optional', 'comments' => 'open', 'access comments' => 0, 'post comments' => 0, 'skip comment approval' => 1, 'edit own comments' => 0, )DebugCommentLinksTest.php194Drupal\comment\Tests\CommentLinksTest->setEnvironment()
Changed environment:array ( 'authenticated' => true, 'comment count' => true, 'form' => 'below', 'user_register' => 'visitors', 'contact' => 'optional', 'comments' => 'open', 'access comments' => 0, 'post comments' => 0, 'skip comment approval' => 1, 'edit own comments' => 0, )DebugCommentLinksTest.php194Drupal\comment\Tests\CommentLinksTest->setEnvironment()
Changed environment:array ( 'authenticated' => false, 'comment count' => false, 'form' => 'below', 'user_register' => 'visitors', 'contact' => 'optional', 'comments' => 'open', 'access comments' => 1, 'post comments' => 0, 'skip comment approval' => 1, 'edit own comments' => 0, )DebugCommentLinksTest.php194Drupal\comment\Tests\CommentLinksTest->setEnvironment()
Changed environment:array ( 'authenticated' => true, 'comment count' => false, 'form' => 'below', 'user_register' => 'visitors', 'contact' => 'optional', 'comments' => 'open', 'access comments' => 1, 'post comments' => 0, 'skip comment approval' => 1, 'edit own comments' => 0, )DebugCommentLinksTest.php194Drupal\comment\Tests\CommentLinksTest->setEnvironment()
Changed environment:array ( 'authenticated' => false, 'comment count' => true, 'form' => 'below', 'user_register' => 'visitors', 'contact' => 'optional', 'comments' => 'open', 'access comments' => 1, 'post comments' => 0, 'skip comment approval' => 1, 'edit own comments' => 0, )DebugCommentLinksTest.php194Drupal\comment\Tests\CommentLinksTest->setEnvironment()
Changed environment:array ( 'authenticated' => true, 'comment count' => true, 'form' => 'below', 'user_register' => 'visitors', 'contact' => 'optional', 'comments' => 'open', 'access comments' => 1, 'post comments' => 0, 'skip comment approval' => 1, 'edit own comments' => 0, )DebugCommentLinksTest.php194Drupal\comment\Tests\CommentLinksTest->setEnvironment()
Changed environment:array ( 'authenticated' => false, 'comment count' => false, 'form' => 'below', 'user_register' => 'visitors', 'contact' => 'optional', 'comments' => 'open', 'access comments' => 0, 'post comments' => 1, 'skip comment approval' => 1, 'edit own comments' => 0, )DebugCommentLinksTest.php194Drupal\comment\Tests\CommentLinksTest->setEnvironment()
Changed environment:array ( 'authenticated' => true, 'comment count' => false, 'form' => 'below', 'user_register' => 'visitors', 'contact' => 'optional', 'comments' => 'open', 'access comments' => 0, 'post comments' => 1, 'skip comment approval' => 1, 'edit own comments' => 0, )DebugCommentLinksTest.php194Drupal\comment\Tests\CommentLinksTest->setEnvironment()
Changed environment:array ( 'authenticated' => false, 'comment count' => true, 'form' => 'below', 'user_register' => 'visitors', 'contact' => 'optional', 'comments' => 'open', 'access comments' => 0, 'post comments' => 1, 'skip comment approval' => 1, 'edit own comments' => 0, )DebugCommentLinksTest.php194Drupal\comment\Tests\CommentLinksTest->setEnvironment()
Changed environment:array ( 'authenticated' => true, 'comment count' => true, 'form' => 'below', 'user_register' => 'visitors', 'contact' => 'optional', 'comments' => 'open', 'access comments' => 0, 'post comments' => 1, 'skip comment approval' => 1, 'edit own comments' => 0, )DebugCommentLinksTest.php194Drupal\comment\Tests\CommentLinksTest->setEnvironment()
Changed environment:array ( 'authenticated' => false, 'comment count' => false, 'form' => 'below', 'user_register' => 'visitors', 'contact' => 'optional', 'comments' => 'open', 'access comments' => 1, 'post comments' => 1, 'skip comment approval' => 1, 'edit own comments' => 0, )DebugCommentLinksTest.php194Drupal\comment\Tests\CommentLinksTest->setEnvironment()
Changed environment:array ( 'authenticated' => true, 'comment count' => false, 'form' => 'below', 'user_register' => 'visitors', 'contact' => 'optional', 'comments' => 'open', 'access comments' => 1, 'post comments' => 1, 'skip comment approval' => 1, 'edit own comments' => 0, )DebugCommentLinksTest.php194Drupal\comment\Tests\CommentLinksTest->setEnvironment()
Changed environment:array ( 'authenticated' => false, 'comment count' => true, 'form' => 'below', 'user_register' => 'visitors', 'contact' => 'optional', 'comments' => 'open', 'access comments' => 1, 'post comments' => 1, 'skip comment approval' => 1, 'edit own comments' => 0, )DebugCommentLinksTest.php194Drupal\comment\Tests\CommentLinksTest->setEnvironment()
Changed environment:array ( 'authenticated' => true, 'comment count' => true, 'form' => 'below', 'user_register' => 'visitors', 'contact' => 'optional', 'comments' => 'open', 'access comments' => 1, 'post comments' => 1, 'skip comment approval' => 1, 'edit own comments' => 0, )DebugCommentLinksTest.php194Drupal\comment\Tests\CommentLinksTest->setEnvironment()
Changed environment:array ( 'authenticated' => false, 'comment count' => false, 'form' => 'separate page', 'user_register' => 'visitors', 'contact' => 'optional', 'comments' => 'open', 'access comments' => 0, 'post comments' => 0, 'skip comment approval' => 1, 'edit own comments' => 0, )DebugCommentLinksTest.php194Drupal\comment\Tests\CommentLinksTest->setEnvironment()
Changed environment:array ( 'authenticated' => true, 'comment count' => false, 'form' => 'separate page', 'user_register' => 'visitors', 'contact' => 'optional', 'comments' => 'open', 'access comments' => 0, 'post comments' => 0, 'skip comment approval' => 1, 'edit own comments' => 0, )DebugCommentLinksTest.php194Drupal\comment\Tests\CommentLinksTest->setEnvironment()
Changed environment:array ( 'authenticated' => false, 'comment count' => true, 'form' => 'separate page', 'user_register' => 'visitors', 'contact' => 'optional', 'comments' => 'open', 'access comments' => 0, 'post comments' => 0, 'skip comment approval' => 1, 'edit own comments' => 0, )DebugCommentLinksTest.php194Drupal\comment\Tests\CommentLinksTest->setEnvironment()
Changed environment:array ( 'authenticated' => true, 'comment count' => true, 'form' => 'separate page', 'user_register' => 'visitors', 'contact' => 'optional', 'comments' => 'open', 'access comments' => 0, 'post comments' => 0, 'skip comment approval' => 1, 'edit own comments' => 0, )DebugCommentLinksTest.php194Drupal\comment\Tests\CommentLinksTest->setEnvironment()
Changed environment:array ( 'authenticated' => false, 'comment count' => false, 'form' => 'separate page', 'user_register' => 'visitors', 'contact' => 'optional', 'comments' => 'open', 'access comments' => 1, 'post comments' => 0, 'skip comment approval' => 1, 'edit own comments' => 0, )DebugCommentLinksTest.php194Drupal\comment\Tests\CommentLinksTest->setEnvironment()
Changed environment:array ( 'authenticated' => true, 'comment count' => false, 'form' => 'separate page', 'user_register' => 'visitors', 'contact' => 'optional', 'comments' => 'open', 'access comments' => 1, 'post comments' => 0, 'skip comment approval' => 1, 'edit own comments' => 0, )DebugCommentLinksTest.php194Drupal\comment\Tests\CommentLinksTest->setEnvironment()
Changed environment:array ( 'authenticated' => false, 'comment count' => true, 'form' => 'separate page', 'user_register' => 'visitors', 'contact' => 'optional', 'comments' => 'open', 'access comments' => 1, 'post comments' => 0, 'skip comment approval' => 1, 'edit own comments' => 0, )DebugCommentLinksTest.php194Drupal\comment\Tests\CommentLinksTest->setEnvironment()
Changed environment:array ( 'authenticated' => true, 'comment count' => true, 'form' => 'separate page', 'user_register' => 'visitors', 'contact' => 'optional', 'comments' => 'open', 'access comments' => 1, 'post comments' => 0, 'skip comment approval' => 1, 'edit own comments' => 0, )DebugCommentLinksTest.php194Drupal\comment\Tests\CommentLinksTest->setEnvironment()
Changed environment:array ( 'authenticated' => false, 'comment count' => false, 'form' => 'separate page', 'user_register' => 'visitors', 'contact' => 'optional', 'comments' => 'open', 'access comments' => 0, 'post comments' => 1, 'skip comment approval' => 1, 'edit own comments' => 0, )DebugCommentLinksTest.php194Drupal\comment\Tests\CommentLinksTest->setEnvironment()
Changed environment:array ( 'authenticated' => true, 'comment count' => false, 'form' => 'separate page', 'user_register' => 'visitors', 'contact' => 'optional', 'comments' => 'open', 'access comments' => 0, 'post comments' => 1, 'skip comment approval' => 1, 'edit own comments' => 0, )DebugCommentLinksTest.php194Drupal\comment\Tests\CommentLinksTest->setEnvironment()
Changed environment:array ( 'authenticated' => false, 'comment count' => true, 'form' => 'separate page', 'user_register' => 'visitors', 'contact' => 'optional', 'comments' => 'open', 'access comments' => 0, 'post comments' => 1, 'skip comment approval' => 1, 'edit own comments' => 0, )DebugCommentLinksTest.php194Drupal\comment\Tests\CommentLinksTest->setEnvironment()
Changed environment:array ( 'authenticated' => true, 'comment count' => true, 'form' => 'separate page', 'user_register' => 'visitors', 'contact' => 'optional', 'comments' => 'open', 'access comments' => 0, 'post comments' => 1, 'skip comment approval' => 1, 'edit own comments' => 0, )DebugCommentLinksTest.php194Drupal\comment\Tests\CommentLinksTest->setEnvironment()
Changed environment:array ( 'authenticated' => false, 'comment count' => false, 'form' => 'separate page', 'user_register' => 'visitors', 'contact' => 'optional', 'comments' => 'open', 'access comments' => 1, 'post comments' => 1, 'skip comment approval' => 1, 'edit own comments' => 0, )DebugCommentLinksTest.php194Drupal\comment\Tests\CommentLinksTest->setEnvironment()
Changed environment:array ( 'authenticated' => true, 'comment count' => false, 'form' => 'separate page', 'user_register' => 'visitors', 'contact' => 'optional', 'comments' => 'open', 'access comments' => 1, 'post comments' => 1, 'skip comment approval' => 1, 'edit own comments' => 0, )DebugCommentLinksTest.php194Drupal\comment\Tests\CommentLinksTest->setEnvironment()
Changed environment:array ( 'authenticated' => false, 'comment count' => true, 'form' => 'separate page', 'user_register' => 'visitors', 'contact' => 'optional', 'comments' => 'open', 'access comments' => 1, 'post comments' => 1, 'skip comment approval' => 1, 'edit own comments' => 0, )DebugCommentLinksTest.php194Drupal\comment\Tests\CommentLinksTest->setEnvironment()
Changed environment:array ( 'authenticated' => true, 'comment count' => true, 'form' => 'separate page', 'user_register' => 'visitors', 'contact' => 'optional', 'comments' => 'open', 'access comments' => 1, 'post comments' => 1, 'skip comment approval' => 1, 'edit own comments' => 0, )DebugCommentLinksTest.php194Drupal\comment\Tests\CommentLinksTest->setEnvironment()
Changed environment:array ( 'authenticated' => false, 'comment count' => false, 'form' => 'below', 'user_register' => 'admin_only', 'contact' => 'optional', 'comments' => 'open', 'access comments' => 0, 'post comments' => 0, 'skip comment approval' => 1, 'edit own comments' => 0, )DebugCommentLinksTest.php194Drupal\comment\Tests\CommentLinksTest->setEnvironment()
Changed environment:array ( 'authenticated' => true, 'comment count' => false, 'form' => 'below', 'user_register' => 'admin_only', 'contact' => 'optional', 'comments' => 'open', 'access comments' => 0, 'post comments' => 0, 'skip comment approval' => 1, 'edit own comments' => 0, )DebugCommentLinksTest.php194Drupal\comment\Tests\CommentLinksTest->setEnvironment()
Changed environment:array ( 'authenticated' => false, 'comment count' => true, 'form' => 'below', 'user_register' => 'admin_only', 'contact' => 'optional', 'comments' => 'open', 'access comments' => 0, 'post comments' => 0, 'skip comment approval' => 1, 'edit own comments' => 0, )DebugCommentLinksTest.php194Drupal\comment\Tests\CommentLinksTest->setEnvironment()
Changed environment:array ( 'authenticated' => true, 'comment count' => true, 'form' => 'below', 'user_register' => 'admin_only', 'contact' => 'optional', 'comments' => 'open', 'access comments' => 0, 'post comments' => 0, 'skip comment approval' => 1, 'edit own comments' => 0, )DebugCommentLinksTest.php194Drupal\comment\Tests\CommentLinksTest->setEnvironment()
Changed environment:array ( 'authenticated' => false, 'comment count' => false, 'form' => 'below', 'user_register' => 'admin_only', 'contact' => 'optional', 'comments' => 'open', 'access comments' => 1, 'post comments' => 0, 'skip comment approval' => 1, 'edit own comments' => 0, )DebugCommentLinksTest.php194Drupal\comment\Tests\CommentLinksTest->setEnvironment()
Changed environment:array ( 'authenticated' => true, 'comment count' => false, 'form' => 'below', 'user_register' => 'admin_only', 'contact' => 'optional', 'comments' => 'open', 'access comments' => 1, 'post comments' => 0, 'skip comment approval' => 1, 'edit own comments' => 0, )DebugCommentLinksTest.php194Drupal\comment\Tests\CommentLinksTest->setEnvironment()
Changed environment:array ( 'authenticated' => false, 'comment count' => true, 'form' => 'below', 'user_register' => 'admin_only', 'contact' => 'optional', 'comments' => 'open', 'access comments' => 1, 'post comments' => 0, 'skip comment approval' => 1, 'edit own comments' => 0, )DebugCommentLinksTest.php194Drupal\comment\Tests\CommentLinksTest->setEnvironment()
Changed environment:array ( 'authenticated' => true, 'comment count' => true, 'form' => 'below', 'user_register' => 'admin_only', 'contact' => 'optional', 'comments' => 'open', 'access comments' => 1, 'post comments' => 0, 'skip comment approval' => 1, 'edit own comments' => 0, )DebugCommentLinksTest.php194Drupal\comment\Tests\CommentLinksTest->setEnvironment()
Changed environment:array ( 'authenticated' => false, 'comment count' => false, 'form' => 'below', 'user_register' => 'admin_only', 'contact' => 'optional', 'comments' => 'open', 'access comments' => 0, 'post comments' => 1, 'skip comment approval' => 1, 'edit own comments' => 0, )DebugCommentLinksTest.php194Drupal\comment\Tests\CommentLinksTest->setEnvironment()
Changed environment:array ( 'authenticated' => true, 'comment count' => false, 'form' => 'below', 'user_register' => 'admin_only', 'contact' => 'optional', 'comments' => 'open', 'access comments' => 0, 'post comments' => 1, 'skip comment approval' => 1, 'edit own comments' => 0, )DebugCommentLinksTest.php194Drupal\comment\Tests\CommentLinksTest->setEnvironment()
Changed environment:array ( 'authenticated' => false, 'comment count' => true, 'form' => 'below', 'user_register' => 'admin_only', 'contact' => 'optional', 'comments' => 'open', 'access comments' => 0, 'post comments' => 1, 'skip comment approval' => 1, 'edit own comments' => 0, )DebugCommentLinksTest.php194Drupal\comment\Tests\CommentLinksTest->setEnvironment()
Changed environment:array ( 'authenticated' => true, 'comment count' => true, 'form' => 'below', 'user_register' => 'admin_only', 'contact' => 'optional', 'comments' => 'open', 'access comments' => 0, 'post comments' => 1, 'skip comment approval' => 1, 'edit own comments' => 0, )DebugCommentLinksTest.php194Drupal\comment\Tests\CommentLinksTest->setEnvironment()
Changed environment:array ( 'authenticated' => false, 'comment count' => false, 'form' => 'below', 'user_register' => 'admin_only', 'contact' => 'optional', 'comments' => 'open', 'access comments' => 1, 'post comments' => 1, 'skip comment approval' => 1, 'edit own comments' => 0, )DebugCommentLinksTest.php194Drupal\comment\Tests\CommentLinksTest->setEnvironment()
Changed environment:array ( 'authenticated' => true, 'comment count' => false, 'form' => 'below', 'user_register' => 'admin_only', 'contact' => 'optional', 'comments' => 'open', 'access comments' => 1, 'post comments' => 1, 'skip comment approval' => 1, 'edit own comments' => 0, )DebugCommentLinksTest.php194Drupal\comment\Tests\CommentLinksTest->setEnvironment()
Changed environment:array ( 'authenticated' => false, 'comment count' => true, 'form' => 'below', 'user_register' => 'admin_only', 'contact' => 'optional', 'comments' => 'open', 'access comments' => 1, 'post comments' => 1, 'skip comment approval' => 1, 'edit own comments' => 0, )DebugCommentLinksTest.php194Drupal\comment\Tests\CommentLinksTest->setEnvironment()
Changed environment:array ( 'authenticated' => true, 'comment count' => true, 'form' => 'below', 'user_register' => 'admin_only', 'contact' => 'optional', 'comments' => 'open', 'access comments' => 1, 'post comments' => 1, 'skip comment approval' => 1, 'edit own comments' => 0, )DebugCommentLinksTest.php194Drupal\comment\Tests\CommentLinksTest->setEnvironment()
Changed environment:array ( 'authenticated' => false, 'comment count' => false, 'form' => 'separate page', 'user_register' => 'admin_only', 'contact' => 'optional', 'comments' => 'open', 'access comments' => 0, 'post comments' => 0, 'skip comment approval' => 1, 'edit own comments' => 0, )DebugCommentLinksTest.php194Drupal\comment\Tests\CommentLinksTest->setEnvironment()
Changed environment:array ( 'authenticated' => true, 'comment count' => false, 'form' => 'separate page', 'user_register' => 'admin_only', 'contact' => 'optional', 'comments' => 'open', 'access comments' => 0, 'post comments' => 0, 'skip comment approval' => 1, 'edit own comments' => 0, )DebugCommentLinksTest.php194Drupal\comment\Tests\CommentLinksTest->setEnvironment()
Changed environment:array ( 'authenticated' => false, 'comment count' => true, 'form' => 'separate page', 'user_register' => 'admin_only', 'contact' => 'optional', 'comments' => 'open', 'access comments' => 0, 'post comments' => 0, 'skip comment approval' => 1, 'edit own comments' => 0, )DebugCommentLinksTest.php194Drupal\comment\Tests\CommentLinksTest->setEnvironment()
Changed environment:array ( 'authenticated' => true, 'comment count' => true, 'form' => 'separate page', 'user_register' => 'admin_only', 'contact' => 'optional', 'comments' => 'open', 'access comments' => 0, 'post comments' => 0, 'skip comment approval' => 1, 'edit own comments' => 0, )DebugCommentLinksTest.php194Drupal\comment\Tests\CommentLinksTest->setEnvironment()
Changed environment:array ( 'authenticated' => false, 'comment count' => false, 'form' => 'separate page', 'user_register' => 'admin_only', 'contact' => 'optional', 'comments' => 'open', 'access comments' => 1, 'post comments' => 0, 'skip comment approval' => 1, 'edit own comments' => 0, )DebugCommentLinksTest.php194Drupal\comment\Tests\CommentLinksTest->setEnvironment()
Changed environment:array ( 'authenticated' => true, 'comment count' => false, 'form' => 'separate page', 'user_register' => 'admin_only', 'contact' => 'optional', 'comments' => 'open', 'access comments' => 1, 'post comments' => 0, 'skip comment approval' => 1, 'edit own comments' => 0, )DebugCommentLinksTest.php194Drupal\comment\Tests\CommentLinksTest->setEnvironment()
Changed environment:array ( 'authenticated' => false, 'comment count' => true, 'form' => 'separate page', 'user_register' => 'admin_only', 'contact' => 'optional', 'comments' => 'open', 'access comments' => 1, 'post comments' => 0, 'skip comment approval' => 1, 'edit own comments' => 0, )DebugCommentLinksTest.php194Drupal\comment\Tests\CommentLinksTest->setEnvironment()
Changed environment:array ( 'authenticated' => true, 'comment count' => true, 'form' => 'separate page', 'user_register' => 'admin_only', 'contact' => 'optional', 'comments' => 'open', 'access comments' => 1, 'post comments' => 0, 'skip comment approval' => 1, 'edit own comments' => 0, )DebugCommentLinksTest.php194Drupal\comment\Tests\CommentLinksTest->setEnvironment()
Changed environment:array ( 'authenticated' => false, 'comment count' => false, 'form' => 'separate page', 'user_register' => 'admin_only', 'contact' => 'optional', 'comments' => 'open', 'access comments' => 0, 'post comments' => 1, 'skip comment approval' => 1, 'edit own comments' => 0, )DebugCommentLinksTest.php194Drupal\comment\Tests\CommentLinksTest->setEnvironment()
Changed environment:array ( 'authenticated' => true, 'comment count' => false, 'form' => 'separate page', 'user_register' => 'admin_only', 'contact' => 'optional', 'comments' => 'open', 'access comments' => 0, 'post comments' => 1, 'skip comment approval' => 1, 'edit own comments' => 0, )DebugCommentLinksTest.php194Drupal\comment\Tests\CommentLinksTest->setEnvironment()
Changed environment:array ( 'authenticated' => false, 'comment count' => true, 'form' => 'separate page', 'user_register' => 'admin_only', 'contact' => 'optional', 'comments' => 'open', 'access comments' => 0, 'post comments' => 1, 'skip comment approval' => 1, 'edit own comments' => 0, )DebugCommentLinksTest.php194Drupal\comment\Tests\CommentLinksTest->setEnvironment()
Changed environment:array ( 'authenticated' => true, 'comment count' => true, 'form' => 'separate page', 'user_register' => 'admin_only', 'contact' => 'optional', 'comments' => 'open', 'access comments' => 0, 'post comments' => 1, 'skip comment approval' => 1, 'edit own comments' => 0, )DebugCommentLinksTest.php194Drupal\comment\Tests\CommentLinksTest->setEnvironment()
Changed environment:array ( 'authenticated' => false, 'comment count' => false, 'form' => 'separate page', 'user_register' => 'admin_only', 'contact' => 'optional', 'comments' => 'open', 'access comments' => 1, 'post comments' => 1, 'skip comment approval' => 1, 'edit own comments' => 0, )DebugCommentLinksTest.php194Drupal\comment\Tests\CommentLinksTest->setEnvironment()
Changed environment:array ( 'authenticated' => true, 'comment count' => false, 'form' => 'separate page', 'user_register' => 'admin_only', 'contact' => 'optional', 'comments' => 'open', 'access comments' => 1, 'post comments' => 1, 'skip comment approval' => 1, 'edit own comments' => 0, )DebugCommentLinksTest.php194Drupal\comment\Tests\CommentLinksTest->setEnvironment()
Changed environment:array ( 'authenticated' => false, 'comment count' => true, 'form' => 'separate page', 'user_register' => 'admin_only', 'contact' => 'optional', 'comments' => 'open', 'access comments' => 1, 'post comments' => 1, 'skip comment approval' => 1, 'edit own comments' => 0, )DebugCommentLinksTest.php194Drupal\comment\Tests\CommentLinksTest->setEnvironment()
Changed environment:array ( 'authenticated' => true, 'comment count' => true, 'form' => 'separate page', 'user_register' => 'admin_only', 'contact' => 'optional', 'comments' => 'open', 'access comments' => 1, 'post comments' => 1, 'skip comment approval' => 1, 'edit own comments' => 0, )DebugCommentLinksTest.php194Drupal\comment\Tests\CommentLinksTest->setEnvironment()
LeafDrupal\comment\Tests\CommentNewIndicatorTest4200
LeafDrupal\comment\Tests\CommentNodeAccessTest5700
LeafDrupal\comment\Tests\CommentNodeChangesTest2400
LeafDrupal\comment\Tests\CommentPagerTest21300
LeafDrupal\comment\Tests\CommentPreviewTest9800
LeafDrupal\comment\Tests\CommentRssTest2600
LeafDrupal\comment\Tests\CommentStatisticsTest9800
LeafDrupal\comment\Tests\CommentThreadingTest15900
LeafDrupal\comment\Tests\CommentTokenReplaceTest6600
ExpandDrupal\comment\Tests\CommentTranslationUITest010
MessageGroupFilenameLineFunctionStatus
The test did not complete due to a fatal error.Completion checkEntityTranslationUITest.php146Drupal\comment\Tests\CommentTranslationUITest->testTranslationUI()
LeafDrupal\config\Tests\ConfigCRUDTest2000
LeafDrupal\config\Tests\ConfigEntityListTest6800
LeafDrupal\config\Tests\ConfigEntityTest13700
LeafDrupal\config\Tests\ConfigFileContentTest3100
LeafDrupal\config\Tests\ConfigImportTest3800
LeafDrupal\config\Tests\ConfigImportUITest4600
LeafDrupal\config\Tests\ConfigInstallTest1100
LeafDrupal\config\Tests\ConfigOverrideTest1800
LeafDrupal\config\Tests\ConfigUpgradeTest1200
ExpandDrupal\config\Tests\LocaleConfigOverride010
MessageGroupFilenameLineFunctionStatus
The test did not complete due to a fatal error.Completion checkLocaleConfigOverride.php32Drupal\config\Tests\LocaleConfigOverride->testLocaleConfigOverride()
LeafDrupal\config\Tests\Storage\DatabaseStorageTest1900
LeafDrupal\config\Tests\Storage\FileStorageTest2100
LeafDrupal\contact\Tests\ContactAuthenticatedUserTest1300
LeafDrupal\contact\Tests\ContactPersonalTest16200
LeafDrupal\contact\Tests\ContactSitewideTest24400
LeafDrupal\contextual\Tests\ContextualDynamicContextTest1600
LeafDrupal\dblog\Tests\DBLogTest48700
LeafDrupal\email\Tests\EmailFieldTest1800
LeafDrupal\field\Tests\BulkDeleteTest7500
LeafDrupal\field\Tests\CrudTest6900
LeafDrupal\field\Tests\DisplayApiTest4600
LeafDrupal\field\Tests\EntityPropertiesTest400
LeafDrupal\field\Tests\FieldAccessTest2100
LeafDrupal\field\Tests\FieldAttachOtherTest10300
LeafDrupal\field\Tests\FieldAttachStorageTest9200
LeafDrupal\field\Tests\FieldInfoTest7100
LeafDrupal\field\Tests\FieldInstanceCrudTest3800
LeafDrupal\field\Tests\FormTest26500
ExpandDrupal\field\Tests\TranslationTest010
MessageGroupFilenameLineFunctionStatus
The test did not complete due to a fatal error.Completion checkTranslationTest.php71Drupal\field\Tests\TranslationTest->testFieldAvailableLanguages()
LeafDrupal\field_sql_storage\Tests\FieldSqlStorageTest9200
LeafDrupal\field_ui\Tests\AlterTest2100
LeafDrupal\field_ui\Tests\ManageDisplayTest12300
LeafDrupal\field_ui\Tests\ManageFieldsTest20100
LeafDrupal\file\Tests\CopyTest11000
LeafDrupal\file\Tests\DeleteTest2400
LeafDrupal\file\Tests\DownloadTest4500
LeafDrupal\file\Tests\FileFieldDisplayTest5000
LeafDrupal\file\Tests\FileFieldPathTest2700
LeafDrupal\file\Tests\FileFieldRevisionTest6700
LeafDrupal\file\Tests\FileFieldRSSContentTest2300
LeafDrupal\file\Tests\FileFieldValidateTest11800
LeafDrupal\file\Tests\FileFieldWidgetTest29900
LeafDrupal\file\Tests\FileManagedFileElementTest26800
LeafDrupal\file\Tests\FilePrivateTest3700
LeafDrupal\file\Tests\FileTokenReplaceTest3500
LeafDrupal\file\Tests\LoadTest3400
LeafDrupal\file\Tests\MoveTest11000
LeafDrupal\file\Tests\RemoteFileSaveUploadTest27000
LeafDrupal\file\Tests\SaveDataTest9300
LeafDrupal\file\Tests\SaveTest1600
LeafDrupal\file\Tests\SaveUploadTest27000
LeafDrupal\file\Tests\SpaceUsedTest1200
LeafDrupal\file\Tests\UsageTest3400
LeafDrupal\file\Tests\ValidateTest1200
LeafDrupal\file\Tests\ValidatorTest2900
LeafDrupal\filter\Tests\FilterAdminTest17800
LeafDrupal\filter\Tests\FilterAPITest500
LeafDrupal\filter\Tests\FilterCrudTest23900
LeafDrupal\filter\Tests\FilterDefaultFormatTest3300
LeafDrupal\filter\Tests\FilterFormatAccessTest27200
LeafDrupal\filter\Tests\FilterHooksTest3300
LeafDrupal\filter\Tests\FilterHtmlImageSecureTest4600
LeafDrupal\filter\Tests\FilterNoFormatTest100
LeafDrupal\filter\Tests\FilterSecurityTest4000
LeafDrupal\filter\Tests\FilterSettingsTest1200
LeafDrupal\filter\Tests\FilterUnitTest21500
LeafDrupal\forum\Tests\ForumBlockTest14800
LeafDrupal\forum\Tests\ForumIndexTest2700
LeafDrupal\forum\Tests\ForumNodeAccessTest6300
LeafDrupal\forum\Tests\ForumTest69000
LeafDrupal\help\Tests\HelpTest28700
LeafDrupal\help\Tests\NoHelpTest1200
LeafDrupal\image\Tests\ImageAdminStylesTest22700
LeafDrupal\image\Tests\ImageDimensionsScaleUnitTest1500
LeafDrupal\image\Tests\ImageDimensionsTest5600
LeafDrupal\image\Tests\ImageEffectsTest4400
LeafDrupal\image\Tests\ImageFieldDefaultImagesTest3600
LeafDrupal\image\Tests\ImageFieldDisplayTest16100
LeafDrupal\image\Tests\ImageFieldValidateTest2100
LeafDrupal\image\Tests\ImageStylesPathAndUrlTest8500
LeafDrupal\image\Tests\ImageThemeFunctionTest600
ExpandDrupal\jsonld\Tests\DrupalJsonldNormalizerTest010
MessageGroupFilenameLineFunctionStatus
The test did not complete due to a fatal error.Completion checkDrupalJsonldNormalizerTest.php44Drupal\jsonld\Tests\DrupalJsonldNormalizerTest->testSupportsNormalization()
ExpandDrupal\jsonld\Tests\JsonldNormalizerTest010
MessageGroupFilenameLineFunctionStatus
The test did not complete due to a fatal error.Completion checkJsonldNormalizerTest.php43Drupal\jsonld\Tests\JsonldNormalizerTest->testSupportsNormalization()
ExpandDrupal\language\Tests\LanguageBrowserDetectionUnitTest010
MessageGroupFilenameLineFunctionStatus
The test did not complete due to a fatal error.Completion checkLanguageBrowserDetectionUnitTest.php33Drupal\language\Tests\LanguageBrowserDetectionUnitTest->testLanguageFromBrowser()
ExpandDrupal\language\Tests\LanguageConfigurationElementTest010
MessageGroupFilenameLineFunctionStatus
The test did not complete due to a fatal error.Completion checkLanguageConfigurationElementTest.php36Drupal\language\Tests\LanguageConfigurationElementTest->testLanguageConfigurationElement()
ExpandDrupal\language\Tests\LanguageConfigurationTest010
MessageGroupFilenameLineFunctionStatus
The test did not complete due to a fatal error.Completion checkLanguageConfigurationTest.php35Drupal\language\Tests\LanguageConfigurationTest->testLanguageConfiguration()
ExpandDrupal\language\Tests\LanguageCustomLanguageConfigurationTest010
MessageGroupFilenameLineFunctionStatus
The test did not complete due to a fatal error.Completion checkLanguageCustomLanguageConfigurationTest.php36Drupal\language\Tests\LanguageCustomLanguageConfigurationTest->testLanguageConfiguration()
ExpandDrupal\language\Tests\LanguageDependencyInjectionTest010
MessageGroupFilenameLineFunctionStatus
The test did not complete due to a fatal error.Completion checkLanguageDependencyInjectionTest.php47Drupal\language\Tests\LanguageDependencyInjectionTest->testDependencyInjectedNewLanguage()
ExpandDrupal\language\Tests\LanguageListTest010
MessageGroupFilenameLineFunctionStatus
The test did not complete due to a fatal error.Completion checkLanguageListTest.php36Drupal\language\Tests\LanguageListTest->testLanguageList()
ExpandDrupal\language\Tests\LanguageNegotiationInfoTest010
MessageGroupFilenameLineFunctionStatus
The test did not complete due to a fatal error.Completion checkLanguageNegotiationInfoTest.php43Drupal\language\Tests\LanguageNegotiationInfoTest->testInfoAlterations()
ExpandDrupal\language\Tests\LanguagePathMonolingualTest010
MessageGroupFilenameLineFunctionStatus
The test did not complete due to a fatal error.Completion checkLanguagePathMonolingualTest.php66Drupal\language\Tests\LanguagePathMonolingualTest->testPageLinks()
ExpandDrupal\language\Tests\LanguageSwitchingTest010
MessageGroupFilenameLineFunctionStatus
The test did not complete due to a fatal error.Completion checkLanguageSwitchingTest.php43Drupal\language\Tests\LanguageSwitchingTest->testLanguageBlock()
ExpandDrupal\language\Tests\LanguageUILanguageNegotiationTest010
MessageGroupFilenameLineFunctionStatus
The test did not complete due to a fatal error.Completion checkLanguageUILanguageNegotiationTest.php70Drupal\language\Tests\LanguageUILanguageNegotiationTest->testUILanguageNegotiation()
ExpandDrupal\language\Tests\LanguageUrlRewritingTest010
MessageGroupFilenameLineFunctionStatus
The test did not complete due to a fatal error.Completion checkLanguageUrlRewritingTest.php57Drupal\language\Tests\LanguageUrlRewritingTest->testUrlRewritingEdgeCases()
LeafDrupal\layout\Tests\DisplayInternalLogicTest1500
LeafDrupal\layout\Tests\LayoutDerivativesTest2400
LeafDrupal\link\Tests\LinkFieldTest13300
LeafDrupal\link\Tests\LinkFieldUITest2100
ExpandDrupal\locale\Tests\LocaleCompareTest010
MessageGroupFilenameLineFunctionStatus
The test did not complete due to a fatal error.Completion checkLocaleCompareTest.php109Drupal\locale\Tests\LocaleCompareTest->testLocaleCompare()
ExpandDrupal\locale\Tests\LocaleContentTest010
MessageGroupFilenameLineFunctionStatus
The test did not complete due to a fatal error.Completion checkLocaleContentTest.php35Drupal\locale\Tests\LocaleContentTest->testMachineNameLTR()
ExpandDrupal\locale\Tests\LocaleExportTest010
MessageGroupFilenameLineFunctionStatus
The test did not complete due to a fatal error.Completion checkLocaleExportTest.php51Drupal\locale\Tests\LocaleExportTest->testExportTranslation()
ExpandDrupal\locale\Tests\LocaleFileImportStatus010
MessageGroupFilenameLineFunctionStatus
The test did not complete due to a fatal error.Completion checkLocaleFileImportStatus.php107Drupal\locale\Tests\LocaleFileImportStatus->testBulkImport()
ExpandDrupal\locale\Tests\LocaleImportFunctionalTest010
MessageGroupFilenameLineFunctionStatus
The test did not complete due to a fatal error.Completion checkLocaleImportFunctionalTest.php51Drupal\locale\Tests\LocaleImportFunctionalTest->testStandalonePoFile()
ExpandDrupal\locale\Tests\LocaleInstallTest010
MessageGroupFilenameLineFunctionStatus
The test did not complete due to a fatal error.Completion checkLocaleInstallTest.php42Drupal\locale\Tests\LocaleInstallTest->testFunctionSignatures()
ExpandDrupal\locale\Tests\LocaleJavascriptTranslation010
MessageGroupFilenameLineFunctionStatus
The test did not complete due to a fatal error.Completion checkLocaleJavascriptTranslation.php32Drupal\locale\Tests\LocaleJavascriptTranslation->testFileParsing()
ExpandDrupal\locale\Tests\LocaleLibraryInfoAlterTest010
MessageGroupFilenameLineFunctionStatus
The test did not complete due to a fatal error.Completion checkLocaleLibraryInfoAlterTest.php38Drupal\locale\Tests\LocaleLibraryInfoAlterTest->testLibraryInfoAlter()
ExpandDrupal\locale\Tests\LocalePathTest010
MessageGroupFilenameLineFunctionStatus
The test did not complete due to a fatal error.Completion checkLocalePathTest.php42Drupal\locale\Tests\LocalePathTest->testPathLanguageConfiguration()
ExpandDrupal\locale\Tests\LocalePluralFormatTest010
MessageGroupFilenameLineFunctionStatus
The test did not complete due to a fatal error.Completion checkLocalePluralFormatTest.php42Drupal\locale\Tests\LocalePluralFormatTest->testGetPluralFormat()
ExpandDrupal\locale\Tests\LocaleStringTest010
MessageGroupFilenameLineFunctionStatus
The test did not complete due to a fatal error.Completion checkLocaleStringTest.php59Drupal\locale\Tests\LocaleStringTest->testStringCRUDAPI()
ExpandDrupal\locale\Tests\LocaleTranslationTest010
MessageGroupFilenameLineFunctionStatus
The test did not complete due to a fatal error.Completion checkLocaleTranslationTest.php35Drupal\locale\Tests\LocaleTranslationTest->testEnglishTranslation()
ExpandDrupal\locale\Tests\LocaleUninstallFrenchTest010
MessageGroupFilenameLineFunctionStatus
The test did not complete due to a fatal error.Completion checkLocaleUninstallTest.php50Drupal\locale\Tests\LocaleUninstallFrenchTest->testUninstallProcess()
ExpandDrupal\locale\Tests\LocaleUninstallTest010
MessageGroupFilenameLineFunctionStatus
The test did not complete due to a fatal error.Completion checkLocaleUninstallTest.php50Drupal\locale\Tests\LocaleUninstallTest->testUninstallProcess()
LeafDrupal\menu\Tests\MenuNodeTest6100
LeafDrupal\menu\Tests\MenuTest310000
LeafDrupal\node\Tests\MultiStepNodeFormBasicOptionsTest1600
LeafDrupal\node\Tests\NodeAccessBaseTableTest15900
LeafDrupal\node\Tests\NodeAccessFieldTest5000
ExpandDrupal\node\Tests\NodeAccessLanguageTest010
MessageGroupFilenameLineFunctionStatus
The test did not complete due to a fatal error.Completion checkNodeAccessLanguageTest.php54Drupal\node\Tests\NodeAccessLanguageTest->testNodeAccess()
LeafDrupal\node\Tests\NodeAccessPagerTest3000
LeafDrupal\node\Tests\NodeAccessRebuildTest1900
LeafDrupal\node\Tests\NodeAccessRecordsTest2600
LeafDrupal\node\Tests\NodeAccessTest3400
LeafDrupal\node\Tests\NodeAdminTest14500
LeafDrupal\node\Tests\NodeBlockFunctionalTest8400
LeafDrupal\node\Tests\NodeBlockTest2100
LeafDrupal\node\Tests\NodeBuildContentTest400
LeafDrupal\node\Tests\NodeCreationTest4900
LeafDrupal\node\Tests\NodeEntityFieldQueryAlterTest3200
LeafDrupal\node\Tests\NodeEntityViewModeAlterTest2000
LeafDrupal\node\Tests\NodeFeedTest100
ExpandDrupal\node\Tests\NodeFieldMultilingualTestCase010
MessageGroupFilenameLineFunctionStatus
The test did not complete due to a fatal error.Completion checkNodeFieldMultilingualTestCase.php70Drupal\node\Tests\NodeFieldMultilingualTestCase->testMultilingualNodeForm()
LeafDrupal\node\Tests\NodeLoadHooksTest700
LeafDrupal\node\Tests\NodeLoadMultipleTest2700
LeafDrupal\node\Tests\NodePostSettingsTest4000
LeafDrupal\node\Tests\NodeQueryAlterTest9900
LeafDrupal\node\Tests\NodeRevisionPermissionsTest3300
LeafDrupal\node\Tests\NodeRevisionsTest6400
LeafDrupal\node\Tests\NodeRSSContentTest2100
LeafDrupal\node\Tests\NodeSaveTest6000
LeafDrupal\node\Tests\NodeTitleTest2300
LeafDrupal\node\Tests\NodeTitleXSSTest2300
LeafDrupal\node\Tests\NodeTokenReplaceTest4000
ExpandDrupal\node\Tests\NodeTranslationUITest010
MessageGroupFilenameLineFunctionStatus
The test did not complete due to a fatal error.Completion checkNodeTranslationUITest.php73Drupal\node\Tests\NodeTranslationUITest->testDisabledBundle()
ExpandDrupal\node\Tests\NodeTypeInitialLanguageTest010
MessageGroupFilenameLineFunctionStatus
The test did not complete due to a fatal error.Completion checkNodeTypeInitialLanguageTest.php43Drupal\node\Tests\NodeTypeInitialLanguageTest->testNodeTypeInitialLanguageDefaults()
LeafDrupal\node\Tests\NodeTypePersistenceTest6500
LeafDrupal\node\Tests\NodeTypeTest13600
LeafDrupal\node\Tests\PageEditTest9700
LeafDrupal\node\Tests\PagePreviewTest4100
LeafDrupal\node\Tests\PageViewTest3400
LeafDrupal\node\Tests\SummaryLengthTest1800
LeafDrupal\number\Tests\NumberFieldTest8700
LeafDrupal\openid\Tests\OpenIDFunctionalTest31800
ExpandDrupal\openid\Tests\OpenIDRegistrationTest010
MessageGroupFilenameLineFunctionStatus
The test did not complete due to a fatal error.Completion checkOpenIDRegistrationTest.php42Drupal\openid\Tests\OpenIDRegistrationTest->testRegisterUserWithEmailVerification()
LeafDrupal\openid\Tests\OpenIDTest4500
LeafDrupal\options\Tests\OptionsDynamicValuesValidationTest900
LeafDrupal\options\Tests\OptionsFieldTest1600
LeafDrupal\options\Tests\OptionsFieldUITest20700
LeafDrupal\options\Tests\OptionsSelectDynamicValuesTest1600
LeafDrupal\options\Tests\OptionsWidgetsTest26100
LeafDrupal\path\Tests\PathAliasTest13800
ExpandDrupal\path\Tests\PathLanguageTest010
MessageGroupFilenameLineFunctionStatus
The test did not complete due to a fatal error.Completion checkPathLanguageTest.php51Drupal\path\Tests\PathLanguageTest->testAliasTranslation()
ExpandDrupal\path\Tests\PathLanguageUiTest010
MessageGroupFilenameLineFunctionStatus
The test did not complete due to a fatal error.Completion checkPathLanguageUiTest.php51Drupal\path\Tests\PathLanguageUiTest->testLanguageNeutralUrl()
LeafDrupal\path\Tests\PathTaxonomyTermTest3700
LeafDrupal\php\Tests\PhpAccessTest3800
LeafDrupal\php\Tests\PhpFilterTest4200
LeafDrupal\picture\Tests\PictureAdminUITest5400
LeafDrupal\picture\Tests\PictureFieldDisplayTest16200
LeafDrupal\poll\Tests\PollBlockTest17200
LeafDrupal\poll\Tests\PollCreateTest35700
LeafDrupal\poll\Tests\PollDeleteChoiceTest5400
LeafDrupal\poll\Tests\PollExpirationTest5200
LeafDrupal\poll\Tests\PollJsAddChoiceTest2000
LeafDrupal\poll\Tests\PollTokenReplaceTest18400
ExpandDrupal\poll\Tests\PollTranslateTest010
MessageGroupFilenameLineFunctionStatus
The test did not complete due to a fatal error.Completion checkPollTranslateTest.php36Drupal\poll\Tests\PollTranslateTest->testPollTranslate()
LeafDrupal\poll\Tests\PollVoteCheckHostnameTest14900
LeafDrupal\poll\Tests\PollVoteTest14600
LeafDrupal\rdf\Tests\CommentAttributesTest20300
LeafDrupal\rdf\Tests\CrudTest1000
LeafDrupal\rdf\Tests\GetNamespacesTest700
LeafDrupal\rdf\Tests\GetRdfNamespacesTest500
LeafDrupal\rdf\Tests\MappingDefinitionTest5900
LeafDrupal\rdf\Tests\MappingHookTest600
LeafDrupal\rdf\Tests\RdfaMarkupTest2900
LeafDrupal\rdf\Tests\TrackerAttributesTest3300
LeafDrupal\rest\Tests\DBLogTest1700
LeafDrupal\rest\Tests\DeleteTest7900
LeafDrupal\search\Tests\SearchAdvancedSearchFormTest3400
LeafDrupal\search\Tests\SearchBlockTest6400
LeafDrupal\search\Tests\SearchCommentCountToggleTest3100
LeafDrupal\search\Tests\SearchCommentTest19300
LeafDrupal\search\Tests\SearchConfigSettingsFormTest13200
LeafDrupal\search\Tests\SearchEmbedFormTest3200
LeafDrupal\search\Tests\SearchExactTest2500
LeafDrupal\search\Tests\SearchExcerptTest1800
LeafDrupal\search\Tests\SearchExpressionInsertExtractTest2400
LeafDrupal\search\Tests\SearchKeywordsConditionsTest2800
ExpandDrupal\search\Tests\SearchLanguageTest010
MessageGroupFilenameLineFunctionStatus
The test did not complete due to a fatal error.Completion checkSearchLanguageTest.php38Drupal\search\Tests\SearchLanguageTest->testLanguages()
LeafDrupal\search\Tests\SearchMatchTest14700
ExpandDrupal\search\Tests\SearchMultilingualEntityTest010
MessageGroupFilenameLineFunctionStatus
The test did not complete due to a fatal error.Completion checkSearchMultilingualEntityTest.php92Drupal\search\Tests\SearchMultilingualEntityTest->testIndexingThrottle()
LeafDrupal\search\Tests\SearchNodeAccessTest1600
LeafDrupal\search\Tests\SearchNumberMatchingTest29500
LeafDrupal\search\Tests\SearchNumbersTest17500
LeafDrupal\search\Tests\SearchPageOverrideTest1500
LeafDrupal\search\Tests\SearchPageTextTest3700
ExpandDrupal\search\Tests\SearchPreprocessLangcodeTest3634
MessageGroupFilenameLineFunctionStatus
Trying to get property of non-objectDrupal\Core\Entity\Entity->getTranslationLanguages() node_update_index() Drupal\search\Tests\SearchPreprocessLangcodeTest->testPreprocessLangcode() Drupal\simpletest\TestBase->run() simpletest_script_run_one_test('452', 'Drupal\search\Tests\SearchPreprocessLangcodeTest') NoticeEntity.php293Drupal\Core\Entity\Entity->getTranslationLanguages()
Trying to get property of non-objectDrupal\Core\Entity\Entity->getTranslationLanguages() _node_index_node(Object) node_update_index() Drupal\search\Tests\SearchPreprocessLangcodeTest->testPreprocessLangcode() Drupal\simpletest\TestBase->run() simpletest_script_run_one_test('452', 'Drupal\search\Tests\SearchPreprocessLangcodeTest') NoticeEntity.php293Drupal\Core\Entity\Entity->getTranslationLanguages()
"Langcode Preprocess Test: en" foundOtherSearchPreprocessLangcodeTest.php61Drupal\search\Tests\SearchPreprocessLangcodeTest->testPreprocessLangcode()
Trying to get property of non-objectDrupal\Core\Entity\Entity->getTranslationLanguages() node_update_index() Drupal\search\Tests\SearchPreprocessLangcodeTest->testPreprocessStemming() Drupal\simpletest\TestBase->run() simpletest_script_run_one_test('452', 'Drupal\search\Tests\SearchPreprocessLangcodeTest') NoticeEntity.php293Drupal\Core\Entity\Entity->getTranslationLanguages()
Trying to get property of non-objectDrupal\Core\Entity\Entity->getTranslationLanguages() _node_index_node(Object) node_update_index() Drupal\search\Tests\SearchPreprocessLangcodeTest->testPreprocessStemming() Drupal\simpletest\TestBase->run() simpletest_script_run_one_test('452', 'Drupal\search\Tests\SearchPreprocessLangcodeTest') NoticeEntity.php293Drupal\Core\Entity\Entity->getTranslationLanguages()
"Search results" foundOtherSearchPreprocessLangcodeTest.php96Drupal\search\Tests\SearchPreprocessLangcodeTest->testPreprocessStemming()
"we are testing" foundOtherSearchPreprocessLangcodeTest.php97Drupal\search\Tests\SearchPreprocessLangcodeTest->testPreprocessStemming()
LeafDrupal\search\Tests\SearchRankingTest5900
LeafDrupal\search\Tests\SearchSimplifyTest65700
LeafDrupal\search\Tests\SearchTokenizerTest800
LeafDrupal\shortcut\Tests\ShortcutLinksTest14800
LeafDrupal\shortcut\Tests\ShortcutSetsTest21600
LeafDrupal\simpletest\Tests\BrokenSetUpTest2100
LeafDrupal\simpletest\Tests\BrowserTest1600
LeafDrupal\simpletest\Tests\FolderTest200
LeafDrupal\simpletest\Tests\InstallationProfileModuleTestsTest1900
LeafDrupal\simpletest\Tests\MailCaptureTest1200
LeafDrupal\simpletest\Tests\MissingCheckedRequirementsTest1900
LeafDrupal\simpletest\Tests\OtherInstallationProfileModuleTestsTest1200
LeafDrupal\simpletest\Tests\SimpleTestTest11400
LeafDrupal\statistics\Tests\StatisticsAdminTest11000
LeafDrupal\statistics\Tests\StatisticsBlockVisitorsTest4600
LeafDrupal\statistics\Tests\StatisticsLoggingTest3500
LeafDrupal\statistics\Tests\StatisticsReportsTest9200
LeafDrupal\statistics\Tests\StatisticsTokenReplaceTest3000
LeafDrupal\syslog\Tests\SyslogTest1700
LeafDrupal\system\Tests\Ajax\AjaxCommandsUnitTest1600
LeafDrupal\system\Tests\Ajax\CommandsTest7300
LeafDrupal\system\Tests\Ajax\ElementValidationTest700
LeafDrupal\system\Tests\Ajax\FormValuesTest2900
LeafDrupal\system\Tests\Ajax\FrameworkTest3400
LeafDrupal\system\Tests\Ajax\MultiFormTest3600
LeafDrupal\system\Tests\Batch\PageTest1600
LeafDrupal\system\Tests\Batch\PercentagesUnitTest1800
LeafDrupal\system\Tests\Batch\ProcessingTest16100
LeafDrupal\system\Tests\Bootstrap\GetFilenameUnitTest500
LeafDrupal\system\Tests\Bootstrap\HookBootExitTest1900
LeafDrupal\system\Tests\Bootstrap\IpAddressTest1100
LeafDrupal\system\Tests\Bootstrap\MiscUnitTest500
LeafDrupal\system\Tests\Bootstrap\OverrideServerVariablesUnitTest600
LeafDrupal\system\Tests\Bootstrap\PageCacheTest7900
LeafDrupal\system\Tests\Bootstrap\ResettableStaticUnitTest500
LeafDrupal\system\Tests\Bootstrap\TimerUnitTest500
LeafDrupal\system\Tests\Bootstrap\VariableTest900
LeafDrupal\system\Tests\Bundle\BundleTest900
LeafDrupal\system\Tests\Cache\BackendChainImplementationUnitTest4800
LeafDrupal\system\Tests\Cache\BackendChainUnitTest8600
LeafDrupal\system\Tests\Cache\ClearTest900
LeafDrupal\system\Tests\Cache\DatabaseBackendUnitTest8600
LeafDrupal\system\Tests\Cache\InstallTest1500
LeafDrupal\system\Tests\Cache\MemoryBackendUnitTest8600
LeafDrupal\system\Tests\Cache\NullBackendTest200
LeafDrupal\system\Tests\Common\AddFeedTest700
LeafDrupal\system\Tests\Common\AlterTest700
LeafDrupal\system\Tests\Common\ArrayUnitTest1300
LeafDrupal\system\Tests\Common\AttributesUnitTest700
LeafDrupal\system\Tests\Common\AutocompleteTagsUnitTest800
ExpandDrupal\system\Tests\Common\CascadingStylesheetsTest010
MessageGroupFilenameLineFunctionStatus
The test did not complete due to a fatal error.Completion checkCascadingStylesheetsTest.php41Drupal\system\Tests\Common\CascadingStylesheetsTest->testDefault()
LeafDrupal\system\Tests\Common\CascadingStylesheetsUnitTest1200
LeafDrupal\system\Tests\Common\ColorTest8500
ExpandDrupal\system\Tests\Common\FormatDateTest010
MessageGroupFilenameLineFunctionStatus
The test did not complete due to a fatal error.Completion checkFormatDateTest.php53Drupal\system\Tests\Common\FormatDateTest->testAdminDefinedFormatDate()
LeafDrupal\system\Tests\Common\GotoTest2700
LeafDrupal\system\Tests\Common\HtmlIdentifierUnitTest1000
ExpandDrupal\system\Tests\Common\HttpRequestTest010
MessageGroupFilenameLineFunctionStatus
The test did not complete due to a fatal error.Completion checkHttpRequestTest.php36Drupal\system\Tests\Common\HttpRequestTest->testDrupalHTTPRequest()
LeafDrupal\system\Tests\Common\InstallerLanguageTest800
ExpandDrupal\system\Tests\Common\JavaScriptTest010
MessageGroupFilenameLineFunctionStatus
The test did not complete due to a fatal error.Completion checkJavaScriptTest.php62Drupal\system\Tests\Common\JavaScriptTest->testDefault()
LeafDrupal\system\Tests\Common\JsonUnitTest2100
LeafDrupal\system\Tests\Common\ParseInfoFileUnitTest300
LeafDrupal\system\Tests\Common\RegionContentTest1800
LeafDrupal\system\Tests\Common\RenderTest5400
LeafDrupal\system\Tests\Common\SchemaTest58800
LeafDrupal\system\Tests\Common\SimpleTestErrorCollectorTest1600
LeafDrupal\system\Tests\Common\SizeUnitTest3500
LeafDrupal\system\Tests\Common\SystemListingTest600
LeafDrupal\system\Tests\Common\TableSortExtenderUnitTest600
LeafDrupal\system\Tests\Common\UrlTest7000
LeafDrupal\system\Tests\Common\ValidNumberStepUnitTest2400
LeafDrupal\system\Tests\Common\ValidUrlUnitTest7900
LeafDrupal\system\Tests\Common\WriteRecordTest3400
LeafDrupal\system\Tests\Common\XssUnitTest1700
LeafDrupal\system\Tests\Database\AlterTest6200
LeafDrupal\system\Tests\Database\BasicSyntaxTest3000
LeafDrupal\system\Tests\Database\CaseSensitivityTest800
LeafDrupal\system\Tests\Database\ConnectionTest3800
LeafDrupal\system\Tests\Database\ConnectionUnitTest1200
LeafDrupal\system\Tests\Database\DeleteTruncateTest2300
LeafDrupal\system\Tests\Database\EmptyStatementTest400
LeafDrupal\system\Tests\Database\FetchTest6600
LeafDrupal\system\Tests\Database\InsertDefaultsTest2200
LeafDrupal\system\Tests\Database\InsertLobTest1500
LeafDrupal\system\Tests\Database\InsertTest5100
LeafDrupal\system\Tests\Database\InvalidDataTest800
LeafDrupal\system\Tests\Database\LoggingTest4400
LeafDrupal\system\Tests\Database\MergeTest8300
LeafDrupal\system\Tests\Database\NextIdTest200
LeafDrupal\system\Tests\Database\QueryTest700
LeafDrupal\system\Tests\Database\RangeQueryTest800
LeafDrupal\system\Tests\Database\RegressionTest3100
LeafDrupal\system\Tests\Database\SelectComplexTest18100
LeafDrupal\system\Tests\Database\SelectOrderedTest2900
LeafDrupal\system\Tests\Database\SelectPagerDefaultTest4700
LeafDrupal\system\Tests\Database\SelectSubqueryTest5700
LeafDrupal\system\Tests\Database\SelectTableSortDefaultTest4500
LeafDrupal\system\Tests\Database\SelectTest18800
LeafDrupal\system\Tests\Database\SerializeQueryTest700
LeafDrupal\system\Tests\Database\TaggingTest3200
LeafDrupal\system\Tests\Database\TemporaryQueryTest1100
LeafDrupal\system\Tests\Database\TransactionTest12800
LeafDrupal\system\Tests\Database\UpdateComplexTest8300
LeafDrupal\system\Tests\Database\UpdateLobTest2200
LeafDrupal\system\Tests\Database\UpdateTest7400
LeafDrupal\system\Tests\Datetime\DateTimePlusTest5500
LeafDrupal\system\Tests\Datetime\DrupalDateTimeTest2800
LeafDrupal\system\Tests\DrupalKernel\ContentNegotiationTest8000
LeafDrupal\system\Tests\DrupalKernel\DrupalKernelTest1000
LeafDrupal\system\Tests\Entity\EntityApiInfoTest600
LeafDrupal\system\Tests\Entity\EntityApiTest800
LeafDrupal\system\Tests\Entity\EntityCrudHookTest11400
ExpandDrupal\system\Tests\Entity\EntityFieldTest14120
MessageGroupFilenameLineFunctionStatus
Language object can be read.OtherEntityFieldTest.php146Drupal\system\Tests\Entity\EntityFieldTest->testReadWrite()
Language object can be read.OtherEntityFieldTest.php152Drupal\system\Tests\Entity\EntityFieldTest->testReadWrite()
ExpandDrupal\system\Tests\Entity\EntityFormTest010
MessageGroupFilenameLineFunctionStatus
The test did not complete due to a fatal error.Completion checkEntityFormTest.php41Drupal\system\Tests\Entity\EntityFormTest->testFormCRUD()
LeafDrupal\system\Tests\Entity\EntityQueryTest6200
ExpandDrupal\system\Tests\Entity\EntityTranslationFormTest010
MessageGroupFilenameLineFunctionStatus
The test did not complete due to a fatal error.Completion checkEntityTranslationFormTest.php57Drupal\system\Tests\Entity\EntityTranslationFormTest->testEntityFormLanguage()
ExpandDrupal\system\Tests\Entity\EntityTranslationTest010
MessageGroupFilenameLineFunctionStatus
The test did not complete due to a fatal error.Completion checkEntityTranslationTest.php76Drupal\system\Tests\Entity\EntityTranslationTest->testEntityLanguageMethods()
LeafDrupal\system\Tests\Entity\EntityUUIDTest1900
LeafDrupal\system\Tests\FileTransfer\FileTransferTest200
LeafDrupal\system\Tests\File\DirectoryTest2000
LeafDrupal\system\Tests\File\MimeTypeTest4200
LeafDrupal\system\Tests\File\NameMungingTest500
LeafDrupal\system\Tests\File\RemoteFileDirectoryTest2400
LeafDrupal\system\Tests\File\RemoteFileScanDirectoryTest2900
LeafDrupal\system\Tests\File\RemoteFileUnmanagedCopyTest3200
LeafDrupal\system\Tests\File\RemoteFileUnmanagedDeleteRecursiveTest2100
LeafDrupal\system\Tests\File\RemoteFileUnmanagedDeleteTest1000
LeafDrupal\system\Tests\File\RemoteFileUnmanagedMoveTest2300
LeafDrupal\system\Tests\File\RemoteFileUnmanagedSaveDataTest800
LeafDrupal\system\Tests\File\ScanDirectoryTest2900
LeafDrupal\system\Tests\File\StreamWrapperTest1900
LeafDrupal\system\Tests\File\UnmanagedCopyTest2900
LeafDrupal\system\Tests\File\UnmanagedDeleteRecursiveTest1700
LeafDrupal\system\Tests\File\UnmanagedDeleteTest700
LeafDrupal\system\Tests\File\UnmanagedMoveTest2000
LeafDrupal\system\Tests\File\UnmanagedSaveDataTest700
LeafDrupal\system\Tests\File\UrlRewritingTest1400
LeafDrupal\system\Tests\Form\AlterTest400
LeafDrupal\system\Tests\Form\ArbitraryRebuildTest1600
LeafDrupal\system\Tests\Form\CheckboxTest9700
LeafDrupal\system\Tests\Form\ElementsLabelsTest2000
LeafDrupal\system\Tests\Form\ElementsTableSelectTest6900
LeafDrupal\system\Tests\Form\ElementsVerticalTabsTest3900
LeafDrupal\system\Tests\Form\ElementTest3700
LeafDrupal\system\Tests\Form\EmailTest1700
LeafDrupal\system\Tests\Form\FileInclusionTest1100
LeafDrupal\system\Tests\Form\FormTest64300
LeafDrupal\system\Tests\Form\HTMLIdTest700
ExpandDrupal\system\Tests\Form\LanguageSelectElementTest010
MessageGroupFilenameLineFunctionStatus
The test did not complete due to a fatal error.Completion checkLanguageSelectElementTest.php36Drupal\system\Tests\Form\LanguageSelectElementTest->testLanguageSelectElementOptions()
LeafDrupal\system\Tests\Form\ProgrammaticTest2400
LeafDrupal\system\Tests\Form\RebuildTest5300
LeafDrupal\system\Tests\Form\RedirectTest3100
LeafDrupal\system\Tests\Form\StateValuesCleanAdvancedTest700
LeafDrupal\system\Tests\Form\StateValuesCleanTest1400
LeafDrupal\system\Tests\Form\StorageTest12000
LeafDrupal\system\Tests\Form\TriggeringElementTest5000
LeafDrupal\system\Tests\Form\UrlTest1700
LeafDrupal\system\Tests\Form\ValidationTest11200
LeafDrupal\system\Tests\Form\WrapperTest500
LeafDrupal\system\Tests\Graph\GraphUnitTest2800
LeafDrupal\system\Tests\Image\FileMoveTest400
LeafDrupal\system\Tests\Image\ToolkitGdTest40800
LeafDrupal\system\Tests\Image\ToolkitTest5300
LeafDrupal\system\Tests\KeyValueStore\DatabaseStorageExpirableTest6800
LeafDrupal\system\Tests\KeyValueStore\DatabaseStorageTest3600
LeafDrupal\system\Tests\KeyValueStore\GarbageCollectionTest200
LeafDrupal\system\Tests\KeyValueStore\MemoryStorageTest3600
LeafDrupal\system\Tests\Lock\LockFunctionalTest2900
LeafDrupal\system\Tests\Mail\HtmlToTextTest8300
LeafDrupal\system\Tests\Mail\MailTest400
LeafDrupal\system\Tests\Menu\BreadcrumbTest40900
LeafDrupal\system\Tests\Menu\LinksTest5000
LeafDrupal\system\Tests\Menu\RebuildTest500
ExpandDrupal\system\Tests\Menu\RouterTest22040
MessageGroupFilenameLineFunctionStatus
Menu title is: Alternative example title - Case 1.MenuRouterTest.php518Drupal\system\Tests\Menu\RouterTest->menuItemTitlesCasesHelper()
Menu title is: Alternative example title - Case 2.MenuRouterTest.php518Drupal\system\Tests\Menu\RouterTest->menuItemTitlesCasesHelper()
Menu title is: Alternative example title - Case 3.MenuRouterTest.php518Drupal\system\Tests\Menu\RouterTest->menuItemTitlesCasesHelper()
Menu title is: Alternative example title - Case 4.MenuRouterTest.php518Drupal\system\Tests\Menu\RouterTest->menuItemTitlesCasesHelper()
LeafDrupal\system\Tests\Menu\TrailTest6800
LeafDrupal\system\Tests\Menu\TreeDataUnitTest400
LeafDrupal\system\Tests\Menu\TreeOutputTest700
LeafDrupal\system\Tests\Module\ClassLoaderTest1000
ExpandDrupal\system\Tests\Module\DependencyTest15620
MessageGroupFilenameLineFunctionStatus
Modules status has been updated.OtherDependencyTest.php38Drupal\system\Tests\Module\DependencyTest->testEnableWithoutDependency()
Module "translation_entity" is enabled.OtherDependencyTest.php40Drupal\system\Tests\Module\DependencyTest->testEnableWithoutDependency()
ExpandDrupal\system\Tests\Module\EnableDisableTest1847432
MessageGroupFilenameLineFunctionStatus
Modules status has been updated.OtherEnableDisableTest.php98Drupal\system\Tests\Module\EnableDisableTest->testEnableDisable()
"hook_modules_installed fired for language" foundOtherEnableDisableTest.php105Drupal\system\Tests\Module\EnableDisableTest->testEnableDisable()
"hook_modules_enabled fired for language" foundOtherEnableDisableTest.php106Drupal\system\Tests\Module\EnableDisableTest->testEnableDisable()
watchdog table contains 0 rows for %module module installed.OtherEnableDisableTest.php110Drupal\system\Tests\Module\EnableDisableTest->testEnableDisable()
watchdog table contains 0 rows for %module module enabled.OtherEnableDisableTest.php111Drupal\system\Tests\Module\EnableDisableTest->testEnableDisable()
Modules status has been updated.OtherEnableDisableTest.php120Drupal\system\Tests\Module\EnableDisableTest->testEnableDisable()
Module "language" is not enabled.OtherEnableDisableTest.php120Drupal\system\Tests\Module\EnableDisableTest->testEnableDisable()
"hook_modules_disabled fired for language" foundOtherEnableDisableTest.php120Drupal\system\Tests\Module\EnableDisableTest->testEnableDisable()
watchdog table contains 0 rows for %module module disabled.OtherEnableDisableTest.php120Drupal\system\Tests\Module\EnableDisableTest->testEnableDisable()
Failed to set field uninstall[language] to languageOtherEnableDisableTest.php120Drupal\system\Tests\Module\EnableDisableTest->testEnableDisable()
Found the Uninstall buttonOtherEnableDisableTest.php120Drupal\system\Tests\Module\EnableDisableTest->testEnableDisable()
Found the requested form fields at admin/modules/uninstallOtherEnableDisableTest.php120Drupal\system\Tests\Module\EnableDisableTest->testEnableDisable()
Invalid argument supplied for foreach()Drupal\simpletest\WebTestBase->drupalPost(NULL, NULL, 'Uninstall') Drupal\system\Tests\Module\EnableDisableTest->assertSuccessfulDisableAndUninstall('language') Drupal\system\Tests\Module\EnableDisableTest->testEnableDisable() Drupal\simpletest\TestBase->run() simpletest_script_run_one_test('337', 'Drupal\system\Tests\Module\EnableDisableTest') WarningWebTestBase.php1230Drupal\simpletest\WebTestBase->drupalPost()
Found the Uninstall buttonOtherEnableDisableTest.php120Drupal\system\Tests\Module\EnableDisableTest->testEnableDisable()
Found the requested form fields at OtherEnableDisableTest.php120Drupal\system\Tests\Module\EnableDisableTest->testEnableDisable()
Modules status has been updated.OtherEnableDisableTest.php120Drupal\system\Tests\Module\EnableDisableTest->testEnableDisable()
Module "language" is not enabled.OtherEnableDisableTest.php120Drupal\system\Tests\Module\EnableDisableTest->testEnableDisable()
"hook_modules_uninstalled fired for language" foundOtherEnableDisableTest.php120Drupal\system\Tests\Module\EnableDisableTest->testEnableDisable()
watchdog table contains 0 rows for %module module uninstalled.OtherEnableDisableTest.php120Drupal\system\Tests\Module\EnableDisableTest->testEnableDisable()
None of the database tables defined by the language module exist.OtherEnableDisableTest.php120Drupal\system\Tests\Module\EnableDisableTest->testEnableDisable()
No configuration found for language module.OtherEnableDisableTest.php120Drupal\system\Tests\Module\EnableDisableTest->testEnableDisable()
Module "language" is not enabled.OtherEnableDisableTest.php85Drupal\system\Tests\Module\EnableDisableTest->testEnableDisable()
None of the database tables defined by the language module exist.OtherEnableDisableTest.php86Drupal\system\Tests\Module\EnableDisableTest->testEnableDisable()
Found the Continue buttonOtherEnableDisableTest.php96Drupal\system\Tests\Module\EnableDisableTest->testEnableDisable()
Found the requested form fields at OtherEnableDisableTest.php96Drupal\system\Tests\Module\EnableDisableTest->testEnableDisable()
"hook_modules_installed fired for language" foundOtherEnableDisableTest.php105Drupal\system\Tests\Module\EnableDisableTest->testEnableDisable()
"hook_modules_enabled fired for language" foundOtherEnableDisableTest.php106Drupal\system\Tests\Module\EnableDisableTest->testEnableDisable()
watchdog table contains 0 rows for %module module installed.OtherEnableDisableTest.php110Drupal\system\Tests\Module\EnableDisableTest->testEnableDisable()
watchdog table contains 0 rows for %module module enabled.OtherEnableDisableTest.php111Drupal\system\Tests\Module\EnableDisableTest->testEnableDisable()
Modules status has been updated.OtherEnableDisableTest.php136Drupal\system\Tests\Module\EnableDisableTest->testEnableDisable()
Module "language" is not enabled.OtherEnableDisableTest.php136Drupal\system\Tests\Module\EnableDisableTest->testEnableDisable()
"hook_modules_disabled fired for language" foundOtherEnableDisableTest.php136Drupal\system\Tests\Module\EnableDisableTest->testEnableDisable()
watchdog table contains 0 rows for %module module disabled.OtherEnableDisableTest.php136Drupal\system\Tests\Module\EnableDisableTest->testEnableDisable()
Failed to set field uninstall[language] to languageOtherEnableDisableTest.php136Drupal\system\Tests\Module\EnableDisableTest->testEnableDisable()
Found the Uninstall buttonOtherEnableDisableTest.php136Drupal\system\Tests\Module\EnableDisableTest->testEnableDisable()
Found the requested form fields at admin/modules/uninstallOtherEnableDisableTest.php136Drupal\system\Tests\Module\EnableDisableTest->testEnableDisable()
Invalid argument supplied for foreach()Drupal\simpletest\WebTestBase->drupalPost(NULL, NULL, 'Uninstall') Drupal\system\Tests\Module\EnableDisableTest->assertSuccessfulDisableAndUninstall('language') Drupal\system\Tests\Module\EnableDisableTest->testEnableDisable() Drupal\simpletest\TestBase->run() simpletest_script_run_one_test('337', 'Drupal\system\Tests\Module\EnableDisableTest') WarningWebTestBase.php1230Drupal\simpletest\WebTestBase->drupalPost()
Found the Uninstall buttonOtherEnableDisableTest.php136Drupal\system\Tests\Module\EnableDisableTest->testEnableDisable()
Found the requested form fields at OtherEnableDisableTest.php136Drupal\system\Tests\Module\EnableDisableTest->testEnableDisable()
Modules status has been updated.OtherEnableDisableTest.php136Drupal\system\Tests\Module\EnableDisableTest->testEnableDisable()
Module "language" is not enabled.OtherEnableDisableTest.php136Drupal\system\Tests\Module\EnableDisableTest->testEnableDisable()
"hook_modules_uninstalled fired for language" foundOtherEnableDisableTest.php136Drupal\system\Tests\Module\EnableDisableTest->testEnableDisable()
watchdog table contains 0 rows for %module module uninstalled.OtherEnableDisableTest.php136Drupal\system\Tests\Module\EnableDisableTest->testEnableDisable()
None of the database tables defined by the language module exist.OtherEnableDisableTest.php136Drupal\system\Tests\Module\EnableDisableTest->testEnableDisable()
No configuration found for language module.OtherEnableDisableTest.php136Drupal\system\Tests\Module\EnableDisableTest->testEnableDisable()
LeafDrupal\system\Tests\Module\HookRequirementsTest1600
LeafDrupal\system\Tests\Module\InstallTest300
LeafDrupal\system\Tests\Module\ModuleApiTest6800
LeafDrupal\system\Tests\Module\ModuleEnable300
LeafDrupal\system\Tests\Module\RequiredTest1800
LeafDrupal\system\Tests\Module\UninstallTest200
LeafDrupal\system\Tests\Module\VersionTest5100
LeafDrupal\system\Tests\Pager\PagerTest12300
ExpandDrupal\system\Tests\Path\LookupTest760
MessageGroupFilenameLineFunctionStatus
English alias overrides language-neutral alias.OtherLookupTest.php49Drupal\system\Tests\Path\LookupTest->testDrupalLookupPath()
English source overrides language-neutral source.OtherLookupTest.php50Drupal\system\Tests\Path\LookupTest->testDrupalLookupPath()
English alias still returned after entering a language-neutral alias.OtherLookupTest.php58Drupal\system\Tests\Path\LookupTest->testDrupalLookupPath()
English alias still returned after entering a LOLspeak alias.OtherLookupTest.php67Drupal\system\Tests\Path\LookupTest->testDrupalLookupPath()
Recently created English alias returned.OtherLookupTest.php79Drupal\system\Tests\Path\LookupTest->testDrupalLookupPath()
Recently created English source returned.OtherLookupTest.php80Drupal\system\Tests\Path\LookupTest->testDrupalLookupPath()
LeafDrupal\system\Tests\Path\MatchPathTest4100
LeafDrupal\system\Tests\Path\SaveTest400
LeafDrupal\system\Tests\Path\UrlAlterFunctionalTest3400
LeafDrupal\system\Tests\PhpStorage\FileStorageTest1200
LeafDrupal\system\Tests\PhpStorage\MTimeProtectedFastFileStorageTest1900
LeafDrupal\system\Tests\PhpStorage\MTimeProtectedFileStorageTest1900
LeafDrupal\system\Tests\Plugin\AlterDecoratorTest300
LeafDrupal\system\Tests\Plugin\DerivativeTest900
LeafDrupal\system\Tests\Plugin\Discovery\AnnotatedClassDiscoveryTest700
LeafDrupal\system\Tests\Plugin\Discovery\StaticDiscoveryTest600
LeafDrupal\system\Tests\Plugin\FactoryTest900
LeafDrupal\system\Tests\Plugin\InspectionTest1000
LeafDrupal\system\Tests\Queue\QueueTest1400
LeafDrupal\system\Tests\Routing\ChainMatcherTest300
LeafDrupal\system\Tests\Routing\ControllerResolverTest100
LeafDrupal\system\Tests\Routing\FirstEntryFinalMatcherTest800
LeafDrupal\system\Tests\Routing\HttpMethodMatcherTest800
LeafDrupal\system\Tests\Routing\MatcherDumperTest800
LeafDrupal\system\Tests\Routing\NestedMatcherTest100
LeafDrupal\system\Tests\Routing\PathMatcherTest2700
LeafDrupal\system\Tests\Routing\RouterTest3000
LeafDrupal\system\Tests\Routing\RouteTest600
LeafDrupal\system\Tests\Serialization\SerializationTest200
LeafDrupal\system\Tests\Session\SessionHttpsTest8300
LeafDrupal\system\Tests\Session\SessionTest19000
LeafDrupal\system\Tests\System\AccessDeniedTest6800
LeafDrupal\system\Tests\System\AdminMetaTagTest300
ExpandDrupal\system\Tests\System\AdminTest010
MessageGroupFilenameLineFunctionStatus
The test did not complete due to a fatal error.Completion checkAdminTest.php50Drupal\system\Tests\System\AdminTest->testAdminPages()
LeafDrupal\system\Tests\System\CronRunTest4000
ExpandDrupal\system\Tests\System\DateFormatsLanguageTest010
MessageGroupFilenameLineFunctionStatus
The test did not complete due to a fatal error.Completion checkDateFormatsLanguageTest.php46Drupal\system\Tests\System\DateFormatsLanguageTest->testLocalizeDateFormats()
ExpandDrupal\system\Tests\System\DateTimeTest010
MessageGroupFilenameLineFunctionStatus
The test did not complete due to a fatal error.Completion checkDateTimeTest.php45Drupal\system\Tests\System\DateTimeTest->testTimeZoneHandling()
LeafDrupal\system\Tests\System\DefaultMobileMetaTagsTest1200
LeafDrupal\system\Tests\System\ErrorHandlerTest4000
LeafDrupal\system\Tests\System\ExceptionControllerTest200
LeafDrupal\system\Tests\System\FloodTest600
LeafDrupal\system\Tests\System\FrontPageTest3700
LeafDrupal\system\Tests\System\IndexPhpTest600
LeafDrupal\system\Tests\System\InfoAlterTest1000
LeafDrupal\system\Tests\System\InfoFileParserUnitTest900
LeafDrupal\system\Tests\System\MainContentFallbackTest6000
LeafDrupal\system\Tests\System\PageNotFoundTest1800
LeafDrupal\system\Tests\System\PageTitleFilteringTest4400
LeafDrupal\system\Tests\System\PasswordHashingTest1000
LeafDrupal\system\Tests\System\RetrieveFileTest700
LeafDrupal\system\Tests\System\ShutdownFunctionsTest500
LeafDrupal\system\Tests\System\SiteMaintenanceTest7700
LeafDrupal\system\Tests\System\SystemAuthorizeTest1600
LeafDrupal\system\Tests\System\ThemeTest20500
LeafDrupal\system\Tests\System\TokenReplaceTest3600
LeafDrupal\system\Tests\System\UnicodeUnitTest18200
LeafDrupal\system\Tests\Theme\EntityFilteringThemeTest5600
LeafDrupal\system\Tests\Theme\FastTest1200
LeafDrupal\system\Tests\Theme\FunctionsTest2500
LeafDrupal\system\Tests\Theme\HookInitTest500
LeafDrupal\system\Tests\Theme\HtmlTagUnitTest200
LeafDrupal\system\Tests\Theme\HtmlTplPhpAttributesTest500
LeafDrupal\system\Tests\Theme\RegistryTest600
LeafDrupal\system\Tests\Theme\TableTest600
LeafDrupal\system\Tests\Theme\ThemeTest4800
LeafDrupal\system\Tests\Theme\ThemeTestTwig1000
LeafDrupal\system\Tests\Theme\TwigReferenceUnitTest1500
LeafDrupal\system\Tests\Transliteration\TransliterationTest2700
LeafDrupal\system\Tests\TypedData\TypedDataTest6100
LeafDrupal\system\Tests\Update\DependencyHookInvocationTest400
LeafDrupal\system\Tests\Update\DependencyMissingTest400
LeafDrupal\system\Tests\Update\DependencyOrderingTest500
LeafDrupal\system\Tests\Update\UpdateScriptTest20100
LeafDrupal\system\Tests\Upgrade\BareMinimalUpgradePathTest6200
ExpandDrupal\system\Tests\Upgrade\BareStandardUpgradePathTest211
MessageGroupFilenameLineFunctionStatus
HTTP response expected 200, actual 500BrowserUpgradePathTestBase.php193Drupal\system\Tests\Upgrade\UpgradePathTestBase->performUpgrade()
Exception: Initial GET to update.php did not return HTTP 200 status. in Drupal\system\Tests\Upgrade\UpgradePathTestBase->performUpgrade() (line 194 of /var/lib/drupaltestbot/sites/default/files/checkout/core/modules/system/lib/Drupal/system/Tests/Upgrade/UpgradePathTestBase.php). Drupal\system\Tests\Upgrade\UpgradePathTestBase->performUpgrade() Drupal\system\Tests\Upgrade\BareStandardUpgradePathTest->testBasicStandardUpgrade() Drupal\simpletest\TestBase->run() simpletest_script_run_one_test('546', 'Drupal\system\Tests\Upgrade\BareStandardUpgradePathTest') Uncaught exceptionUpgradePathTestBase.php194Drupal\system\Tests\Upgrade\UpgradePathTestBase->performUpgrade()
LeafDrupal\system\Tests\Upgrade\BlockUpgradePathTest3400
LeafDrupal\system\Tests\Upgrade\FilledMinimalUpgradePathTest6200
ExpandDrupal\system\Tests\Upgrade\FilledStandardUpgradePathTest211
MessageGroupFilenameLineFunctionStatus
HTTP response expected 200, actual 500BrowserUpgradePathTestBase.php193Drupal\system\Tests\Upgrade\UpgradePathTestBase->performUpgrade()
Exception: Initial GET to update.php did not return HTTP 200 status. in Drupal\system\Tests\Upgrade\UpgradePathTestBase->performUpgrade() (line 194 of /var/lib/drupaltestbot/sites/default/files/checkout/core/modules/system/lib/Drupal/system/Tests/Upgrade/UpgradePathTestBase.php). Drupal\system\Tests\Upgrade\UpgradePathTestBase->performUpgrade() Drupal\system\Tests\Upgrade\FilledStandardUpgradePathTest->testFilledStandardUpgrade() Drupal\simpletest\TestBase->run() simpletest_script_run_one_test('549', 'Drupal\system\Tests\Upgrade\FilledStandardUpgradePathTest') Uncaught exceptionUpgradePathTestBase.php194Drupal\system\Tests\Upgrade\UpgradePathTestBase->performUpgrade()
ExpandDrupal\system\Tests\Upgrade\ImageUpgradePathTest211
MessageGroupFilenameLineFunctionStatus
HTTP response expected 200, actual 500BrowserUpgradePathTestBase.php193Drupal\system\Tests\Upgrade\UpgradePathTestBase->performUpgrade()
Exception: Initial GET to update.php did not return HTTP 200 status. in Drupal\system\Tests\Upgrade\UpgradePathTestBase->performUpgrade() (line 194 of /var/lib/drupaltestbot/sites/default/files/checkout/core/modules/system/lib/Drupal/system/Tests/Upgrade/UpgradePathTestBase.php). Drupal\system\Tests\Upgrade\UpgradePathTestBase->performUpgrade() Drupal\system\Tests\Upgrade\ImageUpgradePathTest->testImageStyleUpgrade() Drupal\simpletest\TestBase->run() simpletest_script_run_one_test('550', 'Drupal\system\Tests\Upgrade\ImageUpgradePathTest') Uncaught exceptionUpgradePathTestBase.php194Drupal\system\Tests\Upgrade\UpgradePathTestBase->performUpgrade()
ExpandDrupal\system\Tests\Upgrade\LanguageUpgradePathTest844
MessageGroupFilenameLineFunctionStatus
HTTP response expected 200, actual 500BrowserUpgradePathTestBase.php193Drupal\system\Tests\Upgrade\UpgradePathTestBase->performUpgrade()
Exception: Initial GET to update.php did not return HTTP 200 status. in Drupal\system\Tests\Upgrade\UpgradePathTestBase->performUpgrade() (line 194 of /var/lib/drupaltestbot/sites/default/files/checkout/core/modules/system/lib/Drupal/system/Tests/Upgrade/UpgradePathTestBase.php). Drupal\system\Tests\Upgrade\UpgradePathTestBase->performUpgrade() Drupal\system\Tests\Upgrade\LanguageUpgradePathTest->testLanguageUpgrade() Drupal\simpletest\TestBase->run() simpletest_script_run_one_test('551', 'Drupal\system\Tests\Upgrade\LanguageUpgradePathTest') Uncaught exceptionUpgradePathTestBase.php194Drupal\system\Tests\Upgrade\UpgradePathTestBase->performUpgrade()
HTTP response expected 200, actual 500BrowserUpgradePathTestBase.php193Drupal\system\Tests\Upgrade\UpgradePathTestBase->performUpgrade()
Exception: Initial GET to update.php did not return HTTP 200 status. in Drupal\system\Tests\Upgrade\UpgradePathTestBase->performUpgrade() (line 194 of /var/lib/drupaltestbot/sites/default/files/checkout/core/modules/system/lib/Drupal/system/Tests/Upgrade/UpgradePathTestBase.php). Drupal\system\Tests\Upgrade\UpgradePathTestBase->performUpgrade() Drupal\system\Tests\Upgrade\LanguageUpgradePathTest->testLanguageUrlUpgrade() Drupal\simpletest\TestBase->run() simpletest_script_run_one_test('551', 'Drupal\system\Tests\Upgrade\LanguageUpgradePathTest') Uncaught exceptionUpgradePathTestBase.php194Drupal\system\Tests\Upgrade\UpgradePathTestBase->performUpgrade()
HTTP response expected 200, actual 500BrowserUpgradePathTestBase.php193Drupal\system\Tests\Upgrade\UpgradePathTestBase->performUpgrade()
Exception: Initial GET to update.php did not return HTTP 200 status. in Drupal\system\Tests\Upgrade\UpgradePathTestBase->performUpgrade() (line 194 of /var/lib/drupaltestbot/sites/default/files/checkout/core/modules/system/lib/Drupal/system/Tests/Upgrade/UpgradePathTestBase.php). Drupal\system\Tests\Upgrade\UpgradePathTestBase->performUpgrade() Drupal\system\Tests\Upgrade\LanguageUpgradePathTest->testLanguageNoPluralsUpgrade() Drupal\simpletest\TestBase->run() simpletest_script_run_one_test('551', 'Drupal\system\Tests\Upgrade\LanguageUpgradePathTest') Uncaught exceptionUpgradePathTestBase.php194Drupal\system\Tests\Upgrade\UpgradePathTestBase->performUpgrade()
HTTP response expected 200, actual 500BrowserUpgradePathTestBase.php193Drupal\system\Tests\Upgrade\UpgradePathTestBase->performUpgrade()
Exception: Initial GET to update.php did not return HTTP 200 status. in Drupal\system\Tests\Upgrade\UpgradePathTestBase->performUpgrade() (line 194 of /var/lib/drupaltestbot/sites/default/files/checkout/core/modules/system/lib/Drupal/system/Tests/Upgrade/UpgradePathTestBase.php). Drupal\system\Tests\Upgrade\UpgradePathTestBase->performUpgrade() Drupal\system\Tests\Upgrade\LanguageUpgradePathTest->testLanguagePermissionsUpgrade() Drupal\simpletest\TestBase->run() simpletest_script_run_one_test('551', 'Drupal\system\Tests\Upgrade\LanguageUpgradePathTest') Uncaught exceptionUpgradePathTestBase.php194Drupal\system\Tests\Upgrade\UpgradePathTestBase->performUpgrade()
ExpandDrupal\system\Tests\Upgrade\ModulesDisabledUpgradePathTest211
MessageGroupFilenameLineFunctionStatus
HTTP response expected 200, actual 500BrowserUpgradePathTestBase.php193Drupal\system\Tests\Upgrade\UpgradePathTestBase->performUpgrade()
Exception: Initial GET to update.php did not return HTTP 200 status. in Drupal\system\Tests\Upgrade\UpgradePathTestBase->performUpgrade() (line 194 of /var/lib/drupaltestbot/sites/default/files/checkout/core/modules/system/lib/Drupal/system/Tests/Upgrade/UpgradePathTestBase.php). Drupal\system\Tests\Upgrade\UpgradePathTestBase->performUpgrade() Drupal\system\Tests\Upgrade\ModulesDisabledUpgradePathTest->testDisabledUpgrade() Drupal\simpletest\TestBase->run() simpletest_script_run_one_test('552', 'Drupal\system\Tests\Upgrade\ModulesDisabledUpgradePathTest') Uncaught exceptionUpgradePathTestBase.php194Drupal\system\Tests\Upgrade\UpgradePathTestBase->performUpgrade()
ExpandDrupal\system\Tests\Upgrade\StateSystemUpgradePathTest211
MessageGroupFilenameLineFunctionStatus
HTTP response expected 200, actual 500BrowserUpgradePathTestBase.php193Drupal\system\Tests\Upgrade\UpgradePathTestBase->performUpgrade()
Exception: Initial GET to update.php did not return HTTP 200 status. in Drupal\system\Tests\Upgrade\UpgradePathTestBase->performUpgrade() (line 194 of /var/lib/drupaltestbot/sites/default/files/checkout/core/modules/system/lib/Drupal/system/Tests/Upgrade/UpgradePathTestBase.php). Drupal\system\Tests\Upgrade\UpgradePathTestBase->performUpgrade() Drupal\system\Tests\Upgrade\StateSystemUpgradePathTest->testSystemVariableUpgrade() Drupal\simpletest\TestBase->run() simpletest_script_run_one_test('553', 'Drupal\system\Tests\Upgrade\StateSystemUpgradePathTest') Uncaught exceptionUpgradePathTestBase.php194Drupal\system\Tests\Upgrade\UpgradePathTestBase->performUpgrade()
ExpandDrupal\system\Tests\Upgrade\SystemUpgradePathTest211
MessageGroupFilenameLineFunctionStatus
HTTP response expected 200, actual 500BrowserUpgradePathTestBase.php193Drupal\system\Tests\Upgrade\UpgradePathTestBase->performUpgrade()
Exception: Initial GET to update.php did not return HTTP 200 status. in Drupal\system\Tests\Upgrade\UpgradePathTestBase->performUpgrade() (line 194 of /var/lib/drupaltestbot/sites/default/files/checkout/core/modules/system/lib/Drupal/system/Tests/Upgrade/UpgradePathTestBase.php). Drupal\system\Tests\Upgrade\UpgradePathTestBase->performUpgrade() Drupal\system\Tests\Upgrade\SystemUpgradePathTest->testVariableUpgrade() Drupal\simpletest\TestBase->run() simpletest_script_run_one_test('554', 'Drupal\system\Tests\Upgrade\SystemUpgradePathTest') Uncaught exceptionUpgradePathTestBase.php194Drupal\system\Tests\Upgrade\UpgradePathTestBase->performUpgrade()
ExpandDrupal\system\Tests\Upgrade\UserRoleUpgradePathTest211
MessageGroupFilenameLineFunctionStatus
HTTP response expected 200, actual 500BrowserUpgradePathTestBase.php193Drupal\system\Tests\Upgrade\UpgradePathTestBase->performUpgrade()
Exception: Initial GET to update.php did not return HTTP 200 status. in Drupal\system\Tests\Upgrade\UpgradePathTestBase->performUpgrade() (line 194 of /var/lib/drupaltestbot/sites/default/files/checkout/core/modules/system/lib/Drupal/system/Tests/Upgrade/UpgradePathTestBase.php). Drupal\system\Tests\Upgrade\UpgradePathTestBase->performUpgrade() Drupal\system\Tests\Upgrade\UserRoleUpgradePathTest->testRoleUpgrade() Drupal\simpletest\TestBase->run() simpletest_script_run_one_test('555', 'Drupal\system\Tests\Upgrade\UserRoleUpgradePathTest') Uncaught exceptionUpgradePathTestBase.php194Drupal\system\Tests\Upgrade\UpgradePathTestBase->performUpgrade()
ExpandDrupal\system\Tests\Upgrade\UuidUpgradePathTest211
MessageGroupFilenameLineFunctionStatus
HTTP response expected 200, actual 500BrowserUpgradePathTestBase.php193Drupal\system\Tests\Upgrade\UpgradePathTestBase->performUpgrade()
Exception: Initial GET to update.php did not return HTTP 200 status. in Drupal\system\Tests\Upgrade\UpgradePathTestBase->performUpgrade() (line 194 of /var/lib/drupaltestbot/sites/default/files/checkout/core/modules/system/lib/Drupal/system/Tests/Upgrade/UpgradePathTestBase.php). Drupal\system\Tests\Upgrade\UpgradePathTestBase->performUpgrade() Drupal\system\Tests\Upgrade\UuidUpgradePathTest->testUuidUpgrade() Drupal\simpletest\TestBase->run() simpletest_script_run_one_test('556', 'Drupal\system\Tests\Upgrade\UuidUpgradePathTest') Uncaught exceptionUpgradePathTestBase.php194Drupal\system\Tests\Upgrade\UpgradePathTestBase->performUpgrade()
LeafDrupal\system\Tests\Uuid\UuidUnitTest700
LeafDrupal\taxonomy\Tests\EfqTest1400
LeafDrupal\taxonomy\Tests\HooksTest2300
LeafDrupal\taxonomy\Tests\LegacyTest1400
LeafDrupal\taxonomy\Tests\LoadMultipleTest1800
LeafDrupal\taxonomy\Tests\RssTest2600
LeafDrupal\taxonomy\Tests\TermFieldMultipleVocabularyTest2600
LeafDrupal\taxonomy\Tests\TermFieldTest4500
LeafDrupal\taxonomy\Tests\TermIndexTest4600
ExpandDrupal\taxonomy\Tests\TermLanguageTest010
MessageGroupFilenameLineFunctionStatus
The test did not complete due to a fatal error.Completion checkTermLanguageTest.php47Drupal\taxonomy\Tests\TermLanguageTest->testTermLanguage()
LeafDrupal\taxonomy\Tests\TermTest26300
ExpandDrupal\taxonomy\Tests\TermTranslationUITest010
MessageGroupFilenameLineFunctionStatus
The test did not complete due to a fatal error.Completion checkTermTranslationUITest.php92Drupal\taxonomy\Tests\TermTranslationUITest->testTranslationUI()
LeafDrupal\taxonomy\Tests\TermUnitTest1100
LeafDrupal\taxonomy\Tests\ThemeTest1900
LeafDrupal\taxonomy\Tests\TokenReplaceTest5500
ExpandDrupal\taxonomy\Tests\VocabularyLanguageTest010
MessageGroupFilenameLineFunctionStatus
The test did not complete due to a fatal error.Completion checkVocabularyLanguageTest.php51Drupal\taxonomy\Tests\VocabularyLanguageTest->testVocabularyLanguage()
LeafDrupal\taxonomy\Tests\VocabularyTest11000
LeafDrupal\taxonomy\Tests\VocabularyUnitTest8300
LeafDrupal\text\Tests\TextFieldTest18400
LeafDrupal\text\Tests\TextSummaryTest13800
ExpandDrupal\text\Tests\TextTranslationTest010
MessageGroupFilenameLineFunctionStatus
The test did not complete due to a fatal error.Completion checkTextTranslationTest.php62Drupal\text\Tests\TextTranslationTest->testTextField()
LeafDrupal\tracker\Tests\TrackerNodeAccessTest2800
LeafDrupal\tracker\Tests\TrackerTest22800
ExpandDrupal\translation\Tests\TranslationTest010
MessageGroupFilenameLineFunctionStatus
The test did not complete due to a fatal error.Completion checkTranslationTest.php72Drupal\translation\Tests\TranslationTest->testContentTranslation()
ExpandDrupal\translation_entity\Tests\ConfigTestTranslationUITest010
MessageGroupFilenameLineFunctionStatus
The test did not complete due to a fatal error.Completion checkConfigTestTranslationUITest.php64Drupal\translation_entity\Tests\ConfigTestTranslationUITest->testTranslationUI()
ExpandDrupal\translation_entity\Tests\EntityTestTranslationUITest010
MessageGroupFilenameLineFunctionStatus
The test did not complete due to a fatal error.Completion checkEntityTranslationUITest.php146Drupal\translation_entity\Tests\EntityTestTranslationUITest->testTranslationUI()
LeafDrupal\update\Tests\UpdateContribTest18700
LeafDrupal\update\Tests\UpdateCoreTest21400
LeafDrupal\update\Tests\UpdateCoreUnitTest400
LeafDrupal\update\Tests\UpdateUploadTest6400
LeafDrupal\user\Tests\TempStoreDatabaseTest1900
LeafDrupal\user\Tests\UserAccountLinksTests6100
LeafDrupal\user\Tests\UserAdminSettingsFormTest400
LeafDrupal\user\Tests\UserAdminTest6100
LeafDrupal\user\Tests\UserAuthmapAssignmentTest600
LeafDrupal\user\Tests\UserAutocompleteTest2500
LeafDrupal\user\Tests\UserBlocksTests4000
LeafDrupal\user\Tests\UserCancelTest32000
LeafDrupal\user\Tests\UserCreateTest3300
LeafDrupal\user\Tests\UserDeleteTest1500
LeafDrupal\user\Tests\UserEditedOwnAccountTest2200
LeafDrupal\user\Tests\UserEditTest7800
LeafDrupal\user\Tests\UserEntityCallbacksTest700
ExpandDrupal\user\Tests\UserLanguageCreationTest010
MessageGroupFilenameLineFunctionStatus
The test did not complete due to a fatal error.Completion checkUserLanguageCreationTest.php40Drupal\user\Tests\UserLanguageCreationTest->testLocalUserCreation()
ExpandDrupal\user\Tests\UserLanguageTest010
MessageGroupFilenameLineFunctionStatus
The test did not complete due to a fatal error.Completion checkUserLanguageTest.php35Drupal\user\Tests\UserLanguageTest->testUserLanguageConfiguration()
LeafDrupal\user\Tests\UserLoginTest15900
LeafDrupal\user\Tests\UserPasswordResetTest3000
LeafDrupal\user\Tests\UserPermissionsTest5000
LeafDrupal\user\Tests\UserPictureTest12600
LeafDrupal\user\Tests\UserRegistrationTest13000
LeafDrupal\user\Tests\UserRoleAdminTest5400
LeafDrupal\user\Tests\UserRolesAssignmentTest5100
LeafDrupal\user\Tests\UserSaveTest200
ExpandDrupal\user\Tests\UserSearchTest010
MessageGroupFilenameLineFunctionStatus
The test did not complete due to a fatal error.Completion checkUserSearchTest.php32Drupal\user\Tests\UserSearchTest->testUserSearch()
LeafDrupal\user\Tests\UserSignatureTest4600
LeafDrupal\user\Tests\UserTimeZoneTest2900
ExpandDrupal\user\Tests\UserTokenReplaceTest010
MessageGroupFilenameLineFunctionStatus
The test did not complete due to a fatal error.Completion checkUserTokenReplaceTest.php44Drupal\user\Tests\UserTokenReplaceTest->testUserTokenReplacement()
ExpandDrupal\user\Tests\UserTranslationUITest010
MessageGroupFilenameLineFunctionStatus
The test did not complete due to a fatal error.Completion checkEntityTranslationUITest.php146Drupal\user\Tests\UserTranslationUITest->testTranslationUI()
LeafDrupal\user\Tests\UserValidateCurrentPassCustomFormTest1700
LeafDrupal\user\Tests\UserValidationTest1600
ExpandDrupal\views\Tests\AnalyzeTest1800
MessageGroupFilenameLineFunctionStatus
'Missing handler: views_test_data age field'Debugviews.module1208views_get_handler()
'Missing handler: views_test_data id field'Debugviews.module1208views_get_handler()
'Missing handler: views_test_data name field'Debugviews.module1208views_get_handler()
LeafDrupal\views\Tests\BasicTest1100
ExpandDrupal\views\Tests\Comment\ArgumentUserUIDTest900
MessageGroupFilenameLineFunctionStatus
'Missing handler: views_test_data age field'Debugviews.module1208views_get_handler()
'Missing handler: views_test_data id field'Debugviews.module1208views_get_handler()
'Missing handler: views_test_data name field'Debugviews.module1208views_get_handler()
ExpandDrupal\views\Tests\Comment\DefaultViewRecentComments1100
MessageGroupFilenameLineFunctionStatus
'Missing handler: views_test_data age field'Debugviews.module1208views_get_handler()
'Missing handler: views_test_data id field'Debugviews.module1208views_get_handler()
'Missing handler: views_test_data name field'Debugviews.module1208views_get_handler()
'Missing handler: views_test_data age field'Debugviews.module1208views_get_handler()
'Missing handler: views_test_data id field'Debugviews.module1208views_get_handler()
'Missing handler: views_test_data name field'Debugviews.module1208views_get_handler()
'Missing handler: views_test_data age field'Debugviews.module1208views_get_handler()
'Missing handler: views_test_data id field'Debugviews.module1208views_get_handler()
'Missing handler: views_test_data name field'Debugviews.module1208views_get_handler()
ExpandDrupal\views\Tests\Comment\FilterUserUIDTest900
MessageGroupFilenameLineFunctionStatus
'Missing handler: views_test_data age field'Debugviews.module1208views_get_handler()
'Missing handler: views_test_data id field'Debugviews.module1208views_get_handler()
'Missing handler: views_test_data name field'Debugviews.module1208views_get_handler()
ExpandDrupal\views\Tests\Comment\WizardTest3500
MessageGroupFilenameLineFunctionStatus
'Missing handler: views_test_data age field'Debugviews.module1208views_get_handler()
'Missing handler: views_test_data id field'Debugviews.module1208views_get_handler()
'Missing handler: views_test_data name field'Debugviews.module1208views_get_handler()
'Missing handler: views_test_data age field'Debugviews.module1208views_get_handler()
'Missing handler: views_test_data id field'Debugviews.module1208views_get_handler()
'Missing handler: views_test_data name field'Debugviews.module1208views_get_handler()
ExpandDrupal\views\Tests\DefaultViewsTest7200
MessageGroupFilenameLineFunctionStatus
'Missing handler: search_node_links_to nid argument'Debugviews.module1208views_get_handler()
'Missing handler: search_node_links_to nid argument'Debugviews.module1208views_get_handler()
'Missing handler: search_node_links_to nid argument'Debugviews.module1208views_get_handler()
'Missing handler: field_data_comment_body comment_body field'Debugviews.module1208views_get_handler()
LeafDrupal\views\Tests\Entity\FieldEntityTest400
LeafDrupal\views\Tests\Field\ApiDataTest1500
LeafDrupal\views\Tests\Field\HandlerFieldFieldTest2400
ExpandDrupal\views\Tests\GlossaryTest800
MessageGroupFilenameLineFunctionStatus
'Missing handler: views_test_data age field'Debugviews.module1208views_get_handler()
'Missing handler: views_test_data id field'Debugviews.module1208views_get_handler()
'Missing handler: views_test_data name field'Debugviews.module1208views_get_handler()
LeafDrupal\views\Tests\Handler\AreaTest10800
LeafDrupal\views\Tests\Handler\AreaTextTest1000
LeafDrupal\views\Tests\Handler\ArgumentNullTest1000
LeafDrupal\views\Tests\Handler\ArgumentStringTest800
LeafDrupal\views\Tests\Handler\FieldBooleanTest2200
LeafDrupal\views\Tests\Handler\FieldCounterTest1600
LeafDrupal\views\Tests\Handler\FieldCustomTest400
LeafDrupal\views\Tests\Handler\FieldDateTest3000
LeafDrupal\views\Tests\Handler\FieldFileSizeTest1800
LeafDrupal\views\Tests\Handler\FieldTest22700
LeafDrupal\views\Tests\Handler\FieldUrlTest600
LeafDrupal\views\Tests\Handler\FieldXssTest800
LeafDrupal\views\Tests\Handler\FilterCombineTest400
ExpandDrupal\views\Tests\Handler\FilterDateTest3200
MessageGroupFilenameLineFunctionStatus
'Missing handler: views_test_data age field'Debugviews.module1208views_get_handler()
'Missing handler: views_test_data id field'Debugviews.module1208views_get_handler()
'Missing handler: views_test_data name field'Debugviews.module1208views_get_handler()
'Missing handler: views_test_data age field'Debugviews.module1208views_get_handler()
'Missing handler: views_test_data id field'Debugviews.module1208views_get_handler()
'Missing handler: views_test_data name field'Debugviews.module1208views_get_handler()
LeafDrupal\views\Tests\Handler\FilterEqualityTest1100
LeafDrupal\views\Tests\Handler\FilterInOperatorTest1700
LeafDrupal\views\Tests\Handler\FilterNumericTest2600
LeafDrupal\views\Tests\Handler\FilterStringTest5200
LeafDrupal\views\Tests\Handler\HandlerAliasTest1000
ExpandDrupal\views\Tests\Handler\HandlerAllTest020
MessageGroupFilenameLineFunctionStatus
The test did not complete due to a fatal error.Completion checkHandlerAllTest.php54Drupal\views\Tests\Handler\HandlerAllTest->testHandlers()
The test did not complete due to a fatal error.Completion checkHandlerAllTest.php54Drupal\views\Tests\Handler\HandlerAllTest->testHandlers()
ExpandDrupal\views\Tests\Handler\HandlerTest11600
MessageGroupFilenameLineFunctionStatus
'Missing handler: v1gQeyuX sRgu0GCR relationship'Debugviews.module1208views_get_handler()
'Missing handler: v1gQeyuX sRgu0GCR relationship'Debugviews.module1208views_get_handler()
LeafDrupal\views\Tests\Handler\RelationshipTest500
LeafDrupal\views\Tests\Handler\SortDateTest2500
LeafDrupal\views\Tests\Handler\SortRandomTest700
LeafDrupal\views\Tests\Handler\SortTest1000
ExpandDrupal\views\Tests\Language\ArgumentLanguageTest010
MessageGroupFilenameLineFunctionStatus
The test did not complete due to a fatal error.Completion checkArgumentLanguageTest.php30Drupal\views\Tests\Language\ArgumentLanguageTest->testArgument()
ExpandDrupal\views\Tests\Language\FieldLanguageTest010
MessageGroupFilenameLineFunctionStatus
The test did not complete due to a fatal error.Completion checkFieldLanguageTest.php30Drupal\views\Tests\Language\FieldLanguageTest->testField()
ExpandDrupal\views\Tests\Language\FilterLanguageTest010
MessageGroupFilenameLineFunctionStatus
The test did not complete due to a fatal error.Completion checkFilterLanguageTest.php30Drupal\views\Tests\Language\FilterLanguageTest->testFilter()
ExpandDrupal\views\Tests\ModuleTest5700
MessageGroupFilenameLineFunctionStatus
'Missing handler: bfXU8ueO fgY2k8bw field'Debugviews.module1208views_get_handler()
'Missing handler: sOXnykCs ee3SZPI0 area'Debugviews.module1208views_get_handler()
'Missing handler: mvQRAYGU kE0ITMZe filter'Debugviews.module1208views_get_handler()
LeafDrupal\views\Tests\Node\FieldTypeTest200
LeafDrupal\views\Tests\Node\FilterUidRevisionTest400
LeafDrupal\views\Tests\Node\RevisionRelationships300
ExpandDrupal\views\Tests\Node\StatusExtraTest6800
MessageGroupFilenameLineFunctionStatus
'Missing handler: views_test_data age field'Debugviews.module1208views_get_handler()
'Missing handler: views_test_data id field'Debugviews.module1208views_get_handler()
'Missing handler: views_test_data name field'Debugviews.module1208views_get_handler()
LeafDrupal\views\Tests\PluginInstanceTest25900
LeafDrupal\views\Tests\PluginTypeListTest100
LeafDrupal\views\Tests\Plugin\AccessTest3900
LeafDrupal\views\Tests\Plugin\ArgumentDefaultTest2400
LeafDrupal\views\Tests\Plugin\ArgumentValidatorTest600
LeafDrupal\views\Tests\Plugin\CacheTest1200
LeafDrupal\views\Tests\Plugin\DisplayExtenderTest600
LeafDrupal\views\Tests\Plugin\DisplayFeedTest2800
LeafDrupal\views\Tests\Plugin\DisplayPageTest700
LeafDrupal\views\Tests\Plugin\DisplayTest3900
LeafDrupal\views\Tests\Plugin\ExposedFormTest8500
LeafDrupal\views\Tests\Plugin\FilterTest1300
ExpandDrupal\views\Tests\Plugin\JoinTest1600
MessageGroupFilenameLineFunctionStatus
array ( 'join type' => 'LEFT', 'table' => 'users', 'alias' => 'users', 'condition' => 'node.uid = users.uid AND (node.uid = 509)', 'arguments' => array ( ), )DebugJoinTest.php70Drupal\views\Tests\Plugin\JoinTest->testExamplePlugin()
ExpandDrupal\views\Tests\Plugin\PagerTest9200
MessageGroupFilenameLineFunctionStatus
'Missing handler: views_test_data age field'Debugviews.module1208views_get_handler()
'Missing handler: views_test_data id field'Debugviews.module1208views_get_handler()
'Missing handler: views_test_data name field'Debugviews.module1208views_get_handler()
'Missing handler: views_test_data age field'Debugviews.module1208views_get_handler()
'Missing handler: views_test_data id field'Debugviews.module1208views_get_handler()
'Missing handler: views_test_data name field'Debugviews.module1208views_get_handler()
LeafDrupal\views\Tests\Plugin\QueryTest300
LeafDrupal\views\Tests\Plugin\StyleMappingTest4300
LeafDrupal\views\Tests\Plugin\StyleTest2400
LeafDrupal\views\Tests\Plugin\StyleUnformattedTest1800
ExpandDrupal\views\Tests\QueryGroupByTest6100
MessageGroupFilenameLineFunctionStatus
'Missing handler: views_test_data age field'Debugviews.module1208views_get_handler()
'Missing handler: views_test_data id field'Debugviews.module1208views_get_handler()
'Missing handler: views_test_data name field'Debugviews.module1208views_get_handler()
'Missing handler: views_test_data age field'Debugviews.module1208views_get_handler()
'Missing handler: views_test_data id field'Debugviews.module1208views_get_handler()
'Missing handler: views_test_data name field'Debugviews.module1208views_get_handler()
'Missing handler: views_test_data age field'Debugviews.module1208views_get_handler()
'Missing handler: views_test_data id field'Debugviews.module1208views_get_handler()
'Missing handler: views_test_data name field'Debugviews.module1208views_get_handler()
'Missing handler: views_test_data age field'Debugviews.module1208views_get_handler()
'Missing handler: views_test_data id field'Debugviews.module1208views_get_handler()
'Missing handler: views_test_data name field'Debugviews.module1208views_get_handler()
'Missing handler: views_test_data age field'Debugviews.module1208views_get_handler()
'Missing handler: views_test_data id field'Debugviews.module1208views_get_handler()
'Missing handler: views_test_data name field'Debugviews.module1208views_get_handler()
'Missing handler: views_test_data age field'Debugviews.module1208views_get_handler()
'Missing handler: views_test_data id field'Debugviews.module1208views_get_handler()
'Missing handler: views_test_data name field'Debugviews.module1208views_get_handler()
'Missing handler: views_test_data age field'Debugviews.module1208views_get_handler()
'Missing handler: views_test_data id field'Debugviews.module1208views_get_handler()
'Missing handler: views_test_data name field'Debugviews.module1208views_get_handler()
'Missing handler: views_test_data age field'Debugviews.module1208views_get_handler()
'Missing handler: views_test_data id field'Debugviews.module1208views_get_handler()
'Missing handler: views_test_data name field'Debugviews.module1208views_get_handler()
'Missing handler: views_test_data age field'Debugviews.module1208views_get_handler()
'Missing handler: views_test_data id field'Debugviews.module1208views_get_handler()
'Missing handler: views_test_data name field'Debugviews.module1208views_get_handler()
'Missing handler: views_test_data age field'Debugviews.module1208views_get_handler()
'Missing handler: views_test_data id field'Debugviews.module1208views_get_handler()
'Missing handler: views_test_data name field'Debugviews.module1208views_get_handler()
'Missing handler: views_test_data age field'Debugviews.module1208views_get_handler()
'Missing handler: views_test_data id field'Debugviews.module1208views_get_handler()
'Missing handler: views_test_data name field'Debugviews.module1208views_get_handler()
'Missing handler: views_test_data age field'Debugviews.module1208views_get_handler()
'Missing handler: views_test_data id field'Debugviews.module1208views_get_handler()
'Missing handler: views_test_data name field'Debugviews.module1208views_get_handler()
'Missing handler: views_test_data age field'Debugviews.module1208views_get_handler()
'Missing handler: views_test_data id field'Debugviews.module1208views_get_handler()
'Missing handler: views_test_data name field'Debugviews.module1208views_get_handler()
'Missing handler: views_test_data age field'Debugviews.module1208views_get_handler()
'Missing handler: views_test_data id field'Debugviews.module1208views_get_handler()
'Missing handler: views_test_data name field'Debugviews.module1208views_get_handler()
'Missing handler: views_test_data age field'Debugviews.module1208views_get_handler()
'Missing handler: views_test_data id field'Debugviews.module1208views_get_handler()
'Missing handler: views_test_data name field'Debugviews.module1208views_get_handler()
'Missing handler: views_test_data age field'Debugviews.module1208views_get_handler()
'Missing handler: views_test_data id field'Debugviews.module1208views_get_handler()
'Missing handler: views_test_data name field'Debugviews.module1208views_get_handler()
'Missing handler: views_test_data age field'Debugviews.module1208views_get_handler()
'Missing handler: views_test_data id field'Debugviews.module1208views_get_handler()
'Missing handler: views_test_data name field'Debugviews.module1208views_get_handler()
'Missing handler: views_test_data age field'Debugviews.module1208views_get_handler()
'Missing handler: views_test_data id field'Debugviews.module1208views_get_handler()
'Missing handler: views_test_data name field'Debugviews.module1208views_get_handler()
'Missing handler: views_test_data age field'Debugviews.module1208views_get_handler()
'Missing handler: views_test_data id field'Debugviews.module1208views_get_handler()
'Missing handler: views_test_data name field'Debugviews.module1208views_get_handler()
'Missing handler: views_test_data age field'Debugviews.module1208views_get_handler()
'Missing handler: views_test_data id field'Debugviews.module1208views_get_handler()
'Missing handler: views_test_data name field'Debugviews.module1208views_get_handler()
ExpandDrupal\views\Tests\Taxonomy\RelationshipNodeTermDataTest200
MessageGroupFilenameLineFunctionStatus
'Missing handler: nid nid sort'Debugviews.module1208views_get_handler()
LeafDrupal\views\Tests\Taxonomy\RelationshipRepresentativeNode200
LeafDrupal\views\Tests\TokenReplaceTest1200
LeafDrupal\views\Tests\UI\DefaultViewsTest8800
LeafDrupal\views\Tests\UI\DisplayExtenderUITest2300
LeafDrupal\views\Tests\UI\DisplayPath2200
LeafDrupal\views\Tests\UI\DisplayTest20100
LeafDrupal\views\Tests\UI\GroupByTest2600
LeafDrupal\views\Tests\UI\HandlerTest11000
LeafDrupal\views\Tests\UI\OverrideDisplaysTest16700
LeafDrupal\views\Tests\UI\QueryTest1900
LeafDrupal\views\Tests\UI\RedirectTest2600
LeafDrupal\views\Tests\UI\RowUITest3000
LeafDrupal\views\Tests\UI\SettingsTest9000
LeafDrupal\views\Tests\UI\StorageTest2100
LeafDrupal\views\Tests\UI\StyleUITest3000
LeafDrupal\views\Tests\UI\TagTest2300
LeafDrupal\views\Tests\User\AccessPermissionTest1400
LeafDrupal\views\Tests\User\AccessRoleTest1400
ExpandDrupal\views\Tests\User\ArgumentDefaultTest900
MessageGroupFilenameLineFunctionStatus
'Missing handler: views_test_data age field'Debugviews.module1208views_get_handler()
'Missing handler: views_test_data id field'Debugviews.module1208views_get_handler()
'Missing handler: views_test_data name field'Debugviews.module1208views_get_handler()
LeafDrupal\views\Tests\User\ArgumentValidateTest1900
LeafDrupal\views\Tests\User\HandlerArgumentUserUidTest500
LeafDrupal\views\Tests\User\HandlerFieldUserNameTest700
LeafDrupal\views\Tests\User\HandlerFilterUserNameTest5700
LeafDrupal\views\Tests\User\RelationshipRepresentativeNode300
LeafDrupal\views\Tests\ViewElementTest1500
LeafDrupal\views\Tests\ViewExecutableTest20400
ExpandDrupal\views\Tests\ViewsDataTest1400
MessageGroupFilenameLineFunctionStatus
'Missing handler: views_test_data id field'Debugviews.module1208views_get_handler()
'Missing handler: views_test_data id field'Debugviews.module1208views_get_handler()
'Missing handler: views_test_data id field'Debugviews.module1208views_get_handler()
'Missing handler: views_test_data id field'Debugviews.module1208views_get_handler()
'Missing handler: views_test_data id field'Debugviews.module1208views_get_handler()
'Missing handler: views_test_data id field'Debugviews.module1208views_get_handler()
ExpandDrupal\views\Tests\ViewStorageTest10900
MessageGroupFilenameLineFunctionStatus
'Missing handler: views_test_data id field'Debugviews.module1208views_get_handler()
'Missing handler: views_test_data name field'Debugviews.module1208views_get_handler()
ExpandDrupal\views\Tests\Wizard\BasicTest7800
MessageGroupFilenameLineFunctionStatus
'Missing handler: views_test_data age field'Debugviews.module1208views_get_handler()
'Missing handler: views_test_data id field'Debugviews.module1208views_get_handler()
'Missing handler: views_test_data name field'Debugviews.module1208views_get_handler()
'Missing handler: views_test_data age field'Debugviews.module1208views_get_handler()
'Missing handler: views_test_data id field'Debugviews.module1208views_get_handler()
'Missing handler: views_test_data name field'Debugviews.module1208views_get_handler()
'Missing handler: views_test_data age field'Debugviews.module1208views_get_handler()
'Missing handler: views_test_data id field'Debugviews.module1208views_get_handler()
'Missing handler: views_test_data name field'Debugviews.module1208views_get_handler()
'Missing handler: views_test_data age field'Debugviews.module1208views_get_handler()
'Missing handler: views_test_data id field'Debugviews.module1208views_get_handler()
'Missing handler: views_test_data name field'Debugviews.module1208views_get_handler()
'Missing handler: views_test_data age field'Debugviews.module1208views_get_handler()
'Missing handler: views_test_data id field'Debugviews.module1208views_get_handler()
'Missing handler: views_test_data name field'Debugviews.module1208views_get_handler()
'Missing handler: views_test_data age field'Debugviews.module1208views_get_handler()
'Missing handler: views_test_data id field'Debugviews.module1208views_get_handler()
'Missing handler: views_test_data name field'Debugviews.module1208views_get_handler()
ExpandDrupal\views\Tests\Wizard\ItemsPerPageTest4000
MessageGroupFilenameLineFunctionStatus
'Missing handler: views_test_data age field'Debugviews.module1208views_get_handler()
'Missing handler: views_test_data id field'Debugviews.module1208views_get_handler()
'Missing handler: views_test_data name field'Debugviews.module1208views_get_handler()
'Missing handler: views_test_data age field'Debugviews.module1208views_get_handler()
'Missing handler: views_test_data id field'Debugviews.module1208views_get_handler()
'Missing handler: views_test_data name field'Debugviews.module1208views_get_handler()
'Missing handler: views_test_data age field'Debugviews.module1208views_get_handler()
'Missing handler: views_test_data id field'Debugviews.module1208views_get_handler()
'Missing handler: views_test_data name field'Debugviews.module1208views_get_handler()
ExpandDrupal\views\Tests\Wizard\MenuTest2000
MessageGroupFilenameLineFunctionStatus
'Missing handler: views_test_data age field'Debugviews.module1208views_get_handler()
'Missing handler: views_test_data id field'Debugviews.module1208views_get_handler()
'Missing handler: views_test_data name field'Debugviews.module1208views_get_handler()
'Missing handler: views_test_data age field'Debugviews.module1208views_get_handler()
'Missing handler: views_test_data id field'Debugviews.module1208views_get_handler()
'Missing handler: views_test_data name field'Debugviews.module1208views_get_handler()
ExpandDrupal\views\Tests\Wizard\SortingTest3100
MessageGroupFilenameLineFunctionStatus
'Missing handler: views_test_data age field'Debugviews.module1208views_get_handler()
'Missing handler: views_test_data id field'Debugviews.module1208views_get_handler()
'Missing handler: views_test_data name field'Debugviews.module1208views_get_handler()
'Missing handler: views_test_data age field'Debugviews.module1208views_get_handler()
'Missing handler: views_test_data id field'Debugviews.module1208views_get_handler()
'Missing handler: views_test_data name field'Debugviews.module1208views_get_handler()
'Missing handler: views_test_data age field'Debugviews.module1208views_get_handler()
'Missing handler: views_test_data id field'Debugviews.module1208views_get_handler()
'Missing handler: views_test_data name field'Debugviews.module1208views_get_handler()
ExpandDrupal\views\Tests\Wizard\TaggedWithTest7800
MessageGroupFilenameLineFunctionStatus
'Missing handler: views_test_data age field'Debugviews.module1208views_get_handler()
'Missing handler: views_test_data id field'Debugviews.module1208views_get_handler()
'Missing handler: views_test_data name field'Debugviews.module1208views_get_handler()
'Missing handler: views_test_data age field'Debugviews.module1208views_get_handler()
'Missing handler: views_test_data id field'Debugviews.module1208views_get_handler()
'Missing handler: views_test_data name field'Debugviews.module1208views_get_handler()
'Missing handler: views_test_data age field'Debugviews.module1208views_get_handler()
'Missing handler: views_test_data id field'Debugviews.module1208views_get_handler()
'Missing handler: views_test_data name field'Debugviews.module1208views_get_handler()
'Missing handler: views_test_data age field'Debugviews.module1208views_get_handler()
'Missing handler: views_test_data id field'Debugviews.module1208views_get_handler()
'Missing handler: views_test_data name field'Debugviews.module1208views_get_handler()
'Missing handler: views_test_data age field'Debugviews.module1208views_get_handler()
'Missing handler: views_test_data id field'Debugviews.module1208views_get_handler()
'Missing handler: views_test_data name field'Debugviews.module1208views_get_handler()
'Missing handler: views_test_data age field'Debugviews.module1208views_get_handler()
'Missing handler: views_test_data id field'Debugviews.module1208views_get_handler()
'Missing handler: views_test_data name field'Debugviews.module1208views_get_handler()
'Missing handler: views_test_data age field'Debugviews.module1208views_get_handler()
'Missing handler: views_test_data id field'Debugviews.module1208views_get_handler()
'Missing handler: views_test_data name field'Debugviews.module1208views_get_handler()
'Missing handler: views_test_data age field'Debugviews.module1208views_get_handler()
'Missing handler: views_test_data id field'Debugviews.module1208views_get_handler()
'Missing handler: views_test_data name field'Debugviews.module1208views_get_handler()
LeafDrupal\xmlrpc\Tests\XmlRpcBasicTest900
LeafDrupal\xmlrpc\Tests\XmlRpcMessagesTest700
LeafDrupal\xmlrpc\Tests\XmlRpcValidatorTest1000