1784312_45.patch

Test status
StatusResult
Last receivedSat, 11/17/2012 - 08:58:56
Last requestedSat, 11/17/2012 - 08:59:02
Last testedSat, 11/17/2012 - 09:38:27
Test count1
Environment status
MySQLfail
File information
File1784312_45.patch
BranchDrupal core - 8.x
LinkIssue Link
SummaryFAILED: [[SimpleTest]]: [MySQL] 47,775 pass(es), 75 fail(s), and 148 exception(s).
Details

MySQL

  1. Setup environment
  2. Detect an invalid patch URL
  3. Detect invalid repository information
  4. Detect invalid patch format
  5. Detect a non-applicable patch
  6. Detect invalid PHP syntax
  7. Detect a Drupal installation failure
  8. Detect a test run failure
  9. Detect a failing test
    Review the test failures below then if necessary run them locally until the problem has been fixed.
  10. Complete test suite with all tests passing
47,775 pass(es), 75 fail(s), and 148 exception(s)

Non-pass

Test namePassFailException
ExpandDrupal\block\Tests\BlockTest35801
MessageGroupFilenameLineFunctionStatus
rmdir(/var/lib/drupaltestbot/sites/default/files/checkout/sites/default/files/php/service_container): No such file or directoryrmdir('/var/lib/drupaltestbot/sites/default/files/checkout/sites/default/files/php/service_container') drupal_rmdir('/var/lib/drupaltestbot/sites/default/files/checkout/sites/default/files/php/service_container') file_unmanaged_delete_recursive('/var/lib/drupaltestbot/sites/default/files/checkout/sites/default/files/php/service_container', Array) Drupal\Component\PhpStorage\FileStorage->deleteAll() drupal_flush_all_caches() _install_profile_modules_finished(1, Array, Array, '0 sec') _batch_finished() _batch_process() batch_process('core/install.php?profile=testing&langcode=en', 'http://drupaltestbot659-mysql/checkout/core/install.php?profile=testing&langcode=en') install_run_task(Array, Array) install_run_tasks(Array) install_drupal(Array) Drupal\simpletest\WebTestBase->setUp() Drupal\block\Tests\BlockTest->setUp() Drupal\simpletest\TestBase->run() simpletest_script_run_one_test('32', 'Drupal\block\Tests\BlockTest') Warningfile.inc1769drupal_rmdir()
ExpandDrupal\file\Tests\ValidatorTest2901
MessageGroupFilenameLineFunctionStatus
rmdir(/var/lib/drupaltestbot/sites/default/files/checkout/sites/default/files/php/service_container): No such file or directoryrmdir('/var/lib/drupaltestbot/sites/default/files/checkout/sites/default/files/php/service_container') drupal_rmdir('/var/lib/drupaltestbot/sites/default/files/checkout/sites/default/files/php/service_container') file_unmanaged_delete_recursive('/var/lib/drupaltestbot/sites/default/files/checkout/sites/default/files/php/service_container', Array) Drupal\Component\PhpStorage\FileStorage->deleteAll() drupal_flush_all_caches() install_finished(Array) install_run_task(Array, Array) install_run_tasks(Array) install_drupal(Array) Drupal\simpletest\WebTestBase->setUp() Drupal\system\Tests\File\FileTestBase->setUp() Drupal\file\Tests\FileManagedTestBase->setUp() Drupal\file\Tests\ValidatorTest->setUp() Drupal\simpletest\TestBase->run() simpletest_script_run_one_test('219', 'Drupal\file\Tests\ValidatorTest') Warningfile.inc1769drupal_rmdir()
ExpandDrupal\image\Tests\ImageEffectsTest5002
MessageGroupFilenameLineFunctionStatus
rmdir(/var/lib/drupaltestbot/sites/default/files/checkout/sites/default/files/php/service_container/service_container_prod__simpletest145122.php): No such file or directoryrmdir('/var/lib/drupaltestbot/sites/default/files/checkout/sites/default/files/php/service_container/service_container_prod__simpletest145122.php') drupal_rmdir('/var/lib/drupaltestbot/sites/default/files/checkout/sites/default/files/php/service_container/service_container_prod__simpletest145122.php') file_unmanaged_delete_recursive('/var/lib/drupaltestbot/sites/default/files/checkout/sites/default/files/php/service_container/service_container_prod__simpletest145122.php', Array) file_unmanaged_delete_recursive('/var/lib/drupaltestbot/sites/default/files/checkout/sites/default/files/php/service_container', Array) Drupal\Component\PhpStorage\FileStorage->deleteAll() drupal_flush_all_caches() install_finished(Array) install_run_task(Array, Array) install_run_tasks(Array) install_drupal(Array) Drupal\simpletest\WebTestBase->setUp() Drupal\system\Tests\Image\ToolkitTestBase->setUp() Drupal\image\Tests\ImageEffectsTest->setUp() Drupal\simpletest\TestBase->run() simpletest_script_run_one_test('281', 'Drupal\image\Tests\ImageEffectsTest') Warningfile.inc1769drupal_rmdir()
rmdir(/var/lib/drupaltestbot/sites/default/files/checkout/sites/default/files/php/service_container): No such file or directoryrmdir('/var/lib/drupaltestbot/sites/default/files/checkout/sites/default/files/php/service_container') drupal_rmdir('/var/lib/drupaltestbot/sites/default/files/checkout/sites/default/files/php/service_container') file_unmanaged_delete_recursive('/var/lib/drupaltestbot/sites/default/files/checkout/sites/default/files/php/service_container', Array) Drupal\Component\PhpStorage\FileStorage->deleteAll() drupal_flush_all_caches() install_finished(Array) install_run_task(Array, Array) install_run_tasks(Array) install_drupal(Array) Drupal\simpletest\WebTestBase->setUp() Drupal\system\Tests\Image\ToolkitTestBase->setUp() Drupal\image\Tests\ImageEffectsTest->setUp() Drupal\simpletest\TestBase->run() simpletest_script_run_one_test('281', 'Drupal\image\Tests\ImageEffectsTest') Warningfile.inc1769drupal_rmdir()
ExpandDrupal\node\Tests\NodeAccessBaseTableTest15901
MessageGroupFilenameLineFunctionStatus
mkdir(): File existsWarningMTimeProtectedFastFileStorage.php144Drupal\Component\PhpStorage\MTimeProtectedFastFileStorage->ensureDirectory()
ExpandDrupal\node\Tests\NodeQueryAlterTest9902
MessageGroupFilenameLineFunctionStatus
rmdir(/var/lib/drupaltestbot/sites/default/files/checkout/sites/default/files/php/service_container/service_container_prod__simpletest782905.php): No such file or directoryrmdir('/var/lib/drupaltestbot/sites/default/files/checkout/sites/default/files/php/service_container/service_container_prod__simpletest782905.php') drupal_rmdir('/var/lib/drupaltestbot/sites/default/files/checkout/sites/default/files/php/service_container/service_container_prod__simpletest782905.php') file_unmanaged_delete_recursive('/var/lib/drupaltestbot/sites/default/files/checkout/sites/default/files/php/service_container/service_container_prod__simpletest782905.php', Array) file_unmanaged_delete_recursive('/var/lib/drupaltestbot/sites/default/files/checkout/sites/default/files/php/service_container', Array) Drupal\Component\PhpStorage\FileStorage->deleteAll() drupal_flush_all_caches() _install_profile_modules_finished(1, Array, Array, '0 sec') _batch_finished() _batch_process() batch_process('core/install.php?profile=testing&langcode=en', 'http://drupaltestbot659-mysql/checkout/core/install.php?profile=testing&langcode=en') install_run_task(Array, Array) install_run_tasks(Array) install_drupal(Array) Drupal\simpletest\WebTestBase->setUp() Drupal\node\Tests\NodeTestBase->setUp() Drupal\node\Tests\NodeQueryAlterTest->setUp() Drupal\simpletest\TestBase->run() simpletest_script_run_one_test('364', 'Drupal\node\Tests\NodeQueryAlterTest') Warningfile.inc1769drupal_rmdir()
rmdir(/var/lib/drupaltestbot/sites/default/files/checkout/sites/default/files/php/service_container): No such file or directoryrmdir('/var/lib/drupaltestbot/sites/default/files/checkout/sites/default/files/php/service_container') drupal_rmdir('/var/lib/drupaltestbot/sites/default/files/checkout/sites/default/files/php/service_container') file_unmanaged_delete_recursive('/var/lib/drupaltestbot/sites/default/files/checkout/sites/default/files/php/service_container', Array) Drupal\Component\PhpStorage\FileStorage->deleteAll() drupal_flush_all_caches() _install_profile_modules_finished(1, Array, Array, '0 sec') _batch_finished() _batch_process() batch_process('core/install.php?profile=testing&langcode=en', 'http://drupaltestbot659-mysql/checkout/core/install.php?profile=testing&langcode=en') install_run_task(Array, Array) install_run_tasks(Array) install_drupal(Array) Drupal\simpletest\WebTestBase->setUp() Drupal\node\Tests\NodeTestBase->setUp() Drupal\node\Tests\NodeQueryAlterTest->setUp() Drupal\simpletest\TestBase->run() simpletest_script_run_one_test('364', 'Drupal\node\Tests\NodeQueryAlterTest') Warningfile.inc1769drupal_rmdir()
ExpandDrupal\simpletest\Tests\SimpleTestTest11020
MessageGroupFilenameLineFunctionStatus
Requesting http.php with a legitimate simpletest User-Agent returns OK.BrowserSimpleTestTest.php115Drupal\simpletest\Tests\SimpleTestTest->testUserAgentValidation()
Requesting https.php with a legitimate simpletest User-Agent returns OK.BrowserSimpleTestTest.php117Drupal\simpletest\Tests\SimpleTestTest->testUserAgentValidation()
ExpandDrupal\system\Tests\DrupalKernel\DrupalKernelTest011
MessageGroupFilenameLineFunctionStatus
The test did not complete due to a fatal error.Completion checkDrupalKernelTest.php32Drupal\system\Tests\DrupalKernel\DrupalKernelTest->testCompileDIC()
Argument 4 passed to Drupal\Core\DrupalKernel::__construct() must be an instance of Drupal\Component\PhpStorage\PhpStorageFactory, instance of Drupal\Component\PhpStorage\MTimeProtectedFastFileStorage given, called in /var/lib/drupaltestbot/sites/default/files/checkout/core/modules/system/lib/Drupal/system/Tests/DrupalKernel/DrupalKernelTest.php on line 50 and definedDrupal\Core\DrupalKernel->__construct('testing', , Object, Object) Drupal\system\Tests\DrupalKernel\DrupalKernelTest->testCompileDIC() Drupal\simpletest\TestBase->run() simpletest_script_run_one_test('158', 'Drupal\system\Tests\DrupalKernel\DrupalKernelTest') Recoverable errorDrupalKernel.php132Drupal\Core\DrupalKernel->__construct()
ExpandDrupal\system\Tests\Menu\RouterTest22601
MessageGroupFilenameLineFunctionStatus
rmdir(/var/lib/drupaltestbot/sites/default/files/checkout/sites/default/files/php/service_container): Directory not emptyrmdir('/var/lib/drupaltestbot/sites/default/files/checkout/sites/default/files/php/service_container') drupal_rmdir('/var/lib/drupaltestbot/sites/default/files/checkout/sites/default/files/php/service_container') file_unmanaged_delete_recursive('/var/lib/drupaltestbot/sites/default/files/checkout/sites/default/files/php/service_container', Array) Drupal\Component\PhpStorage\FileStorage->deleteAll() drupal_flush_all_caches() _install_profile_modules_finished(1, Array, Array, '0 sec') _batch_finished() _batch_process() batch_process('core/install.php?profile=testing&langcode=en', 'http://drupaltestbot659-mysql/checkout/core/install.php?profile=testing&langcode=en') install_run_task(Array, Array) install_run_tasks(Array) install_drupal(Array) Drupal\simpletest\WebTestBase->setUp() Drupal\system\Tests\Menu\RouterTest->setUp() Drupal\simpletest\TestBase->run() simpletest_script_run_one_test('331', 'Drupal\system\Tests\Menu\RouterTest') Warningfile.inc1769drupal_rmdir()
ExpandDrupal\system\Tests\Module\ModuleApiTest7602
MessageGroupFilenameLineFunctionStatus
mkdir(): File existsWarningMTimeProtectedFastFileStorage.php144Drupal\Component\PhpStorage\MTimeProtectedFastFileStorage->ensureDirectory()
rmdir(/var/lib/drupaltestbot/sites/default/files/checkout/sites/default/files/php/service_container): Directory not emptyrmdir('/var/lib/drupaltestbot/sites/default/files/checkout/sites/default/files/php/service_container') drupal_rmdir('/var/lib/drupaltestbot/sites/default/files/checkout/sites/default/files/php/service_container') file_unmanaged_delete_recursive('/var/lib/drupaltestbot/sites/default/files/checkout/sites/default/files/php/service_container', Array) Drupal\Component\PhpStorage\FileStorage->deleteAll() drupal_flush_all_caches() install_finished(Array) install_run_task(Array, Array) install_run_tasks(Array) install_drupal(Array) Drupal\simpletest\WebTestBase->setUp() Drupal\simpletest\TestBase->run() simpletest_script_run_one_test('340', 'Drupal\system\Tests\Module\ModuleApiTest') Warningfile.inc1769drupal_rmdir()
ExpandDrupal\system\Tests\Session\SessionHttpsTest54163
MessageGroupFilenameLineFunctionStatus
Undefined property: Drupal\system\Tests\Session\SessionHttpsTest::$cookiesDrupal\system\Tests\Session\SessionHttpsTest->testHttpsSession() Drupal\simpletest\TestBase->run() simpletest_script_run_one_test('457', 'Drupal\system\Tests\Session\SessionHttpsTest') NoticeSessionHttpsTest.php62Drupal\system\Tests\Session\SessionHttpsTest->testHttpsSession()
The secure cookie has the secure attributeOtherSessionHttpsTest.php62Drupal\system\Tests\Session\SessionHttpsTest->testHttpsSession()
Undefined property: Drupal\system\Tests\Session\SessionHttpsTest::$cookiesDrupal\system\Tests\Session\SessionHttpsTest->testHttpsSession() Drupal\simpletest\TestBase->run() simpletest_script_run_one_test('457', 'Drupal\system\Tests\Session\SessionHttpsTest') NoticeSessionHttpsTest.php65Drupal\system\Tests\Session\SessionHttpsTest->testHttpsSession()
Session has a non-empty SID and a correct secure SID.OtherSessionHttpsTest.php66Drupal\system\Tests\Session\SessionHttpsTest->testHttpsSession()
"Configuration" foundOtherSessionHttpsTest.php72Drupal\system\Tests\Session\SessionHttpsTest->testHttpsSession()
HTTP response expected 200, actual 500BrowserSessionHttpsTest.php73Drupal\system\Tests\Session\SessionHttpsTest->testHttpsSession()
HTTP response expected 403, actual 500BrowserSessionHttpsTest.php79Drupal\system\Tests\Session\SessionHttpsTest->testHttpsSession()
HTTP response expected 403, actual 500BrowserSessionHttpsTest.php85Drupal\system\Tests\Session\SessionHttpsTest->testHttpsSession()
HTTP response expected 200, actual 500BrowserSessionHttpsTest.php97Drupal\system\Tests\Session\SessionHttpsTest->testHttpsSession()
Undefined property: Drupal\system\Tests\Session\SessionHttpsTest::$cookiesDrupal\system\Tests\Session\SessionHttpsTest->testHttpsSession() Drupal\simpletest\TestBase->run() simpletest_script_run_one_test('457', 'Drupal\system\Tests\Session\SessionHttpsTest') NoticeSessionHttpsTest.php98Drupal\system\Tests\Session\SessionHttpsTest->testHttpsSession()
Session has the correct SID and an empty secure SID.OtherSessionHttpsTest.php99Drupal\system\Tests\Session\SessionHttpsTest->testHttpsSession()
HTTP response expected 403, actual 500BrowserSessionHttpsTest.php105Drupal\system\Tests\Session\SessionHttpsTest->testHttpsSession()
Session has both secure and insecure SIDsOtherSessionHttpsTest.php155Drupal\system\Tests\Session\SessionHttpsTest->testHttpsSession()
"Configuration" foundOtherSessionHttpsTest.php172Drupal\system\Tests\Session\SessionHttpsTest->testHttpsSession()
HTTP response expected 200, actual 403BrowserSessionHttpsTest.php173Drupal\system\Tests\Session\SessionHttpsTest->testHttpsSession()
HTTP response expected 403, actual 500BrowserSessionHttpsTest.php177Drupal\system\Tests\Session\SessionHttpsTest->testHttpsSession()
"Configuration" foundOtherSessionHttpsTest.php172Drupal\system\Tests\Session\SessionHttpsTest->testHttpsSession()
HTTP response expected 200, actual 500BrowserSessionHttpsTest.php173Drupal\system\Tests\Session\SessionHttpsTest->testHttpsSession()
HTTP response expected 200, actual 403BrowserSessionHttpsTest.php202Drupal\system\Tests\Session\SessionHttpsTest->testHttpsSession()
ExpandDrupal\system\Tests\Update\UpdateScriptTest1792527
MessageGroupFilenameLineFunctionStatus
Undefined index: backtraceNoticeerrors.inc188_drupal_log_error()
The service definition "php_storage" does not exist.Symfony\Component\DependencyInjection\Exception\InvalidArgumentExceptionContainerBuilder.php690Symfony\Component\DependencyInjection\ContainerBuilder->getDefinition()
End of update process was reached.OtherUpdateScriptTest.php83Drupal\system\Tests\Update\UpdateScriptTest->testRequirements()
Caches were cleared when there were no requirements warnings or errors.OtherUpdateScriptTest.php85Drupal\system\Tests\Update\UpdateScriptTest->testRequirements()
Undefined index: backtraceNoticeerrors.inc188_drupal_log_error()
The service definition "php_storage" does not exist.Symfony\Component\DependencyInjection\Exception\InvalidArgumentExceptionContainerBuilder.php690Symfony\Component\DependencyInjection\ContainerBuilder->getDefinition()
End of update process was reached.OtherUpdateScriptTest.php101Drupal\system\Tests\Update\UpdateScriptTest->testRequirements()
Caches were cleared after resolving a requirements warning and applying updates.OtherUpdateScriptTest.php103Drupal\system\Tests\Update\UpdateScriptTest->testRequirements()
Undefined index: backtraceNoticeerrors.inc188_drupal_log_error()
The service definition "php_storage" does not exist.Symfony\Component\DependencyInjection\Exception\InvalidArgumentExceptionContainerBuilder.php690Symfony\Component\DependencyInjection\ContainerBuilder->getDefinition()
End of update process was reached.OtherUpdateScriptTest.php111Drupal\system\Tests\Update\UpdateScriptTest->testRequirements()
Caches were cleared after applying updates and re-running the script.OtherUpdateScriptTest.php113Drupal\system\Tests\Update\UpdateScriptTest->testRequirements()
Undefined index: backtraceNoticeerrors.inc188_drupal_log_error()
The service definition "php_storage" does not exist.Symfony\Component\DependencyInjection\Exception\InvalidArgumentExceptionContainerBuilder.php690Symfony\Component\DependencyInjection\ContainerBuilder->getDefinition()
"No pending updates." foundOtherUpdateScriptTest.php146Drupal\system\Tests\Update\UpdateScriptTest->testNoUpdateFunctionality()
simplexml_import_dom(): Invalid Nodetype to importsimplexml_import_dom(Object) Drupal\simpletest\WebTestBase->parse() Drupal\simpletest\WebTestBase->xpath('//a[normalize-space(text())=:label]', Array) Drupal\simpletest\WebTestBase->assertNoLink('Administration pages') Drupal\system\Tests\Update\UpdateScriptTest->testNoUpdateFunctionality() Drupal\simpletest\TestBase->run() simpletest_script_run_one_test('537', 'Drupal\system\Tests\Update\UpdateScriptTest') WarningWebTestBase.php1036Drupal\simpletest\WebTestBase->parse()
Parsed page successfully.BrowserUpdateScriptTest.php147Drupal\system\Tests\Update\UpdateScriptTest->testNoUpdateFunctionality()
simplexml_import_dom(): Invalid Nodetype to importsimplexml_import_dom(Object) Drupal\simpletest\WebTestBase->parse() Drupal\simpletest\WebTestBase->xpath('//a[normalize-space(text())=:label]', Array) Drupal\simpletest\WebTestBase->clickLink('Front page') Drupal\system\Tests\Update\UpdateScriptTest->testNoUpdateFunctionality() Drupal\simpletest\TestBase->run() simpletest_script_run_one_test('537', 'Drupal\system\Tests\Update\UpdateScriptTest') WarningWebTestBase.php1036Drupal\simpletest\WebTestBase->parse()
Parsed page successfully.BrowserUpdateScriptTest.php148Drupal\system\Tests\Update\UpdateScriptTest->testNoUpdateFunctionality()
Undefined variable: url_targetDrupal\simpletest\WebTestBase->clickLink('Front page') Drupal\system\Tests\Update\UpdateScriptTest->testNoUpdateFunctionality() Drupal\simpletest\TestBase->run() simpletest_script_run_one_test('537', 'Drupal\system\Tests\Update\UpdateScriptTest') NoticeWebTestBase.php1852Drupal\simpletest\WebTestBase->clickLink()
Clicked link Front page () from http://drupaltestbot659-mysql/checkout/core/update.php?op=selection&token=RAwI6o7RnvvwXQbOhKPQSfZY6HEUeZW29EP4bBPvTRcBrowserUpdateScriptTest.php148Drupal\system\Tests\Update\UpdateScriptTest->testNoUpdateFunctionality()
Undefined index: backtraceNoticeerrors.inc188_drupal_log_error()
The service definition "php_storage" does not exist.Symfony\Component\DependencyInjection\Exception\InvalidArgumentExceptionContainerBuilder.php690Symfony\Component\DependencyInjection\ContainerBuilder->getDefinition()
"No pending updates." foundOtherUpdateScriptTest.php155Drupal\system\Tests\Update\UpdateScriptTest->testNoUpdateFunctionality()
simplexml_import_dom(): Invalid Nodetype to importsimplexml_import_dom(Object) Drupal\simpletest\WebTestBase->parse() Drupal\simpletest\WebTestBase->xpath('//a[normalize-space(text())=:label]', Array) Drupal\simpletest\WebTestBase->clickLink('Administration pages') Drupal\system\Tests\Update\UpdateScriptTest->testNoUpdateFunctionality() Drupal\simpletest\TestBase->run() simpletest_script_run_one_test('537', 'Drupal\system\Tests\Update\UpdateScriptTest') WarningWebTestBase.php1036Drupal\simpletest\WebTestBase->parse()
Parsed page successfully.BrowserUpdateScriptTest.php156Drupal\system\Tests\Update\UpdateScriptTest->testNoUpdateFunctionality()
Undefined variable: url_targetDrupal\simpletest\WebTestBase->clickLink('Administration pages') Drupal\system\Tests\Update\UpdateScriptTest->testNoUpdateFunctionality() Drupal\simpletest\TestBase->run() simpletest_script_run_one_test('537', 'Drupal\system\Tests\Update\UpdateScriptTest') NoticeWebTestBase.php1852Drupal\simpletest\WebTestBase->clickLink()
Clicked link Administration pages () from http://drupaltestbot659-mysql/checkout/core/update.php?op=selection&token=rrI1uDgVZcXupkujixhmUGwikjZGbqnDHD4up9Ny4D8BrowserUpdateScriptTest.php156Drupal\system\Tests\Update\UpdateScriptTest->testNoUpdateFunctionality()
Undefined index: backtraceNoticeerrors.inc188_drupal_log_error()
The service definition "php_storage" does not exist.Symfony\Component\DependencyInjection\Exception\InvalidArgumentExceptionContainerBuilder.php690Symfony\Component\DependencyInjection\ContainerBuilder->getDefinition()
"Updates were attempted." foundOtherUpdateScriptTest.php169Drupal\system\Tests\Update\UpdateScriptTest->testSuccessfulUpdateFunctionality()
simplexml_import_dom(): Invalid Nodetype to importsimplexml_import_dom(Object) Drupal\simpletest\WebTestBase->parse() Drupal\simpletest\WebTestBase->xpath('//a[normalize-space(text())=:label]', Array) Drupal\simpletest\WebTestBase->assertLink('site') Drupal\system\Tests\Update\UpdateScriptTest->testSuccessfulUpdateFunctionality() Drupal\simpletest\TestBase->run() simpletest_script_run_one_test('537', 'Drupal\system\Tests\Update\UpdateScriptTest') WarningWebTestBase.php1036Drupal\simpletest\WebTestBase->parse()
Parsed page successfully.BrowserUpdateScriptTest.php170Drupal\system\Tests\Update\UpdateScriptTest->testSuccessfulUpdateFunctionality()
Link with label site found.OtherUpdateScriptTest.php170Drupal\system\Tests\Update\UpdateScriptTest->testSuccessfulUpdateFunctionality()
simplexml_import_dom(): Invalid Nodetype to importsimplexml_import_dom(Object) Drupal\simpletest\WebTestBase->parse() Drupal\simpletest\WebTestBase->xpath('//a[normalize-space(text())=:label]', Array) Drupal\simpletest\WebTestBase->assertNoLink('Administration pages') Drupal\system\Tests\Update\UpdateScriptTest->testSuccessfulUpdateFunctionality() Drupal\simpletest\TestBase->run() simpletest_script_run_one_test('537', 'Drupal\system\Tests\Update\UpdateScriptTest') WarningWebTestBase.php1036Drupal\simpletest\WebTestBase->parse()
Parsed page successfully.BrowserUpdateScriptTest.php171Drupal\system\Tests\Update\UpdateScriptTest->testSuccessfulUpdateFunctionality()
simplexml_import_dom(): Invalid Nodetype to importsimplexml_import_dom(Object) Drupal\simpletest\WebTestBase->parse() Drupal\simpletest\WebTestBase->xpath('//a[normalize-space(text())=:label]', Array) Drupal\simpletest\WebTestBase->assertNoLink('logged') Drupal\system\Tests\Update\UpdateScriptTest->testSuccessfulUpdateFunctionality() Drupal\simpletest\TestBase->run() simpletest_script_run_one_test('537', 'Drupal\system\Tests\Update\UpdateScriptTest') WarningWebTestBase.php1036Drupal\simpletest\WebTestBase->parse()
Parsed page successfully.BrowserUpdateScriptTest.php172Drupal\system\Tests\Update\UpdateScriptTest->testSuccessfulUpdateFunctionality()
simplexml_import_dom(): Invalid Nodetype to importsimplexml_import_dom(Object) Drupal\simpletest\WebTestBase->parse() Drupal\simpletest\WebTestBase->xpath('//a[normalize-space(text())=:label]', Array) Drupal\simpletest\WebTestBase->clickLink('Front page') Drupal\system\Tests\Update\UpdateScriptTest->testSuccessfulUpdateFunctionality() Drupal\simpletest\TestBase->run() simpletest_script_run_one_test('537', 'Drupal\system\Tests\Update\UpdateScriptTest') WarningWebTestBase.php1036Drupal\simpletest\WebTestBase->parse()
Parsed page successfully.BrowserUpdateScriptTest.php173Drupal\system\Tests\Update\UpdateScriptTest->testSuccessfulUpdateFunctionality()
Undefined variable: url_targetDrupal\simpletest\WebTestBase->clickLink('Front page') Drupal\system\Tests\Update\UpdateScriptTest->testSuccessfulUpdateFunctionality() Drupal\simpletest\TestBase->run() simpletest_script_run_one_test('537', 'Drupal\system\Tests\Update\UpdateScriptTest') NoticeWebTestBase.php1852Drupal\simpletest\WebTestBase->clickLink()
Clicked link Front page () from http://drupaltestbot659-mysql/checkout/core/update.php?op=selection&token=jSzQX_qu7BIkVRYmZrR1JL2yiEhD0hhomiHcl0H8h2s&id=3&op=finishedBrowserUpdateScriptTest.php173Drupal\system\Tests\Update\UpdateScriptTest->testSuccessfulUpdateFunctionality()
Undefined index: backtraceNoticeerrors.inc188_drupal_log_error()
The service definition "php_storage" does not exist.Symfony\Component\DependencyInjection\Exception\InvalidArgumentExceptionContainerBuilder.php690Symfony\Component\DependencyInjection\ContainerBuilder->getDefinition()
"Updates were attempted." foundOtherUpdateScriptTest.php183Drupal\system\Tests\Update\UpdateScriptTest->testSuccessfulUpdateFunctionality()
simplexml_import_dom(): Invalid Nodetype to importsimplexml_import_dom(Object) Drupal\simpletest\WebTestBase->parse() Drupal\simpletest\WebTestBase->xpath('//a[normalize-space(text())=:label]', Array) Drupal\simpletest\WebTestBase->assertLink('logged') Drupal\system\Tests\Update\UpdateScriptTest->testSuccessfulUpdateFunctionality() Drupal\simpletest\TestBase->run() simpletest_script_run_one_test('537', 'Drupal\system\Tests\Update\UpdateScriptTest') WarningWebTestBase.php1036Drupal\simpletest\WebTestBase->parse()
Parsed page successfully.BrowserUpdateScriptTest.php184Drupal\system\Tests\Update\UpdateScriptTest->testSuccessfulUpdateFunctionality()
Link with label logged found.OtherUpdateScriptTest.php184Drupal\system\Tests\Update\UpdateScriptTest->testSuccessfulUpdateFunctionality()
simplexml_import_dom(): Invalid Nodetype to importsimplexml_import_dom(Object) Drupal\simpletest\WebTestBase->parse() Drupal\simpletest\WebTestBase->xpath('//a[normalize-space(text())=:label]', Array) Drupal\simpletest\WebTestBase->clickLink('Administration pages') Drupal\system\Tests\Update\UpdateScriptTest->testSuccessfulUpdateFunctionality() Drupal\simpletest\TestBase->run() simpletest_script_run_one_test('537', 'Drupal\system\Tests\Update\UpdateScriptTest') WarningWebTestBase.php1036Drupal\simpletest\WebTestBase->parse()
Parsed page successfully.BrowserUpdateScriptTest.php185Drupal\system\Tests\Update\UpdateScriptTest->testSuccessfulUpdateFunctionality()
Undefined variable: url_targetDrupal\simpletest\WebTestBase->clickLink('Administration pages') Drupal\system\Tests\Update\UpdateScriptTest->testSuccessfulUpdateFunctionality() Drupal\simpletest\TestBase->run() simpletest_script_run_one_test('537', 'Drupal\system\Tests\Update\UpdateScriptTest') NoticeWebTestBase.php1852Drupal\simpletest\WebTestBase->clickLink()
Clicked link Administration pages () from http://drupaltestbot659-mysql/checkout/core/update.php?op=selection&token=1T2vuGJx1iUVIM_5D31vRRvZAZbyiIOjF9zDiXixU40&id=5&op=finishedBrowserUpdateScriptTest.php185Drupal\system\Tests\Update\UpdateScriptTest->testSuccessfulUpdateFunctionality()
ExpandDrupal\system\Tests\Upgrade\BareMinimalUpgradePathTest1727
MessageGroupFilenameLineFunctionStatus
Undefined index: backtraceNoticeerrors.inc188_drupal_log_error()
The service definition "php_storage" does not exist.Symfony\Component\DependencyInjection\Exception\InvalidArgumentExceptionContainerBuilder.php690Symfony\Component\DependencyInjection\ContainerBuilder->getDefinition()
simplexml_import_dom(): Invalid Nodetype to importsimplexml_import_dom(Object) Drupal\simpletest\WebTestBase->parse() Drupal\simpletest\WebTestBase->xpath('//li[@class=:class]', Array) Drupal\system\Tests\Upgrade\UpgradePathTestBase->performUpgrade() Drupal\system\Tests\Upgrade\BareMinimalUpgradePathTest->testBasicMinimalUpgrade() Drupal\simpletest\TestBase->run() simpletest_script_run_one_test('545', 'Drupal\system\Tests\Upgrade\BareMinimalUpgradePathTest') WarningWebTestBase.php1036Drupal\simpletest\WebTestBase->parse()
Parsed page successfully.BrowserUpgradePathTestBase.php218Drupal\system\Tests\Upgrade\UpgradePathTestBase->performUpgrade()
Invalid argument supplied for foreach()Drupal\system\Tests\Upgrade\UpgradePathTestBase->performUpgrade() Drupal\system\Tests\Upgrade\BareMinimalUpgradePathTest->testBasicMinimalUpgrade() Drupal\simpletest\TestBase->run() simpletest_script_run_one_test('545', 'Drupal\system\Tests\Upgrade\BareMinimalUpgradePathTest') WarningUpgradePathTestBase.php218Drupal\system\Tests\Upgrade\UpgradePathTestBase->performUpgrade()
Undefined index: backtraceNoticeerrors.inc188_drupal_log_error()
The service definition "php_storage" does not exist.Symfony\Component\DependencyInjection\Exception\InvalidArgumentExceptionContainerBuilder.php690Symfony\Component\DependencyInjection\ContainerBuilder->getDefinition()
No pending updates at the end of the update process.OtherUpgradePathTestBase.php234Drupal\system\Tests\Upgrade\UpgradePathTestBase->performUpgrade()
Exception: update.php still shows pending updates after execution. in Drupal\system\Tests\Upgrade\UpgradePathTestBase->performUpgrade() (line 235 of /var/lib/drupaltestbot/sites/default/files/checkout/core/modules/system/lib/Drupal/system/Tests/Upgrade/UpgradePathTestBase.php). Drupal\system\Tests\Upgrade\UpgradePathTestBase->performUpgrade() Drupal\system\Tests\Upgrade\BareMinimalUpgradePathTest->testBasicMinimalUpgrade() Drupal\simpletest\TestBase->run() simpletest_script_run_one_test('545', 'Drupal\system\Tests\Upgrade\BareMinimalUpgradePathTest') Uncaught exceptionUpgradePathTestBase.php235Drupal\system\Tests\Upgrade\UpgradePathTestBase->performUpgrade()
ExpandDrupal\system\Tests\Upgrade\BareStandardUpgradePathTest2127
MessageGroupFilenameLineFunctionStatus
Undefined index: backtraceNoticeerrors.inc188_drupal_log_error()
The service definition "php_storage" does not exist.Symfony\Component\DependencyInjection\Exception\InvalidArgumentExceptionContainerBuilder.php690Symfony\Component\DependencyInjection\ContainerBuilder->getDefinition()
simplexml_import_dom(): Invalid Nodetype to importsimplexml_import_dom(Object) Drupal\simpletest\WebTestBase->parse() Drupal\simpletest\WebTestBase->xpath('//li[@class=:class]', Array) Drupal\system\Tests\Upgrade\UpgradePathTestBase->performUpgrade() Drupal\system\Tests\Upgrade\BareStandardUpgradePathTest->testBasicStandardUpgrade() Drupal\simpletest\TestBase->run() simpletest_script_run_one_test('546', 'Drupal\system\Tests\Upgrade\BareStandardUpgradePathTest') WarningWebTestBase.php1036Drupal\simpletest\WebTestBase->parse()
Parsed page successfully.BrowserUpgradePathTestBase.php218Drupal\system\Tests\Upgrade\UpgradePathTestBase->performUpgrade()
Invalid argument supplied for foreach()Drupal\system\Tests\Upgrade\UpgradePathTestBase->performUpgrade() Drupal\system\Tests\Upgrade\BareStandardUpgradePathTest->testBasicStandardUpgrade() Drupal\simpletest\TestBase->run() simpletest_script_run_one_test('546', 'Drupal\system\Tests\Upgrade\BareStandardUpgradePathTest') WarningUpgradePathTestBase.php218Drupal\system\Tests\Upgrade\UpgradePathTestBase->performUpgrade()
Undefined index: backtraceNoticeerrors.inc188_drupal_log_error()
The service definition "php_storage" does not exist.Symfony\Component\DependencyInjection\Exception\InvalidArgumentExceptionContainerBuilder.php690Symfony\Component\DependencyInjection\ContainerBuilder->getDefinition()
No pending updates at the end of the update process.OtherUpgradePathTestBase.php234Drupal\system\Tests\Upgrade\UpgradePathTestBase->performUpgrade()
Exception: update.php still shows pending updates after execution. in Drupal\system\Tests\Upgrade\UpgradePathTestBase->performUpgrade() (line 235 of /var/lib/drupaltestbot/sites/default/files/checkout/core/modules/system/lib/Drupal/system/Tests/Upgrade/UpgradePathTestBase.php). Drupal\system\Tests\Upgrade\UpgradePathTestBase->performUpgrade() Drupal\system\Tests\Upgrade\BareStandardUpgradePathTest->testBasicStandardUpgrade() Drupal\simpletest\TestBase->run() simpletest_script_run_one_test('546', 'Drupal\system\Tests\Upgrade\BareStandardUpgradePathTest') Uncaught exceptionUpgradePathTestBase.php235Drupal\system\Tests\Upgrade\UpgradePathTestBase->performUpgrade()
ExpandDrupal\system\Tests\Upgrade\BlockUpgradePathTest1927
MessageGroupFilenameLineFunctionStatus
Undefined index: backtraceNoticeerrors.inc188_drupal_log_error()
The service definition "php_storage" does not exist.Symfony\Component\DependencyInjection\Exception\InvalidArgumentExceptionContainerBuilder.php690Symfony\Component\DependencyInjection\ContainerBuilder->getDefinition()
simplexml_import_dom(): Invalid Nodetype to importsimplexml_import_dom(Object) Drupal\simpletest\WebTestBase->parse() Drupal\simpletest\WebTestBase->xpath('//li[@class=:class]', Array) Drupal\system\Tests\Upgrade\UpgradePathTestBase->performUpgrade() Drupal\system\Tests\Upgrade\BlockUpgradePathTest->testBlockUpgradeTitleLength() Drupal\simpletest\TestBase->run() simpletest_script_run_one_test('547', 'Drupal\system\Tests\Upgrade\BlockUpgradePathTest') WarningWebTestBase.php1036Drupal\simpletest\WebTestBase->parse()
Parsed page successfully.BrowserUpgradePathTestBase.php218Drupal\system\Tests\Upgrade\UpgradePathTestBase->performUpgrade()
Invalid argument supplied for foreach()Drupal\system\Tests\Upgrade\UpgradePathTestBase->performUpgrade() Drupal\system\Tests\Upgrade\BlockUpgradePathTest->testBlockUpgradeTitleLength() Drupal\simpletest\TestBase->run() simpletest_script_run_one_test('547', 'Drupal\system\Tests\Upgrade\BlockUpgradePathTest') WarningUpgradePathTestBase.php218Drupal\system\Tests\Upgrade\UpgradePathTestBase->performUpgrade()
Undefined index: backtraceNoticeerrors.inc188_drupal_log_error()
The service definition "php_storage" does not exist.Symfony\Component\DependencyInjection\Exception\InvalidArgumentExceptionContainerBuilder.php690Symfony\Component\DependencyInjection\ContainerBuilder->getDefinition()
No pending updates at the end of the update process.OtherUpgradePathTestBase.php234Drupal\system\Tests\Upgrade\UpgradePathTestBase->performUpgrade()
Exception: update.php still shows pending updates after execution. in Drupal\system\Tests\Upgrade\UpgradePathTestBase->performUpgrade() (line 235 of /var/lib/drupaltestbot/sites/default/files/checkout/core/modules/system/lib/Drupal/system/Tests/Upgrade/UpgradePathTestBase.php). Drupal\system\Tests\Upgrade\UpgradePathTestBase->performUpgrade() Drupal\system\Tests\Upgrade\BlockUpgradePathTest->testBlockUpgradeTitleLength() Drupal\simpletest\TestBase->run() simpletest_script_run_one_test('547', 'Drupal\system\Tests\Upgrade\BlockUpgradePathTest') Uncaught exceptionUpgradePathTestBase.php235Drupal\system\Tests\Upgrade\UpgradePathTestBase->performUpgrade()
ExpandDrupal\system\Tests\Upgrade\FilledMinimalUpgradePathTest1927
MessageGroupFilenameLineFunctionStatus
Undefined index: backtraceNoticeerrors.inc188_drupal_log_error()
The service definition "php_storage" does not exist.Symfony\Component\DependencyInjection\Exception\InvalidArgumentExceptionContainerBuilder.php690Symfony\Component\DependencyInjection\ContainerBuilder->getDefinition()
simplexml_import_dom(): Invalid Nodetype to importsimplexml_import_dom(Object) Drupal\simpletest\WebTestBase->parse() Drupal\simpletest\WebTestBase->xpath('//li[@class=:class]', Array) Drupal\system\Tests\Upgrade\UpgradePathTestBase->performUpgrade() Drupal\system\Tests\Upgrade\FilledMinimalUpgradePathTest->testFilledMinimalUpgrade() Drupal\simpletest\TestBase->run() simpletest_script_run_one_test('548', 'Drupal\system\Tests\Upgrade\FilledMinimalUpgradePathTest') WarningWebTestBase.php1036Drupal\simpletest\WebTestBase->parse()
Parsed page successfully.BrowserUpgradePathTestBase.php218Drupal\system\Tests\Upgrade\UpgradePathTestBase->performUpgrade()
Invalid argument supplied for foreach()Drupal\system\Tests\Upgrade\UpgradePathTestBase->performUpgrade() Drupal\system\Tests\Upgrade\FilledMinimalUpgradePathTest->testFilledMinimalUpgrade() Drupal\simpletest\TestBase->run() simpletest_script_run_one_test('548', 'Drupal\system\Tests\Upgrade\FilledMinimalUpgradePathTest') WarningUpgradePathTestBase.php218Drupal\system\Tests\Upgrade\UpgradePathTestBase->performUpgrade()
Undefined index: backtraceNoticeerrors.inc188_drupal_log_error()
The service definition "php_storage" does not exist.Symfony\Component\DependencyInjection\Exception\InvalidArgumentExceptionContainerBuilder.php690Symfony\Component\DependencyInjection\ContainerBuilder->getDefinition()
No pending updates at the end of the update process.OtherUpgradePathTestBase.php234Drupal\system\Tests\Upgrade\UpgradePathTestBase->performUpgrade()
Exception: update.php still shows pending updates after execution. in Drupal\system\Tests\Upgrade\UpgradePathTestBase->performUpgrade() (line 235 of /var/lib/drupaltestbot/sites/default/files/checkout/core/modules/system/lib/Drupal/system/Tests/Upgrade/UpgradePathTestBase.php). Drupal\system\Tests\Upgrade\UpgradePathTestBase->performUpgrade() Drupal\system\Tests\Upgrade\FilledMinimalUpgradePathTest->testFilledMinimalUpgrade() Drupal\simpletest\TestBase->run() simpletest_script_run_one_test('548', 'Drupal\system\Tests\Upgrade\FilledMinimalUpgradePathTest') Uncaught exceptionUpgradePathTestBase.php235Drupal\system\Tests\Upgrade\UpgradePathTestBase->performUpgrade()
ExpandDrupal\system\Tests\Upgrade\FilledStandardUpgradePathTest2127
MessageGroupFilenameLineFunctionStatus
Undefined index: backtraceNoticeerrors.inc188_drupal_log_error()
The service definition "php_storage" does not exist.Symfony\Component\DependencyInjection\Exception\InvalidArgumentExceptionContainerBuilder.php690Symfony\Component\DependencyInjection\ContainerBuilder->getDefinition()
simplexml_import_dom(): Invalid Nodetype to importsimplexml_import_dom(Object) Drupal\simpletest\WebTestBase->parse() Drupal\simpletest\WebTestBase->xpath('//li[@class=:class]', Array) Drupal\system\Tests\Upgrade\UpgradePathTestBase->performUpgrade() Drupal\system\Tests\Upgrade\FilledStandardUpgradePathTest->testFilledStandardUpgrade() Drupal\simpletest\TestBase->run() simpletest_script_run_one_test('549', 'Drupal\system\Tests\Upgrade\FilledStandardUpgradePathTest') WarningWebTestBase.php1036Drupal\simpletest\WebTestBase->parse()
Parsed page successfully.BrowserUpgradePathTestBase.php218Drupal\system\Tests\Upgrade\UpgradePathTestBase->performUpgrade()
Invalid argument supplied for foreach()Drupal\system\Tests\Upgrade\UpgradePathTestBase->performUpgrade() Drupal\system\Tests\Upgrade\FilledStandardUpgradePathTest->testFilledStandardUpgrade() Drupal\simpletest\TestBase->run() simpletest_script_run_one_test('549', 'Drupal\system\Tests\Upgrade\FilledStandardUpgradePathTest') WarningUpgradePathTestBase.php218Drupal\system\Tests\Upgrade\UpgradePathTestBase->performUpgrade()
Undefined index: backtraceNoticeerrors.inc188_drupal_log_error()
The service definition "php_storage" does not exist.Symfony\Component\DependencyInjection\Exception\InvalidArgumentExceptionContainerBuilder.php690Symfony\Component\DependencyInjection\ContainerBuilder->getDefinition()
No pending updates at the end of the update process.OtherUpgradePathTestBase.php234Drupal\system\Tests\Upgrade\UpgradePathTestBase->performUpgrade()
Exception: update.php still shows pending updates after execution. in Drupal\system\Tests\Upgrade\UpgradePathTestBase->performUpgrade() (line 235 of /var/lib/drupaltestbot/sites/default/files/checkout/core/modules/system/lib/Drupal/system/Tests/Upgrade/UpgradePathTestBase.php). Drupal\system\Tests\Upgrade\UpgradePathTestBase->performUpgrade() Drupal\system\Tests\Upgrade\FilledStandardUpgradePathTest->testFilledStandardUpgrade() Drupal\simpletest\TestBase->run() simpletest_script_run_one_test('549', 'Drupal\system\Tests\Upgrade\FilledStandardUpgradePathTest') Uncaught exceptionUpgradePathTestBase.php235Drupal\system\Tests\Upgrade\UpgradePathTestBase->performUpgrade()
ExpandDrupal\system\Tests\Upgrade\ImageUpgradePathTest2127
MessageGroupFilenameLineFunctionStatus
Undefined index: backtraceNoticeerrors.inc188_drupal_log_error()
The service definition "php_storage" does not exist.Symfony\Component\DependencyInjection\Exception\InvalidArgumentExceptionContainerBuilder.php690Symfony\Component\DependencyInjection\ContainerBuilder->getDefinition()
simplexml_import_dom(): Invalid Nodetype to importsimplexml_import_dom(Object) Drupal\simpletest\WebTestBase->parse() Drupal\simpletest\WebTestBase->xpath('//li[@class=:class]', Array) Drupal\system\Tests\Upgrade\UpgradePathTestBase->performUpgrade() Drupal\system\Tests\Upgrade\ImageUpgradePathTest->testImageStyleUpgrade() Drupal\simpletest\TestBase->run() simpletest_script_run_one_test('550', 'Drupal\system\Tests\Upgrade\ImageUpgradePathTest') WarningWebTestBase.php1036Drupal\simpletest\WebTestBase->parse()
Parsed page successfully.BrowserUpgradePathTestBase.php218Drupal\system\Tests\Upgrade\UpgradePathTestBase->performUpgrade()
Invalid argument supplied for foreach()Drupal\system\Tests\Upgrade\UpgradePathTestBase->performUpgrade() Drupal\system\Tests\Upgrade\ImageUpgradePathTest->testImageStyleUpgrade() Drupal\simpletest\TestBase->run() simpletest_script_run_one_test('550', 'Drupal\system\Tests\Upgrade\ImageUpgradePathTest') WarningUpgradePathTestBase.php218Drupal\system\Tests\Upgrade\UpgradePathTestBase->performUpgrade()
Undefined index: backtraceNoticeerrors.inc188_drupal_log_error()
The service definition "php_storage" does not exist.Symfony\Component\DependencyInjection\Exception\InvalidArgumentExceptionContainerBuilder.php690Symfony\Component\DependencyInjection\ContainerBuilder->getDefinition()
No pending updates at the end of the update process.OtherUpgradePathTestBase.php234Drupal\system\Tests\Upgrade\UpgradePathTestBase->performUpgrade()
Exception: update.php still shows pending updates after execution. in Drupal\system\Tests\Upgrade\UpgradePathTestBase->performUpgrade() (line 235 of /var/lib/drupaltestbot/sites/default/files/checkout/core/modules/system/lib/Drupal/system/Tests/Upgrade/UpgradePathTestBase.php). Drupal\system\Tests\Upgrade\UpgradePathTestBase->performUpgrade() Drupal\system\Tests\Upgrade\ImageUpgradePathTest->testImageStyleUpgrade() Drupal\simpletest\TestBase->run() simpletest_script_run_one_test('550', 'Drupal\system\Tests\Upgrade\ImageUpgradePathTest') Uncaught exceptionUpgradePathTestBase.php235Drupal\system\Tests\Upgrade\UpgradePathTestBase->performUpgrade()
ExpandDrupal\system\Tests\Upgrade\LanguageUpgradePathTest88828
MessageGroupFilenameLineFunctionStatus
Undefined index: backtraceNoticeerrors.inc188_drupal_log_error()
The service definition "php_storage" does not exist.Symfony\Component\DependencyInjection\Exception\InvalidArgumentExceptionContainerBuilder.php690Symfony\Component\DependencyInjection\ContainerBuilder->getDefinition()
simplexml_import_dom(): Invalid Nodetype to importsimplexml_import_dom(Object) Drupal\simpletest\WebTestBase->parse() Drupal\simpletest\WebTestBase->xpath('//li[@class=:class]', Array) Drupal\system\Tests\Upgrade\UpgradePathTestBase->performUpgrade() Drupal\system\Tests\Upgrade\LanguageUpgradePathTest->testLanguageUpgrade() Drupal\simpletest\TestBase->run() simpletest_script_run_one_test('551', 'Drupal\system\Tests\Upgrade\LanguageUpgradePathTest') WarningWebTestBase.php1036Drupal\simpletest\WebTestBase->parse()
Parsed page successfully.BrowserUpgradePathTestBase.php218Drupal\system\Tests\Upgrade\UpgradePathTestBase->performUpgrade()
Invalid argument supplied for foreach()Drupal\system\Tests\Upgrade\UpgradePathTestBase->performUpgrade() Drupal\system\Tests\Upgrade\LanguageUpgradePathTest->testLanguageUpgrade() Drupal\simpletest\TestBase->run() simpletest_script_run_one_test('551', 'Drupal\system\Tests\Upgrade\LanguageUpgradePathTest') WarningUpgradePathTestBase.php218Drupal\system\Tests\Upgrade\UpgradePathTestBase->performUpgrade()
Undefined index: backtraceNoticeerrors.inc188_drupal_log_error()
The service definition "php_storage" does not exist.Symfony\Component\DependencyInjection\Exception\InvalidArgumentExceptionContainerBuilder.php690Symfony\Component\DependencyInjection\ContainerBuilder->getDefinition()
No pending updates at the end of the update process.OtherUpgradePathTestBase.php234Drupal\system\Tests\Upgrade\UpgradePathTestBase->performUpgrade()
Exception: update.php still shows pending updates after execution. in Drupal\system\Tests\Upgrade\UpgradePathTestBase->performUpgrade() (line 235 of /var/lib/drupaltestbot/sites/default/files/checkout/core/modules/system/lib/Drupal/system/Tests/Upgrade/UpgradePathTestBase.php). Drupal\system\Tests\Upgrade\UpgradePathTestBase->performUpgrade() Drupal\system\Tests\Upgrade\LanguageUpgradePathTest->testLanguageUpgrade() Drupal\simpletest\TestBase->run() simpletest_script_run_one_test('551', 'Drupal\system\Tests\Upgrade\LanguageUpgradePathTest') Uncaught exceptionUpgradePathTestBase.php235Drupal\system\Tests\Upgrade\UpgradePathTestBase->performUpgrade()
Undefined index: backtraceNoticeerrors.inc188_drupal_log_error()
The service definition "php_storage" does not exist.Symfony\Component\DependencyInjection\Exception\InvalidArgumentExceptionContainerBuilder.php690Symfony\Component\DependencyInjection\ContainerBuilder->getDefinition()
simplexml_import_dom(): Invalid Nodetype to importsimplexml_import_dom(Object) Drupal\simpletest\WebTestBase->parse() Drupal\simpletest\WebTestBase->xpath('//li[@class=:class]', Array) Drupal\system\Tests\Upgrade\UpgradePathTestBase->performUpgrade() Drupal\system\Tests\Upgrade\LanguageUpgradePathTest->testLanguageUrlUpgrade() Drupal\simpletest\TestBase->run() simpletest_script_run_one_test('551', 'Drupal\system\Tests\Upgrade\LanguageUpgradePathTest') WarningWebTestBase.php1036Drupal\simpletest\WebTestBase->parse()
Parsed page successfully.BrowserUpgradePathTestBase.php218Drupal\system\Tests\Upgrade\UpgradePathTestBase->performUpgrade()
Invalid argument supplied for foreach()Drupal\system\Tests\Upgrade\UpgradePathTestBase->performUpgrade() Drupal\system\Tests\Upgrade\LanguageUpgradePathTest->testLanguageUrlUpgrade() Drupal\simpletest\TestBase->run() simpletest_script_run_one_test('551', 'Drupal\system\Tests\Upgrade\LanguageUpgradePathTest') WarningUpgradePathTestBase.php218Drupal\system\Tests\Upgrade\UpgradePathTestBase->performUpgrade()
Undefined index: backtraceNoticeerrors.inc188_drupal_log_error()
The service definition "php_storage" does not exist.Symfony\Component\DependencyInjection\Exception\InvalidArgumentExceptionContainerBuilder.php690Symfony\Component\DependencyInjection\ContainerBuilder->getDefinition()
No pending updates at the end of the update process.OtherUpgradePathTestBase.php234Drupal\system\Tests\Upgrade\UpgradePathTestBase->performUpgrade()
Exception: update.php still shows pending updates after execution. in Drupal\system\Tests\Upgrade\UpgradePathTestBase->performUpgrade() (line 235 of /var/lib/drupaltestbot/sites/default/files/checkout/core/modules/system/lib/Drupal/system/Tests/Upgrade/UpgradePathTestBase.php). Drupal\system\Tests\Upgrade\UpgradePathTestBase->performUpgrade() Drupal\system\Tests\Upgrade\LanguageUpgradePathTest->testLanguageUrlUpgrade() Drupal\simpletest\TestBase->run() simpletest_script_run_one_test('551', 'Drupal\system\Tests\Upgrade\LanguageUpgradePathTest') Uncaught exceptionUpgradePathTestBase.php235Drupal\system\Tests\Upgrade\UpgradePathTestBase->performUpgrade()
Undefined index: backtraceNoticeerrors.inc188_drupal_log_error()
The service definition "php_storage" does not exist.Symfony\Component\DependencyInjection\Exception\InvalidArgumentExceptionContainerBuilder.php690Symfony\Component\DependencyInjection\ContainerBuilder->getDefinition()
simplexml_import_dom(): Invalid Nodetype to importsimplexml_import_dom(Object) Drupal\simpletest\WebTestBase->parse() Drupal\simpletest\WebTestBase->xpath('//li[@class=:class]', Array) Drupal\system\Tests\Upgrade\UpgradePathTestBase->performUpgrade() Drupal\system\Tests\Upgrade\LanguageUpgradePathTest->testLanguageNoPluralsUpgrade() Drupal\simpletest\TestBase->run() simpletest_script_run_one_test('551', 'Drupal\system\Tests\Upgrade\LanguageUpgradePathTest') WarningWebTestBase.php1036Drupal\simpletest\WebTestBase->parse()
Parsed page successfully.BrowserUpgradePathTestBase.php218Drupal\system\Tests\Upgrade\UpgradePathTestBase->performUpgrade()
Invalid argument supplied for foreach()Drupal\system\Tests\Upgrade\UpgradePathTestBase->performUpgrade() Drupal\system\Tests\Upgrade\LanguageUpgradePathTest->testLanguageNoPluralsUpgrade() Drupal\simpletest\TestBase->run() simpletest_script_run_one_test('551', 'Drupal\system\Tests\Upgrade\LanguageUpgradePathTest') WarningUpgradePathTestBase.php218Drupal\system\Tests\Upgrade\UpgradePathTestBase->performUpgrade()
Undefined index: backtraceNoticeerrors.inc188_drupal_log_error()
The service definition "php_storage" does not exist.Symfony\Component\DependencyInjection\Exception\InvalidArgumentExceptionContainerBuilder.php690Symfony\Component\DependencyInjection\ContainerBuilder->getDefinition()
No pending updates at the end of the update process.OtherUpgradePathTestBase.php234Drupal\system\Tests\Upgrade\UpgradePathTestBase->performUpgrade()
Exception: update.php still shows pending updates after execution. in Drupal\system\Tests\Upgrade\UpgradePathTestBase->performUpgrade() (line 235 of /var/lib/drupaltestbot/sites/default/files/checkout/core/modules/system/lib/Drupal/system/Tests/Upgrade/UpgradePathTestBase.php). Drupal\system\Tests\Upgrade\UpgradePathTestBase->performUpgrade() Drupal\system\Tests\Upgrade\LanguageUpgradePathTest->testLanguageNoPluralsUpgrade() Drupal\simpletest\TestBase->run() simpletest_script_run_one_test('551', 'Drupal\system\Tests\Upgrade\LanguageUpgradePathTest') Uncaught exceptionUpgradePathTestBase.php235Drupal\system\Tests\Upgrade\UpgradePathTestBase->performUpgrade()
Undefined index: backtraceNoticeerrors.inc188_drupal_log_error()
The service definition "php_storage" does not exist.Symfony\Component\DependencyInjection\Exception\InvalidArgumentExceptionContainerBuilder.php690Symfony\Component\DependencyInjection\ContainerBuilder->getDefinition()
simplexml_import_dom(): Invalid Nodetype to importsimplexml_import_dom(Object) Drupal\simpletest\WebTestBase->parse() Drupal\simpletest\WebTestBase->xpath('//li[@class=:class]', Array) Drupal\system\Tests\Upgrade\UpgradePathTestBase->performUpgrade() Drupal\system\Tests\Upgrade\LanguageUpgradePathTest->testLanguagePermissionsUpgrade() Drupal\simpletest\TestBase->run() simpletest_script_run_one_test('551', 'Drupal\system\Tests\Upgrade\LanguageUpgradePathTest') WarningWebTestBase.php1036Drupal\simpletest\WebTestBase->parse()
Parsed page successfully.BrowserUpgradePathTestBase.php218Drupal\system\Tests\Upgrade\UpgradePathTestBase->performUpgrade()
Invalid argument supplied for foreach()Drupal\system\Tests\Upgrade\UpgradePathTestBase->performUpgrade() Drupal\system\Tests\Upgrade\LanguageUpgradePathTest->testLanguagePermissionsUpgrade() Drupal\simpletest\TestBase->run() simpletest_script_run_one_test('551', 'Drupal\system\Tests\Upgrade\LanguageUpgradePathTest') WarningUpgradePathTestBase.php218Drupal\system\Tests\Upgrade\UpgradePathTestBase->performUpgrade()
Undefined index: backtraceNoticeerrors.inc188_drupal_log_error()
The service definition "php_storage" does not exist.Symfony\Component\DependencyInjection\Exception\InvalidArgumentExceptionContainerBuilder.php690Symfony\Component\DependencyInjection\ContainerBuilder->getDefinition()
No pending updates at the end of the update process.OtherUpgradePathTestBase.php234Drupal\system\Tests\Upgrade\UpgradePathTestBase->performUpgrade()
Exception: update.php still shows pending updates after execution. in Drupal\system\Tests\Upgrade\UpgradePathTestBase->performUpgrade() (line 235 of /var/lib/drupaltestbot/sites/default/files/checkout/core/modules/system/lib/Drupal/system/Tests/Upgrade/UpgradePathTestBase.php). Drupal\system\Tests\Upgrade\UpgradePathTestBase->performUpgrade() Drupal\system\Tests\Upgrade\LanguageUpgradePathTest->testLanguagePermissionsUpgrade() Drupal\simpletest\TestBase->run() simpletest_script_run_one_test('551', 'Drupal\system\Tests\Upgrade\LanguageUpgradePathTest') Uncaught exceptionUpgradePathTestBase.php235Drupal\system\Tests\Upgrade\UpgradePathTestBase->performUpgrade()
ExpandDrupal\system\Tests\Upgrade\ModulesDisabledUpgradePathTest2127
MessageGroupFilenameLineFunctionStatus
Undefined index: backtraceNoticeerrors.inc188_drupal_log_error()
The service definition "php_storage" does not exist.Symfony\Component\DependencyInjection\Exception\InvalidArgumentExceptionContainerBuilder.php690Symfony\Component\DependencyInjection\ContainerBuilder->getDefinition()
simplexml_import_dom(): Invalid Nodetype to importsimplexml_import_dom(Object) Drupal\simpletest\WebTestBase->parse() Drupal\simpletest\WebTestBase->xpath('//li[@class=:class]', Array) Drupal\system\Tests\Upgrade\UpgradePathTestBase->performUpgrade() Drupal\system\Tests\Upgrade\ModulesDisabledUpgradePathTest->testDisabledUpgrade() Drupal\simpletest\TestBase->run() simpletest_script_run_one_test('552', 'Drupal\system\Tests\Upgrade\ModulesDisabledUpgradePathTest') WarningWebTestBase.php1036Drupal\simpletest\WebTestBase->parse()
Parsed page successfully.BrowserUpgradePathTestBase.php218Drupal\system\Tests\Upgrade\UpgradePathTestBase->performUpgrade()
Invalid argument supplied for foreach()Drupal\system\Tests\Upgrade\UpgradePathTestBase->performUpgrade() Drupal\system\Tests\Upgrade\ModulesDisabledUpgradePathTest->testDisabledUpgrade() Drupal\simpletest\TestBase->run() simpletest_script_run_one_test('552', 'Drupal\system\Tests\Upgrade\ModulesDisabledUpgradePathTest') WarningUpgradePathTestBase.php218Drupal\system\Tests\Upgrade\UpgradePathTestBase->performUpgrade()
Undefined index: backtraceNoticeerrors.inc188_drupal_log_error()
The service definition "php_storage" does not exist.Symfony\Component\DependencyInjection\Exception\InvalidArgumentExceptionContainerBuilder.php690Symfony\Component\DependencyInjection\ContainerBuilder->getDefinition()
No pending updates at the end of the update process.OtherUpgradePathTestBase.php234Drupal\system\Tests\Upgrade\UpgradePathTestBase->performUpgrade()
Exception: update.php still shows pending updates after execution. in Drupal\system\Tests\Upgrade\UpgradePathTestBase->performUpgrade() (line 235 of /var/lib/drupaltestbot/sites/default/files/checkout/core/modules/system/lib/Drupal/system/Tests/Upgrade/UpgradePathTestBase.php). Drupal\system\Tests\Upgrade\UpgradePathTestBase->performUpgrade() Drupal\system\Tests\Upgrade\ModulesDisabledUpgradePathTest->testDisabledUpgrade() Drupal\simpletest\TestBase->run() simpletest_script_run_one_test('552', 'Drupal\system\Tests\Upgrade\ModulesDisabledUpgradePathTest') Uncaught exceptionUpgradePathTestBase.php235Drupal\system\Tests\Upgrade\UpgradePathTestBase->performUpgrade()
ExpandDrupal\system\Tests\Upgrade\StateSystemUpgradePathTest2327
MessageGroupFilenameLineFunctionStatus
Undefined index: backtraceNoticeerrors.inc188_drupal_log_error()
The service definition "php_storage" does not exist.Symfony\Component\DependencyInjection\Exception\InvalidArgumentExceptionContainerBuilder.php690Symfony\Component\DependencyInjection\ContainerBuilder->getDefinition()
simplexml_import_dom(): Invalid Nodetype to importsimplexml_import_dom(Object) Drupal\simpletest\WebTestBase->parse() Drupal\simpletest\WebTestBase->xpath('//li[@class=:class]', Array) Drupal\system\Tests\Upgrade\UpgradePathTestBase->performUpgrade() Drupal\system\Tests\Upgrade\StateSystemUpgradePathTest->testSystemVariableUpgrade() Drupal\simpletest\TestBase->run() simpletest_script_run_one_test('553', 'Drupal\system\Tests\Upgrade\StateSystemUpgradePathTest') WarningWebTestBase.php1036Drupal\simpletest\WebTestBase->parse()
Parsed page successfully.BrowserUpgradePathTestBase.php218Drupal\system\Tests\Upgrade\UpgradePathTestBase->performUpgrade()
Invalid argument supplied for foreach()Drupal\system\Tests\Upgrade\UpgradePathTestBase->performUpgrade() Drupal\system\Tests\Upgrade\StateSystemUpgradePathTest->testSystemVariableUpgrade() Drupal\simpletest\TestBase->run() simpletest_script_run_one_test('553', 'Drupal\system\Tests\Upgrade\StateSystemUpgradePathTest') WarningUpgradePathTestBase.php218Drupal\system\Tests\Upgrade\UpgradePathTestBase->performUpgrade()
Undefined index: backtraceNoticeerrors.inc188_drupal_log_error()
The service definition "php_storage" does not exist.Symfony\Component\DependencyInjection\Exception\InvalidArgumentExceptionContainerBuilder.php690Symfony\Component\DependencyInjection\ContainerBuilder->getDefinition()
No pending updates at the end of the update process.OtherUpgradePathTestBase.php234Drupal\system\Tests\Upgrade\UpgradePathTestBase->performUpgrade()
Exception: update.php still shows pending updates after execution. in Drupal\system\Tests\Upgrade\UpgradePathTestBase->performUpgrade() (line 235 of /var/lib/drupaltestbot/sites/default/files/checkout/core/modules/system/lib/Drupal/system/Tests/Upgrade/UpgradePathTestBase.php). Drupal\system\Tests\Upgrade\UpgradePathTestBase->performUpgrade() Drupal\system\Tests\Upgrade\StateSystemUpgradePathTest->testSystemVariableUpgrade() Drupal\simpletest\TestBase->run() simpletest_script_run_one_test('553', 'Drupal\system\Tests\Upgrade\StateSystemUpgradePathTest') Uncaught exceptionUpgradePathTestBase.php235Drupal\system\Tests\Upgrade\UpgradePathTestBase->performUpgrade()
ExpandDrupal\system\Tests\Upgrade\SystemUpgradePathTest2327
MessageGroupFilenameLineFunctionStatus
Undefined index: backtraceNoticeerrors.inc188_drupal_log_error()
The service definition "php_storage" does not exist.Symfony\Component\DependencyInjection\Exception\InvalidArgumentExceptionContainerBuilder.php690Symfony\Component\DependencyInjection\ContainerBuilder->getDefinition()
simplexml_import_dom(): Invalid Nodetype to importsimplexml_import_dom(Object) Drupal\simpletest\WebTestBase->parse() Drupal\simpletest\WebTestBase->xpath('//li[@class=:class]', Array) Drupal\system\Tests\Upgrade\UpgradePathTestBase->performUpgrade() Drupal\system\Tests\Upgrade\SystemUpgradePathTest->testVariableUpgrade() Drupal\simpletest\TestBase->run() simpletest_script_run_one_test('554', 'Drupal\system\Tests\Upgrade\SystemUpgradePathTest') WarningWebTestBase.php1036Drupal\simpletest\WebTestBase->parse()
Parsed page successfully.BrowserUpgradePathTestBase.php218Drupal\system\Tests\Upgrade\UpgradePathTestBase->performUpgrade()
Invalid argument supplied for foreach()Drupal\system\Tests\Upgrade\UpgradePathTestBase->performUpgrade() Drupal\system\Tests\Upgrade\SystemUpgradePathTest->testVariableUpgrade() Drupal\simpletest\TestBase->run() simpletest_script_run_one_test('554', 'Drupal\system\Tests\Upgrade\SystemUpgradePathTest') WarningUpgradePathTestBase.php218Drupal\system\Tests\Upgrade\UpgradePathTestBase->performUpgrade()
Undefined index: backtraceNoticeerrors.inc188_drupal_log_error()
The service definition "php_storage" does not exist.Symfony\Component\DependencyInjection\Exception\InvalidArgumentExceptionContainerBuilder.php690Symfony\Component\DependencyInjection\ContainerBuilder->getDefinition()
No pending updates at the end of the update process.OtherUpgradePathTestBase.php234Drupal\system\Tests\Upgrade\UpgradePathTestBase->performUpgrade()
Exception: update.php still shows pending updates after execution. in Drupal\system\Tests\Upgrade\UpgradePathTestBase->performUpgrade() (line 235 of /var/lib/drupaltestbot/sites/default/files/checkout/core/modules/system/lib/Drupal/system/Tests/Upgrade/UpgradePathTestBase.php). Drupal\system\Tests\Upgrade\UpgradePathTestBase->performUpgrade() Drupal\system\Tests\Upgrade\SystemUpgradePathTest->testVariableUpgrade() Drupal\simpletest\TestBase->run() simpletest_script_run_one_test('554', 'Drupal\system\Tests\Upgrade\SystemUpgradePathTest') Uncaught exceptionUpgradePathTestBase.php235Drupal\system\Tests\Upgrade\UpgradePathTestBase->performUpgrade()
ExpandDrupal\system\Tests\Upgrade\UserRoleUpgradePathTest2327
MessageGroupFilenameLineFunctionStatus
Undefined index: backtraceNoticeerrors.inc188_drupal_log_error()
The service definition "php_storage" does not exist.Symfony\Component\DependencyInjection\Exception\InvalidArgumentExceptionContainerBuilder.php690Symfony\Component\DependencyInjection\ContainerBuilder->getDefinition()
simplexml_import_dom(): Invalid Nodetype to importsimplexml_import_dom(Object) Drupal\simpletest\WebTestBase->parse() Drupal\simpletest\WebTestBase->xpath('//li[@class=:class]', Array) Drupal\system\Tests\Upgrade\UpgradePathTestBase->performUpgrade() Drupal\system\Tests\Upgrade\UserRoleUpgradePathTest->testRoleUpgrade() Drupal\simpletest\TestBase->run() simpletest_script_run_one_test('555', 'Drupal\system\Tests\Upgrade\UserRoleUpgradePathTest') WarningWebTestBase.php1036Drupal\simpletest\WebTestBase->parse()
Parsed page successfully.BrowserUpgradePathTestBase.php218Drupal\system\Tests\Upgrade\UpgradePathTestBase->performUpgrade()
Invalid argument supplied for foreach()Drupal\system\Tests\Upgrade\UpgradePathTestBase->performUpgrade() Drupal\system\Tests\Upgrade\UserRoleUpgradePathTest->testRoleUpgrade() Drupal\simpletest\TestBase->run() simpletest_script_run_one_test('555', 'Drupal\system\Tests\Upgrade\UserRoleUpgradePathTest') WarningUpgradePathTestBase.php218Drupal\system\Tests\Upgrade\UpgradePathTestBase->performUpgrade()
Undefined index: backtraceNoticeerrors.inc188_drupal_log_error()
The service definition "php_storage" does not exist.Symfony\Component\DependencyInjection\Exception\InvalidArgumentExceptionContainerBuilder.php690Symfony\Component\DependencyInjection\ContainerBuilder->getDefinition()
No pending updates at the end of the update process.OtherUpgradePathTestBase.php234Drupal\system\Tests\Upgrade\UpgradePathTestBase->performUpgrade()
Exception: update.php still shows pending updates after execution. in Drupal\system\Tests\Upgrade\UpgradePathTestBase->performUpgrade() (line 235 of /var/lib/drupaltestbot/sites/default/files/checkout/core/modules/system/lib/Drupal/system/Tests/Upgrade/UpgradePathTestBase.php). Drupal\system\Tests\Upgrade\UpgradePathTestBase->performUpgrade() Drupal\system\Tests\Upgrade\UserRoleUpgradePathTest->testRoleUpgrade() Drupal\simpletest\TestBase->run() simpletest_script_run_one_test('555', 'Drupal\system\Tests\Upgrade\UserRoleUpgradePathTest') Uncaught exceptionUpgradePathTestBase.php235Drupal\system\Tests\Upgrade\UpgradePathTestBase->performUpgrade()
ExpandDrupal\system\Tests\Upgrade\UuidUpgradePathTest2127
MessageGroupFilenameLineFunctionStatus
Undefined index: backtraceNoticeerrors.inc188_drupal_log_error()
The service definition "php_storage" does not exist.Symfony\Component\DependencyInjection\Exception\InvalidArgumentExceptionContainerBuilder.php690Symfony\Component\DependencyInjection\ContainerBuilder->getDefinition()
simplexml_import_dom(): Invalid Nodetype to importsimplexml_import_dom(Object) Drupal\simpletest\WebTestBase->parse() Drupal\simpletest\WebTestBase->xpath('//li[@class=:class]', Array) Drupal\system\Tests\Upgrade\UpgradePathTestBase->performUpgrade() Drupal\system\Tests\Upgrade\UuidUpgradePathTest->testUuidUpgrade() Drupal\simpletest\TestBase->run() simpletest_script_run_one_test('556', 'Drupal\system\Tests\Upgrade\UuidUpgradePathTest') WarningWebTestBase.php1036Drupal\simpletest\WebTestBase->parse()
Parsed page successfully.BrowserUpgradePathTestBase.php218Drupal\system\Tests\Upgrade\UpgradePathTestBase->performUpgrade()
Invalid argument supplied for foreach()Drupal\system\Tests\Upgrade\UpgradePathTestBase->performUpgrade() Drupal\system\Tests\Upgrade\UuidUpgradePathTest->testUuidUpgrade() Drupal\simpletest\TestBase->run() simpletest_script_run_one_test('556', 'Drupal\system\Tests\Upgrade\UuidUpgradePathTest') WarningUpgradePathTestBase.php218Drupal\system\Tests\Upgrade\UpgradePathTestBase->performUpgrade()
Undefined index: backtraceNoticeerrors.inc188_drupal_log_error()
The service definition "php_storage" does not exist.Symfony\Component\DependencyInjection\Exception\InvalidArgumentExceptionContainerBuilder.php690Symfony\Component\DependencyInjection\ContainerBuilder->getDefinition()
No pending updates at the end of the update process.OtherUpgradePathTestBase.php234Drupal\system\Tests\Upgrade\UpgradePathTestBase->performUpgrade()
Exception: update.php still shows pending updates after execution. in Drupal\system\Tests\Upgrade\UpgradePathTestBase->performUpgrade() (line 235 of /var/lib/drupaltestbot/sites/default/files/checkout/core/modules/system/lib/Drupal/system/Tests/Upgrade/UpgradePathTestBase.php). Drupal\system\Tests\Upgrade\UpgradePathTestBase->performUpgrade() Drupal\system\Tests\Upgrade\UuidUpgradePathTest->testUuidUpgrade() Drupal\simpletest\TestBase->run() simpletest_script_run_one_test('556', 'Drupal\system\Tests\Upgrade\UuidUpgradePathTest') Uncaught exceptionUpgradePathTestBase.php235Drupal\system\Tests\Upgrade\UpgradePathTestBase->performUpgrade()
ExpandDrupal\user\Tests\UserRegistrationTest13002
MessageGroupFilenameLineFunctionStatus
rmdir(/var/lib/drupaltestbot/sites/default/files/checkout/sites/default/files/php/service_container/service_container_prod__simpletest166604.php): No such file or directoryrmdir('/var/lib/drupaltestbot/sites/default/files/checkout/sites/default/files/php/service_container/service_container_prod__simpletest166604.php') drupal_rmdir('/var/lib/drupaltestbot/sites/default/files/checkout/sites/default/files/php/service_container/service_container_prod__simpletest166604.php') file_unmanaged_delete_recursive('/var/lib/drupaltestbot/sites/default/files/checkout/sites/default/files/php/service_container/service_container_prod__simpletest166604.php', Array) file_unmanaged_delete_recursive('/var/lib/drupaltestbot/sites/default/files/checkout/sites/default/files/php/service_container', Array) Drupal\Component\PhpStorage\FileStorage->deleteAll() drupal_flush_all_caches() _install_profile_modules_finished(1, Array, Array, '0 sec') _batch_finished() _batch_process() batch_process('core/install.php?profile=testing&langcode=en', 'http://drupaltestbot659-mysql/checkout/core/install.php?profile=testing&langcode=en') install_run_task(Array, Array) install_run_tasks(Array) install_drupal(Array) Drupal\simpletest\WebTestBase->setUp() Drupal\simpletest\TestBase->run() simpletest_script_run_one_test('575', 'Drupal\user\Tests\UserRegistrationTest') Warningfile.inc1769drupal_rmdir()
rmdir(/var/lib/drupaltestbot/sites/default/files/checkout/sites/default/files/php/service_container): No such file or directoryrmdir('/var/lib/drupaltestbot/sites/default/files/checkout/sites/default/files/php/service_container') drupal_rmdir('/var/lib/drupaltestbot/sites/default/files/checkout/sites/default/files/php/service_container') file_unmanaged_delete_recursive('/var/lib/drupaltestbot/sites/default/files/checkout/sites/default/files/php/service_container', Array) Drupal\Component\PhpStorage\FileStorage->deleteAll() drupal_flush_all_caches() _install_profile_modules_finished(1, Array, Array, '0 sec') _batch_finished() _batch_process() batch_process('core/install.php?profile=testing&langcode=en', 'http://drupaltestbot659-mysql/checkout/core/install.php?profile=testing&langcode=en') install_run_task(Array, Array) install_run_tasks(Array) install_drupal(Array) Drupal\simpletest\WebTestBase->setUp() Drupal\simpletest\TestBase->run() simpletest_script_run_one_test('575', 'Drupal\user\Tests\UserRegistrationTest') Warningfile.inc1769drupal_rmdir()
ExpandDrupal\views\Tests\Handler\FilterEqualityTest410
MessageGroupFilenameLineFunctionStatus
The test did not complete due to a fatal error.Completion checkFilterEqualityTest.php82Drupal\views\Tests\Handler\FilterEqualityTest->testNotEqual()

All

Test namePassFailException
LeafDrupal\action\Tests\ConfigurationTest3900
LeafDrupal\action\Tests\LoopTest2100
LeafDrupal\aggregator\Tests\AddFeedTest7100
LeafDrupal\aggregator\Tests\AggregatorConfigurationTest2000
LeafDrupal\aggregator\Tests\AggregatorCronTest5500
LeafDrupal\aggregator\Tests\AggregatorRenderingTest22800
LeafDrupal\aggregator\Tests\CategorizeFeedItemTest6100
LeafDrupal\aggregator\Tests\CategorizeFeedTest2100
LeafDrupal\aggregator\Tests\FeedParserTest7200
LeafDrupal\aggregator\Tests\ImportOpmlTest5500
LeafDrupal\aggregator\Tests\RemoveFeedItemTest27000
LeafDrupal\aggregator\Tests\RemoveFeedTest2500
LeafDrupal\aggregator\Tests\UpdateFeedItemTest6500
LeafDrupal\aggregator\Tests\UpdateFeedTest7600
LeafDrupal\ban\Tests\IpAddressBlockingTest4300
LeafDrupal\block\Tests\BlockAdminThemeTest1900
LeafDrupal\block\Tests\BlockCacheTest20500
LeafDrupal\block\Tests\BlockHiddenRegionTest1800
LeafDrupal\block\Tests\BlockHtmlIdTest1600
LeafDrupal\block\Tests\BlockInvalidRegionTest2400
LeafDrupal\block\Tests\BlockLanguageTest9100
LeafDrupal\block\Tests\BlockTemplateSuggestionsUnitTest300
ExpandDrupal\block\Tests\BlockTest35801
MessageGroupFilenameLineFunctionStatus
rmdir(/var/lib/drupaltestbot/sites/default/files/checkout/sites/default/files/php/service_container): No such file or directoryrmdir('/var/lib/drupaltestbot/sites/default/files/checkout/sites/default/files/php/service_container') drupal_rmdir('/var/lib/drupaltestbot/sites/default/files/checkout/sites/default/files/php/service_container') file_unmanaged_delete_recursive('/var/lib/drupaltestbot/sites/default/files/checkout/sites/default/files/php/service_container', Array) Drupal\Component\PhpStorage\FileStorage->deleteAll() drupal_flush_all_caches() _install_profile_modules_finished(1, Array, Array, '0 sec') _batch_finished() _batch_process() batch_process('core/install.php?profile=testing&langcode=en', 'http://drupaltestbot659-mysql/checkout/core/install.php?profile=testing&langcode=en') install_run_task(Array, Array) install_run_tasks(Array) install_drupal(Array) Drupal\simpletest\WebTestBase->setUp() Drupal\block\Tests\BlockTest->setUp() Drupal\simpletest\TestBase->run() simpletest_script_run_one_test('32', 'Drupal\block\Tests\BlockTest') Warningfile.inc1769drupal_rmdir()
LeafDrupal\block\Tests\BlockUserAccountSettingsTest1200
LeafDrupal\block\Tests\NewDefaultThemeBlocksTest2200
LeafDrupal\block\Tests\NonDefaultBlockAdminTest1100
LeafDrupal\book\Tests\BookTest51700
LeafDrupal\breakpoint\Tests\BreakpointAPITest600
LeafDrupal\breakpoint\Tests\BreakpointCRUDTest2100
LeafDrupal\breakpoint\Tests\BreakpointGroupAPITest400
LeafDrupal\breakpoint\Tests\BreakpointGroupCRUDTest1200
LeafDrupal\breakpoint\Tests\BreakpointMediaQueryTest6300
LeafDrupal\breakpoint\Tests\BreakpointThemeTest2300
LeafDrupal\color\Tests\ColorTest8700
LeafDrupal\comment\Tests\CommentActionsTest3000
LeafDrupal\comment\Tests\CommentAnonymousTest16300
LeafDrupal\comment\Tests\CommentApprovalTest15200
LeafDrupal\comment\Tests\CommentBlockTest11800
LeafDrupal\comment\Tests\CommentContentRebuildTest3300
LeafDrupal\comment\Tests\CommentCSSTest50100
LeafDrupal\comment\Tests\CommentFieldsTest10700
LeafDrupal\comment\Tests\CommentInterfaceTest25100
LeafDrupal\comment\Tests\CommentLanguageTest7200
ExpandDrupal\comment\Tests\CommentLinksTest109300
MessageGroupFilenameLineFunctionStatus
Changed environment:array ( 'authenticated' => false, 'comment count' => false, 'form' => 'below', 'user_register' => 'visitors', 'contact' => 'optional', 'comments' => 'open', 'access comments' => 0, 'post comments' => 0, 'skip comment approval' => 1, 'edit own comments' => 0, )DebugCommentLinksTest.php194Drupal\comment\Tests\CommentLinksTest->setEnvironment()
Changed environment:array ( 'authenticated' => true, 'comment count' => false, 'form' => 'below', 'user_register' => 'visitors', 'contact' => 'optional', 'comments' => 'open', 'access comments' => 0, 'post comments' => 0, 'skip comment approval' => 1, 'edit own comments' => 0, )DebugCommentLinksTest.php194Drupal\comment\Tests\CommentLinksTest->setEnvironment()
Changed environment:array ( 'authenticated' => false, 'comment count' => true, 'form' => 'below', 'user_register' => 'visitors', 'contact' => 'optional', 'comments' => 'open', 'access comments' => 0, 'post comments' => 0, 'skip comment approval' => 1, 'edit own comments' => 0, )DebugCommentLinksTest.php194Drupal\comment\Tests\CommentLinksTest->setEnvironment()
Changed environment:array ( 'authenticated' => true, 'comment count' => true, 'form' => 'below', 'user_register' => 'visitors', 'contact' => 'optional', 'comments' => 'open', 'access comments' => 0, 'post comments' => 0, 'skip comment approval' => 1, 'edit own comments' => 0, )DebugCommentLinksTest.php194Drupal\comment\Tests\CommentLinksTest->setEnvironment()
Changed environment:array ( 'authenticated' => false, 'comment count' => false, 'form' => 'below', 'user_register' => 'visitors', 'contact' => 'optional', 'comments' => 'open', 'access comments' => 1, 'post comments' => 0, 'skip comment approval' => 1, 'edit own comments' => 0, )DebugCommentLinksTest.php194Drupal\comment\Tests\CommentLinksTest->setEnvironment()
Changed environment:array ( 'authenticated' => true, 'comment count' => false, 'form' => 'below', 'user_register' => 'visitors', 'contact' => 'optional', 'comments' => 'open', 'access comments' => 1, 'post comments' => 0, 'skip comment approval' => 1, 'edit own comments' => 0, )DebugCommentLinksTest.php194Drupal\comment\Tests\CommentLinksTest->setEnvironment()
Changed environment:array ( 'authenticated' => false, 'comment count' => true, 'form' => 'below', 'user_register' => 'visitors', 'contact' => 'optional', 'comments' => 'open', 'access comments' => 1, 'post comments' => 0, 'skip comment approval' => 1, 'edit own comments' => 0, )DebugCommentLinksTest.php194Drupal\comment\Tests\CommentLinksTest->setEnvironment()
Changed environment:array ( 'authenticated' => true, 'comment count' => true, 'form' => 'below', 'user_register' => 'visitors', 'contact' => 'optional', 'comments' => 'open', 'access comments' => 1, 'post comments' => 0, 'skip comment approval' => 1, 'edit own comments' => 0, )DebugCommentLinksTest.php194Drupal\comment\Tests\CommentLinksTest->setEnvironment()
Changed environment:array ( 'authenticated' => false, 'comment count' => false, 'form' => 'below', 'user_register' => 'visitors', 'contact' => 'optional', 'comments' => 'open', 'access comments' => 0, 'post comments' => 1, 'skip comment approval' => 1, 'edit own comments' => 0, )DebugCommentLinksTest.php194Drupal\comment\Tests\CommentLinksTest->setEnvironment()
Changed environment:array ( 'authenticated' => true, 'comment count' => false, 'form' => 'below', 'user_register' => 'visitors', 'contact' => 'optional', 'comments' => 'open', 'access comments' => 0, 'post comments' => 1, 'skip comment approval' => 1, 'edit own comments' => 0, )DebugCommentLinksTest.php194Drupal\comment\Tests\CommentLinksTest->setEnvironment()
Changed environment:array ( 'authenticated' => false, 'comment count' => true, 'form' => 'below', 'user_register' => 'visitors', 'contact' => 'optional', 'comments' => 'open', 'access comments' => 0, 'post comments' => 1, 'skip comment approval' => 1, 'edit own comments' => 0, )DebugCommentLinksTest.php194Drupal\comment\Tests\CommentLinksTest->setEnvironment()
Changed environment:array ( 'authenticated' => true, 'comment count' => true, 'form' => 'below', 'user_register' => 'visitors', 'contact' => 'optional', 'comments' => 'open', 'access comments' => 0, 'post comments' => 1, 'skip comment approval' => 1, 'edit own comments' => 0, )DebugCommentLinksTest.php194Drupal\comment\Tests\CommentLinksTest->setEnvironment()
Changed environment:array ( 'authenticated' => false, 'comment count' => false, 'form' => 'below', 'user_register' => 'visitors', 'contact' => 'optional', 'comments' => 'open', 'access comments' => 1, 'post comments' => 1, 'skip comment approval' => 1, 'edit own comments' => 0, )DebugCommentLinksTest.php194Drupal\comment\Tests\CommentLinksTest->setEnvironment()
Changed environment:array ( 'authenticated' => true, 'comment count' => false, 'form' => 'below', 'user_register' => 'visitors', 'contact' => 'optional', 'comments' => 'open', 'access comments' => 1, 'post comments' => 1, 'skip comment approval' => 1, 'edit own comments' => 0, )DebugCommentLinksTest.php194Drupal\comment\Tests\CommentLinksTest->setEnvironment()
Changed environment:array ( 'authenticated' => false, 'comment count' => true, 'form' => 'below', 'user_register' => 'visitors', 'contact' => 'optional', 'comments' => 'open', 'access comments' => 1, 'post comments' => 1, 'skip comment approval' => 1, 'edit own comments' => 0, )DebugCommentLinksTest.php194Drupal\comment\Tests\CommentLinksTest->setEnvironment()
Changed environment:array ( 'authenticated' => true, 'comment count' => true, 'form' => 'below', 'user_register' => 'visitors', 'contact' => 'optional', 'comments' => 'open', 'access comments' => 1, 'post comments' => 1, 'skip comment approval' => 1, 'edit own comments' => 0, )DebugCommentLinksTest.php194Drupal\comment\Tests\CommentLinksTest->setEnvironment()
Changed environment:array ( 'authenticated' => false, 'comment count' => false, 'form' => 'separate page', 'user_register' => 'visitors', 'contact' => 'optional', 'comments' => 'open', 'access comments' => 0, 'post comments' => 0, 'skip comment approval' => 1, 'edit own comments' => 0, )DebugCommentLinksTest.php194Drupal\comment\Tests\CommentLinksTest->setEnvironment()
Changed environment:array ( 'authenticated' => true, 'comment count' => false, 'form' => 'separate page', 'user_register' => 'visitors', 'contact' => 'optional', 'comments' => 'open', 'access comments' => 0, 'post comments' => 0, 'skip comment approval' => 1, 'edit own comments' => 0, )DebugCommentLinksTest.php194Drupal\comment\Tests\CommentLinksTest->setEnvironment()
Changed environment:array ( 'authenticated' => false, 'comment count' => true, 'form' => 'separate page', 'user_register' => 'visitors', 'contact' => 'optional', 'comments' => 'open', 'access comments' => 0, 'post comments' => 0, 'skip comment approval' => 1, 'edit own comments' => 0, )DebugCommentLinksTest.php194Drupal\comment\Tests\CommentLinksTest->setEnvironment()
Changed environment:array ( 'authenticated' => true, 'comment count' => true, 'form' => 'separate page', 'user_register' => 'visitors', 'contact' => 'optional', 'comments' => 'open', 'access comments' => 0, 'post comments' => 0, 'skip comment approval' => 1, 'edit own comments' => 0, )DebugCommentLinksTest.php194Drupal\comment\Tests\CommentLinksTest->setEnvironment()
Changed environment:array ( 'authenticated' => false, 'comment count' => false, 'form' => 'separate page', 'user_register' => 'visitors', 'contact' => 'optional', 'comments' => 'open', 'access comments' => 1, 'post comments' => 0, 'skip comment approval' => 1, 'edit own comments' => 0, )DebugCommentLinksTest.php194Drupal\comment\Tests\CommentLinksTest->setEnvironment()
Changed environment:array ( 'authenticated' => true, 'comment count' => false, 'form' => 'separate page', 'user_register' => 'visitors', 'contact' => 'optional', 'comments' => 'open', 'access comments' => 1, 'post comments' => 0, 'skip comment approval' => 1, 'edit own comments' => 0, )DebugCommentLinksTest.php194Drupal\comment\Tests\CommentLinksTest->setEnvironment()
Changed environment:array ( 'authenticated' => false, 'comment count' => true, 'form' => 'separate page', 'user_register' => 'visitors', 'contact' => 'optional', 'comments' => 'open', 'access comments' => 1, 'post comments' => 0, 'skip comment approval' => 1, 'edit own comments' => 0, )DebugCommentLinksTest.php194Drupal\comment\Tests\CommentLinksTest->setEnvironment()
Changed environment:array ( 'authenticated' => true, 'comment count' => true, 'form' => 'separate page', 'user_register' => 'visitors', 'contact' => 'optional', 'comments' => 'open', 'access comments' => 1, 'post comments' => 0, 'skip comment approval' => 1, 'edit own comments' => 0, )DebugCommentLinksTest.php194Drupal\comment\Tests\CommentLinksTest->setEnvironment()
Changed environment:array ( 'authenticated' => false, 'comment count' => false, 'form' => 'separate page', 'user_register' => 'visitors', 'contact' => 'optional', 'comments' => 'open', 'access comments' => 0, 'post comments' => 1, 'skip comment approval' => 1, 'edit own comments' => 0, )DebugCommentLinksTest.php194Drupal\comment\Tests\CommentLinksTest->setEnvironment()
Changed environment:array ( 'authenticated' => true, 'comment count' => false, 'form' => 'separate page', 'user_register' => 'visitors', 'contact' => 'optional', 'comments' => 'open', 'access comments' => 0, 'post comments' => 1, 'skip comment approval' => 1, 'edit own comments' => 0, )DebugCommentLinksTest.php194Drupal\comment\Tests\CommentLinksTest->setEnvironment()
Changed environment:array ( 'authenticated' => false, 'comment count' => true, 'form' => 'separate page', 'user_register' => 'visitors', 'contact' => 'optional', 'comments' => 'open', 'access comments' => 0, 'post comments' => 1, 'skip comment approval' => 1, 'edit own comments' => 0, )DebugCommentLinksTest.php194Drupal\comment\Tests\CommentLinksTest->setEnvironment()
Changed environment:array ( 'authenticated' => true, 'comment count' => true, 'form' => 'separate page', 'user_register' => 'visitors', 'contact' => 'optional', 'comments' => 'open', 'access comments' => 0, 'post comments' => 1, 'skip comment approval' => 1, 'edit own comments' => 0, )DebugCommentLinksTest.php194Drupal\comment\Tests\CommentLinksTest->setEnvironment()
Changed environment:array ( 'authenticated' => false, 'comment count' => false, 'form' => 'separate page', 'user_register' => 'visitors', 'contact' => 'optional', 'comments' => 'open', 'access comments' => 1, 'post comments' => 1, 'skip comment approval' => 1, 'edit own comments' => 0, )DebugCommentLinksTest.php194Drupal\comment\Tests\CommentLinksTest->setEnvironment()
Changed environment:array ( 'authenticated' => true, 'comment count' => false, 'form' => 'separate page', 'user_register' => 'visitors', 'contact' => 'optional', 'comments' => 'open', 'access comments' => 1, 'post comments' => 1, 'skip comment approval' => 1, 'edit own comments' => 0, )DebugCommentLinksTest.php194Drupal\comment\Tests\CommentLinksTest->setEnvironment()
Changed environment:array ( 'authenticated' => false, 'comment count' => true, 'form' => 'separate page', 'user_register' => 'visitors', 'contact' => 'optional', 'comments' => 'open', 'access comments' => 1, 'post comments' => 1, 'skip comment approval' => 1, 'edit own comments' => 0, )DebugCommentLinksTest.php194Drupal\comment\Tests\CommentLinksTest->setEnvironment()
Changed environment:array ( 'authenticated' => true, 'comment count' => true, 'form' => 'separate page', 'user_register' => 'visitors', 'contact' => 'optional', 'comments' => 'open', 'access comments' => 1, 'post comments' => 1, 'skip comment approval' => 1, 'edit own comments' => 0, )DebugCommentLinksTest.php194Drupal\comment\Tests\CommentLinksTest->setEnvironment()
Changed environment:array ( 'authenticated' => false, 'comment count' => false, 'form' => 'below', 'user_register' => 'admin_only', 'contact' => 'optional', 'comments' => 'open', 'access comments' => 0, 'post comments' => 0, 'skip comment approval' => 1, 'edit own comments' => 0, )DebugCommentLinksTest.php194Drupal\comment\Tests\CommentLinksTest->setEnvironment()
Changed environment:array ( 'authenticated' => true, 'comment count' => false, 'form' => 'below', 'user_register' => 'admin_only', 'contact' => 'optional', 'comments' => 'open', 'access comments' => 0, 'post comments' => 0, 'skip comment approval' => 1, 'edit own comments' => 0, )DebugCommentLinksTest.php194Drupal\comment\Tests\CommentLinksTest->setEnvironment()
Changed environment:array ( 'authenticated' => false, 'comment count' => true, 'form' => 'below', 'user_register' => 'admin_only', 'contact' => 'optional', 'comments' => 'open', 'access comments' => 0, 'post comments' => 0, 'skip comment approval' => 1, 'edit own comments' => 0, )DebugCommentLinksTest.php194Drupal\comment\Tests\CommentLinksTest->setEnvironment()
Changed environment:array ( 'authenticated' => true, 'comment count' => true, 'form' => 'below', 'user_register' => 'admin_only', 'contact' => 'optional', 'comments' => 'open', 'access comments' => 0, 'post comments' => 0, 'skip comment approval' => 1, 'edit own comments' => 0, )DebugCommentLinksTest.php194Drupal\comment\Tests\CommentLinksTest->setEnvironment()
Changed environment:array ( 'authenticated' => false, 'comment count' => false, 'form' => 'below', 'user_register' => 'admin_only', 'contact' => 'optional', 'comments' => 'open', 'access comments' => 1, 'post comments' => 0, 'skip comment approval' => 1, 'edit own comments' => 0, )DebugCommentLinksTest.php194Drupal\comment\Tests\CommentLinksTest->setEnvironment()
Changed environment:array ( 'authenticated' => true, 'comment count' => false, 'form' => 'below', 'user_register' => 'admin_only', 'contact' => 'optional', 'comments' => 'open', 'access comments' => 1, 'post comments' => 0, 'skip comment approval' => 1, 'edit own comments' => 0, )DebugCommentLinksTest.php194Drupal\comment\Tests\CommentLinksTest->setEnvironment()
Changed environment:array ( 'authenticated' => false, 'comment count' => true, 'form' => 'below', 'user_register' => 'admin_only', 'contact' => 'optional', 'comments' => 'open', 'access comments' => 1, 'post comments' => 0, 'skip comment approval' => 1, 'edit own comments' => 0, )DebugCommentLinksTest.php194Drupal\comment\Tests\CommentLinksTest->setEnvironment()
Changed environment:array ( 'authenticated' => true, 'comment count' => true, 'form' => 'below', 'user_register' => 'admin_only', 'contact' => 'optional', 'comments' => 'open', 'access comments' => 1, 'post comments' => 0, 'skip comment approval' => 1, 'edit own comments' => 0, )DebugCommentLinksTest.php194Drupal\comment\Tests\CommentLinksTest->setEnvironment()
Changed environment:array ( 'authenticated' => false, 'comment count' => false, 'form' => 'below', 'user_register' => 'admin_only', 'contact' => 'optional', 'comments' => 'open', 'access comments' => 0, 'post comments' => 1, 'skip comment approval' => 1, 'edit own comments' => 0, )DebugCommentLinksTest.php194Drupal\comment\Tests\CommentLinksTest->setEnvironment()
Changed environment:array ( 'authenticated' => true, 'comment count' => false, 'form' => 'below', 'user_register' => 'admin_only', 'contact' => 'optional', 'comments' => 'open', 'access comments' => 0, 'post comments' => 1, 'skip comment approval' => 1, 'edit own comments' => 0, )DebugCommentLinksTest.php194Drupal\comment\Tests\CommentLinksTest->setEnvironment()
Changed environment:array ( 'authenticated' => false, 'comment count' => true, 'form' => 'below', 'user_register' => 'admin_only', 'contact' => 'optional', 'comments' => 'open', 'access comments' => 0, 'post comments' => 1, 'skip comment approval' => 1, 'edit own comments' => 0, )DebugCommentLinksTest.php194Drupal\comment\Tests\CommentLinksTest->setEnvironment()
Changed environment:array ( 'authenticated' => true, 'comment count' => true, 'form' => 'below', 'user_register' => 'admin_only', 'contact' => 'optional', 'comments' => 'open', 'access comments' => 0, 'post comments' => 1, 'skip comment approval' => 1, 'edit own comments' => 0, )DebugCommentLinksTest.php194Drupal\comment\Tests\CommentLinksTest->setEnvironment()
Changed environment:array ( 'authenticated' => false, 'comment count' => false, 'form' => 'below', 'user_register' => 'admin_only', 'contact' => 'optional', 'comments' => 'open', 'access comments' => 1, 'post comments' => 1, 'skip comment approval' => 1, 'edit own comments' => 0, )DebugCommentLinksTest.php194Drupal\comment\Tests\CommentLinksTest->setEnvironment()
Changed environment:array ( 'authenticated' => true, 'comment count' => false, 'form' => 'below', 'user_register' => 'admin_only', 'contact' => 'optional', 'comments' => 'open', 'access comments' => 1, 'post comments' => 1, 'skip comment approval' => 1, 'edit own comments' => 0, )DebugCommentLinksTest.php194Drupal\comment\Tests\CommentLinksTest->setEnvironment()
Changed environment:array ( 'authenticated' => false, 'comment count' => true, 'form' => 'below', 'user_register' => 'admin_only', 'contact' => 'optional', 'comments' => 'open', 'access comments' => 1, 'post comments' => 1, 'skip comment approval' => 1, 'edit own comments' => 0, )DebugCommentLinksTest.php194Drupal\comment\Tests\CommentLinksTest->setEnvironment()
Changed environment:array ( 'authenticated' => true, 'comment count' => true, 'form' => 'below', 'user_register' => 'admin_only', 'contact' => 'optional', 'comments' => 'open', 'access comments' => 1, 'post comments' => 1, 'skip comment approval' => 1, 'edit own comments' => 0, )DebugCommentLinksTest.php194Drupal\comment\Tests\CommentLinksTest->setEnvironment()
Changed environment:array ( 'authenticated' => false, 'comment count' => false, 'form' => 'separate page', 'user_register' => 'admin_only', 'contact' => 'optional', 'comments' => 'open', 'access comments' => 0, 'post comments' => 0, 'skip comment approval' => 1, 'edit own comments' => 0, )DebugCommentLinksTest.php194Drupal\comment\Tests\CommentLinksTest->setEnvironment()
Changed environment:array ( 'authenticated' => true, 'comment count' => false, 'form' => 'separate page', 'user_register' => 'admin_only', 'contact' => 'optional', 'comments' => 'open', 'access comments' => 0, 'post comments' => 0, 'skip comment approval' => 1, 'edit own comments' => 0, )DebugCommentLinksTest.php194Drupal\comment\Tests\CommentLinksTest->setEnvironment()
Changed environment:array ( 'authenticated' => false, 'comment count' => true, 'form' => 'separate page', 'user_register' => 'admin_only', 'contact' => 'optional', 'comments' => 'open', 'access comments' => 0, 'post comments' => 0, 'skip comment approval' => 1, 'edit own comments' => 0, )DebugCommentLinksTest.php194Drupal\comment\Tests\CommentLinksTest->setEnvironment()
Changed environment:array ( 'authenticated' => true, 'comment count' => true, 'form' => 'separate page', 'user_register' => 'admin_only', 'contact' => 'optional', 'comments' => 'open', 'access comments' => 0, 'post comments' => 0, 'skip comment approval' => 1, 'edit own comments' => 0, )DebugCommentLinksTest.php194Drupal\comment\Tests\CommentLinksTest->setEnvironment()
Changed environment:array ( 'authenticated' => false, 'comment count' => false, 'form' => 'separate page', 'user_register' => 'admin_only', 'contact' => 'optional', 'comments' => 'open', 'access comments' => 1, 'post comments' => 0, 'skip comment approval' => 1, 'edit own comments' => 0, )DebugCommentLinksTest.php194Drupal\comment\Tests\CommentLinksTest->setEnvironment()
Changed environment:array ( 'authenticated' => true, 'comment count' => false, 'form' => 'separate page', 'user_register' => 'admin_only', 'contact' => 'optional', 'comments' => 'open', 'access comments' => 1, 'post comments' => 0, 'skip comment approval' => 1, 'edit own comments' => 0, )DebugCommentLinksTest.php194Drupal\comment\Tests\CommentLinksTest->setEnvironment()
Changed environment:array ( 'authenticated' => false, 'comment count' => true, 'form' => 'separate page', 'user_register' => 'admin_only', 'contact' => 'optional', 'comments' => 'open', 'access comments' => 1, 'post comments' => 0, 'skip comment approval' => 1, 'edit own comments' => 0, )DebugCommentLinksTest.php194Drupal\comment\Tests\CommentLinksTest->setEnvironment()
Changed environment:array ( 'authenticated' => true, 'comment count' => true, 'form' => 'separate page', 'user_register' => 'admin_only', 'contact' => 'optional', 'comments' => 'open', 'access comments' => 1, 'post comments' => 0, 'skip comment approval' => 1, 'edit own comments' => 0, )DebugCommentLinksTest.php194Drupal\comment\Tests\CommentLinksTest->setEnvironment()
Changed environment:array ( 'authenticated' => false, 'comment count' => false, 'form' => 'separate page', 'user_register' => 'admin_only', 'contact' => 'optional', 'comments' => 'open', 'access comments' => 0, 'post comments' => 1, 'skip comment approval' => 1, 'edit own comments' => 0, )DebugCommentLinksTest.php194Drupal\comment\Tests\CommentLinksTest->setEnvironment()
Changed environment:array ( 'authenticated' => true, 'comment count' => false, 'form' => 'separate page', 'user_register' => 'admin_only', 'contact' => 'optional', 'comments' => 'open', 'access comments' => 0, 'post comments' => 1, 'skip comment approval' => 1, 'edit own comments' => 0, )DebugCommentLinksTest.php194Drupal\comment\Tests\CommentLinksTest->setEnvironment()
Changed environment:array ( 'authenticated' => false, 'comment count' => true, 'form' => 'separate page', 'user_register' => 'admin_only', 'contact' => 'optional', 'comments' => 'open', 'access comments' => 0, 'post comments' => 1, 'skip comment approval' => 1, 'edit own comments' => 0, )DebugCommentLinksTest.php194Drupal\comment\Tests\CommentLinksTest->setEnvironment()
Changed environment:array ( 'authenticated' => true, 'comment count' => true, 'form' => 'separate page', 'user_register' => 'admin_only', 'contact' => 'optional', 'comments' => 'open', 'access comments' => 0, 'post comments' => 1, 'skip comment approval' => 1, 'edit own comments' => 0, )DebugCommentLinksTest.php194Drupal\comment\Tests\CommentLinksTest->setEnvironment()
Changed environment:array ( 'authenticated' => false, 'comment count' => false, 'form' => 'separate page', 'user_register' => 'admin_only', 'contact' => 'optional', 'comments' => 'open', 'access comments' => 1, 'post comments' => 1, 'skip comment approval' => 1, 'edit own comments' => 0, )DebugCommentLinksTest.php194Drupal\comment\Tests\CommentLinksTest->setEnvironment()
Changed environment:array ( 'authenticated' => true, 'comment count' => false, 'form' => 'separate page', 'user_register' => 'admin_only', 'contact' => 'optional', 'comments' => 'open', 'access comments' => 1, 'post comments' => 1, 'skip comment approval' => 1, 'edit own comments' => 0, )DebugCommentLinksTest.php194Drupal\comment\Tests\CommentLinksTest->setEnvironment()
Changed environment:array ( 'authenticated' => false, 'comment count' => true, 'form' => 'separate page', 'user_register' => 'admin_only', 'contact' => 'optional', 'comments' => 'open', 'access comments' => 1, 'post comments' => 1, 'skip comment approval' => 1, 'edit own comments' => 0, )DebugCommentLinksTest.php194Drupal\comment\Tests\CommentLinksTest->setEnvironment()
Changed environment:array ( 'authenticated' => true, 'comment count' => true, 'form' => 'separate page', 'user_register' => 'admin_only', 'contact' => 'optional', 'comments' => 'open', 'access comments' => 1, 'post comments' => 1, 'skip comment approval' => 1, 'edit own comments' => 0, )DebugCommentLinksTest.php194Drupal\comment\Tests\CommentLinksTest->setEnvironment()
LeafDrupal\comment\Tests\CommentNewIndicatorTest4200
LeafDrupal\comment\Tests\CommentNodeAccessTest5700
LeafDrupal\comment\Tests\CommentNodeChangesTest2400
LeafDrupal\comment\Tests\CommentPagerTest21300
LeafDrupal\comment\Tests\CommentPreviewTest9800
LeafDrupal\comment\Tests\CommentRssTest2600
LeafDrupal\comment\Tests\CommentStatisticsTest9800
LeafDrupal\comment\Tests\CommentThreadingTest15900
LeafDrupal\comment\Tests\CommentTokenReplaceTest6600
LeafDrupal\comment\Tests\CommentTranslationUITest6800
LeafDrupal\config\Tests\ConfigCRUDTest2000
LeafDrupal\config\Tests\ConfigEntityListTest6800
LeafDrupal\config\Tests\ConfigEntityTest13700
LeafDrupal\config\Tests\ConfigFileContentTest3100
LeafDrupal\config\Tests\ConfigImportTest3800
LeafDrupal\config\Tests\ConfigImportUITest4600
LeafDrupal\config\Tests\ConfigInstallTest1100
LeafDrupal\config\Tests\ConfigOverrideTest1800
LeafDrupal\config\Tests\ConfigUpgradeTest1200
LeafDrupal\config\Tests\LocaleConfigOverride300
LeafDrupal\config\Tests\Storage\DatabaseStorageTest1900
LeafDrupal\config\Tests\Storage\FileStorageTest2100
LeafDrupal\contact\Tests\ContactAuthenticatedUserTest1300
LeafDrupal\contact\Tests\ContactPersonalTest16200
LeafDrupal\contact\Tests\ContactSitewideTest24400
LeafDrupal\contextual\Tests\ContextualDynamicContextTest1600
LeafDrupal\dblog\Tests\DBLogTest37300
LeafDrupal\email\Tests\EmailFieldTest1800
LeafDrupal\field\Tests\BulkDeleteTest7500
LeafDrupal\field\Tests\CrudTest6900
LeafDrupal\field\Tests\DisplayApiTest4600
LeafDrupal\field\Tests\EntityPropertiesTest400
LeafDrupal\field\Tests\FieldAccessTest2100
LeafDrupal\field\Tests\FieldAttachOtherTest10300
LeafDrupal\field\Tests\FieldAttachStorageTest9200
LeafDrupal\field\Tests\FieldInfoTest7100
LeafDrupal\field\Tests\FieldInstanceCrudTest3800
LeafDrupal\field\Tests\FormTest26500
LeafDrupal\field\Tests\TranslationTest10200
LeafDrupal\field_sql_storage\Tests\FieldSqlStorageTest9200
LeafDrupal\field_ui\Tests\AlterTest2100
LeafDrupal\field_ui\Tests\ManageDisplayTest12300
LeafDrupal\field_ui\Tests\ManageFieldsTest20100
LeafDrupal\file\Tests\CopyTest11000
LeafDrupal\file\Tests\DeleteTest2400
LeafDrupal\file\Tests\DownloadTest4500
LeafDrupal\file\Tests\FileFieldDisplayTest5000
LeafDrupal\file\Tests\FileFieldPathTest2700
LeafDrupal\file\Tests\FileFieldRevisionTest6700
LeafDrupal\file\Tests\FileFieldRSSContentTest2300
LeafDrupal\file\Tests\FileFieldValidateTest11800
LeafDrupal\file\Tests\FileFieldWidgetTest29900
LeafDrupal\file\Tests\FileManagedFileElementTest26800
LeafDrupal\file\Tests\FilePrivateTest3700
LeafDrupal\file\Tests\FileTokenReplaceTest3500
LeafDrupal\file\Tests\LoadTest3400
LeafDrupal\file\Tests\MoveTest11000
LeafDrupal\file\Tests\RemoteFileSaveUploadTest27000
LeafDrupal\file\Tests\SaveDataTest9300
LeafDrupal\file\Tests\SaveTest1600
LeafDrupal\file\Tests\SaveUploadTest27000
LeafDrupal\file\Tests\SpaceUsedTest1200
LeafDrupal\file\Tests\UsageTest3400
LeafDrupal\file\Tests\ValidateTest1200
ExpandDrupal\file\Tests\ValidatorTest2901
MessageGroupFilenameLineFunctionStatus
rmdir(/var/lib/drupaltestbot/sites/default/files/checkout/sites/default/files/php/service_container): No such file or directoryrmdir('/var/lib/drupaltestbot/sites/default/files/checkout/sites/default/files/php/service_container') drupal_rmdir('/var/lib/drupaltestbot/sites/default/files/checkout/sites/default/files/php/service_container') file_unmanaged_delete_recursive('/var/lib/drupaltestbot/sites/default/files/checkout/sites/default/files/php/service_container', Array) Drupal\Component\PhpStorage\FileStorage->deleteAll() drupal_flush_all_caches() install_finished(Array) install_run_task(Array, Array) install_run_tasks(Array) install_drupal(Array) Drupal\simpletest\WebTestBase->setUp() Drupal\system\Tests\File\FileTestBase->setUp() Drupal\file\Tests\FileManagedTestBase->setUp() Drupal\file\Tests\ValidatorTest->setUp() Drupal\simpletest\TestBase->run() simpletest_script_run_one_test('219', 'Drupal\file\Tests\ValidatorTest') Warningfile.inc1769drupal_rmdir()
LeafDrupal\filter\Tests\FilterAdminTest17800
LeafDrupal\filter\Tests\FilterAPITest500
LeafDrupal\filter\Tests\FilterCrudTest23900
LeafDrupal\filter\Tests\FilterDefaultFormatTest3300
LeafDrupal\filter\Tests\FilterFormatAccessTest27200
LeafDrupal\filter\Tests\FilterHooksTest3300
LeafDrupal\filter\Tests\FilterHtmlImageSecureTest4600
LeafDrupal\filter\Tests\FilterNoFormatTest100
LeafDrupal\filter\Tests\FilterSecurityTest4000
LeafDrupal\filter\Tests\FilterSettingsTest1200
LeafDrupal\filter\Tests\FilterUnitTest21500
LeafDrupal\forum\Tests\ForumBlockTest14800
LeafDrupal\forum\Tests\ForumIndexTest2700
LeafDrupal\forum\Tests\ForumNodeAccessTest6300
LeafDrupal\forum\Tests\ForumTest66200
LeafDrupal\help\Tests\HelpTest36400
LeafDrupal\help\Tests\NoHelpTest1200
LeafDrupal\image\Tests\ImageAdminStylesTest30300
LeafDrupal\image\Tests\ImageDimensionsScaleUnitTest1500
LeafDrupal\image\Tests\ImageDimensionsTest5600
ExpandDrupal\image\Tests\ImageEffectsTest5002
MessageGroupFilenameLineFunctionStatus
rmdir(/var/lib/drupaltestbot/sites/default/files/checkout/sites/default/files/php/service_container/service_container_prod__simpletest145122.php): No such file or directoryrmdir('/var/lib/drupaltestbot/sites/default/files/checkout/sites/default/files/php/service_container/service_container_prod__simpletest145122.php') drupal_rmdir('/var/lib/drupaltestbot/sites/default/files/checkout/sites/default/files/php/service_container/service_container_prod__simpletest145122.php') file_unmanaged_delete_recursive('/var/lib/drupaltestbot/sites/default/files/checkout/sites/default/files/php/service_container/service_container_prod__simpletest145122.php', Array) file_unmanaged_delete_recursive('/var/lib/drupaltestbot/sites/default/files/checkout/sites/default/files/php/service_container', Array) Drupal\Component\PhpStorage\FileStorage->deleteAll() drupal_flush_all_caches() install_finished(Array) install_run_task(Array, Array) install_run_tasks(Array) install_drupal(Array) Drupal\simpletest\WebTestBase->setUp() Drupal\system\Tests\Image\ToolkitTestBase->setUp() Drupal\image\Tests\ImageEffectsTest->setUp() Drupal\simpletest\TestBase->run() simpletest_script_run_one_test('281', 'Drupal\image\Tests\ImageEffectsTest') Warningfile.inc1769drupal_rmdir()
rmdir(/var/lib/drupaltestbot/sites/default/files/checkout/sites/default/files/php/service_container): No such file or directoryrmdir('/var/lib/drupaltestbot/sites/default/files/checkout/sites/default/files/php/service_container') drupal_rmdir('/var/lib/drupaltestbot/sites/default/files/checkout/sites/default/files/php/service_container') file_unmanaged_delete_recursive('/var/lib/drupaltestbot/sites/default/files/checkout/sites/default/files/php/service_container', Array) Drupal\Component\PhpStorage\FileStorage->deleteAll() drupal_flush_all_caches() install_finished(Array) install_run_task(Array, Array) install_run_tasks(Array) install_drupal(Array) Drupal\simpletest\WebTestBase->setUp() Drupal\system\Tests\Image\ToolkitTestBase->setUp() Drupal\image\Tests\ImageEffectsTest->setUp() Drupal\simpletest\TestBase->run() simpletest_script_run_one_test('281', 'Drupal\image\Tests\ImageEffectsTest') Warningfile.inc1769drupal_rmdir()
LeafDrupal\image\Tests\ImageFieldDefaultImagesTest6600
LeafDrupal\image\Tests\ImageFieldDisplayTest18700
LeafDrupal\image\Tests\ImageFieldValidateTest4200
LeafDrupal\image\Tests\ImageStylesPathAndUrlTest6800
LeafDrupal\image\Tests\ImageThemeFunctionTest500
LeafDrupal\jsonld\Tests\DrupalJsonldNormalizerTest1100
LeafDrupal\jsonld\Tests\JsonldNormalizerTest400
LeafDrupal\language\Tests\LanguageBrowserDetectionUnitTest10700
LeafDrupal\language\Tests\LanguageConfigurationElementTest5400
LeafDrupal\language\Tests\LanguageConfigurationTest4600
LeafDrupal\language\Tests\LanguageCustomLanguageConfigurationTest3600
LeafDrupal\language\Tests\LanguageDependencyInjectionTest1700
LeafDrupal\language\Tests\LanguageListTest10000
LeafDrupal\language\Tests\LanguageNegotiationInfoTest4900
LeafDrupal\language\Tests\LanguagePathMonolingualTest3500
LeafDrupal\language\Tests\LanguageSwitchingTest2600
LeafDrupal\language\Tests\LanguageUILanguageNegotiationTest13300
LeafDrupal\language\Tests\LanguageUrlRewritingTest4400
LeafDrupal\layout\Tests\DisplayInternalLogicTest1100
LeafDrupal\layout\Tests\LayoutDerivativesTest2400
LeafDrupal\link\Tests\LinkFieldTest13300
LeafDrupal\link\Tests\LinkFieldUITest2100
LeafDrupal\locale\Tests\LocaleCompareTest6800
LeafDrupal\locale\Tests\LocaleContentTest15000
LeafDrupal\locale\Tests\LocaleExportTest5700
LeafDrupal\locale\Tests\LocaleFileImportStatus9100
LeafDrupal\locale\Tests\LocaleImportFunctionalTest20100
LeafDrupal\locale\Tests\LocaleInstallTest200
LeafDrupal\locale\Tests\LocaleJavascriptTranslation6600
LeafDrupal\locale\Tests\LocaleLibraryInfoAlterTest200
LeafDrupal\locale\Tests\LocalePathTest4700
LeafDrupal\locale\Tests\LocalePluralFormatTest16000
LeafDrupal\locale\Tests\LocaleStringTest2600
LeafDrupal\locale\Tests\LocaleTranslationTest30600
LeafDrupal\locale\Tests\LocaleUninstallFrenchTest3600
LeafDrupal\locale\Tests\LocaleUninstallTest3600
LeafDrupal\menu\Tests\MenuNodeTest6100
LeafDrupal\menu\Tests\MenuTest316000
LeafDrupal\node\Tests\MultiStepNodeFormBasicOptionsTest1600
ExpandDrupal\node\Tests\NodeAccessBaseTableTest15901
MessageGroupFilenameLineFunctionStatus
mkdir(): File existsWarningMTimeProtectedFastFileStorage.php144Drupal\Component\PhpStorage\MTimeProtectedFastFileStorage->ensureDirectory()
LeafDrupal\node\Tests\NodeAccessFieldTest5000
LeafDrupal\node\Tests\NodeAccessLanguageTest2500
LeafDrupal\node\Tests\NodeAccessPagerTest3000
LeafDrupal\node\Tests\NodeAccessRebuildTest1900
LeafDrupal\node\Tests\NodeAccessRecordsTest2600
LeafDrupal\node\Tests\NodeAccessTest3400
LeafDrupal\node\Tests\NodeAdminTest14500
LeafDrupal\node\Tests\NodeBlockFunctionalTest8400
LeafDrupal\node\Tests\NodeBlockTest2100
LeafDrupal\node\Tests\NodeBuildContentTest400
LeafDrupal\node\Tests\NodeCreationTest4900
LeafDrupal\node\Tests\NodeEntityFieldQueryAlterTest3200
LeafDrupal\node\Tests\NodeEntityViewModeAlterTest2000
LeafDrupal\node\Tests\NodeFeedTest100
LeafDrupal\node\Tests\NodeFieldMultilingualTestCase6400
LeafDrupal\node\Tests\NodeLoadHooksTest700
LeafDrupal\node\Tests\NodeLoadMultipleTest2700
LeafDrupal\node\Tests\NodePostSettingsTest4000
ExpandDrupal\node\Tests\NodeQueryAlterTest9902
MessageGroupFilenameLineFunctionStatus
rmdir(/var/lib/drupaltestbot/sites/default/files/checkout/sites/default/files/php/service_container/service_container_prod__simpletest782905.php): No such file or directoryrmdir('/var/lib/drupaltestbot/sites/default/files/checkout/sites/default/files/php/service_container/service_container_prod__simpletest782905.php') drupal_rmdir('/var/lib/drupaltestbot/sites/default/files/checkout/sites/default/files/php/service_container/service_container_prod__simpletest782905.php') file_unmanaged_delete_recursive('/var/lib/drupaltestbot/sites/default/files/checkout/sites/default/files/php/service_container/service_container_prod__simpletest782905.php', Array) file_unmanaged_delete_recursive('/var/lib/drupaltestbot/sites/default/files/checkout/sites/default/files/php/service_container', Array) Drupal\Component\PhpStorage\FileStorage->deleteAll() drupal_flush_all_caches() _install_profile_modules_finished(1, Array, Array, '0 sec') _batch_finished() _batch_process() batch_process('core/install.php?profile=testing&langcode=en', 'http://drupaltestbot659-mysql/checkout/core/install.php?profile=testing&langcode=en') install_run_task(Array, Array) install_run_tasks(Array) install_drupal(Array) Drupal\simpletest\WebTestBase->setUp() Drupal\node\Tests\NodeTestBase->setUp() Drupal\node\Tests\NodeQueryAlterTest->setUp() Drupal\simpletest\TestBase->run() simpletest_script_run_one_test('364', 'Drupal\node\Tests\NodeQueryAlterTest') Warningfile.inc1769drupal_rmdir()
rmdir(/var/lib/drupaltestbot/sites/default/files/checkout/sites/default/files/php/service_container): No such file or directoryrmdir('/var/lib/drupaltestbot/sites/default/files/checkout/sites/default/files/php/service_container') drupal_rmdir('/var/lib/drupaltestbot/sites/default/files/checkout/sites/default/files/php/service_container') file_unmanaged_delete_recursive('/var/lib/drupaltestbot/sites/default/files/checkout/sites/default/files/php/service_container', Array) Drupal\Component\PhpStorage\FileStorage->deleteAll() drupal_flush_all_caches() _install_profile_modules_finished(1, Array, Array, '0 sec') _batch_finished() _batch_process() batch_process('core/install.php?profile=testing&langcode=en', 'http://drupaltestbot659-mysql/checkout/core/install.php?profile=testing&langcode=en') install_run_task(Array, Array) install_run_tasks(Array) install_drupal(Array) Drupal\simpletest\WebTestBase->setUp() Drupal\node\Tests\NodeTestBase->setUp() Drupal\node\Tests\NodeQueryAlterTest->setUp() Drupal\simpletest\TestBase->run() simpletest_script_run_one_test('364', 'Drupal\node\Tests\NodeQueryAlterTest') Warningfile.inc1769drupal_rmdir()
LeafDrupal\node\Tests\NodeRevisionPermissionsTest3300
LeafDrupal\node\Tests\NodeRevisionsTest6400
LeafDrupal\node\Tests\NodeRSSContentTest2100
LeafDrupal\node\Tests\NodeSaveTest6000
LeafDrupal\node\Tests\NodeTitleTest2300
LeafDrupal\node\Tests\NodeTitleXSSTest2300
LeafDrupal\node\Tests\NodeTokenReplaceTest4000
LeafDrupal\node\Tests\NodeTranslationUITest7800
LeafDrupal\node\Tests\NodeTypeInitialLanguageTest8000
LeafDrupal\node\Tests\NodeTypePersistenceTest6500
LeafDrupal\node\Tests\NodeTypeTest15400
LeafDrupal\node\Tests\PageEditTest13900
LeafDrupal\node\Tests\PagePreviewTest6000
LeafDrupal\node\Tests\PageViewTest6800
LeafDrupal\node\Tests\SummaryLengthTest1800
LeafDrupal\number\Tests\NumberFieldTest8700
LeafDrupal\openid\Tests\OpenIDFunctionalTest31800
LeafDrupal\openid\Tests\OpenIDRegistrationTest14800
LeafDrupal\openid\Tests\OpenIDTest4500
LeafDrupal\options\Tests\OptionsDynamicValuesValidationTest900
LeafDrupal\options\Tests\OptionsFieldTest1600
LeafDrupal\options\Tests\OptionsFieldUITest20700
LeafDrupal\options\Tests\OptionsSelectDynamicValuesTest1600
LeafDrupal\options\Tests\OptionsWidgetsTest26100
LeafDrupal\path\Tests\PathAliasTest13800
LeafDrupal\path\Tests\PathLanguageTest7100
LeafDrupal\path\Tests\PathLanguageUiTest7800
LeafDrupal\path\Tests\PathTaxonomyTermTest3700
LeafDrupal\php\Tests\PhpAccessTest3800
LeafDrupal\php\Tests\PhpFilterTest4200
LeafDrupal\picture\Tests\PictureAdminUITest5400
LeafDrupal\picture\Tests\PictureFieldDisplayTest11600
LeafDrupal\poll\Tests\PollBlockTest17200
LeafDrupal\poll\Tests\PollCreateTest26900
LeafDrupal\poll\Tests\PollDeleteChoiceTest5400
LeafDrupal\poll\Tests\PollExpirationTest5200
LeafDrupal\poll\Tests\PollJsAddChoiceTest1600
LeafDrupal\poll\Tests\PollTokenReplaceTest12500
LeafDrupal\poll\Tests\PollTranslateTest7300
LeafDrupal\poll\Tests\PollVoteCheckHostnameTest14000
LeafDrupal\poll\Tests\PollVoteTest14600
LeafDrupal\rdf\Tests\CommentAttributesTest20300
LeafDrupal\rdf\Tests\CrudTest1000
LeafDrupal\rdf\Tests\GetNamespacesTest700
LeafDrupal\rdf\Tests\GetRdfNamespacesTest500
LeafDrupal\rdf\Tests\MappingDefinitionTest5900
LeafDrupal\rdf\Tests\MappingHookTest600
LeafDrupal\rdf\Tests\RdfaMarkupTest2900
LeafDrupal\rdf\Tests\TrackerAttributesTest3300
LeafDrupal\rest\Tests\DBLogTest1700
LeafDrupal\rest\Tests\DeleteTest7900
LeafDrupal\search\Tests\SearchAdvancedSearchFormTest3400
LeafDrupal\search\Tests\SearchBlockTest6400
LeafDrupal\search\Tests\SearchCommentCountToggleTest3100
LeafDrupal\search\Tests\SearchCommentTest19300
LeafDrupal\search\Tests\SearchConfigSettingsFormTest13200
LeafDrupal\search\Tests\SearchEmbedFormTest3200
LeafDrupal\search\Tests\SearchExactTest2500
LeafDrupal\search\Tests\SearchExcerptTest1800
LeafDrupal\search\Tests\SearchExpressionInsertExtractTest2400
LeafDrupal\search\Tests\SearchKeywordsConditionsTest2800
LeafDrupal\search\Tests\SearchLanguageTest4100
LeafDrupal\search\Tests\SearchMatchTest14700
LeafDrupal\search\Tests\SearchMultilingualEntityTest1000
LeafDrupal\search\Tests\SearchNodeAccessTest1600
LeafDrupal\search\Tests\SearchNumberMatchingTest29500
LeafDrupal\search\Tests\SearchNumbersTest17500
LeafDrupal\search\Tests\SearchPageOverrideTest1500
LeafDrupal\search\Tests\SearchPageTextTest3700
LeafDrupal\search\Tests\SearchPreprocessLangcodeTest3900
LeafDrupal\search\Tests\SearchRankingTest5900
LeafDrupal\search\Tests\SearchSimplifyTest65700
LeafDrupal\search\Tests\SearchTokenizerTest800
LeafDrupal\shortcut\Tests\ShortcutLinksTest14800
LeafDrupal\shortcut\Tests\ShortcutSetsTest21600
LeafDrupal\simpletest\Tests\BrokenSetUpTest2100
LeafDrupal\simpletest\Tests\BrowserTest1600
LeafDrupal\simpletest\Tests\FolderTest200
LeafDrupal\simpletest\Tests\InstallationProfileModuleTestsTest1900
LeafDrupal\simpletest\Tests\MailCaptureTest1200
LeafDrupal\simpletest\Tests\MissingCheckedRequirementsTest1900
LeafDrupal\simpletest\Tests\OtherInstallationProfileModuleTestsTest1200
ExpandDrupal\simpletest\Tests\SimpleTestTest11020
MessageGroupFilenameLineFunctionStatus
Requesting http.php with a legitimate simpletest User-Agent returns OK.BrowserSimpleTestTest.php115Drupal\simpletest\Tests\SimpleTestTest->testUserAgentValidation()
Requesting https.php with a legitimate simpletest User-Agent returns OK.BrowserSimpleTestTest.php117Drupal\simpletest\Tests\SimpleTestTest->testUserAgentValidation()
LeafDrupal\statistics\Tests\StatisticsAdminTest11000
LeafDrupal\statistics\Tests\StatisticsBlockVisitorsTest4600
LeafDrupal\statistics\Tests\StatisticsLoggingTest3500
LeafDrupal\statistics\Tests\StatisticsReportsTest9200
LeafDrupal\statistics\Tests\StatisticsTokenReplaceTest3000
LeafDrupal\syslog\Tests\SyslogTest1700
LeafDrupal\system\Tests\Ajax\AjaxCommandsUnitTest1600
LeafDrupal\system\Tests\Ajax\CommandsTest7300
LeafDrupal\system\Tests\Ajax\ElementValidationTest700
LeafDrupal\system\Tests\Ajax\FormValuesTest2900
LeafDrupal\system\Tests\Ajax\FrameworkTest3400
LeafDrupal\system\Tests\Ajax\MultiFormTest3600
LeafDrupal\system\Tests\Batch\PageTest1600
LeafDrupal\system\Tests\Batch\PercentagesUnitTest1800
LeafDrupal\system\Tests\Batch\ProcessingTest16100
LeafDrupal\system\Tests\Bootstrap\GetFilenameUnitTest500
LeafDrupal\system\Tests\Bootstrap\HookBootExitTest1900
LeafDrupal\system\Tests\Bootstrap\IpAddressTest1100
LeafDrupal\system\Tests\Bootstrap\MiscUnitTest500
LeafDrupal\system\Tests\Bootstrap\OverrideServerVariablesUnitTest600
LeafDrupal\system\Tests\Bootstrap\PageCacheTest7900
LeafDrupal\system\Tests\Bootstrap\ResettableStaticUnitTest500
LeafDrupal\system\Tests\Bootstrap\TimerUnitTest500
LeafDrupal\system\Tests\Bootstrap\VariableTest900
LeafDrupal\system\Tests\Bundle\BundleTest900
LeafDrupal\system\Tests\Cache\BackendChainImplementationUnitTest4800
LeafDrupal\system\Tests\Cache\BackendChainUnitTest8600
LeafDrupal\system\Tests\Cache\ClearTest900
LeafDrupal\system\Tests\Cache\DatabaseBackendUnitTest8600
LeafDrupal\system\Tests\Cache\InstallTest1500
LeafDrupal\system\Tests\Cache\MemoryBackendUnitTest8600
LeafDrupal\system\Tests\Cache\NullBackendTest200
LeafDrupal\system\Tests\Common\AddFeedTest700
LeafDrupal\system\Tests\Common\AlterTest700
LeafDrupal\system\Tests\Common\ArrayUnitTest1300
LeafDrupal\system\Tests\Common\AttributesUnitTest700
LeafDrupal\system\Tests\Common\AutocompleteTagsUnitTest800
LeafDrupal\system\Tests\Common\CascadingStylesheetsTest4100
LeafDrupal\system\Tests\Common\CascadingStylesheetsUnitTest1200
LeafDrupal\system\Tests\Common\ColorTest8500
LeafDrupal\system\Tests\Common\FormatDateTest7100
LeafDrupal\system\Tests\Common\GotoTest2700
LeafDrupal\system\Tests\Common\HtmlIdentifierUnitTest1000
LeafDrupal\system\Tests\Common\HttpRequestTest3500
LeafDrupal\system\Tests\Common\InstallerLanguageTest800
LeafDrupal\system\Tests\Common\JavaScriptTest9500
LeafDrupal\system\Tests\Common\JsonUnitTest2100
LeafDrupal\system\Tests\Common\ParseInfoFileUnitTest300
LeafDrupal\system\Tests\Common\RegionContentTest1800
LeafDrupal\system\Tests\Common\RenderTest5400
LeafDrupal\system\Tests\Common\SchemaTest58800
LeafDrupal\system\Tests\Common\SimpleTestErrorCollectorTest1600
LeafDrupal\system\Tests\Common\SizeUnitTest3500
LeafDrupal\system\Tests\Common\SystemListingTest600
LeafDrupal\system\Tests\Common\TableSortExtenderUnitTest600
LeafDrupal\system\Tests\Common\UrlTest7000
LeafDrupal\system\Tests\Common\ValidNumberStepUnitTest2400
LeafDrupal\system\Tests\Common\ValidUrlUnitTest7900
LeafDrupal\system\Tests\Common\WriteRecordTest3400
LeafDrupal\system\Tests\Common\XssUnitTest1700
LeafDrupal\system\Tests\Database\AlterTest6200
LeafDrupal\system\Tests\Database\BasicSyntaxTest3000
LeafDrupal\system\Tests\Database\CaseSensitivityTest800
LeafDrupal\system\Tests\Database\ConnectionTest3800
LeafDrupal\system\Tests\Database\ConnectionUnitTest1200
LeafDrupal\system\Tests\Database\DeleteTruncateTest2300
LeafDrupal\system\Tests\Database\EmptyStatementTest400
LeafDrupal\system\Tests\Database\FetchTest6600
LeafDrupal\system\Tests\Database\InsertDefaultsTest2200
LeafDrupal\system\Tests\Database\InsertLobTest1500
LeafDrupal\system\Tests\Database\InsertTest5800
LeafDrupal\system\Tests\Database\InvalidDataTest800
LeafDrupal\system\Tests\Database\LoggingTest5100
LeafDrupal\system\Tests\Database\MergeTest12400
LeafDrupal\system\Tests\Database\NextIdTest200
LeafDrupal\system\Tests\Database\QueryTest700
LeafDrupal\system\Tests\Database\RangeQueryTest800
LeafDrupal\system\Tests\Database\RegressionTest3900
LeafDrupal\system\Tests\Database\SelectComplexTest21000
LeafDrupal\system\Tests\Database\SelectOrderedTest3900
LeafDrupal\system\Tests\Database\SelectPagerDefaultTest8400
LeafDrupal\system\Tests\Database\SelectSubqueryTest7900
LeafDrupal\system\Tests\Database\SelectTableSortDefaultTest9000
LeafDrupal\system\Tests\Database\SelectTest18600
LeafDrupal\system\Tests\Database\SerializeQueryTest1400
LeafDrupal\system\Tests\Database\TaggingTest5600
LeafDrupal\system\Tests\Database\TemporaryQueryTest2200
LeafDrupal\system\Tests\Database\TransactionTest8800
LeafDrupal\system\Tests\Database\UpdateComplexTest6700
LeafDrupal\system\Tests\Database\UpdateLobTest1500
LeafDrupal\system\Tests\Database\UpdateTest5600
LeafDrupal\system\Tests\Datetime\DateTimePlusTest5400
LeafDrupal\system\Tests\Datetime\DrupalDateTimeTest1400
LeafDrupal\system\Tests\DrupalKernel\ContentNegotiationTest4000
ExpandDrupal\system\Tests\DrupalKernel\DrupalKernelTest011
MessageGroupFilenameLineFunctionStatus
The test did not complete due to a fatal error.Completion checkDrupalKernelTest.php32Drupal\system\Tests\DrupalKernel\DrupalKernelTest->testCompileDIC()
Argument 4 passed to Drupal\Core\DrupalKernel::__construct() must be an instance of Drupal\Component\PhpStorage\PhpStorageFactory, instance of Drupal\Component\PhpStorage\MTimeProtectedFastFileStorage given, called in /var/lib/drupaltestbot/sites/default/files/checkout/core/modules/system/lib/Drupal/system/Tests/DrupalKernel/DrupalKernelTest.php on line 50 and definedDrupal\Core\DrupalKernel->__construct('testing', , Object, Object) Drupal\system\Tests\DrupalKernel\DrupalKernelTest->testCompileDIC() Drupal\simpletest\TestBase->run() simpletest_script_run_one_test('158', 'Drupal\system\Tests\DrupalKernel\DrupalKernelTest') Recoverable errorDrupalKernel.php132Drupal\Core\DrupalKernel->__construct()
LeafDrupal\system\Tests\Entity\EntityApiInfoTest600
LeafDrupal\system\Tests\Entity\EntityApiTest800
LeafDrupal\system\Tests\Entity\EntityCrudHookTest11400
LeafDrupal\system\Tests\Entity\EntityFieldTest14300
LeafDrupal\system\Tests\Entity\EntityFormTest2600
LeafDrupal\system\Tests\Entity\EntityQueryTest6200
LeafDrupal\system\Tests\Entity\EntityTranslationFormTest3600
LeafDrupal\system\Tests\Entity\EntityTranslationTest5100
LeafDrupal\system\Tests\Entity\EntityUUIDTest1900
LeafDrupal\system\Tests\FileTransfer\FileTransferTest200
LeafDrupal\system\Tests\File\DirectoryTest2000
LeafDrupal\system\Tests\File\MimeTypeTest4200
LeafDrupal\system\Tests\File\NameMungingTest500
LeafDrupal\system\Tests\File\RemoteFileDirectoryTest2400
LeafDrupal\system\Tests\File\RemoteFileScanDirectoryTest2900
LeafDrupal\system\Tests\File\RemoteFileUnmanagedCopyTest3200
LeafDrupal\system\Tests\File\RemoteFileUnmanagedDeleteRecursiveTest2100
LeafDrupal\system\Tests\File\RemoteFileUnmanagedDeleteTest1000
LeafDrupal\system\Tests\File\RemoteFileUnmanagedMoveTest2300
LeafDrupal\system\Tests\File\RemoteFileUnmanagedSaveDataTest800
LeafDrupal\system\Tests\File\ScanDirectoryTest2900
LeafDrupal\system\Tests\File\StreamWrapperTest1900
LeafDrupal\system\Tests\File\UnmanagedCopyTest2900
LeafDrupal\system\Tests\File\UnmanagedDeleteRecursiveTest1700
LeafDrupal\system\Tests\File\UnmanagedDeleteTest700
LeafDrupal\system\Tests\File\UnmanagedMoveTest2000
LeafDrupal\system\Tests\File\UnmanagedSaveDataTest700
LeafDrupal\system\Tests\File\UrlRewritingTest1400
LeafDrupal\system\Tests\Form\AlterTest400
LeafDrupal\system\Tests\Form\ArbitraryRebuildTest1600
LeafDrupal\system\Tests\Form\CheckboxTest9700
LeafDrupal\system\Tests\Form\ElementsLabelsTest2000
LeafDrupal\system\Tests\Form\ElementsTableSelectTest6900
LeafDrupal\system\Tests\Form\ElementsVerticalTabsTest3900
LeafDrupal\system\Tests\Form\ElementTest3700
LeafDrupal\system\Tests\Form\EmailTest1700
LeafDrupal\system\Tests\Form\FileInclusionTest1100
LeafDrupal\system\Tests\Form\FormTest71800
LeafDrupal\system\Tests\Form\HTMLIdTest700
LeafDrupal\system\Tests\Form\LanguageSelectElementTest4700
LeafDrupal\system\Tests\Form\ProgrammaticTest2400
LeafDrupal\system\Tests\Form\RebuildTest5300
LeafDrupal\system\Tests\Form\RedirectTest3100
LeafDrupal\system\Tests\Form\StateValuesCleanAdvancedTest700
LeafDrupal\system\Tests\Form\StateValuesCleanTest1400
LeafDrupal\system\Tests\Form\StorageTest12000
LeafDrupal\system\Tests\Form\TriggeringElementTest5000
LeafDrupal\system\Tests\Form\UrlTest1700
LeafDrupal\system\Tests\Form\ValidationTest11200
LeafDrupal\system\Tests\Form\WrapperTest500
LeafDrupal\system\Tests\Graph\GraphUnitTest2800
LeafDrupal\system\Tests\Image\FileMoveTest400
LeafDrupal\system\Tests\Image\ToolkitGdTest20400
LeafDrupal\system\Tests\Image\ToolkitTest5300
LeafDrupal\system\Tests\KeyValueStore\DatabaseStorageExpirableTest6800
LeafDrupal\system\Tests\KeyValueStore\DatabaseStorageTest3600
LeafDrupal\system\Tests\KeyValueStore\GarbageCollectionTest200
LeafDrupal\system\Tests\KeyValueStore\MemoryStorageTest3600
LeafDrupal\system\Tests\Lock\LockFunctionalTest2900
LeafDrupal\system\Tests\Mail\HtmlToTextTest8300
LeafDrupal\system\Tests\Mail\MailTest400
LeafDrupal\system\Tests\Menu\BreadcrumbTest40900
LeafDrupal\system\Tests\Menu\LinksTest5000
LeafDrupal\system\Tests\Menu\RebuildTest500
ExpandDrupal\system\Tests\Menu\RouterTest22601
MessageGroupFilenameLineFunctionStatus
rmdir(/var/lib/drupaltestbot/sites/default/files/checkout/sites/default/files/php/service_container): Directory not emptyrmdir('/var/lib/drupaltestbot/sites/default/files/checkout/sites/default/files/php/service_container') drupal_rmdir('/var/lib/drupaltestbot/sites/default/files/checkout/sites/default/files/php/service_container') file_unmanaged_delete_recursive('/var/lib/drupaltestbot/sites/default/files/checkout/sites/default/files/php/service_container', Array) Drupal\Component\PhpStorage\FileStorage->deleteAll() drupal_flush_all_caches() _install_profile_modules_finished(1, Array, Array, '0 sec') _batch_finished() _batch_process() batch_process('core/install.php?profile=testing&langcode=en', 'http://drupaltestbot659-mysql/checkout/core/install.php?profile=testing&langcode=en') install_run_task(Array, Array) install_run_tasks(Array) install_drupal(Array) Drupal\simpletest\WebTestBase->setUp() Drupal\system\Tests\Menu\RouterTest->setUp() Drupal\simpletest\TestBase->run() simpletest_script_run_one_test('331', 'Drupal\system\Tests\Menu\RouterTest') Warningfile.inc1769drupal_rmdir()
LeafDrupal\system\Tests\Menu\TrailTest6800
LeafDrupal\system\Tests\Menu\TreeDataUnitTest400
LeafDrupal\system\Tests\Menu\TreeOutputTest700
LeafDrupal\system\Tests\Module\ClassLoaderTest900
LeafDrupal\system\Tests\Module\DependencyTest15900
LeafDrupal\system\Tests\Module\EnableDisableTest192300
LeafDrupal\system\Tests\Module\HookRequirementsTest1600
LeafDrupal\system\Tests\Module\InstallTest300
ExpandDrupal\system\Tests\Module\ModuleApiTest7602
MessageGroupFilenameLineFunctionStatus
mkdir(): File existsWarningMTimeProtectedFastFileStorage.php144Drupal\Component\PhpStorage\MTimeProtectedFastFileStorage->ensureDirectory()
rmdir(/var/lib/drupaltestbot/sites/default/files/checkout/sites/default/files/php/service_container): Directory not emptyrmdir('/var/lib/drupaltestbot/sites/default/files/checkout/sites/default/files/php/service_container') drupal_rmdir('/var/lib/drupaltestbot/sites/default/files/checkout/sites/default/files/php/service_container') file_unmanaged_delete_recursive('/var/lib/drupaltestbot/sites/default/files/checkout/sites/default/files/php/service_container', Array) Drupal\Component\PhpStorage\FileStorage->deleteAll() drupal_flush_all_caches() install_finished(Array) install_run_task(Array, Array) install_run_tasks(Array) install_drupal(Array) Drupal\simpletest\WebTestBase->setUp() Drupal\simpletest\TestBase->run() simpletest_script_run_one_test('340', 'Drupal\system\Tests\Module\ModuleApiTest') Warningfile.inc1769drupal_rmdir()
LeafDrupal\system\Tests\Module\ModuleEnable300
LeafDrupal\system\Tests\Module\RequiredTest1800
LeafDrupal\system\Tests\Module\UninstallTest200
LeafDrupal\system\Tests\Module\VersionTest5100
LeafDrupal\system\Tests\Pager\PagerTest12300
LeafDrupal\system\Tests\Path\LookupTest1300
LeafDrupal\system\Tests\Path\MatchPathTest4100
LeafDrupal\system\Tests\Path\SaveTest400
LeafDrupal\system\Tests\Path\UrlAlterFunctionalTest3400
LeafDrupal\system\Tests\PhpStorage\FileStorageTest1200
LeafDrupal\system\Tests\PhpStorage\MTimeProtectedFastFileStorageTest1900
LeafDrupal\system\Tests\PhpStorage\MTimeProtectedFileStorageTest1900
LeafDrupal\system\Tests\Plugin\AlterDecoratorTest300
LeafDrupal\system\Tests\Plugin\DerivativeTest900
LeafDrupal\system\Tests\Plugin\Discovery\AnnotatedClassDiscoveryTest700
LeafDrupal\system\Tests\Plugin\Discovery\StaticDiscoveryTest600
LeafDrupal\system\Tests\Plugin\FactoryTest900
LeafDrupal\system\Tests\Plugin\InspectionTest1000
LeafDrupal\system\Tests\Queue\QueueTest1400
LeafDrupal\system\Tests\Routing\ChainMatcherTest300
LeafDrupal\system\Tests\Routing\ControllerResolverTest100
LeafDrupal\system\Tests\Routing\FirstEntryFinalMatcherTest800
LeafDrupal\system\Tests\Routing\HttpMethodMatcherTest800
LeafDrupal\system\Tests\Routing\MatcherDumperTest800
LeafDrupal\system\Tests\Routing\NestedMatcherTest100
LeafDrupal\system\Tests\Routing\PathMatcherTest2700
LeafDrupal\system\Tests\Routing\RouterTest3000
LeafDrupal\system\Tests\Routing\RouteTest600
LeafDrupal\system\Tests\Serialization\SerializationTest200
ExpandDrupal\system\Tests\Session\SessionHttpsTest54163
MessageGroupFilenameLineFunctionStatus
Undefined property: Drupal\system\Tests\Session\SessionHttpsTest::$cookiesDrupal\system\Tests\Session\SessionHttpsTest->testHttpsSession() Drupal\simpletest\TestBase->run() simpletest_script_run_one_test('457', 'Drupal\system\Tests\Session\SessionHttpsTest') NoticeSessionHttpsTest.php62Drupal\system\Tests\Session\SessionHttpsTest->testHttpsSession()
The secure cookie has the secure attributeOtherSessionHttpsTest.php62Drupal\system\Tests\Session\SessionHttpsTest->testHttpsSession()
Undefined property: Drupal\system\Tests\Session\SessionHttpsTest::$cookiesDrupal\system\Tests\Session\SessionHttpsTest->testHttpsSession() Drupal\simpletest\TestBase->run() simpletest_script_run_one_test('457', 'Drupal\system\Tests\Session\SessionHttpsTest') NoticeSessionHttpsTest.php65Drupal\system\Tests\Session\SessionHttpsTest->testHttpsSession()
Session has a non-empty SID and a correct secure SID.OtherSessionHttpsTest.php66Drupal\system\Tests\Session\SessionHttpsTest->testHttpsSession()
"Configuration" foundOtherSessionHttpsTest.php72Drupal\system\Tests\Session\SessionHttpsTest->testHttpsSession()
HTTP response expected 200, actual 500BrowserSessionHttpsTest.php73Drupal\system\Tests\Session\SessionHttpsTest->testHttpsSession()
HTTP response expected 403, actual 500BrowserSessionHttpsTest.php79Drupal\system\Tests\Session\SessionHttpsTest->testHttpsSession()
HTTP response expected 403, actual 500BrowserSessionHttpsTest.php85Drupal\system\Tests\Session\SessionHttpsTest->testHttpsSession()
HTTP response expected 200, actual 500BrowserSessionHttpsTest.php97Drupal\system\Tests\Session\SessionHttpsTest->testHttpsSession()
Undefined property: Drupal\system\Tests\Session\SessionHttpsTest::$cookiesDrupal\system\Tests\Session\SessionHttpsTest->testHttpsSession() Drupal\simpletest\TestBase->run() simpletest_script_run_one_test('457', 'Drupal\system\Tests\Session\SessionHttpsTest') NoticeSessionHttpsTest.php98Drupal\system\Tests\Session\SessionHttpsTest->testHttpsSession()
Session has the correct SID and an empty secure SID.OtherSessionHttpsTest.php99Drupal\system\Tests\Session\SessionHttpsTest->testHttpsSession()
HTTP response expected 403, actual 500BrowserSessionHttpsTest.php105Drupal\system\Tests\Session\SessionHttpsTest->testHttpsSession()
Session has both secure and insecure SIDsOtherSessionHttpsTest.php155Drupal\system\Tests\Session\SessionHttpsTest->testHttpsSession()
"Configuration" foundOtherSessionHttpsTest.php172Drupal\system\Tests\Session\SessionHttpsTest->testHttpsSession()
HTTP response expected 200, actual 403BrowserSessionHttpsTest.php173Drupal\system\Tests\Session\SessionHttpsTest->testHttpsSession()
HTTP response expected 403, actual 500BrowserSessionHttpsTest.php177Drupal\system\Tests\Session\SessionHttpsTest->testHttpsSession()
"Configuration" foundOtherSessionHttpsTest.php172Drupal\system\Tests\Session\SessionHttpsTest->testHttpsSession()
HTTP response expected 200, actual 500BrowserSessionHttpsTest.php173Drupal\system\Tests\Session\SessionHttpsTest->testHttpsSession()
HTTP response expected 200, actual 403BrowserSessionHttpsTest.php202Drupal\system\Tests\Session\SessionHttpsTest->testHttpsSession()
LeafDrupal\system\Tests\Session\SessionTest19000
LeafDrupal\system\Tests\System\AccessDeniedTest6800
LeafDrupal\system\Tests\System\AdminMetaTagTest300
LeafDrupal\system\Tests\System\AdminTest18100
LeafDrupal\system\Tests\System\CronRunTest4000
LeafDrupal\system\Tests\System\DateFormatsLanguageTest3700
LeafDrupal\system\Tests\System\DateTimeTest11300
LeafDrupal\system\Tests\System\DefaultMobileMetaTagsTest1200
LeafDrupal\system\Tests\System\ErrorHandlerTest4000
LeafDrupal\system\Tests\System\ExceptionControllerTest200
LeafDrupal\system\Tests\System\FloodTest600
LeafDrupal\system\Tests\System\FrontPageTest3700
LeafDrupal\system\Tests\System\IndexPhpTest600
LeafDrupal\system\Tests\System\InfoAlterTest1000
LeafDrupal\system\Tests\System\InfoFileParserUnitTest900
LeafDrupal\system\Tests\System\MainContentFallbackTest6000
LeafDrupal\system\Tests\System\PageNotFoundTest1800
LeafDrupal\system\Tests\System\PageTitleFilteringTest4400
LeafDrupal\system\Tests\System\PasswordHashingTest1000
LeafDrupal\system\Tests\System\RetrieveFileTest700
LeafDrupal\system\Tests\System\ShutdownFunctionsTest500
LeafDrupal\system\Tests\System\SiteMaintenanceTest7700
LeafDrupal\system\Tests\System\SystemAuthorizeTest1600
LeafDrupal\system\Tests\System\ThemeTest22200
LeafDrupal\system\Tests\System\TokenReplaceTest3600
LeafDrupal\system\Tests\System\UnicodeUnitTest18200
LeafDrupal\system\Tests\Theme\EntityFilteringThemeTest5600
LeafDrupal\system\Tests\Theme\FastTest1300
LeafDrupal\system\Tests\Theme\FunctionsTest2500
LeafDrupal\system\Tests\Theme\HookInitTest500
LeafDrupal\system\Tests\Theme\HtmlTagUnitTest200
LeafDrupal\system\Tests\Theme\HtmlTplPhpAttributesTest500
LeafDrupal\system\Tests\Theme\RegistryTest600
LeafDrupal\system\Tests\Theme\TableTest600
LeafDrupal\system\Tests\Theme\ThemeTest4800
LeafDrupal\system\Tests\Theme\ThemeTestTwig1000
LeafDrupal\system\Tests\Theme\TwigReferenceUnitTest1500
LeafDrupal\system\Tests\Transliteration\TransliterationTest2700
LeafDrupal\system\Tests\TypedData\TypedDataTest6100
LeafDrupal\system\Tests\Update\DependencyHookInvocationTest400
LeafDrupal\system\Tests\Update\DependencyMissingTest400
LeafDrupal\system\Tests\Update\DependencyOrderingTest500
ExpandDrupal\system\Tests\Update\UpdateScriptTest1792527
MessageGroupFilenameLineFunctionStatus
Undefined index: backtraceNoticeerrors.inc188_drupal_log_error()
The service definition "php_storage" does not exist.Symfony\Component\DependencyInjection\Exception\InvalidArgumentExceptionContainerBuilder.php690Symfony\Component\DependencyInjection\ContainerBuilder->getDefinition()
End of update process was reached.OtherUpdateScriptTest.php83Drupal\system\Tests\Update\UpdateScriptTest->testRequirements()
Caches were cleared when there were no requirements warnings or errors.OtherUpdateScriptTest.php85Drupal\system\Tests\Update\UpdateScriptTest->testRequirements()
Undefined index: backtraceNoticeerrors.inc188_drupal_log_error()
The service definition "php_storage" does not exist.Symfony\Component\DependencyInjection\Exception\InvalidArgumentExceptionContainerBuilder.php690Symfony\Component\DependencyInjection\ContainerBuilder->getDefinition()
End of update process was reached.OtherUpdateScriptTest.php101Drupal\system\Tests\Update\UpdateScriptTest->testRequirements()
Caches were cleared after resolving a requirements warning and applying updates.OtherUpdateScriptTest.php103Drupal\system\Tests\Update\UpdateScriptTest->testRequirements()
Undefined index: backtraceNoticeerrors.inc188_drupal_log_error()
The service definition "php_storage" does not exist.Symfony\Component\DependencyInjection\Exception\InvalidArgumentExceptionContainerBuilder.php690Symfony\Component\DependencyInjection\ContainerBuilder->getDefinition()
End of update process was reached.OtherUpdateScriptTest.php111Drupal\system\Tests\Update\UpdateScriptTest->testRequirements()
Caches were cleared after applying updates and re-running the script.OtherUpdateScriptTest.php113Drupal\system\Tests\Update\UpdateScriptTest->testRequirements()
Undefined index: backtraceNoticeerrors.inc188_drupal_log_error()
The service definition "php_storage" does not exist.Symfony\Component\DependencyInjection\Exception\InvalidArgumentExceptionContainerBuilder.php690Symfony\Component\DependencyInjection\ContainerBuilder->getDefinition()
"No pending updates." foundOtherUpdateScriptTest.php146Drupal\system\Tests\Update\UpdateScriptTest->testNoUpdateFunctionality()
simplexml_import_dom(): Invalid Nodetype to importsimplexml_import_dom(Object) Drupal\simpletest\WebTestBase->parse() Drupal\simpletest\WebTestBase->xpath('//a[normalize-space(text())=:label]', Array) Drupal\simpletest\WebTestBase->assertNoLink('Administration pages') Drupal\system\Tests\Update\UpdateScriptTest->testNoUpdateFunctionality() Drupal\simpletest\TestBase->run() simpletest_script_run_one_test('537', 'Drupal\system\Tests\Update\UpdateScriptTest') WarningWebTestBase.php1036Drupal\simpletest\WebTestBase->parse()
Parsed page successfully.BrowserUpdateScriptTest.php147Drupal\system\Tests\Update\UpdateScriptTest->testNoUpdateFunctionality()
simplexml_import_dom(): Invalid Nodetype to importsimplexml_import_dom(Object) Drupal\simpletest\WebTestBase->parse() Drupal\simpletest\WebTestBase->xpath('//a[normalize-space(text())=:label]', Array) Drupal\simpletest\WebTestBase->clickLink('Front page') Drupal\system\Tests\Update\UpdateScriptTest->testNoUpdateFunctionality() Drupal\simpletest\TestBase->run() simpletest_script_run_one_test('537', 'Drupal\system\Tests\Update\UpdateScriptTest') WarningWebTestBase.php1036Drupal\simpletest\WebTestBase->parse()
Parsed page successfully.BrowserUpdateScriptTest.php148Drupal\system\Tests\Update\UpdateScriptTest->testNoUpdateFunctionality()
Undefined variable: url_targetDrupal\simpletest\WebTestBase->clickLink('Front page') Drupal\system\Tests\Update\UpdateScriptTest->testNoUpdateFunctionality() Drupal\simpletest\TestBase->run() simpletest_script_run_one_test('537', 'Drupal\system\Tests\Update\UpdateScriptTest') NoticeWebTestBase.php1852Drupal\simpletest\WebTestBase->clickLink()
Clicked link Front page () from http://drupaltestbot659-mysql/checkout/core/update.php?op=selection&token=RAwI6o7RnvvwXQbOhKPQSfZY6HEUeZW29EP4bBPvTRcBrowserUpdateScriptTest.php148Drupal\system\Tests\Update\UpdateScriptTest->testNoUpdateFunctionality()
Undefined index: backtraceNoticeerrors.inc188_drupal_log_error()
The service definition "php_storage" does not exist.Symfony\Component\DependencyInjection\Exception\InvalidArgumentExceptionContainerBuilder.php690Symfony\Component\DependencyInjection\ContainerBuilder->getDefinition()
"No pending updates." foundOtherUpdateScriptTest.php155Drupal\system\Tests\Update\UpdateScriptTest->testNoUpdateFunctionality()
simplexml_import_dom(): Invalid Nodetype to importsimplexml_import_dom(Object) Drupal\simpletest\WebTestBase->parse() Drupal\simpletest\WebTestBase->xpath('//a[normalize-space(text())=:label]', Array) Drupal\simpletest\WebTestBase->clickLink('Administration pages') Drupal\system\Tests\Update\UpdateScriptTest->testNoUpdateFunctionality() Drupal\simpletest\TestBase->run() simpletest_script_run_one_test('537', 'Drupal\system\Tests\Update\UpdateScriptTest') WarningWebTestBase.php1036Drupal\simpletest\WebTestBase->parse()
Parsed page successfully.BrowserUpdateScriptTest.php156Drupal\system\Tests\Update\UpdateScriptTest->testNoUpdateFunctionality()
Undefined variable: url_targetDrupal\simpletest\WebTestBase->clickLink('Administration pages') Drupal\system\Tests\Update\UpdateScriptTest->testNoUpdateFunctionality() Drupal\simpletest\TestBase->run() simpletest_script_run_one_test('537', 'Drupal\system\Tests\Update\UpdateScriptTest') NoticeWebTestBase.php1852Drupal\simpletest\WebTestBase->clickLink()
Clicked link Administration pages () from http://drupaltestbot659-mysql/checkout/core/update.php?op=selection&token=rrI1uDgVZcXupkujixhmUGwikjZGbqnDHD4up9Ny4D8BrowserUpdateScriptTest.php156Drupal\system\Tests\Update\UpdateScriptTest->testNoUpdateFunctionality()
Undefined index: backtraceNoticeerrors.inc188_drupal_log_error()
The service definition "php_storage" does not exist.Symfony\Component\DependencyInjection\Exception\InvalidArgumentExceptionContainerBuilder.php690Symfony\Component\DependencyInjection\ContainerBuilder->getDefinition()
"Updates were attempted." foundOtherUpdateScriptTest.php169Drupal\system\Tests\Update\UpdateScriptTest->testSuccessfulUpdateFunctionality()
simplexml_import_dom(): Invalid Nodetype to importsimplexml_import_dom(Object) Drupal\simpletest\WebTestBase->parse() Drupal\simpletest\WebTestBase->xpath('//a[normalize-space(text())=:label]', Array) Drupal\simpletest\WebTestBase->assertLink('site') Drupal\system\Tests\Update\UpdateScriptTest->testSuccessfulUpdateFunctionality() Drupal\simpletest\TestBase->run() simpletest_script_run_one_test('537', 'Drupal\system\Tests\Update\UpdateScriptTest') WarningWebTestBase.php1036Drupal\simpletest\WebTestBase->parse()
Parsed page successfully.BrowserUpdateScriptTest.php170Drupal\system\Tests\Update\UpdateScriptTest->testSuccessfulUpdateFunctionality()
Link with label site found.OtherUpdateScriptTest.php170Drupal\system\Tests\Update\UpdateScriptTest->testSuccessfulUpdateFunctionality()
simplexml_import_dom(): Invalid Nodetype to importsimplexml_import_dom(Object) Drupal\simpletest\WebTestBase->parse() Drupal\simpletest\WebTestBase->xpath('//a[normalize-space(text())=:label]', Array) Drupal\simpletest\WebTestBase->assertNoLink('Administration pages') Drupal\system\Tests\Update\UpdateScriptTest->testSuccessfulUpdateFunctionality() Drupal\simpletest\TestBase->run() simpletest_script_run_one_test('537', 'Drupal\system\Tests\Update\UpdateScriptTest') WarningWebTestBase.php1036Drupal\simpletest\WebTestBase->parse()
Parsed page successfully.BrowserUpdateScriptTest.php171Drupal\system\Tests\Update\UpdateScriptTest->testSuccessfulUpdateFunctionality()
simplexml_import_dom(): Invalid Nodetype to importsimplexml_import_dom(Object) Drupal\simpletest\WebTestBase->parse() Drupal\simpletest\WebTestBase->xpath('//a[normalize-space(text())=:label]', Array) Drupal\simpletest\WebTestBase->assertNoLink('logged') Drupal\system\Tests\Update\UpdateScriptTest->testSuccessfulUpdateFunctionality() Drupal\simpletest\TestBase->run() simpletest_script_run_one_test('537', 'Drupal\system\Tests\Update\UpdateScriptTest') WarningWebTestBase.php1036Drupal\simpletest\WebTestBase->parse()
Parsed page successfully.BrowserUpdateScriptTest.php172Drupal\system\Tests\Update\UpdateScriptTest->testSuccessfulUpdateFunctionality()
simplexml_import_dom(): Invalid Nodetype to importsimplexml_import_dom(Object) Drupal\simpletest\WebTestBase->parse() Drupal\simpletest\WebTestBase->xpath('//a[normalize-space(text())=:label]', Array) Drupal\simpletest\WebTestBase->clickLink('Front page') Drupal\system\Tests\Update\UpdateScriptTest->testSuccessfulUpdateFunctionality() Drupal\simpletest\TestBase->run() simpletest_script_run_one_test('537', 'Drupal\system\Tests\Update\UpdateScriptTest') WarningWebTestBase.php1036Drupal\simpletest\WebTestBase->parse()
Parsed page successfully.BrowserUpdateScriptTest.php173Drupal\system\Tests\Update\UpdateScriptTest->testSuccessfulUpdateFunctionality()
Undefined variable: url_targetDrupal\simpletest\WebTestBase->clickLink('Front page') Drupal\system\Tests\Update\UpdateScriptTest->testSuccessfulUpdateFunctionality() Drupal\simpletest\TestBase->run() simpletest_script_run_one_test('537', 'Drupal\system\Tests\Update\UpdateScriptTest') NoticeWebTestBase.php1852Drupal\simpletest\WebTestBase->clickLink()
Clicked link Front page () from http://drupaltestbot659-mysql/checkout/core/update.php?op=selection&token=jSzQX_qu7BIkVRYmZrR1JL2yiEhD0hhomiHcl0H8h2s&id=3&op=finishedBrowserUpdateScriptTest.php173Drupal\system\Tests\Update\UpdateScriptTest->testSuccessfulUpdateFunctionality()
Undefined index: backtraceNoticeerrors.inc188_drupal_log_error()
The service definition "php_storage" does not exist.Symfony\Component\DependencyInjection\Exception\InvalidArgumentExceptionContainerBuilder.php690Symfony\Component\DependencyInjection\ContainerBuilder->getDefinition()
"Updates were attempted." foundOtherUpdateScriptTest.php183Drupal\system\Tests\Update\UpdateScriptTest->testSuccessfulUpdateFunctionality()
simplexml_import_dom(): Invalid Nodetype to importsimplexml_import_dom(Object) Drupal\simpletest\WebTestBase->parse() Drupal\simpletest\WebTestBase->xpath('//a[normalize-space(text())=:label]', Array) Drupal\simpletest\WebTestBase->assertLink('logged') Drupal\system\Tests\Update\UpdateScriptTest->testSuccessfulUpdateFunctionality() Drupal\simpletest\TestBase->run() simpletest_script_run_one_test('537', 'Drupal\system\Tests\Update\UpdateScriptTest') WarningWebTestBase.php1036Drupal\simpletest\WebTestBase->parse()
Parsed page successfully.BrowserUpdateScriptTest.php184Drupal\system\Tests\Update\UpdateScriptTest->testSuccessfulUpdateFunctionality()
Link with label logged found.OtherUpdateScriptTest.php184Drupal\system\Tests\Update\UpdateScriptTest->testSuccessfulUpdateFunctionality()
simplexml_import_dom(): Invalid Nodetype to importsimplexml_import_dom(Object) Drupal\simpletest\WebTestBase->parse() Drupal\simpletest\WebTestBase->xpath('//a[normalize-space(text())=:label]', Array) Drupal\simpletest\WebTestBase->clickLink('Administration pages') Drupal\system\Tests\Update\UpdateScriptTest->testSuccessfulUpdateFunctionality() Drupal\simpletest\TestBase->run() simpletest_script_run_one_test('537', 'Drupal\system\Tests\Update\UpdateScriptTest') WarningWebTestBase.php1036Drupal\simpletest\WebTestBase->parse()
Parsed page successfully.BrowserUpdateScriptTest.php185Drupal\system\Tests\Update\UpdateScriptTest->testSuccessfulUpdateFunctionality()
Undefined variable: url_targetDrupal\simpletest\WebTestBase->clickLink('Administration pages') Drupal\system\Tests\Update\UpdateScriptTest->testSuccessfulUpdateFunctionality() Drupal\simpletest\TestBase->run() simpletest_script_run_one_test('537', 'Drupal\system\Tests\Update\UpdateScriptTest') NoticeWebTestBase.php1852Drupal\simpletest\WebTestBase->clickLink()
Clicked link Administration pages () from http://drupaltestbot659-mysql/checkout/core/update.php?op=selection&token=1T2vuGJx1iUVIM_5D31vRRvZAZbyiIOjF9zDiXixU40&id=5&op=finishedBrowserUpdateScriptTest.php185Drupal\system\Tests\Update\UpdateScriptTest->testSuccessfulUpdateFunctionality()
ExpandDrupal\system\Tests\Upgrade\BareMinimalUpgradePathTest1727
MessageGroupFilenameLineFunctionStatus
Undefined index: backtraceNoticeerrors.inc188_drupal_log_error()
The service definition "php_storage" does not exist.Symfony\Component\DependencyInjection\Exception\InvalidArgumentExceptionContainerBuilder.php690Symfony\Component\DependencyInjection\ContainerBuilder->getDefinition()
simplexml_import_dom(): Invalid Nodetype to importsimplexml_import_dom(Object) Drupal\simpletest\WebTestBase->parse() Drupal\simpletest\WebTestBase->xpath('//li[@class=:class]', Array) Drupal\system\Tests\Upgrade\UpgradePathTestBase->performUpgrade() Drupal\system\Tests\Upgrade\BareMinimalUpgradePathTest->testBasicMinimalUpgrade() Drupal\simpletest\TestBase->run() simpletest_script_run_one_test('545', 'Drupal\system\Tests\Upgrade\BareMinimalUpgradePathTest') WarningWebTestBase.php1036Drupal\simpletest\WebTestBase->parse()
Parsed page successfully.BrowserUpgradePathTestBase.php218Drupal\system\Tests\Upgrade\UpgradePathTestBase->performUpgrade()
Invalid argument supplied for foreach()Drupal\system\Tests\Upgrade\UpgradePathTestBase->performUpgrade() Drupal\system\Tests\Upgrade\BareMinimalUpgradePathTest->testBasicMinimalUpgrade() Drupal\simpletest\TestBase->run() simpletest_script_run_one_test('545', 'Drupal\system\Tests\Upgrade\BareMinimalUpgradePathTest') WarningUpgradePathTestBase.php218Drupal\system\Tests\Upgrade\UpgradePathTestBase->performUpgrade()
Undefined index: backtraceNoticeerrors.inc188_drupal_log_error()
The service definition "php_storage" does not exist.Symfony\Component\DependencyInjection\Exception\InvalidArgumentExceptionContainerBuilder.php690Symfony\Component\DependencyInjection\ContainerBuilder->getDefinition()
No pending updates at the end of the update process.OtherUpgradePathTestBase.php234Drupal\system\Tests\Upgrade\UpgradePathTestBase->performUpgrade()
Exception: update.php still shows pending updates after execution. in Drupal\system\Tests\Upgrade\UpgradePathTestBase->performUpgrade() (line 235 of /var/lib/drupaltestbot/sites/default/files/checkout/core/modules/system/lib/Drupal/system/Tests/Upgrade/UpgradePathTestBase.php). Drupal\system\Tests\Upgrade\UpgradePathTestBase->performUpgrade() Drupal\system\Tests\Upgrade\BareMinimalUpgradePathTest->testBasicMinimalUpgrade() Drupal\simpletest\TestBase->run() simpletest_script_run_one_test('545', 'Drupal\system\Tests\Upgrade\BareMinimalUpgradePathTest') Uncaught exceptionUpgradePathTestBase.php235Drupal\system\Tests\Upgrade\UpgradePathTestBase->performUpgrade()
ExpandDrupal\system\Tests\Upgrade\BareStandardUpgradePathTest2127
MessageGroupFilenameLineFunctionStatus
Undefined index: backtraceNoticeerrors.inc188_drupal_log_error()
The service definition "php_storage" does not exist.Symfony\Component\DependencyInjection\Exception\InvalidArgumentExceptionContainerBuilder.php690Symfony\Component\DependencyInjection\ContainerBuilder->getDefinition()
simplexml_import_dom(): Invalid Nodetype to importsimplexml_import_dom(Object) Drupal\simpletest\WebTestBase->parse() Drupal\simpletest\WebTestBase->xpath('//li[@class=:class]', Array) Drupal\system\Tests\Upgrade\UpgradePathTestBase->performUpgrade() Drupal\system\Tests\Upgrade\BareStandardUpgradePathTest->testBasicStandardUpgrade() Drupal\simpletest\TestBase->run() simpletest_script_run_one_test('546', 'Drupal\system\Tests\Upgrade\BareStandardUpgradePathTest') WarningWebTestBase.php1036Drupal\simpletest\WebTestBase->parse()
Parsed page successfully.BrowserUpgradePathTestBase.php218Drupal\system\Tests\Upgrade\UpgradePathTestBase->performUpgrade()
Invalid argument supplied for foreach()Drupal\system\Tests\Upgrade\UpgradePathTestBase->performUpgrade() Drupal\system\Tests\Upgrade\BareStandardUpgradePathTest->testBasicStandardUpgrade() Drupal\simpletest\TestBase->run() simpletest_script_run_one_test('546', 'Drupal\system\Tests\Upgrade\BareStandardUpgradePathTest') WarningUpgradePathTestBase.php218Drupal\system\Tests\Upgrade\UpgradePathTestBase->performUpgrade()
Undefined index: backtraceNoticeerrors.inc188_drupal_log_error()
The service definition "php_storage" does not exist.Symfony\Component\DependencyInjection\Exception\InvalidArgumentExceptionContainerBuilder.php690Symfony\Component\DependencyInjection\ContainerBuilder->getDefinition()
No pending updates at the end of the update process.OtherUpgradePathTestBase.php234Drupal\system\Tests\Upgrade\UpgradePathTestBase->performUpgrade()
Exception: update.php still shows pending updates after execution. in Drupal\system\Tests\Upgrade\UpgradePathTestBase->performUpgrade() (line 235 of /var/lib/drupaltestbot/sites/default/files/checkout/core/modules/system/lib/Drupal/system/Tests/Upgrade/UpgradePathTestBase.php). Drupal\system\Tests\Upgrade\UpgradePathTestBase->performUpgrade() Drupal\system\Tests\Upgrade\BareStandardUpgradePathTest->testBasicStandardUpgrade() Drupal\simpletest\TestBase->run() simpletest_script_run_one_test('546', 'Drupal\system\Tests\Upgrade\BareStandardUpgradePathTest') Uncaught exceptionUpgradePathTestBase.php235Drupal\system\Tests\Upgrade\UpgradePathTestBase->performUpgrade()
ExpandDrupal\system\Tests\Upgrade\BlockUpgradePathTest1927
MessageGroupFilenameLineFunctionStatus
Undefined index: backtraceNoticeerrors.inc188_drupal_log_error()
The service definition "php_storage" does not exist.Symfony\Component\DependencyInjection\Exception\InvalidArgumentExceptionContainerBuilder.php690Symfony\Component\DependencyInjection\ContainerBuilder->getDefinition()
simplexml_import_dom(): Invalid Nodetype to importsimplexml_import_dom(Object) Drupal\simpletest\WebTestBase->parse() Drupal\simpletest\WebTestBase->xpath('//li[@class=:class]', Array) Drupal\system\Tests\Upgrade\UpgradePathTestBase->performUpgrade() Drupal\system\Tests\Upgrade\BlockUpgradePathTest->testBlockUpgradeTitleLength() Drupal\simpletest\TestBase->run() simpletest_script_run_one_test('547', 'Drupal\system\Tests\Upgrade\BlockUpgradePathTest') WarningWebTestBase.php1036Drupal\simpletest\WebTestBase->parse()
Parsed page successfully.BrowserUpgradePathTestBase.php218Drupal\system\Tests\Upgrade\UpgradePathTestBase->performUpgrade()
Invalid argument supplied for foreach()Drupal\system\Tests\Upgrade\UpgradePathTestBase->performUpgrade() Drupal\system\Tests\Upgrade\BlockUpgradePathTest->testBlockUpgradeTitleLength() Drupal\simpletest\TestBase->run() simpletest_script_run_one_test('547', 'Drupal\system\Tests\Upgrade\BlockUpgradePathTest') WarningUpgradePathTestBase.php218Drupal\system\Tests\Upgrade\UpgradePathTestBase->performUpgrade()
Undefined index: backtraceNoticeerrors.inc188_drupal_log_error()
The service definition "php_storage" does not exist.Symfony\Component\DependencyInjection\Exception\InvalidArgumentExceptionContainerBuilder.php690Symfony\Component\DependencyInjection\ContainerBuilder->getDefinition()
No pending updates at the end of the update process.OtherUpgradePathTestBase.php234Drupal\system\Tests\Upgrade\UpgradePathTestBase->performUpgrade()
Exception: update.php still shows pending updates after execution. in Drupal\system\Tests\Upgrade\UpgradePathTestBase->performUpgrade() (line 235 of /var/lib/drupaltestbot/sites/default/files/checkout/core/modules/system/lib/Drupal/system/Tests/Upgrade/UpgradePathTestBase.php). Drupal\system\Tests\Upgrade\UpgradePathTestBase->performUpgrade() Drupal\system\Tests\Upgrade\BlockUpgradePathTest->testBlockUpgradeTitleLength() Drupal\simpletest\TestBase->run() simpletest_script_run_one_test('547', 'Drupal\system\Tests\Upgrade\BlockUpgradePathTest') Uncaught exceptionUpgradePathTestBase.php235Drupal\system\Tests\Upgrade\UpgradePathTestBase->performUpgrade()
ExpandDrupal\system\Tests\Upgrade\FilledMinimalUpgradePathTest1927
MessageGroupFilenameLineFunctionStatus
Undefined index: backtraceNoticeerrors.inc188_drupal_log_error()
The service definition "php_storage" does not exist.Symfony\Component\DependencyInjection\Exception\InvalidArgumentExceptionContainerBuilder.php690Symfony\Component\DependencyInjection\ContainerBuilder->getDefinition()
simplexml_import_dom(): Invalid Nodetype to importsimplexml_import_dom(Object) Drupal\simpletest\WebTestBase->parse() Drupal\simpletest\WebTestBase->xpath('//li[@class=:class]', Array) Drupal\system\Tests\Upgrade\UpgradePathTestBase->performUpgrade() Drupal\system\Tests\Upgrade\FilledMinimalUpgradePathTest->testFilledMinimalUpgrade() Drupal\simpletest\TestBase->run() simpletest_script_run_one_test('548', 'Drupal\system\Tests\Upgrade\FilledMinimalUpgradePathTest') WarningWebTestBase.php1036Drupal\simpletest\WebTestBase->parse()
Parsed page successfully.BrowserUpgradePathTestBase.php218Drupal\system\Tests\Upgrade\UpgradePathTestBase->performUpgrade()
Invalid argument supplied for foreach()Drupal\system\Tests\Upgrade\UpgradePathTestBase->performUpgrade() Drupal\system\Tests\Upgrade\FilledMinimalUpgradePathTest->testFilledMinimalUpgrade() Drupal\simpletest\TestBase->run() simpletest_script_run_one_test('548', 'Drupal\system\Tests\Upgrade\FilledMinimalUpgradePathTest') WarningUpgradePathTestBase.php218Drupal\system\Tests\Upgrade\UpgradePathTestBase->performUpgrade()
Undefined index: backtraceNoticeerrors.inc188_drupal_log_error()
The service definition "php_storage" does not exist.Symfony\Component\DependencyInjection\Exception\InvalidArgumentExceptionContainerBuilder.php690Symfony\Component\DependencyInjection\ContainerBuilder->getDefinition()
No pending updates at the end of the update process.OtherUpgradePathTestBase.php234Drupal\system\Tests\Upgrade\UpgradePathTestBase->performUpgrade()
Exception: update.php still shows pending updates after execution. in Drupal\system\Tests\Upgrade\UpgradePathTestBase->performUpgrade() (line 235 of /var/lib/drupaltestbot/sites/default/files/checkout/core/modules/system/lib/Drupal/system/Tests/Upgrade/UpgradePathTestBase.php). Drupal\system\Tests\Upgrade\UpgradePathTestBase->performUpgrade() Drupal\system\Tests\Upgrade\FilledMinimalUpgradePathTest->testFilledMinimalUpgrade() Drupal\simpletest\TestBase->run() simpletest_script_run_one_test('548', 'Drupal\system\Tests\Upgrade\FilledMinimalUpgradePathTest') Uncaught exceptionUpgradePathTestBase.php235Drupal\system\Tests\Upgrade\UpgradePathTestBase->performUpgrade()
ExpandDrupal\system\Tests\Upgrade\FilledStandardUpgradePathTest2127
MessageGroupFilenameLineFunctionStatus
Undefined index: backtraceNoticeerrors.inc188_drupal_log_error()
The service definition "php_storage" does not exist.Symfony\Component\DependencyInjection\Exception\InvalidArgumentExceptionContainerBuilder.php690Symfony\Component\DependencyInjection\ContainerBuilder->getDefinition()
simplexml_import_dom(): Invalid Nodetype to importsimplexml_import_dom(Object) Drupal\simpletest\WebTestBase->parse() Drupal\simpletest\WebTestBase->xpath('//li[@class=:class]', Array) Drupal\system\Tests\Upgrade\UpgradePathTestBase->performUpgrade() Drupal\system\Tests\Upgrade\FilledStandardUpgradePathTest->testFilledStandardUpgrade() Drupal\simpletest\TestBase->run() simpletest_script_run_one_test('549', 'Drupal\system\Tests\Upgrade\FilledStandardUpgradePathTest') WarningWebTestBase.php1036Drupal\simpletest\WebTestBase->parse()
Parsed page successfully.BrowserUpgradePathTestBase.php218Drupal\system\Tests\Upgrade\UpgradePathTestBase->performUpgrade()
Invalid argument supplied for foreach()Drupal\system\Tests\Upgrade\UpgradePathTestBase->performUpgrade() Drupal\system\Tests\Upgrade\FilledStandardUpgradePathTest->testFilledStandardUpgrade() Drupal\simpletest\TestBase->run() simpletest_script_run_one_test('549', 'Drupal\system\Tests\Upgrade\FilledStandardUpgradePathTest') WarningUpgradePathTestBase.php218Drupal\system\Tests\Upgrade\UpgradePathTestBase->performUpgrade()
Undefined index: backtraceNoticeerrors.inc188_drupal_log_error()
The service definition "php_storage" does not exist.Symfony\Component\DependencyInjection\Exception\InvalidArgumentExceptionContainerBuilder.php690Symfony\Component\DependencyInjection\ContainerBuilder->getDefinition()
No pending updates at the end of the update process.OtherUpgradePathTestBase.php234Drupal\system\Tests\Upgrade\UpgradePathTestBase->performUpgrade()
Exception: update.php still shows pending updates after execution. in Drupal\system\Tests\Upgrade\UpgradePathTestBase->performUpgrade() (line 235 of /var/lib/drupaltestbot/sites/default/files/checkout/core/modules/system/lib/Drupal/system/Tests/Upgrade/UpgradePathTestBase.php). Drupal\system\Tests\Upgrade\UpgradePathTestBase->performUpgrade() Drupal\system\Tests\Upgrade\FilledStandardUpgradePathTest->testFilledStandardUpgrade() Drupal\simpletest\TestBase->run() simpletest_script_run_one_test('549', 'Drupal\system\Tests\Upgrade\FilledStandardUpgradePathTest') Uncaught exceptionUpgradePathTestBase.php235Drupal\system\Tests\Upgrade\UpgradePathTestBase->performUpgrade()
ExpandDrupal\system\Tests\Upgrade\ImageUpgradePathTest2127
MessageGroupFilenameLineFunctionStatus
Undefined index: backtraceNoticeerrors.inc188_drupal_log_error()
The service definition "php_storage" does not exist.Symfony\Component\DependencyInjection\Exception\InvalidArgumentExceptionContainerBuilder.php690Symfony\Component\DependencyInjection\ContainerBuilder->getDefinition()
simplexml_import_dom(): Invalid Nodetype to importsimplexml_import_dom(Object) Drupal\simpletest\WebTestBase->parse() Drupal\simpletest\WebTestBase->xpath('//li[@class=:class]', Array) Drupal\system\Tests\Upgrade\UpgradePathTestBase->performUpgrade() Drupal\system\Tests\Upgrade\ImageUpgradePathTest->testImageStyleUpgrade() Drupal\simpletest\TestBase->run() simpletest_script_run_one_test('550', 'Drupal\system\Tests\Upgrade\ImageUpgradePathTest') WarningWebTestBase.php1036Drupal\simpletest\WebTestBase->parse()
Parsed page successfully.BrowserUpgradePathTestBase.php218Drupal\system\Tests\Upgrade\UpgradePathTestBase->performUpgrade()
Invalid argument supplied for foreach()Drupal\system\Tests\Upgrade\UpgradePathTestBase->performUpgrade() Drupal\system\Tests\Upgrade\ImageUpgradePathTest->testImageStyleUpgrade() Drupal\simpletest\TestBase->run() simpletest_script_run_one_test('550', 'Drupal\system\Tests\Upgrade\ImageUpgradePathTest') WarningUpgradePathTestBase.php218Drupal\system\Tests\Upgrade\UpgradePathTestBase->performUpgrade()
Undefined index: backtraceNoticeerrors.inc188_drupal_log_error()
The service definition "php_storage" does not exist.Symfony\Component\DependencyInjection\Exception\InvalidArgumentExceptionContainerBuilder.php690Symfony\Component\DependencyInjection\ContainerBuilder->getDefinition()
No pending updates at the end of the update process.OtherUpgradePathTestBase.php234Drupal\system\Tests\Upgrade\UpgradePathTestBase->performUpgrade()
Exception: update.php still shows pending updates after execution. in Drupal\system\Tests\Upgrade\UpgradePathTestBase->performUpgrade() (line 235 of /var/lib/drupaltestbot/sites/default/files/checkout/core/modules/system/lib/Drupal/system/Tests/Upgrade/UpgradePathTestBase.php). Drupal\system\Tests\Upgrade\UpgradePathTestBase->performUpgrade() Drupal\system\Tests\Upgrade\ImageUpgradePathTest->testImageStyleUpgrade() Drupal\simpletest\TestBase->run() simpletest_script_run_one_test('550', 'Drupal\system\Tests\Upgrade\ImageUpgradePathTest') Uncaught exceptionUpgradePathTestBase.php235Drupal\system\Tests\Upgrade\UpgradePathTestBase->performUpgrade()
ExpandDrupal\system\Tests\Upgrade\LanguageUpgradePathTest88828
MessageGroupFilenameLineFunctionStatus
Undefined index: backtraceNoticeerrors.inc188_drupal_log_error()
The service definition "php_storage" does not exist.Symfony\Component\DependencyInjection\Exception\InvalidArgumentExceptionContainerBuilder.php690Symfony\Component\DependencyInjection\ContainerBuilder->getDefinition()
simplexml_import_dom(): Invalid Nodetype to importsimplexml_import_dom(Object) Drupal\simpletest\WebTestBase->parse() Drupal\simpletest\WebTestBase->xpath('//li[@class=:class]', Array) Drupal\system\Tests\Upgrade\UpgradePathTestBase->performUpgrade() Drupal\system\Tests\Upgrade\LanguageUpgradePathTest->testLanguageUpgrade() Drupal\simpletest\TestBase->run() simpletest_script_run_one_test('551', 'Drupal\system\Tests\Upgrade\LanguageUpgradePathTest') WarningWebTestBase.php1036Drupal\simpletest\WebTestBase->parse()
Parsed page successfully.BrowserUpgradePathTestBase.php218Drupal\system\Tests\Upgrade\UpgradePathTestBase->performUpgrade()
Invalid argument supplied for foreach()Drupal\system\Tests\Upgrade\UpgradePathTestBase->performUpgrade() Drupal\system\Tests\Upgrade\LanguageUpgradePathTest->testLanguageUpgrade() Drupal\simpletest\TestBase->run() simpletest_script_run_one_test('551', 'Drupal\system\Tests\Upgrade\LanguageUpgradePathTest') WarningUpgradePathTestBase.php218Drupal\system\Tests\Upgrade\UpgradePathTestBase->performUpgrade()
Undefined index: backtraceNoticeerrors.inc188_drupal_log_error()
The service definition "php_storage" does not exist.Symfony\Component\DependencyInjection\Exception\InvalidArgumentExceptionContainerBuilder.php690Symfony\Component\DependencyInjection\ContainerBuilder->getDefinition()
No pending updates at the end of the update process.OtherUpgradePathTestBase.php234Drupal\system\Tests\Upgrade\UpgradePathTestBase->performUpgrade()
Exception: update.php still shows pending updates after execution. in Drupal\system\Tests\Upgrade\UpgradePathTestBase->performUpgrade() (line 235 of /var/lib/drupaltestbot/sites/default/files/checkout/core/modules/system/lib/Drupal/system/Tests/Upgrade/UpgradePathTestBase.php). Drupal\system\Tests\Upgrade\UpgradePathTestBase->performUpgrade() Drupal\system\Tests\Upgrade\LanguageUpgradePathTest->testLanguageUpgrade() Drupal\simpletest\TestBase->run() simpletest_script_run_one_test('551', 'Drupal\system\Tests\Upgrade\LanguageUpgradePathTest') Uncaught exceptionUpgradePathTestBase.php235Drupal\system\Tests\Upgrade\UpgradePathTestBase->performUpgrade()
Undefined index: backtraceNoticeerrors.inc188_drupal_log_error()
The service definition "php_storage" does not exist.Symfony\Component\DependencyInjection\Exception\InvalidArgumentExceptionContainerBuilder.php690Symfony\Component\DependencyInjection\ContainerBuilder->getDefinition()
simplexml_import_dom(): Invalid Nodetype to importsimplexml_import_dom(Object) Drupal\simpletest\WebTestBase->parse() Drupal\simpletest\WebTestBase->xpath('//li[@class=:class]', Array) Drupal\system\Tests\Upgrade\UpgradePathTestBase->performUpgrade() Drupal\system\Tests\Upgrade\LanguageUpgradePathTest->testLanguageUrlUpgrade() Drupal\simpletest\TestBase->run() simpletest_script_run_one_test('551', 'Drupal\system\Tests\Upgrade\LanguageUpgradePathTest') WarningWebTestBase.php1036Drupal\simpletest\WebTestBase->parse()
Parsed page successfully.BrowserUpgradePathTestBase.php218Drupal\system\Tests\Upgrade\UpgradePathTestBase->performUpgrade()
Invalid argument supplied for foreach()Drupal\system\Tests\Upgrade\UpgradePathTestBase->performUpgrade() Drupal\system\Tests\Upgrade\LanguageUpgradePathTest->testLanguageUrlUpgrade() Drupal\simpletest\TestBase->run() simpletest_script_run_one_test('551', 'Drupal\system\Tests\Upgrade\LanguageUpgradePathTest') WarningUpgradePathTestBase.php218Drupal\system\Tests\Upgrade\UpgradePathTestBase->performUpgrade()
Undefined index: backtraceNoticeerrors.inc188_drupal_log_error()
The service definition "php_storage" does not exist.Symfony\Component\DependencyInjection\Exception\InvalidArgumentExceptionContainerBuilder.php690Symfony\Component\DependencyInjection\ContainerBuilder->getDefinition()
No pending updates at the end of the update process.OtherUpgradePathTestBase.php234Drupal\system\Tests\Upgrade\UpgradePathTestBase->performUpgrade()
Exception: update.php still shows pending updates after execution. in Drupal\system\Tests\Upgrade\UpgradePathTestBase->performUpgrade() (line 235 of /var/lib/drupaltestbot/sites/default/files/checkout/core/modules/system/lib/Drupal/system/Tests/Upgrade/UpgradePathTestBase.php). Drupal\system\Tests\Upgrade\UpgradePathTestBase->performUpgrade() Drupal\system\Tests\Upgrade\LanguageUpgradePathTest->testLanguageUrlUpgrade() Drupal\simpletest\TestBase->run() simpletest_script_run_one_test('551', 'Drupal\system\Tests\Upgrade\LanguageUpgradePathTest') Uncaught exceptionUpgradePathTestBase.php235Drupal\system\Tests\Upgrade\UpgradePathTestBase->performUpgrade()
Undefined index: backtraceNoticeerrors.inc188_drupal_log_error()
The service definition "php_storage" does not exist.Symfony\Component\DependencyInjection\Exception\InvalidArgumentExceptionContainerBuilder.php690Symfony\Component\DependencyInjection\ContainerBuilder->getDefinition()
simplexml_import_dom(): Invalid Nodetype to importsimplexml_import_dom(Object) Drupal\simpletest\WebTestBase->parse() Drupal\simpletest\WebTestBase->xpath('//li[@class=:class]', Array) Drupal\system\Tests\Upgrade\UpgradePathTestBase->performUpgrade() Drupal\system\Tests\Upgrade\LanguageUpgradePathTest->testLanguageNoPluralsUpgrade() Drupal\simpletest\TestBase->run() simpletest_script_run_one_test('551', 'Drupal\system\Tests\Upgrade\LanguageUpgradePathTest') WarningWebTestBase.php1036Drupal\simpletest\WebTestBase->parse()
Parsed page successfully.BrowserUpgradePathTestBase.php218Drupal\system\Tests\Upgrade\UpgradePathTestBase->performUpgrade()
Invalid argument supplied for foreach()Drupal\system\Tests\Upgrade\UpgradePathTestBase->performUpgrade() Drupal\system\Tests\Upgrade\LanguageUpgradePathTest->testLanguageNoPluralsUpgrade() Drupal\simpletest\TestBase->run() simpletest_script_run_one_test('551', 'Drupal\system\Tests\Upgrade\LanguageUpgradePathTest') WarningUpgradePathTestBase.php218Drupal\system\Tests\Upgrade\UpgradePathTestBase->performUpgrade()
Undefined index: backtraceNoticeerrors.inc188_drupal_log_error()
The service definition "php_storage" does not exist.Symfony\Component\DependencyInjection\Exception\InvalidArgumentExceptionContainerBuilder.php690Symfony\Component\DependencyInjection\ContainerBuilder->getDefinition()
No pending updates at the end of the update process.OtherUpgradePathTestBase.php234Drupal\system\Tests\Upgrade\UpgradePathTestBase->performUpgrade()
Exception: update.php still shows pending updates after execution. in Drupal\system\Tests\Upgrade\UpgradePathTestBase->performUpgrade() (line 235 of /var/lib/drupaltestbot/sites/default/files/checkout/core/modules/system/lib/Drupal/system/Tests/Upgrade/UpgradePathTestBase.php). Drupal\system\Tests\Upgrade\UpgradePathTestBase->performUpgrade() Drupal\system\Tests\Upgrade\LanguageUpgradePathTest->testLanguageNoPluralsUpgrade() Drupal\simpletest\TestBase->run() simpletest_script_run_one_test('551', 'Drupal\system\Tests\Upgrade\LanguageUpgradePathTest') Uncaught exceptionUpgradePathTestBase.php235Drupal\system\Tests\Upgrade\UpgradePathTestBase->performUpgrade()
Undefined index: backtraceNoticeerrors.inc188_drupal_log_error()
The service definition "php_storage" does not exist.Symfony\Component\DependencyInjection\Exception\InvalidArgumentExceptionContainerBuilder.php690Symfony\Component\DependencyInjection\ContainerBuilder->getDefinition()
simplexml_import_dom(): Invalid Nodetype to importsimplexml_import_dom(Object) Drupal\simpletest\WebTestBase->parse() Drupal\simpletest\WebTestBase->xpath('//li[@class=:class]', Array) Drupal\system\Tests\Upgrade\UpgradePathTestBase->performUpgrade() Drupal\system\Tests\Upgrade\LanguageUpgradePathTest->testLanguagePermissionsUpgrade() Drupal\simpletest\TestBase->run() simpletest_script_run_one_test('551', 'Drupal\system\Tests\Upgrade\LanguageUpgradePathTest') WarningWebTestBase.php1036Drupal\simpletest\WebTestBase->parse()
Parsed page successfully.BrowserUpgradePathTestBase.php218Drupal\system\Tests\Upgrade\UpgradePathTestBase->performUpgrade()
Invalid argument supplied for foreach()Drupal\system\Tests\Upgrade\UpgradePathTestBase->performUpgrade() Drupal\system\Tests\Upgrade\LanguageUpgradePathTest->testLanguagePermissionsUpgrade() Drupal\simpletest\TestBase->run() simpletest_script_run_one_test('551', 'Drupal\system\Tests\Upgrade\LanguageUpgradePathTest') WarningUpgradePathTestBase.php218Drupal\system\Tests\Upgrade\UpgradePathTestBase->performUpgrade()
Undefined index: backtraceNoticeerrors.inc188_drupal_log_error()
The service definition "php_storage" does not exist.Symfony\Component\DependencyInjection\Exception\InvalidArgumentExceptionContainerBuilder.php690Symfony\Component\DependencyInjection\ContainerBuilder->getDefinition()
No pending updates at the end of the update process.OtherUpgradePathTestBase.php234Drupal\system\Tests\Upgrade\UpgradePathTestBase->performUpgrade()
Exception: update.php still shows pending updates after execution. in Drupal\system\Tests\Upgrade\UpgradePathTestBase->performUpgrade() (line 235 of /var/lib/drupaltestbot/sites/default/files/checkout/core/modules/system/lib/Drupal/system/Tests/Upgrade/UpgradePathTestBase.php). Drupal\system\Tests\Upgrade\UpgradePathTestBase->performUpgrade() Drupal\system\Tests\Upgrade\LanguageUpgradePathTest->testLanguagePermissionsUpgrade() Drupal\simpletest\TestBase->run() simpletest_script_run_one_test('551', 'Drupal\system\Tests\Upgrade\LanguageUpgradePathTest') Uncaught exceptionUpgradePathTestBase.php235Drupal\system\Tests\Upgrade\UpgradePathTestBase->performUpgrade()
ExpandDrupal\system\Tests\Upgrade\ModulesDisabledUpgradePathTest2127
MessageGroupFilenameLineFunctionStatus
Undefined index: backtraceNoticeerrors.inc188_drupal_log_error()
The service definition "php_storage" does not exist.Symfony\Component\DependencyInjection\Exception\InvalidArgumentExceptionContainerBuilder.php690Symfony\Component\DependencyInjection\ContainerBuilder->getDefinition()
simplexml_import_dom(): Invalid Nodetype to importsimplexml_import_dom(Object) Drupal\simpletest\WebTestBase->parse() Drupal\simpletest\WebTestBase->xpath('//li[@class=:class]', Array) Drupal\system\Tests\Upgrade\UpgradePathTestBase->performUpgrade() Drupal\system\Tests\Upgrade\ModulesDisabledUpgradePathTest->testDisabledUpgrade() Drupal\simpletest\TestBase->run() simpletest_script_run_one_test('552', 'Drupal\system\Tests\Upgrade\ModulesDisabledUpgradePathTest') WarningWebTestBase.php1036Drupal\simpletest\WebTestBase->parse()
Parsed page successfully.BrowserUpgradePathTestBase.php218Drupal\system\Tests\Upgrade\UpgradePathTestBase->performUpgrade()
Invalid argument supplied for foreach()Drupal\system\Tests\Upgrade\UpgradePathTestBase->performUpgrade() Drupal\system\Tests\Upgrade\ModulesDisabledUpgradePathTest->testDisabledUpgrade() Drupal\simpletest\TestBase->run() simpletest_script_run_one_test('552', 'Drupal\system\Tests\Upgrade\ModulesDisabledUpgradePathTest') WarningUpgradePathTestBase.php218Drupal\system\Tests\Upgrade\UpgradePathTestBase->performUpgrade()
Undefined index: backtraceNoticeerrors.inc188_drupal_log_error()
The service definition "php_storage" does not exist.Symfony\Component\DependencyInjection\Exception\InvalidArgumentExceptionContainerBuilder.php690Symfony\Component\DependencyInjection\ContainerBuilder->getDefinition()
No pending updates at the end of the update process.OtherUpgradePathTestBase.php234Drupal\system\Tests\Upgrade\UpgradePathTestBase->performUpgrade()
Exception: update.php still shows pending updates after execution. in Drupal\system\Tests\Upgrade\UpgradePathTestBase->performUpgrade() (line 235 of /var/lib/drupaltestbot/sites/default/files/checkout/core/modules/system/lib/Drupal/system/Tests/Upgrade/UpgradePathTestBase.php). Drupal\system\Tests\Upgrade\UpgradePathTestBase->performUpgrade() Drupal\system\Tests\Upgrade\ModulesDisabledUpgradePathTest->testDisabledUpgrade() Drupal\simpletest\TestBase->run() simpletest_script_run_one_test('552', 'Drupal\system\Tests\Upgrade\ModulesDisabledUpgradePathTest') Uncaught exceptionUpgradePathTestBase.php235Drupal\system\Tests\Upgrade\UpgradePathTestBase->performUpgrade()
ExpandDrupal\system\Tests\Upgrade\StateSystemUpgradePathTest2327
MessageGroupFilenameLineFunctionStatus
Undefined index: backtraceNoticeerrors.inc188_drupal_log_error()
The service definition "php_storage" does not exist.Symfony\Component\DependencyInjection\Exception\InvalidArgumentExceptionContainerBuilder.php690Symfony\Component\DependencyInjection\ContainerBuilder->getDefinition()
simplexml_import_dom(): Invalid Nodetype to importsimplexml_import_dom(Object) Drupal\simpletest\WebTestBase->parse() Drupal\simpletest\WebTestBase->xpath('//li[@class=:class]', Array) Drupal\system\Tests\Upgrade\UpgradePathTestBase->performUpgrade() Drupal\system\Tests\Upgrade\StateSystemUpgradePathTest->testSystemVariableUpgrade() Drupal\simpletest\TestBase->run() simpletest_script_run_one_test('553', 'Drupal\system\Tests\Upgrade\StateSystemUpgradePathTest') WarningWebTestBase.php1036Drupal\simpletest\WebTestBase->parse()
Parsed page successfully.BrowserUpgradePathTestBase.php218Drupal\system\Tests\Upgrade\UpgradePathTestBase->performUpgrade()
Invalid argument supplied for foreach()Drupal\system\Tests\Upgrade\UpgradePathTestBase->performUpgrade() Drupal\system\Tests\Upgrade\StateSystemUpgradePathTest->testSystemVariableUpgrade() Drupal\simpletest\TestBase->run() simpletest_script_run_one_test('553', 'Drupal\system\Tests\Upgrade\StateSystemUpgradePathTest') WarningUpgradePathTestBase.php218Drupal\system\Tests\Upgrade\UpgradePathTestBase->performUpgrade()
Undefined index: backtraceNoticeerrors.inc188_drupal_log_error()
The service definition "php_storage" does not exist.Symfony\Component\DependencyInjection\Exception\InvalidArgumentExceptionContainerBuilder.php690Symfony\Component\DependencyInjection\ContainerBuilder->getDefinition()
No pending updates at the end of the update process.OtherUpgradePathTestBase.php234Drupal\system\Tests\Upgrade\UpgradePathTestBase->performUpgrade()
Exception: update.php still shows pending updates after execution. in Drupal\system\Tests\Upgrade\UpgradePathTestBase->performUpgrade() (line 235 of /var/lib/drupaltestbot/sites/default/files/checkout/core/modules/system/lib/Drupal/system/Tests/Upgrade/UpgradePathTestBase.php). Drupal\system\Tests\Upgrade\UpgradePathTestBase->performUpgrade() Drupal\system\Tests\Upgrade\StateSystemUpgradePathTest->testSystemVariableUpgrade() Drupal\simpletest\TestBase->run() simpletest_script_run_one_test('553', 'Drupal\system\Tests\Upgrade\StateSystemUpgradePathTest') Uncaught exceptionUpgradePathTestBase.php235Drupal\system\Tests\Upgrade\UpgradePathTestBase->performUpgrade()
ExpandDrupal\system\Tests\Upgrade\SystemUpgradePathTest2327
MessageGroupFilenameLineFunctionStatus
Undefined index: backtraceNoticeerrors.inc188_drupal_log_error()
The service definition "php_storage" does not exist.Symfony\Component\DependencyInjection\Exception\InvalidArgumentExceptionContainerBuilder.php690Symfony\Component\DependencyInjection\ContainerBuilder->getDefinition()
simplexml_import_dom(): Invalid Nodetype to importsimplexml_import_dom(Object) Drupal\simpletest\WebTestBase->parse() Drupal\simpletest\WebTestBase->xpath('//li[@class=:class]', Array) Drupal\system\Tests\Upgrade\UpgradePathTestBase->performUpgrade() Drupal\system\Tests\Upgrade\SystemUpgradePathTest->testVariableUpgrade() Drupal\simpletest\TestBase->run() simpletest_script_run_one_test('554', 'Drupal\system\Tests\Upgrade\SystemUpgradePathTest') WarningWebTestBase.php1036Drupal\simpletest\WebTestBase->parse()
Parsed page successfully.BrowserUpgradePathTestBase.php218Drupal\system\Tests\Upgrade\UpgradePathTestBase->performUpgrade()
Invalid argument supplied for foreach()Drupal\system\Tests\Upgrade\UpgradePathTestBase->performUpgrade() Drupal\system\Tests\Upgrade\SystemUpgradePathTest->testVariableUpgrade() Drupal\simpletest\TestBase->run() simpletest_script_run_one_test('554', 'Drupal\system\Tests\Upgrade\SystemUpgradePathTest') WarningUpgradePathTestBase.php218Drupal\system\Tests\Upgrade\UpgradePathTestBase->performUpgrade()
Undefined index: backtraceNoticeerrors.inc188_drupal_log_error()
The service definition "php_storage" does not exist.Symfony\Component\DependencyInjection\Exception\InvalidArgumentExceptionContainerBuilder.php690Symfony\Component\DependencyInjection\ContainerBuilder->getDefinition()
No pending updates at the end of the update process.OtherUpgradePathTestBase.php234Drupal\system\Tests\Upgrade\UpgradePathTestBase->performUpgrade()
Exception: update.php still shows pending updates after execution. in Drupal\system\Tests\Upgrade\UpgradePathTestBase->performUpgrade() (line 235 of /var/lib/drupaltestbot/sites/default/files/checkout/core/modules/system/lib/Drupal/system/Tests/Upgrade/UpgradePathTestBase.php). Drupal\system\Tests\Upgrade\UpgradePathTestBase->performUpgrade() Drupal\system\Tests\Upgrade\SystemUpgradePathTest->testVariableUpgrade() Drupal\simpletest\TestBase->run() simpletest_script_run_one_test('554', 'Drupal\system\Tests\Upgrade\SystemUpgradePathTest') Uncaught exceptionUpgradePathTestBase.php235Drupal\system\Tests\Upgrade\UpgradePathTestBase->performUpgrade()
ExpandDrupal\system\Tests\Upgrade\UserRoleUpgradePathTest2327
MessageGroupFilenameLineFunctionStatus
Undefined index: backtraceNoticeerrors.inc188_drupal_log_error()
The service definition "php_storage" does not exist.Symfony\Component\DependencyInjection\Exception\InvalidArgumentExceptionContainerBuilder.php690Symfony\Component\DependencyInjection\ContainerBuilder->getDefinition()
simplexml_import_dom(): Invalid Nodetype to importsimplexml_import_dom(Object) Drupal\simpletest\WebTestBase->parse() Drupal\simpletest\WebTestBase->xpath('//li[@class=:class]', Array) Drupal\system\Tests\Upgrade\UpgradePathTestBase->performUpgrade() Drupal\system\Tests\Upgrade\UserRoleUpgradePathTest->testRoleUpgrade() Drupal\simpletest\TestBase->run() simpletest_script_run_one_test('555', 'Drupal\system\Tests\Upgrade\UserRoleUpgradePathTest') WarningWebTestBase.php1036Drupal\simpletest\WebTestBase->parse()
Parsed page successfully.BrowserUpgradePathTestBase.php218Drupal\system\Tests\Upgrade\UpgradePathTestBase->performUpgrade()
Invalid argument supplied for foreach()Drupal\system\Tests\Upgrade\UpgradePathTestBase->performUpgrade() Drupal\system\Tests\Upgrade\UserRoleUpgradePathTest->testRoleUpgrade() Drupal\simpletest\TestBase->run() simpletest_script_run_one_test('555', 'Drupal\system\Tests\Upgrade\UserRoleUpgradePathTest') WarningUpgradePathTestBase.php218Drupal\system\Tests\Upgrade\UpgradePathTestBase->performUpgrade()
Undefined index: backtraceNoticeerrors.inc188_drupal_log_error()
The service definition "php_storage" does not exist.Symfony\Component\DependencyInjection\Exception\InvalidArgumentExceptionContainerBuilder.php690Symfony\Component\DependencyInjection\ContainerBuilder->getDefinition()
No pending updates at the end of the update process.OtherUpgradePathTestBase.php234Drupal\system\Tests\Upgrade\UpgradePathTestBase->performUpgrade()
Exception: update.php still shows pending updates after execution. in Drupal\system\Tests\Upgrade\UpgradePathTestBase->performUpgrade() (line 235 of /var/lib/drupaltestbot/sites/default/files/checkout/core/modules/system/lib/Drupal/system/Tests/Upgrade/UpgradePathTestBase.php). Drupal\system\Tests\Upgrade\UpgradePathTestBase->performUpgrade() Drupal\system\Tests\Upgrade\UserRoleUpgradePathTest->testRoleUpgrade() Drupal\simpletest\TestBase->run() simpletest_script_run_one_test('555', 'Drupal\system\Tests\Upgrade\UserRoleUpgradePathTest') Uncaught exceptionUpgradePathTestBase.php235Drupal\system\Tests\Upgrade\UpgradePathTestBase->performUpgrade()
ExpandDrupal\system\Tests\Upgrade\UuidUpgradePathTest2127
MessageGroupFilenameLineFunctionStatus
Undefined index: backtraceNoticeerrors.inc188_drupal_log_error()
The service definition "php_storage" does not exist.Symfony\Component\DependencyInjection\Exception\InvalidArgumentExceptionContainerBuilder.php690Symfony\Component\DependencyInjection\ContainerBuilder->getDefinition()
simplexml_import_dom(): Invalid Nodetype to importsimplexml_import_dom(Object) Drupal\simpletest\WebTestBase->parse() Drupal\simpletest\WebTestBase->xpath('//li[@class=:class]', Array) Drupal\system\Tests\Upgrade\UpgradePathTestBase->performUpgrade() Drupal\system\Tests\Upgrade\UuidUpgradePathTest->testUuidUpgrade() Drupal\simpletest\TestBase->run() simpletest_script_run_one_test('556', 'Drupal\system\Tests\Upgrade\UuidUpgradePathTest') WarningWebTestBase.php1036Drupal\simpletest\WebTestBase->parse()
Parsed page successfully.BrowserUpgradePathTestBase.php218Drupal\system\Tests\Upgrade\UpgradePathTestBase->performUpgrade()
Invalid argument supplied for foreach()Drupal\system\Tests\Upgrade\UpgradePathTestBase->performUpgrade() Drupal\system\Tests\Upgrade\UuidUpgradePathTest->testUuidUpgrade() Drupal\simpletest\TestBase->run() simpletest_script_run_one_test('556', 'Drupal\system\Tests\Upgrade\UuidUpgradePathTest') WarningUpgradePathTestBase.php218Drupal\system\Tests\Upgrade\UpgradePathTestBase->performUpgrade()
Undefined index: backtraceNoticeerrors.inc188_drupal_log_error()
The service definition "php_storage" does not exist.Symfony\Component\DependencyInjection\Exception\InvalidArgumentExceptionContainerBuilder.php690Symfony\Component\DependencyInjection\ContainerBuilder->getDefinition()
No pending updates at the end of the update process.OtherUpgradePathTestBase.php234Drupal\system\Tests\Upgrade\UpgradePathTestBase->performUpgrade()
Exception: update.php still shows pending updates after execution. in Drupal\system\Tests\Upgrade\UpgradePathTestBase->performUpgrade() (line 235 of /var/lib/drupaltestbot/sites/default/files/checkout/core/modules/system/lib/Drupal/system/Tests/Upgrade/UpgradePathTestBase.php). Drupal\system\Tests\Upgrade\UpgradePathTestBase->performUpgrade() Drupal\system\Tests\Upgrade\UuidUpgradePathTest->testUuidUpgrade() Drupal\simpletest\TestBase->run() simpletest_script_run_one_test('556', 'Drupal\system\Tests\Upgrade\UuidUpgradePathTest') Uncaught exceptionUpgradePathTestBase.php235Drupal\system\Tests\Upgrade\UpgradePathTestBase->performUpgrade()
LeafDrupal\system\Tests\Uuid\UuidUnitTest700
LeafDrupal\taxonomy\Tests\EfqTest1400
LeafDrupal\taxonomy\Tests\HooksTest2300
LeafDrupal\taxonomy\Tests\LegacyTest1400
LeafDrupal\taxonomy\Tests\LoadMultipleTest1800
LeafDrupal\taxonomy\Tests\RssTest2600
LeafDrupal\taxonomy\Tests\TermFieldMultipleVocabularyTest2600
LeafDrupal\taxonomy\Tests\TermFieldTest5800
LeafDrupal\taxonomy\Tests\TermIndexTest5100
LeafDrupal\taxonomy\Tests\TermLanguageTest9700
LeafDrupal\taxonomy\Tests\TermTest30200
LeafDrupal\taxonomy\Tests\TermTranslationUITest6700
LeafDrupal\taxonomy\Tests\TermUnitTest1800
LeafDrupal\taxonomy\Tests\ThemeTest3800
LeafDrupal\taxonomy\Tests\TokenReplaceTest11000
LeafDrupal\taxonomy\Tests\VocabularyLanguageTest8400
LeafDrupal\taxonomy\Tests\VocabularyTest15100
LeafDrupal\taxonomy\Tests\VocabularyUnitTest8400
LeafDrupal\text\Tests\TextFieldTest18400
LeafDrupal\text\Tests\TextSummaryTest13800
LeafDrupal\text\Tests\TextTranslationTest10400
LeafDrupal\tracker\Tests\TrackerNodeAccessTest2800
LeafDrupal\tracker\Tests\TrackerTest22800
LeafDrupal\translation\Tests\TranslationTest59000
LeafDrupal\translation_entity\Tests\ConfigTestTranslationUITest1300
LeafDrupal\translation_entity\Tests\EntityTestTranslationUITest6800
LeafDrupal\update\Tests\UpdateContribTest18700
LeafDrupal\update\Tests\UpdateCoreTest21400
LeafDrupal\update\Tests\UpdateCoreUnitTest400
LeafDrupal\update\Tests\UpdateUploadTest6400
LeafDrupal\user\Tests\TempStoreDatabaseTest3800
LeafDrupal\user\Tests\UserAccountLinksTests6100
LeafDrupal\user\Tests\UserAdminSettingsFormTest400
LeafDrupal\user\Tests\UserAdminTest6100
LeafDrupal\user\Tests\UserAuthmapAssignmentTest600
LeafDrupal\user\Tests\UserAutocompleteTest2500
LeafDrupal\user\Tests\UserBlocksTests4000
LeafDrupal\user\Tests\UserCancelTest25400
LeafDrupal\user\Tests\UserCreateTest3300
LeafDrupal\user\Tests\UserDeleteTest1500
LeafDrupal\user\Tests\UserEditedOwnAccountTest2200
LeafDrupal\user\Tests\UserEditTest7800
LeafDrupal\user\Tests\UserEntityCallbacksTest700
LeafDrupal\user\Tests\UserLanguageCreationTest6800
LeafDrupal\user\Tests\UserLanguageTest3900
LeafDrupal\user\Tests\UserLoginTest15900
LeafDrupal\user\Tests\UserPasswordResetTest3000
LeafDrupal\user\Tests\UserPermissionsTest5000
LeafDrupal\user\Tests\UserPictureTest12600
ExpandDrupal\user\Tests\UserRegistrationTest13002
MessageGroupFilenameLineFunctionStatus
rmdir(/var/lib/drupaltestbot/sites/default/files/checkout/sites/default/files/php/service_container/service_container_prod__simpletest166604.php): No such file or directoryrmdir('/var/lib/drupaltestbot/sites/default/files/checkout/sites/default/files/php/service_container/service_container_prod__simpletest166604.php') drupal_rmdir('/var/lib/drupaltestbot/sites/default/files/checkout/sites/default/files/php/service_container/service_container_prod__simpletest166604.php') file_unmanaged_delete_recursive('/var/lib/drupaltestbot/sites/default/files/checkout/sites/default/files/php/service_container/service_container_prod__simpletest166604.php', Array) file_unmanaged_delete_recursive('/var/lib/drupaltestbot/sites/default/files/checkout/sites/default/files/php/service_container', Array) Drupal\Component\PhpStorage\FileStorage->deleteAll() drupal_flush_all_caches() _install_profile_modules_finished(1, Array, Array, '0 sec') _batch_finished() _batch_process() batch_process('core/install.php?profile=testing&langcode=en', 'http://drupaltestbot659-mysql/checkout/core/install.php?profile=testing&langcode=en') install_run_task(Array, Array) install_run_tasks(Array) install_drupal(Array) Drupal\simpletest\WebTestBase->setUp() Drupal\simpletest\TestBase->run() simpletest_script_run_one_test('575', 'Drupal\user\Tests\UserRegistrationTest') Warningfile.inc1769drupal_rmdir()
rmdir(/var/lib/drupaltestbot/sites/default/files/checkout/sites/default/files/php/service_container): No such file or directoryrmdir('/var/lib/drupaltestbot/sites/default/files/checkout/sites/default/files/php/service_container') drupal_rmdir('/var/lib/drupaltestbot/sites/default/files/checkout/sites/default/files/php/service_container') file_unmanaged_delete_recursive('/var/lib/drupaltestbot/sites/default/files/checkout/sites/default/files/php/service_container', Array) Drupal\Component\PhpStorage\FileStorage->deleteAll() drupal_flush_all_caches() _install_profile_modules_finished(1, Array, Array, '0 sec') _batch_finished() _batch_process() batch_process('core/install.php?profile=testing&langcode=en', 'http://drupaltestbot659-mysql/checkout/core/install.php?profile=testing&langcode=en') install_run_task(Array, Array) install_run_tasks(Array) install_drupal(Array) Drupal\simpletest\WebTestBase->setUp() Drupal\simpletest\TestBase->run() simpletest_script_run_one_test('575', 'Drupal\user\Tests\UserRegistrationTest') Warningfile.inc1769drupal_rmdir()
LeafDrupal\user\Tests\UserRoleAdminTest5400
LeafDrupal\user\Tests\UserRolesAssignmentTest5100
LeafDrupal\user\Tests\UserSaveTest200
LeafDrupal\user\Tests\UserSearchTest3700
LeafDrupal\user\Tests\UserSignatureTest4600
LeafDrupal\user\Tests\UserTimeZoneTest2900
LeafDrupal\user\Tests\UserTokenReplaceTest4700
LeafDrupal\user\Tests\UserTranslationUITest6300
LeafDrupal\user\Tests\UserValidateCurrentPassCustomFormTest1700
LeafDrupal\user\Tests\UserValidationTest1600
ExpandDrupal\views\Tests\AnalyzeTest1800
MessageGroupFilenameLineFunctionStatus
'Missing handler: views_test_data age field'Debugviews.module1208views_get_handler()
'Missing handler: views_test_data id field'Debugviews.module1208views_get_handler()
'Missing handler: views_test_data name field'Debugviews.module1208views_get_handler()
LeafDrupal\views\Tests\BasicTest1100
ExpandDrupal\views\Tests\Comment\ArgumentUserUIDTest900
MessageGroupFilenameLineFunctionStatus
'Missing handler: views_test_data age field'Debugviews.module1208views_get_handler()
'Missing handler: views_test_data id field'Debugviews.module1208views_get_handler()
'Missing handler: views_test_data name field'Debugviews.module1208views_get_handler()
ExpandDrupal\views\Tests\Comment\DefaultViewRecentComments800
MessageGroupFilenameLineFunctionStatus
'Missing handler: views_test_data age field'Debugviews.module1208views_get_handler()
'Missing handler: views_test_data id field'Debugviews.module1208views_get_handler()
'Missing handler: views_test_data name field'Debugviews.module1208views_get_handler()
'Missing handler: views_test_data age field'Debugviews.module1208views_get_handler()
'Missing handler: views_test_data id field'Debugviews.module1208views_get_handler()
'Missing handler: views_test_data name field'Debugviews.module1208views_get_handler()
ExpandDrupal\views\Tests\Comment\FilterUserUIDTest900
MessageGroupFilenameLineFunctionStatus
'Missing handler: views_test_data age field'Debugviews.module1208views_get_handler()
'Missing handler: views_test_data id field'Debugviews.module1208views_get_handler()
'Missing handler: views_test_data name field'Debugviews.module1208views_get_handler()
ExpandDrupal\views\Tests\Comment\WizardTest3500
MessageGroupFilenameLineFunctionStatus
'Missing handler: views_test_data age field'Debugviews.module1208views_get_handler()
'Missing handler: views_test_data id field'Debugviews.module1208views_get_handler()
'Missing handler: views_test_data name field'Debugviews.module1208views_get_handler()
'Missing handler: views_test_data age field'Debugviews.module1208views_get_handler()
'Missing handler: views_test_data id field'Debugviews.module1208views_get_handler()
'Missing handler: views_test_data name field'Debugviews.module1208views_get_handler()
ExpandDrupal\views\Tests\DefaultViewsTest7200
MessageGroupFilenameLineFunctionStatus
'Missing handler: search_node_links_to nid argument'Debugviews.module1208views_get_handler()
'Missing handler: search_node_links_to nid argument'Debugviews.module1208views_get_handler()
'Missing handler: search_node_links_to nid argument'Debugviews.module1208views_get_handler()
'Missing handler: field_data_comment_body comment_body field'Debugviews.module1208views_get_handler()
LeafDrupal\views\Tests\Entity\FieldEntityTest400
LeafDrupal\views\Tests\Field\ApiDataTest1500
LeafDrupal\views\Tests\Field\HandlerFieldFieldTest2400
ExpandDrupal\views\Tests\GlossaryTest800
MessageGroupFilenameLineFunctionStatus
'Missing handler: views_test_data age field'Debugviews.module1208views_get_handler()
'Missing handler: views_test_data id field'Debugviews.module1208views_get_handler()
'Missing handler: views_test_data name field'Debugviews.module1208views_get_handler()
LeafDrupal\views\Tests\Handler\AreaTest5800
LeafDrupal\views\Tests\Handler\AreaTextTest500
LeafDrupal\views\Tests\Handler\ArgumentNullTest500
LeafDrupal\views\Tests\Handler\ArgumentStringTest400
LeafDrupal\views\Tests\Handler\FieldBooleanTest1100
LeafDrupal\views\Tests\Handler\FieldCounterTest800
LeafDrupal\views\Tests\Handler\FieldCustomTest200
LeafDrupal\views\Tests\Handler\FieldDateTest1500
LeafDrupal\views\Tests\Handler\FieldFileSizeTest900
LeafDrupal\views\Tests\Handler\FieldTest20600
LeafDrupal\views\Tests\Handler\FieldUrlTest300
LeafDrupal\views\Tests\Handler\FieldXssTest400
LeafDrupal\views\Tests\Handler\FilterCombineTest200
ExpandDrupal\views\Tests\Handler\FilterDateTest2400
MessageGroupFilenameLineFunctionStatus
'Missing handler: views_test_data age field'Debugviews.module1208views_get_handler()
'Missing handler: views_test_data id field'Debugviews.module1208views_get_handler()
'Missing handler: views_test_data name field'Debugviews.module1208views_get_handler()
'Missing handler: views_test_data age field'Debugviews.module1208views_get_handler()
'Missing handler: views_test_data id field'Debugviews.module1208views_get_handler()
'Missing handler: views_test_data name field'Debugviews.module1208views_get_handler()
ExpandDrupal\views\Tests\Handler\FilterEqualityTest410
MessageGroupFilenameLineFunctionStatus
The test did not complete due to a fatal error.Completion checkFilterEqualityTest.php82Drupal\views\Tests\Handler\FilterEqualityTest->testNotEqual()
LeafDrupal\views\Tests\Handler\FilterInOperatorTest1100
LeafDrupal\views\Tests\Handler\FilterNumericTest2300
LeafDrupal\views\Tests\Handler\FilterStringTest5000
LeafDrupal\views\Tests\Handler\HandlerAliasTest1000
LeafDrupal\views\Tests\Handler\HandlerAllTest26400
ExpandDrupal\views\Tests\Handler\HandlerTest11600
MessageGroupFilenameLineFunctionStatus
'Missing handler: muUUgQ9x eFEemgS2 relationship'Debugviews.module1208views_get_handler()
'Missing handler: muUUgQ9x eFEemgS2 relationship'Debugviews.module1208views_get_handler()
LeafDrupal\views\Tests\Handler\RelationshipTest500
LeafDrupal\views\Tests\Handler\SortDateTest2500
LeafDrupal\views\Tests\Handler\SortRandomTest700
LeafDrupal\views\Tests\Handler\SortTest1000
LeafDrupal\views\Tests\Language\ArgumentLanguageTest300
LeafDrupal\views\Tests\Language\FieldLanguageTest300
LeafDrupal\views\Tests\Language\FilterLanguageTest300
ExpandDrupal\views\Tests\ModuleTest5200
MessageGroupFilenameLineFunctionStatus
'Missing handler: aHESXusC hBjITFEx field'Debugviews.module1208views_get_handler()
'Missing handler: jokuIj9V vn7QMD6N area'Debugviews.module1208views_get_handler()
'Missing handler: otbZqC4s ph6lrlTY filter'Debugviews.module1208views_get_handler()
LeafDrupal\views\Tests\Node\FieldTypeTest200
LeafDrupal\views\Tests\Node\FilterUidRevisionTest400
LeafDrupal\views\Tests\Node\RevisionRelationships300
ExpandDrupal\views\Tests\Node\StatusExtraTest6800
MessageGroupFilenameLineFunctionStatus
'Missing handler: views_test_data age field'Debugviews.module1208views_get_handler()
'Missing handler: views_test_data id field'Debugviews.module1208views_get_handler()
'Missing handler: views_test_data name field'Debugviews.module1208views_get_handler()
LeafDrupal\views\Tests\PluginInstanceTest25900
LeafDrupal\views\Tests\PluginTypeListTest100
LeafDrupal\views\Tests\Plugin\AccessTest3900
LeafDrupal\views\Tests\Plugin\ArgumentDefaultTest2400
LeafDrupal\views\Tests\Plugin\ArgumentValidatorTest600
LeafDrupal\views\Tests\Plugin\CacheTest1200
LeafDrupal\views\Tests\Plugin\DisplayExtenderTest600
LeafDrupal\views\Tests\Plugin\DisplayFeedTest2800
LeafDrupal\views\Tests\Plugin\DisplayPageTest700
LeafDrupal\views\Tests\Plugin\DisplayTest3900
LeafDrupal\views\Tests\Plugin\ExposedFormTest8500
LeafDrupal\views\Tests\Plugin\FilterTest1300
ExpandDrupal\views\Tests\Plugin\JoinTest1600
MessageGroupFilenameLineFunctionStatus
array ( 'join type' => 'LEFT', 'table' => 'users', 'alias' => 'users', 'condition' => 'node.uid = users.uid AND (node.uid = 96)', 'arguments' => array ( ), )DebugJoinTest.php70Drupal\views\Tests\Plugin\JoinTest->testExamplePlugin()
ExpandDrupal\views\Tests\Plugin\PagerTest9200
MessageGroupFilenameLineFunctionStatus
'Missing handler: views_test_data age field'Debugviews.module1208views_get_handler()
'Missing handler: views_test_data id field'Debugviews.module1208views_get_handler()
'Missing handler: views_test_data name field'Debugviews.module1208views_get_handler()
'Missing handler: views_test_data age field'Debugviews.module1208views_get_handler()
'Missing handler: views_test_data id field'Debugviews.module1208views_get_handler()
'Missing handler: views_test_data name field'Debugviews.module1208views_get_handler()
LeafDrupal\views\Tests\Plugin\QueryTest300
LeafDrupal\views\Tests\Plugin\StyleMappingTest4300
LeafDrupal\views\Tests\Plugin\StyleTest2400
LeafDrupal\views\Tests\Plugin\StyleUnformattedTest1800
ExpandDrupal\views\Tests\QueryGroupByTest4000
MessageGroupFilenameLineFunctionStatus
'Missing handler: views_test_data age field'Debugviews.module1208views_get_handler()
'Missing handler: views_test_data id field'Debugviews.module1208views_get_handler()
'Missing handler: views_test_data name field'Debugviews.module1208views_get_handler()
'Missing handler: views_test_data age field'Debugviews.module1208views_get_handler()
'Missing handler: views_test_data id field'Debugviews.module1208views_get_handler()
'Missing handler: views_test_data name field'Debugviews.module1208views_get_handler()
'Missing handler: views_test_data age field'Debugviews.module1208views_get_handler()
'Missing handler: views_test_data id field'Debugviews.module1208views_get_handler()
'Missing handler: views_test_data name field'Debugviews.module1208views_get_handler()
'Missing handler: views_test_data age field'Debugviews.module1208views_get_handler()
'Missing handler: views_test_data id field'Debugviews.module1208views_get_handler()
'Missing handler: views_test_data name field'Debugviews.module1208views_get_handler()
'Missing handler: views_test_data age field'Debugviews.module1208views_get_handler()
'Missing handler: views_test_data id field'Debugviews.module1208views_get_handler()
'Missing handler: views_test_data name field'Debugviews.module1208views_get_handler()
'Missing handler: views_test_data age field'Debugviews.module1208views_get_handler()
'Missing handler: views_test_data id field'Debugviews.module1208views_get_handler()
'Missing handler: views_test_data name field'Debugviews.module1208views_get_handler()
'Missing handler: views_test_data age field'Debugviews.module1208views_get_handler()
'Missing handler: views_test_data id field'Debugviews.module1208views_get_handler()
'Missing handler: views_test_data name field'Debugviews.module1208views_get_handler()
'Missing handler: views_test_data age field'Debugviews.module1208views_get_handler()
'Missing handler: views_test_data id field'Debugviews.module1208views_get_handler()
'Missing handler: views_test_data name field'Debugviews.module1208views_get_handler()
'Missing handler: views_test_data age field'Debugviews.module1208views_get_handler()
'Missing handler: views_test_data id field'Debugviews.module1208views_get_handler()
'Missing handler: views_test_data name field'Debugviews.module1208views_get_handler()
'Missing handler: views_test_data age field'Debugviews.module1208views_get_handler()
'Missing handler: views_test_data id field'Debugviews.module1208views_get_handler()
'Missing handler: views_test_data name field'Debugviews.module1208views_get_handler()
'Missing handler: views_test_data age field'Debugviews.module1208views_get_handler()
'Missing handler: views_test_data id field'Debugviews.module1208views_get_handler()
'Missing handler: views_test_data name field'Debugviews.module1208views_get_handler()
'Missing handler: views_test_data age field'Debugviews.module1208views_get_handler()
'Missing handler: views_test_data id field'Debugviews.module1208views_get_handler()
'Missing handler: views_test_data name field'Debugviews.module1208views_get_handler()
'Missing handler: views_test_data age field'Debugviews.module1208views_get_handler()
'Missing handler: views_test_data id field'Debugviews.module1208views_get_handler()
'Missing handler: views_test_data name field'Debugviews.module1208views_get_handler()
ExpandDrupal\views\Tests\Taxonomy\RelationshipNodeTermDataTest200
MessageGroupFilenameLineFunctionStatus
'Missing handler: nid nid sort'Debugviews.module1208views_get_handler()
LeafDrupal\views\Tests\Taxonomy\RelationshipRepresentativeNode200
LeafDrupal\views\Tests\TokenReplaceTest1200
LeafDrupal\views\Tests\UI\DefaultViewsTest8800
LeafDrupal\views\Tests\UI\DisplayExtenderUITest2300
LeafDrupal\views\Tests\UI\DisplayPath2200
LeafDrupal\views\Tests\UI\DisplayTest20100
LeafDrupal\views\Tests\UI\GroupByTest2600
LeafDrupal\views\Tests\UI\HandlerTest11000
LeafDrupal\views\Tests\UI\OverrideDisplaysTest16700
LeafDrupal\views\Tests\UI\QueryTest1900
LeafDrupal\views\Tests\UI\RedirectTest2600
LeafDrupal\views\Tests\UI\RowUITest3000
LeafDrupal\views\Tests\UI\SettingsTest9000
LeafDrupal\views\Tests\UI\StorageTest2100
LeafDrupal\views\Tests\UI\StyleUITest3000
LeafDrupal\views\Tests\UI\TagTest2300
LeafDrupal\views\Tests\User\AccessPermissionTest1400
LeafDrupal\views\Tests\User\AccessRoleTest1400
ExpandDrupal\views\Tests\User\ArgumentDefaultTest900
MessageGroupFilenameLineFunctionStatus
'Missing handler: views_test_data age field'Debugviews.module1208views_get_handler()
'Missing handler: views_test_data id field'Debugviews.module1208views_get_handler()
'Missing handler: views_test_data name field'Debugviews.module1208views_get_handler()
LeafDrupal\views\Tests\User\ArgumentValidateTest1900
LeafDrupal\views\Tests\User\HandlerArgumentUserUidTest500
LeafDrupal\views\Tests\User\HandlerFieldUserNameTest700
LeafDrupal\views\Tests\User\HandlerFilterUserNameTest5700
LeafDrupal\views\Tests\User\RelationshipRepresentativeNode300
LeafDrupal\views\Tests\ViewElementTest1500
LeafDrupal\views\Tests\ViewExecutableTest11000
ExpandDrupal\views\Tests\ViewsDataTest1400
MessageGroupFilenameLineFunctionStatus
'Missing handler: views_test_data id field'Debugviews.module1208views_get_handler()
'Missing handler: views_test_data id field'Debugviews.module1208views_get_handler()
'Missing handler: views_test_data id field'Debugviews.module1208views_get_handler()
'Missing handler: views_test_data id field'Debugviews.module1208views_get_handler()
'Missing handler: views_test_data id field'Debugviews.module1208views_get_handler()
'Missing handler: views_test_data id field'Debugviews.module1208views_get_handler()
ExpandDrupal\views\Tests\ViewStorageTest10900
MessageGroupFilenameLineFunctionStatus
'Missing handler: views_test_data id field'Debugviews.module1208views_get_handler()
'Missing handler: views_test_data name field'Debugviews.module1208views_get_handler()
ExpandDrupal\views\Tests\Wizard\BasicTest7800
MessageGroupFilenameLineFunctionStatus
'Missing handler: views_test_data age field'Debugviews.module1208views_get_handler()
'Missing handler: views_test_data id field'Debugviews.module1208views_get_handler()
'Missing handler: views_test_data name field'Debugviews.module1208views_get_handler()
'Missing handler: views_test_data age field'Debugviews.module1208views_get_handler()
'Missing handler: views_test_data id field'Debugviews.module1208views_get_handler()
'Missing handler: views_test_data name field'Debugviews.module1208views_get_handler()
'Missing handler: views_test_data age field'Debugviews.module1208views_get_handler()
'Missing handler: views_test_data id field'Debugviews.module1208views_get_handler()
'Missing handler: views_test_data name field'Debugviews.module1208views_get_handler()
'Missing handler: views_test_data age field'Debugviews.module1208views_get_handler()
'Missing handler: views_test_data id field'Debugviews.module1208views_get_handler()
'Missing handler: views_test_data name field'Debugviews.module1208views_get_handler()
'Missing handler: views_test_data age field'Debugviews.module1208views_get_handler()
'Missing handler: views_test_data id field'Debugviews.module1208views_get_handler()
'Missing handler: views_test_data name field'Debugviews.module1208views_get_handler()
'Missing handler: views_test_data age field'Debugviews.module1208views_get_handler()
'Missing handler: views_test_data id field'Debugviews.module1208views_get_handler()
'Missing handler: views_test_data name field'Debugviews.module1208views_get_handler()
ExpandDrupal\views\Tests\Wizard\ItemsPerPageTest4000
MessageGroupFilenameLineFunctionStatus
'Missing handler: views_test_data age field'Debugviews.module1208views_get_handler()
'Missing handler: views_test_data id field'Debugviews.module1208views_get_handler()
'Missing handler: views_test_data name field'Debugviews.module1208views_get_handler()
'Missing handler: views_test_data age field'Debugviews.module1208views_get_handler()
'Missing handler: views_test_data id field'Debugviews.module1208views_get_handler()
'Missing handler: views_test_data name field'Debugviews.module1208views_get_handler()
'Missing handler: views_test_data age field'Debugviews.module1208views_get_handler()
'Missing handler: views_test_data id field'Debugviews.module1208views_get_handler()
'Missing handler: views_test_data name field'Debugviews.module1208views_get_handler()
ExpandDrupal\views\Tests\Wizard\MenuTest2000
MessageGroupFilenameLineFunctionStatus
'Missing handler: views_test_data age field'Debugviews.module1208views_get_handler()
'Missing handler: views_test_data id field'Debugviews.module1208views_get_handler()
'Missing handler: views_test_data name field'Debugviews.module1208views_get_handler()
'Missing handler: views_test_data age field'Debugviews.module1208views_get_handler()
'Missing handler: views_test_data id field'Debugviews.module1208views_get_handler()
'Missing handler: views_test_data name field'Debugviews.module1208views_get_handler()
ExpandDrupal\views\Tests\Wizard\SortingTest3100
MessageGroupFilenameLineFunctionStatus
'Missing handler: views_test_data age field'Debugviews.module1208views_get_handler()
'Missing handler: views_test_data id field'Debugviews.module1208views_get_handler()
'Missing handler: views_test_data name field'Debugviews.module1208views_get_handler()
'Missing handler: views_test_data age field'Debugviews.module1208views_get_handler()
'Missing handler: views_test_data id field'Debugviews.module1208views_get_handler()
'Missing handler: views_test_data name field'Debugviews.module1208views_get_handler()
'Missing handler: views_test_data age field'Debugviews.module1208views_get_handler()
'Missing handler: views_test_data id field'Debugviews.module1208views_get_handler()
'Missing handler: views_test_data name field'Debugviews.module1208views_get_handler()
ExpandDrupal\views\Tests\Wizard\TaggedWithTest7800
MessageGroupFilenameLineFunctionStatus
'Missing handler: views_test_data age field'Debugviews.module1208views_get_handler()
'Missing handler: views_test_data id field'Debugviews.module1208views_get_handler()
'Missing handler: views_test_data name field'Debugviews.module1208views_get_handler()
'Missing handler: views_test_data age field'Debugviews.module1208views_get_handler()
'Missing handler: views_test_data id field'Debugviews.module1208views_get_handler()
'Missing handler: views_test_data name field'Debugviews.module1208views_get_handler()
'Missing handler: views_test_data age field'Debugviews.module1208views_get_handler()
'Missing handler: views_test_data id field'Debugviews.module1208views_get_handler()
'Missing handler: views_test_data name field'Debugviews.module1208views_get_handler()
'Missing handler: views_test_data age field'Debugviews.module1208views_get_handler()
'Missing handler: views_test_data id field'Debugviews.module1208views_get_handler()
'Missing handler: views_test_data name field'Debugviews.module1208views_get_handler()
'Missing handler: views_test_data age field'Debugviews.module1208views_get_handler()
'Missing handler: views_test_data id field'Debugviews.module1208views_get_handler()
'Missing handler: views_test_data name field'Debugviews.module1208views_get_handler()
'Missing handler: views_test_data age field'Debugviews.module1208views_get_handler()
'Missing handler: views_test_data id field'Debugviews.module1208views_get_handler()
'Missing handler: views_test_data name field'Debugviews.module1208views_get_handler()
'Missing handler: views_test_data age field'Debugviews.module1208views_get_handler()
'Missing handler: views_test_data id field'Debugviews.module1208views_get_handler()
'Missing handler: views_test_data name field'Debugviews.module1208views_get_handler()
'Missing handler: views_test_data age field'Debugviews.module1208views_get_handler()
'Missing handler: views_test_data id field'Debugviews.module1208views_get_handler()
'Missing handler: views_test_data name field'Debugviews.module1208views_get_handler()
LeafDrupal\xmlrpc\Tests\XmlRpcBasicTest900
LeafDrupal\xmlrpc\Tests\XmlRpcMessagesTest700
LeafDrupal\xmlrpc\Tests\XmlRpcValidatorTest1000