decouple-comment-node-731724.115.patch

Test status
StatusResult
Last receivedThu, 10/25/2012 - 22:32:04
Last requestedThu, 10/25/2012 - 22:32:07
Last testedThu, 10/25/2012 - 23:12:03
Test count1
Environment status
MySQLfail
File information
Filedecouple-comment-node-731724.115.patch
BranchDrupal core - 8.x
LinkIssue Link
SummaryFAILED: [[SimpleTest]]: [MySQL] 45,515 pass(es), 101 fail(s), and 86 exception(s).
Details

MySQL

  1. Setup environment
  2. Detect an invalid patch URL
  3. Detect invalid repository information
  4. Detect invalid patch format
  5. Detect a non-applicable patch
  6. Detect invalid PHP syntax
  7. Detect a Drupal installation failure
  8. Detect a test run failure
  9. Detect a failing test
    Review the test failures below then if necessary run them locally until the problem has been fixed.
  10. Complete test suite with all tests passing
45,515 pass(es), 101 fail(s), and 86 exception(s)

Non-pass

Test namePassFailException
ExpandDrupal\comment\Tests\CommentUserTest8330
MessageGroupFilenameLineFunctionStatus
Comments were displayed.OtherCommentUserTest.php305Drupal\comment\Tests\CommentUserTest->testCommentUser()
Link to log in was found.OtherCommentUserTest.php306Drupal\comment\Tests\CommentUserTest->testCommentUser()
Link to register was found.OtherCommentUserTest.php307Drupal\comment\Tests\CommentUserTest->testCommentUser()
ExpandDrupal\file\Tests\FileFieldWidgetTest289189
MessageGroupFilenameLineFunctionStatus
Failed to set field fields[_add_new_field][label] to rgd7oh5zOtherFileFieldWidgetTest.php262Drupal\file\Tests\FileFieldWidgetTest->testPrivateFileComment()
Failed to set field fields[_add_new_field][field_name] to umwecobeOtherFileFieldWidgetTest.php262Drupal\file\Tests\FileFieldWidgetTest->testPrivateFileComment()
Failed to set field fields[_add_new_field][type] to fileOtherFileFieldWidgetTest.php262Drupal\file\Tests\FileFieldWidgetTest->testPrivateFileComment()
Failed to set field fields[_add_new_field][widget_type] to file_genericOtherFileFieldWidgetTest.php262Drupal\file\Tests\FileFieldWidgetTest->testPrivateFileComment()
Found the Save buttonOtherFileFieldWidgetTest.php262Drupal\file\Tests\FileFieldWidgetTest->testPrivateFileComment()
Found the requested form fields at admin/structure/comments/comment/fieldsOtherFileFieldWidgetTest.php262Drupal\file\Tests\FileFieldWidgetTest->testPrivateFileComment()
Failed to set field field[settings][uri_scheme] to privateOtherFileFieldWidgetTest.php264Drupal\file\Tests\FileFieldWidgetTest->testPrivateFileComment()
Found the Save field settings buttonOtherFileFieldWidgetTest.php264Drupal\file\Tests\FileFieldWidgetTest->testPrivateFileComment()
Found the requested form fields at OtherFileFieldWidgetTest.php264Drupal\file\Tests\FileFieldWidgetTest->testPrivateFileComment()
Found the Save settings buttonOtherFileFieldWidgetTest.php265Drupal\file\Tests\FileFieldWidgetTest->testPrivateFileComment()
Found the requested form fields at OtherFileFieldWidgetTest.php265Drupal\file\Tests\FileFieldWidgetTest->testPrivateFileComment()
Failed to set field files[field_umwecobe_und_0] to /var/lib/drupaltestbot/sites/default/files/checkout/sites/default/files/simpletest/505935/text-0.txtOtherFileFieldWidgetTest.php281Drupal\file\Tests\FileFieldWidgetTest->testPrivateFileComment()
Failed to set field comment_body[und][0][value] to v7Zz4eXBOtherFileFieldWidgetTest.php281Drupal\file\Tests\FileFieldWidgetTest->testPrivateFileComment()
Found the Save buttonOtherFileFieldWidgetTest.php281Drupal\file\Tests\FileFieldWidgetTest->testPrivateFileComment()
Found the requested form fields at OtherFileFieldWidgetTest.php281Drupal\file\Tests\FileFieldWidgetTest->testPrivateFileComment()
Undefined offset: 1NoticeFileFieldWidgetTest.php285Drupal\file\Tests\FileFieldWidgetTest->testPrivateFileComment()
array_flip(): Can only flip STRING and INTEGER values!WarningDatabaseStorageController.php167Drupal\Core\Entity\DatabaseStorageController->load()
Trying to get property of non-objectNoticeFileFieldWidgetTest.php291Drupal\file\Tests\FileFieldWidgetTest->testPrivateFileComment()
array_flip(): Can only flip STRING and INTEGER values!WarningDatabaseStorageController.php167Drupal\Core\Entity\DatabaseStorageController->load()
Trying to get property of non-objectNoticeFileFieldTestBase.php189Drupal\file\Tests\FileFieldTestBase->assertFileExists()
New file saved to disk on node creation.OtherFileFieldWidgetTest.php292Drupal\file\Tests\FileFieldWidgetTest->testPrivateFileComment()
Trying to get property of non-objectNoticeFileFieldWidgetTest.php294Drupal\file\Tests\FileFieldWidgetTest->testPrivateFileComment()
Trying to get property of non-objectNoticeFileFieldWidgetTest.php296Drupal\file\Tests\FileFieldWidgetTest->testPrivateFileComment()
Trying to get property of non-objectNoticeFileFieldWidgetTest.php301Drupal\file\Tests\FileFieldWidgetTest->testPrivateFileComment()
Confirmed that access is denied for the file without the needed permission.BrowserFileFieldWidgetTest.php302Drupal\file\Tests\FileFieldWidgetTest->testPrivateFileComment()
Trying to get property of non-objectNoticeFileFieldWidgetTest.php313Drupal\file\Tests\FileFieldWidgetTest->testPrivateFileComment()
Confirmed that access is denied for the file without the needed permission.BrowserFileFieldWidgetTest.php314Drupal\file\Tests\FileFieldWidgetTest->testPrivateFileComment()
ExpandDrupal\filter\Tests\FilterHtmlImageSecureTest12140
MessageGroupFilenameLineFunctionStatus
Failed to set field comment_body[und][0][value] to http://drupaltestbot654-mysql/checkout/core/misc/druplicon.png: <img src="http://drupaltestbot654-mysql/checkout/core/misc/druplicon.png" testattribute="c04a6d965266c2f249da58bfbc042a61" /> https://drupaltestbot654-mysql/checkout/core/misc/druplicon.png: <img src="https://drupaltestbot654-mysql/checkout/core/misc/druplicon.png" testattribute="151255dccb1bacb3147b934833992c29" /> /checkout/core/misc/druplicon.png: <img src="/checkout/core/misc/druplicon.png" testattribute="7095199e8ffffe10c0b06c8b057556de" /> /checkout/sites/default/files/simpletest/244770/image-test.png: <img src="/checkout/sites/default/files/simpletest/244770/image-test.png" testattribute="d7fc01a67a4249a3cc9105c425f107de" /> http://drupaltestbot654-mysql/checkout/sites/default/files/simpletest/244770/image-test.png: <img src="http://drupaltestbot654-mysql/checkout/sites/default/files/simpletest/244770/image-test.png" testattribute="6d8c73b2b04edb6cf01f24b91e74300d" /> https://drupaltestbot654-mysql/checkout/sites/default/files/simpletest/244770/image-test.png: <img src="https://drupaltestbot654-mysql/checkout/sites/default/files/simpletest/244770/image-test.png" testattribute="a806e14599085f173e5c803c9db43e0f" /> /checkout/sites/default/files/simpletest/244770/example.png: <img src="/checkout/sites/default/files/simpletest/244770/example.png" testattribute="bbb5eecc44b26d2c167b1fef9b16ec86" /> http://example.com/core/misc/druplicon.png: <img src="http://example.com/core/misc/druplicon.png" testattribute="49acc5a6300d320b55ca1c7965e67984" /> https://example.com/core/misc/druplicon.png: <img src="https://example.com/core/misc/druplicon.png" testattribute="413c0c1c1c388afb869f127880afebc9" /> javascript:druplicon.png: <img src="javascript:druplicon.png" testattribute="83f76f48013e52cd57f8f6c8bae93da0" /> sites/default/files/simpletest/244770/../../../../../logout: <img src="sites/default/files/simpletest/244770/../../../../../logout" testattribute="7bcfe764adb06ffe58790a3f92f71c0c" />OtherFilterHtmlImageSecureTest.php122Drupal\filter\Tests\FilterHtmlImageSecureTest->testImageSource()
Found the Save buttonOtherFilterHtmlImageSecureTest.php122Drupal\filter\Tests\FilterHtmlImageSecureTest->testImageSource()
Found the requested form fields at node/1OtherFilterHtmlImageSecureTest.php122Drupal\filter\Tests\FilterHtmlImageSecureTest->testImageSource()
http://drupaltestbot654-mysql/checkout/core/misc/druplicon.png was found.OtherFilterHtmlImageSecureTest.php136Drupal\filter\Tests\FilterHtmlImageSecureTest->testImageSource()
https://drupaltestbot654-mysql/checkout/core/misc/druplicon.png was found.OtherFilterHtmlImageSecureTest.php136Drupal\filter\Tests\FilterHtmlImageSecureTest->testImageSource()
/checkout/core/misc/druplicon.png was found.OtherFilterHtmlImageSecureTest.php136Drupal\filter\Tests\FilterHtmlImageSecureTest->testImageSource()
/checkout/sites/default/files/simpletest/244770/image-test.png was found.OtherFilterHtmlImageSecureTest.php136Drupal\filter\Tests\FilterHtmlImageSecureTest->testImageSource()
http://drupaltestbot654-mysql/checkout/sites/default/files/simpletest/244770/image-test.png was found.OtherFilterHtmlImageSecureTest.php136Drupal\filter\Tests\FilterHtmlImageSecureTest->testImageSource()
https://drupaltestbot654-mysql/checkout/sites/default/files/simpletest/244770/image-test.png was found.OtherFilterHtmlImageSecureTest.php136Drupal\filter\Tests\FilterHtmlImageSecureTest->testImageSource()
/checkout/sites/default/files/simpletest/244770/example.png was found.OtherFilterHtmlImageSecureTest.php136Drupal\filter\Tests\FilterHtmlImageSecureTest->testImageSource()
http://example.com/core/misc/druplicon.png was found.OtherFilterHtmlImageSecureTest.php136Drupal\filter\Tests\FilterHtmlImageSecureTest->testImageSource()
https://example.com/core/misc/druplicon.png was found.OtherFilterHtmlImageSecureTest.php136Drupal\filter\Tests\FilterHtmlImageSecureTest->testImageSource()
javascript:druplicon.png was found.OtherFilterHtmlImageSecureTest.php136Drupal\filter\Tests\FilterHtmlImageSecureTest->testImageSource()
sites/default/files/simpletest/244770/../../../../../logout was found.OtherFilterHtmlImageSecureTest.php136Drupal\filter\Tests\FilterHtmlImageSecureTest->testImageSource()
ExpandDrupal\node\Tests\NodeAccessPagerTest2820
MessageGroupFilenameLineFunctionStatus
"Comments" foundOtherNodeAccessPagerTest.php69Drupal\node\Tests\NodeAccessPagerTest->testCommentPager()
Raw "page=1" foundOtherNodeAccessPagerTest.php70Drupal\node\Tests\NodeAccessPagerTest->testCommentPager()
ExpandDrupal\node\Tests\NodeTitleTest2301
MessageGroupFilenameLineFunctionStatus
reset() expects parameter 1 to be array, boolean givenWarningcomment.pages.inc105comment_reply()
ExpandDrupal\rdf\Tests\CommentAttributesTest1812
MessageGroupFilenameLineFunctionStatus
The test did not complete due to a fatal error.Completion checkCommentAttributesTest.php75Drupal\rdf\Tests\CommentAttributesTest->testNumberOfCommentsRdfaMarkup()
Undefined index: field_nameNoticefield.crud.inc540field_update_instance()
Undefined index: field_nameNoticefield.crud.inc542field_update_instance()
ExpandDrupal\rdf\Tests\TrackerAttributesTest112
MessageGroupFilenameLineFunctionStatus
The test did not complete due to a fatal error.Completion checkTrackerAttributesTest.php57Drupal\rdf\Tests\TrackerAttributesTest->testAttributesInTracker()
Undefined index: field_nameNoticefield.crud.inc540field_update_instance()
Undefined index: field_nameNoticefield.crud.inc542field_update_instance()
ExpandDrupal\search\Tests\SearchCommentCountToggleTest2683
MessageGroupFilenameLineFunctionStatus
Undefined property: Drupal\node\Node::$comment_articleNoticecomment.pages.inc97comment_reply()
reset() expects parameter 1 to be array, boolean givenWarningcomment.pages.inc105comment_reply()
Undefined index: comment_bodyNoticeCommentFormController.php220Drupal\comment\CommentFormController->actions()
Failed to set field subject to jHmt8NYHOtherSearchCommentCountToggleTest.php70Drupal\search\Tests\SearchCommentCountToggleTest->setUp()
Failed to set field comment_body[und][0][value] to sPH3nzaPOtherSearchCommentCountToggleTest.php70Drupal\search\Tests\SearchCommentCountToggleTest->setUp()
Failed to set field comment_body[und][0][format] to filtered_htmlOtherSearchCommentCountToggleTest.php70Drupal\search\Tests\SearchCommentCountToggleTest->setUp()
Found the Save buttonOtherSearchCommentCountToggleTest.php70Drupal\search\Tests\SearchCommentCountToggleTest->setUp()
Found the requested form fields at comment/reply/node/1/comment_articleOtherSearchCommentCountToggleTest.php70Drupal\search\Tests\SearchCommentCountToggleTest->setUp()
Empty comment count displays for nodes with comment status set to OpenOtherSearchCommentCountToggleTest.php92Drupal\search\Tests\SearchCommentCountToggleTest->testSearchCommentCountToggle()
Non-empty comment count displays for nodes with comment status set to OpenOtherSearchCommentCountToggleTest.php93Drupal\search\Tests\SearchCommentCountToggleTest->testSearchCommentCountToggle()
Non-empty comment count displays for nodes with comment status set to ClosedOtherSearchCommentCountToggleTest.php107Drupal\search\Tests\SearchCommentCountToggleTest->testSearchCommentCountToggle()
ExpandDrupal\search\Tests\SearchCommentTest10786
MessageGroupFilenameLineFunctionStatus
Undefined property: Drupal\node\Node::$comment_articleNoticecomment.pages.inc97comment_reply()
reset() expects parameter 1 to be array, boolean givenWarningcomment.pages.inc105comment_reply()
Undefined index: comment_bodyNoticeCommentFormController.php220Drupal\comment\CommentFormController->actions()
Failed to set field comment_body[und][0][value] to <h1>Test comment body</h1>OtherSearchCommentTest.php88Drupal\search\Tests\SearchCommentTest->testSearchResultsComment()
Failed to set field comment_body[und][0][format] to full_htmlOtherSearchCommentTest.php88Drupal\search\Tests\SearchCommentTest->testSearchResultsComment()
Found the requested form fields at comment/reply/node/1/comment_articleOtherSearchCommentTest.php88Drupal\search\Tests\SearchCommentTest->testSearchResultsComment()
Node found in search results.OtherSearchCommentTest.php100Drupal\search\Tests\SearchCommentTest->testSearchResultsComment()
Comment subject found in search results.OtherSearchCommentTest.php101Drupal\search\Tests\SearchCommentTest->testSearchResultsComment()
Node found in search results.OtherSearchCommentTest.php108Drupal\search\Tests\SearchCommentTest->testSearchResultsComment()
Comment body text found in search results.OtherSearchCommentTest.php111Drupal\search\Tests\SearchCommentTest->testSearchResultsComment()
Undefined index: field_nameNoticefield.crud.inc540field_update_instance()
Undefined index: field_nameNoticefield.crud.inc542field_update_instance()
Drupal\field\FieldException: Attempt to update an instance of a nonexistent field . in field_update_instance() (line 542 of /var/lib/drupaltestbot/sites/default/files/checkout/core/modules/field/field.crud.inc).Uncaught exceptionfield.crud.inc542field_update_instance()
Add new comment appears on node pageOtherSearchCommentTest.php256Drupal\search\Tests\SearchCommentTest->testAddNewComment()
ExpandDrupal\search\Tests\SearchRankingTest3303
MessageGroupFilenameLineFunctionStatus
Drupal\Core\Database\DatabaseExceptionWrapper: SQLSTATE[42S02]: Base table or view not found: 1146 Table 'drupaltestbotmysql.simpletest89360node_comment_statistics' doesn't exist: SELECT MAX(comment_count) FROM {node_comment_statistics}; Array ( ) in Drupal\Core\Database\Connection->query() (line 548 of /var/lib/drupaltestbot/sites/default/files/checkout/core/lib/Drupal/Core/Database/Connection.php).Uncaught exceptionConnection.php548Drupal\Core\Database\Connection->query()
Drupal\Core\Database\DatabaseExceptionWrapper: SQLSTATE[42S02]: Base table or view not found: 1146 Table 'drupaltestbotmysql.simpletest86197node_comment_statistics' doesn't exist: SELECT MAX(comment_count) FROM {node_comment_statistics}; Array ( ) in Drupal\Core\Database\Connection->query() (line 548 of /var/lib/drupaltestbot/sites/default/files/checkout/core/lib/Drupal/Core/Database/Connection.php).Uncaught exceptionConnection.php548Drupal\Core\Database\Connection->query()
Drupal\Core\Database\DatabaseExceptionWrapper: SQLSTATE[42S02]: Base table or view not found: 1146 Table 'drupaltestbotmysql.simpletest563944node_comment_statistics' doesn't exist: SELECT MAX(comment_count) FROM {node_comment_statistics}; Array ( ) in Drupal\Core\Database\Connection->query() (line 548 of /var/lib/drupaltestbot/sites/default/files/checkout/core/lib/Drupal/Core/Database/Connection.php).Uncaught exceptionConnection.php548Drupal\Core\Database\Connection->query()
ExpandDrupal\system\Tests\Module\DependencyTest152101
MessageGroupFilenameLineFunctionStatus
Failed to set field modules[Core][comment][enable] to OtherDependencyTest.php177Drupal\system\Tests\Module\DependencyTest->testUninstallDependents()
Found the requested form fields at admin/modulesOtherDependencyTest.php177Drupal\system\Tests\Module\DependencyTest->testUninstallDependents()
Module "comment" is not enabled.OtherDependencyTest.php178Drupal\system\Tests\Module\DependencyTest->testUninstallDependents()
Checkbox for uninstalling the comment module is disabled.OtherDependencyTest.php183Drupal\system\Tests\Module\DependencyTest->testUninstallDependents()
Failed to set field uninstall[comment] to commentOtherDependencyTest.php192Drupal\system\Tests\Module\DependencyTest->testUninstallDependents()
Found the Uninstall buttonOtherDependencyTest.php192Drupal\system\Tests\Module\DependencyTest->testUninstallDependents()
Found the requested form fields at admin/modules/uninstallOtherDependencyTest.php192Drupal\system\Tests\Module\DependencyTest->testUninstallDependents()
Invalid argument supplied for foreach()WarningWebTestBase.php1224Drupal\simpletest\WebTestBase->drupalPost()
Found the Uninstall buttonOtherDependencyTest.php193Drupal\system\Tests\Module\DependencyTest->testUninstallDependents()
Found the requested form fields at OtherDependencyTest.php193Drupal\system\Tests\Module\DependencyTest->testUninstallDependents()
Modules status has been updated.OtherDependencyTest.php194Drupal\system\Tests\Module\DependencyTest->testUninstallDependents()
ExpandDrupal\system\Tests\Module\EnableDisableTest1687110
MessageGroupFilenameLineFunctionStatus
Modules status has been updated.OtherEnableDisableTest.php120Drupal\system\Tests\Module\EnableDisableTest->testEnableDisable()
"hook_modules_uninstalled fired for comment" foundOtherEnableDisableTest.php120Drupal\system\Tests\Module\EnableDisableTest->testEnableDisable()
watchdog table contains 0 rows for %module module uninstalled.OtherEnableDisableTest.php120Drupal\system\Tests\Module\EnableDisableTest->testEnableDisable()
None of the database tables defined by the comment module exist.OtherEnableDisableTest.php120Drupal\system\Tests\Module\EnableDisableTest->testEnableDisable()
None of the database tables defined by the comment module exist.OtherEnableDisableTest.php86Drupal\system\Tests\Module\EnableDisableTest->testEnableDisable()
"hook_modules_installed fired for comment" foundOtherEnableDisableTest.php105Drupal\system\Tests\Module\EnableDisableTest->testEnableDisable()
Remaining modules could not be disabled.OtherEnableDisableTest.php143Drupal\system\Tests\Module\EnableDisableTest->testEnableDisable()
Failed to set field modules[Core][comment][enable] to commentOtherEnableDisableTest.php164Drupal\system\Tests\Module\EnableDisableTest->testEnableDisable()
Failed to set field modules[Core][node][enable] to nodeOtherEnableDisableTest.php164Drupal\system\Tests\Module\EnableDisableTest->testEnableDisable()
Found the requested form fields at admin/modulesOtherEnableDisableTest.php164Drupal\system\Tests\Module\EnableDisableTest->testEnableDisable()
Modules status has been updated.OtherEnableDisableTest.php165Drupal\system\Tests\Module\EnableDisableTest->testEnableDisable()
ExpandDrupal\system\Tests\Module\ModuleApiTest6401
MessageGroupFilenameLineFunctionStatus
Drupal\field\FieldException: Attempt to create field name <em class="placeholder">comment_forum</em> which already exists, although it is inactive. in field_create_field() (line 87 of /var/lib/drupaltestbot/sites/default/files/checkout/core/modules/field/field.crud.inc).Uncaught exceptionfield.crud.inc87field_create_field()
ExpandDrupal\system\Tests\Theme\EntityFilteringThemeTest811
MessageGroupFilenameLineFunctionStatus
The test did not complete due to a fatal error.Completion checkEntityFilteringThemeTest.php122Drupal\system\Tests\Theme\EntityFilteringThemeTest->testThemedEntity()
Undefined index: controller classNoticeentity.inc314entity_get_controller()
ExpandDrupal\system\Tests\Upgrade\BareStandardUpgradePathTest2511
MessageGroupFilenameLineFunctionStatus
Failed: Drupal\Core\Database\DatabaseExceptionWrapper: SQLSTATE[42000]: Syntax error or access violation: 1072 Key column 'entity_id' doesn't exist in table: ALTER TABLE {comment} ADD INDEX `comment_entity_langcode` (`entity_id`, `entity_type`, `field_name`, `langcode`); Array ( ) in Drupal\Core\Database\Connection->query() (line 548 of /var/lib/drupaltestbot/sites/default/files/checkout/core/lib/Drupal/Core/Database/Connection.php).OtherUpgradePathTestBase.php222Drupal\system\Tests\Upgrade\UpgradePathTestBase->performUpgrade()
Exception: Errors during update process. in Drupal\system\Tests\Upgrade\UpgradePathTestBase->performUpgrade() (line 228 of /var/lib/drupaltestbot/sites/default/files/checkout/core/modules/system/lib/Drupal/system/Tests/Upgrade/UpgradePathTestBase.php).Uncaught exceptionUpgradePathTestBase.php228Drupal\system\Tests\Upgrade\UpgradePathTestBase->performUpgrade()
ExpandDrupal\system\Tests\Upgrade\FilledStandardUpgradePathTest1811
MessageGroupFilenameLineFunctionStatus
Failed: Drupal\Core\Database\DatabaseExceptionWrapper: SQLSTATE[42000]: Syntax error or access violation: 1072 Key column 'entity_id' doesn't exist in table: ALTER TABLE {comment} ADD INDEX `comment_entity_langcode` (`entity_id`, `entity_type`, `field_name`, `langcode`); Array ( ) in Drupal\Core\Database\Connection->query() (line 548 of /var/lib/drupaltestbot/sites/default/files/checkout/core/lib/Drupal/Core/Database/Connection.php).OtherUpgradePathTestBase.php222Drupal\system\Tests\Upgrade\UpgradePathTestBase->performUpgrade()
Exception: Errors during update process. in Drupal\system\Tests\Upgrade\UpgradePathTestBase->performUpgrade() (line 228 of /var/lib/drupaltestbot/sites/default/files/checkout/core/modules/system/lib/Drupal/system/Tests/Upgrade/UpgradePathTestBase.php).Uncaught exceptionUpgradePathTestBase.php228Drupal\system\Tests\Upgrade\UpgradePathTestBase->performUpgrade()
ExpandDrupal\system\Tests\Upgrade\ImageUpgradePathTest2011
MessageGroupFilenameLineFunctionStatus
Failed: Drupal\Core\Database\DatabaseExceptionWrapper: SQLSTATE[42000]: Syntax error or access violation: 1072 Key column 'entity_id' doesn't exist in table: ALTER TABLE {comment} ADD INDEX `comment_entity_langcode` (`entity_id`, `entity_type`, `field_name`, `langcode`); Array ( ) in Drupal\Core\Database\Connection->query() (line 548 of /var/lib/drupaltestbot/sites/default/files/checkout/core/lib/Drupal/Core/Database/Connection.php).OtherUpgradePathTestBase.php222Drupal\system\Tests\Upgrade\UpgradePathTestBase->performUpgrade()
Exception: Errors during update process. in Drupal\system\Tests\Upgrade\UpgradePathTestBase->performUpgrade() (line 228 of /var/lib/drupaltestbot/sites/default/files/checkout/core/modules/system/lib/Drupal/system/Tests/Upgrade/UpgradePathTestBase.php).Uncaught exceptionUpgradePathTestBase.php228Drupal\system\Tests\Upgrade\UpgradePathTestBase->performUpgrade()
ExpandDrupal\system\Tests\Upgrade\LanguageUpgradePathTest7644
MessageGroupFilenameLineFunctionStatus
Failed: Drupal\Core\Database\DatabaseExceptionWrapper: SQLSTATE[42000]: Syntax error or access violation: 1072 Key column 'entity_id' doesn't exist in table: ALTER TABLE {comment} ADD INDEX `comment_entity_langcode` (`entity_id`, `entity_type`, `field_name`, `langcode`); Array ( ) in Drupal\Core\Database\Connection->query() (line 548 of /var/lib/drupaltestbot/sites/default/files/checkout/core/lib/Drupal/Core/Database/Connection.php).OtherUpgradePathTestBase.php222Drupal\system\Tests\Upgrade\UpgradePathTestBase->performUpgrade()
Exception: Errors during update process. in Drupal\system\Tests\Upgrade\UpgradePathTestBase->performUpgrade() (line 228 of /var/lib/drupaltestbot/sites/default/files/checkout/core/modules/system/lib/Drupal/system/Tests/Upgrade/UpgradePathTestBase.php).Uncaught exceptionUpgradePathTestBase.php228Drupal\system\Tests\Upgrade\UpgradePathTestBase->performUpgrade()
Failed: Drupal\Core\Database\DatabaseExceptionWrapper: SQLSTATE[42000]: Syntax error or access violation: 1072 Key column 'entity_id' doesn't exist in table: ALTER TABLE {comment} ADD INDEX `comment_entity_langcode` (`entity_id`, `entity_type`, `field_name`, `langcode`); Array ( ) in Drupal\Core\Database\Connection->query() (line 548 of /var/lib/drupaltestbot/sites/default/files/checkout/core/lib/Drupal/Core/Database/Connection.php).OtherUpgradePathTestBase.php222Drupal\system\Tests\Upgrade\UpgradePathTestBase->performUpgrade()
Exception: Errors during update process. in Drupal\system\Tests\Upgrade\UpgradePathTestBase->performUpgrade() (line 228 of /var/lib/drupaltestbot/sites/default/files/checkout/core/modules/system/lib/Drupal/system/Tests/Upgrade/UpgradePathTestBase.php).Uncaught exceptionUpgradePathTestBase.php228Drupal\system\Tests\Upgrade\UpgradePathTestBase->performUpgrade()
Failed: Drupal\Core\Database\DatabaseExceptionWrapper: SQLSTATE[42000]: Syntax error or access violation: 1072 Key column 'entity_id' doesn't exist in table: ALTER TABLE {comment} ADD INDEX `comment_entity_langcode` (`entity_id`, `entity_type`, `field_name`, `langcode`); Array ( ) in Drupal\Core\Database\Connection->query() (line 548 of /var/lib/drupaltestbot/sites/default/files/checkout/core/lib/Drupal/Core/Database/Connection.php).OtherUpgradePathTestBase.php222Drupal\system\Tests\Upgrade\UpgradePathTestBase->performUpgrade()
Exception: Errors during update process. in Drupal\system\Tests\Upgrade\UpgradePathTestBase->performUpgrade() (line 228 of /var/lib/drupaltestbot/sites/default/files/checkout/core/modules/system/lib/Drupal/system/Tests/Upgrade/UpgradePathTestBase.php).Uncaught exceptionUpgradePathTestBase.php228Drupal\system\Tests\Upgrade\UpgradePathTestBase->performUpgrade()
Failed: Drupal\Core\Database\DatabaseExceptionWrapper: SQLSTATE[42000]: Syntax error or access violation: 1072 Key column 'entity_id' doesn't exist in table: ALTER TABLE {comment} ADD INDEX `comment_entity_langcode` (`entity_id`, `entity_type`, `field_name`, `langcode`); Array ( ) in Drupal\Core\Database\Connection->query() (line 548 of /var/lib/drupaltestbot/sites/default/files/checkout/core/lib/Drupal/Core/Database/Connection.php).OtherUpgradePathTestBase.php222Drupal\system\Tests\Upgrade\UpgradePathTestBase->performUpgrade()
Exception: Errors during update process. in Drupal\system\Tests\Upgrade\UpgradePathTestBase->performUpgrade() (line 228 of /var/lib/drupaltestbot/sites/default/files/checkout/core/modules/system/lib/Drupal/system/Tests/Upgrade/UpgradePathTestBase.php).Uncaught exceptionUpgradePathTestBase.php228Drupal\system\Tests\Upgrade\UpgradePathTestBase->performUpgrade()
ExpandDrupal\system\Tests\Upgrade\ModulesDisabledUpgradePathTest2211
MessageGroupFilenameLineFunctionStatus
Failed: Drupal\Core\Database\DatabaseExceptionWrapper: SQLSTATE[42000]: Syntax error or access violation: 1072 Key column 'entity_id' doesn't exist in table: ALTER TABLE {comment} ADD INDEX `comment_entity_langcode` (`entity_id`, `entity_type`, `field_name`, `langcode`); Array ( ) in Drupal\Core\Database\Connection->query() (line 548 of /var/lib/drupaltestbot/sites/default/files/checkout/core/lib/Drupal/Core/Database/Connection.php).OtherUpgradePathTestBase.php222Drupal\system\Tests\Upgrade\UpgradePathTestBase->performUpgrade()
Exception: Errors during update process. in Drupal\system\Tests\Upgrade\UpgradePathTestBase->performUpgrade() (line 228 of /var/lib/drupaltestbot/sites/default/files/checkout/core/modules/system/lib/Drupal/system/Tests/Upgrade/UpgradePathTestBase.php).Uncaught exceptionUpgradePathTestBase.php228Drupal\system\Tests\Upgrade\UpgradePathTestBase->performUpgrade()
ExpandDrupal\system\Tests\Upgrade\SystemUpgradePathTest2211
MessageGroupFilenameLineFunctionStatus
Failed: Drupal\Core\Database\DatabaseExceptionWrapper: SQLSTATE[42000]: Syntax error or access violation: 1072 Key column 'entity_id' doesn't exist in table: ALTER TABLE {comment} ADD INDEX `comment_entity_langcode` (`entity_id`, `entity_type`, `field_name`, `langcode`); Array ( ) in Drupal\Core\Database\Connection->query() (line 548 of /var/lib/drupaltestbot/sites/default/files/checkout/core/lib/Drupal/Core/Database/Connection.php).OtherUpgradePathTestBase.php222Drupal\system\Tests\Upgrade\UpgradePathTestBase->performUpgrade()
Exception: Errors during update process. in Drupal\system\Tests\Upgrade\UpgradePathTestBase->performUpgrade() (line 228 of /var/lib/drupaltestbot/sites/default/files/checkout/core/modules/system/lib/Drupal/system/Tests/Upgrade/UpgradePathTestBase.php).Uncaught exceptionUpgradePathTestBase.php228Drupal\system\Tests\Upgrade\UpgradePathTestBase->performUpgrade()
ExpandDrupal\system\Tests\Upgrade\UserRoleUpgradePathTest2211
MessageGroupFilenameLineFunctionStatus
Failed: Drupal\Core\Database\DatabaseExceptionWrapper: SQLSTATE[42000]: Syntax error or access violation: 1072 Key column 'entity_id' doesn't exist in table: ALTER TABLE {comment} ADD INDEX `comment_entity_langcode` (`entity_id`, `entity_type`, `field_name`, `langcode`); Array ( ) in Drupal\Core\Database\Connection->query() (line 548 of /var/lib/drupaltestbot/sites/default/files/checkout/core/lib/Drupal/Core/Database/Connection.php).OtherUpgradePathTestBase.php222Drupal\system\Tests\Upgrade\UpgradePathTestBase->performUpgrade()
Exception: Errors during update process. in Drupal\system\Tests\Upgrade\UpgradePathTestBase->performUpgrade() (line 228 of /var/lib/drupaltestbot/sites/default/files/checkout/core/modules/system/lib/Drupal/system/Tests/Upgrade/UpgradePathTestBase.php).Uncaught exceptionUpgradePathTestBase.php228Drupal\system\Tests\Upgrade\UpgradePathTestBase->performUpgrade()
ExpandDrupal\system\Tests\Upgrade\UuidUpgradePathTest2011
MessageGroupFilenameLineFunctionStatus
Failed: Drupal\Core\Database\DatabaseExceptionWrapper: SQLSTATE[42000]: Syntax error or access violation: 1072 Key column 'entity_id' doesn't exist in table: ALTER TABLE {comment} ADD INDEX `comment_entity_langcode` (`entity_id`, `entity_type`, `field_name`, `langcode`); Array ( ) in Drupal\Core\Database\Connection->query() (line 548 of /var/lib/drupaltestbot/sites/default/files/checkout/core/lib/Drupal/Core/Database/Connection.php).OtherUpgradePathTestBase.php222Drupal\system\Tests\Upgrade\UpgradePathTestBase->performUpgrade()
Exception: Errors during update process. in Drupal\system\Tests\Upgrade\UpgradePathTestBase->performUpgrade() (line 228 of /var/lib/drupaltestbot/sites/default/files/checkout/core/modules/system/lib/Drupal/system/Tests/Upgrade/UpgradePathTestBase.php).Uncaught exceptionUpgradePathTestBase.php228Drupal\system\Tests\Upgrade\UpgradePathTestBase->performUpgrade()
ExpandDrupal\user\Tests\UserCancelTest256511
MessageGroupFilenameLineFunctionStatus
Undefined property: Drupal\node\Node::$comment_pageNoticecomment.pages.inc97comment_reply()
reset() expects parameter 1 to be array, boolean givenWarningcomment.pages.inc105comment_reply()
Undefined index: comment_bodyNoticeCommentFormController.php220Drupal\comment\CommentFormController->actions()
Failed to set field comment_body[und][0][value] to qzcIlt5iMiP81uy9OtherUserCancelTest.php311Drupal\user\Tests\UserCancelTest->testUserDelete()
Found the Preview buttonOtherUserCancelTest.php311Drupal\user\Tests\UserCancelTest->testUserDelete()
Found the requested form fields at comment/reply/node/1/comment_pageOtherUserCancelTest.php311Drupal\user\Tests\UserCancelTest->testUserDelete()
Undefined property: Drupal\node\Node::$comment_pageNoticecomment.pages.inc97comment_reply()
reset() expects parameter 1 to be array, boolean givenWarningcomment.pages.inc105comment_reply()
Undefined index: comment_bodyNoticeCommentFormController.php220Drupal\comment\CommentFormController->actions()
Undefined property: Drupal\comment\Comment::$comment_bodyNoticeCommentFormController.php295Drupal\comment\CommentFormController->submit()
reset() expects parameter 1 to be array, boolean givenWarningCommentFormController.php337Drupal\comment\CommentFormController->save()
"Your comment has been posted." foundOtherUserCancelTest.php313Drupal\user\Tests\UserCancelTest->testUserDelete()
Trying to get property of non-objectNoticeUserCancelTest.php316Drupal\user\Tests\UserCancelTest->testUserDelete()
Comment found.OtherUserCancelTest.php316Drupal\user\Tests\UserCancelTest->testUserDelete()
Trying to get property of non-objectNoticeUserCancelTest.php346Drupal\user\Tests\UserCancelTest->testUserDelete()
array_flip(): Can only flip STRING and INTEGER values!WarningDatabaseStorageController.php167Drupal\Core\Entity\DatabaseStorageController->load()
ExpandDrupal\user\Tests\UserSignatureTest4364
MessageGroupFilenameLineFunctionStatus
reset() expects parameter 1 to be array, boolean givenWarningcomment.pages.inc105comment_reply()
reset() expects parameter 1 to be array, boolean givenWarningcomment.pages.inc105comment_reply()
reset() expects parameter 1 to be array, boolean givenWarningCommentFormController.php337Drupal\comment\CommentFormController->save()
Undefined offset: 1NoticeUserSignatureTest.php111Drupal\user\Tests\UserSignatureTest->testUserSignature()
Failed to set field subject to iv0uBwNVOtherUserSignatureTest.php117Drupal\user\Tests\UserSignatureTest->testUserSignature()
Failed to set field comment_body[und][0][value] to hrEQ4ronh8TnZG4EOtherUserSignatureTest.php117Drupal\user\Tests\UserSignatureTest->testUserSignature()
Failed to set field comment_body[und][0][format] to full_htmlOtherUserSignatureTest.php117Drupal\user\Tests\UserSignatureTest->testUserSignature()
Found the Save buttonOtherUserSignatureTest.php117Drupal\user\Tests\UserSignatureTest->testUserSignature()
Found the requested form fields at comment//editOtherUserSignatureTest.php117Drupal\user\Tests\UserSignatureTest->testUserSignature()
Filtered signature text found.OtherUserSignatureTest.php122Drupal\user\Tests\UserSignatureTest->testUserSignature()
ExpandDrupal\views\Tests\Comment\DefaultViewRecentComments406
MessageGroupFilenameLineFunctionStatus
'Missing handler: views_test_data age field'Debugviews.module1220views_get_handler()
'Missing handler: views_test_data id field'Debugviews.module1220views_get_handler()
'Missing handler: views_test_data name field'Debugviews.module1220views_get_handler()
'Missing handler: comment nid relationship'Debugviews.module1220views_get_handler()
Undefined index: baseNoticeSql.php1554Drupal\views\Plugin\views\query\Sql->get_entity_tables()
Undefined index: baseNoticeSql.php1554Drupal\views\Plugin\views\query\Sql->get_entity_tables()
Drupal\Core\Database\DatabaseExceptionWrapper: Exception in Recent comments[comments_recent]: SQLSTATE[42000]: Syntax error or access violation: 1064 You have an error in your SQL syntax; check the manual that corresponds to your MySQL server version for the right syntax to use near &#039;= 1 OR (.uid = 1 AND 1 &lt;&gt; 0 AND 1 = 1) OR 1 = 1) ))) subquery&#039; at line 1: SELECT COUNT(*) AS expression FROM (SELECT 1 AS expression FROM {comment} comment WHERE (( (.status = 1 OR (.uid = 1 AND 1 &lt;&gt; 0 AND 1 = 1) OR 1 = 1) ))) subquery; Array ( ) in Drupal\views\Plugin\views\query\Sql->execute() (line 1515 of /var/lib/drupaltestbot/sites/default/files/checkout/core/modules/views/lib/Drupal/views/Plugin/views/query/Sql.php).Uncaught exceptionSql.php1515Drupal\views\Plugin\views\query\Sql->execute()
'Missing handler: views_test_data age field'Debugviews.module1220views_get_handler()
'Missing handler: views_test_data id field'Debugviews.module1220views_get_handler()
'Missing handler: views_test_data name field'Debugviews.module1220views_get_handler()
'Missing handler: comment nid relationship'Debugviews.module1220views_get_handler()
Undefined index: baseNoticeSql.php1554Drupal\views\Plugin\views\query\Sql->get_entity_tables()
Undefined index: baseNoticeSql.php1554Drupal\views\Plugin\views\query\Sql->get_entity_tables()
Drupal\Core\Database\DatabaseExceptionWrapper: Exception in Recent comments[comments_recent]: SQLSTATE[42000]: Syntax error or access violation: 1064 You have an error in your SQL syntax; check the manual that corresponds to your MySQL server version for the right syntax to use near &#039;= 1 OR (.uid = 1 AND 1 &lt;&gt; 0 AND 1 = 1) OR 1 = 1) ))) subquery&#039; at line 1: SELECT COUNT(*) AS expression FROM (SELECT 1 AS expression FROM {comment} comment WHERE (( (.status = 1 OR (.uid = 1 AND 1 &lt;&gt; 0 AND 1 = 1) OR 1 = 1) ))) subquery; Array ( ) in Drupal\views\Plugin\views\query\Sql->execute() (line 1515 of /var/lib/drupaltestbot/sites/default/files/checkout/core/modules/views/lib/Drupal/views/Plugin/views/query/Sql.php).Uncaught exceptionSql.php1515Drupal\views\Plugin\views\query\Sql->execute()
ExpandDrupal\views\Tests\Comment\FilterUserUIDTest801
MessageGroupFilenameLineFunctionStatus
Drupal\Core\Database\DatabaseExceptionWrapper: Exception in test_comment_user_uid[test_comment_user_uid]: SQLSTATE[42S22]: Column not found: 1054 Unknown column &#039;c.nid&#039; in &#039;where clause&#039;: SELECT COUNT(*) AS expression FROM (SELECT 1 AS expression FROM {node} node WHERE ((( (node.uid = :db_condition_placeholder_0_0) OR ( EXISTS (SELECT c.cid AS cid FROM {comment} c WHERE (c.uid = :db_condition_placeholder_1_0) AND (c.nid = node.nid) )) )))) subquery; Array ( [:db_condition_placeholder_0_0] =&gt; 2 [:db_condition_placeholder_1_0] =&gt; 2 ) in Drupal\views\Plugin\views\query\Sql->execute() (line 1515 of /var/lib/drupaltestbot/sites/default/files/checkout/core/modules/views/lib/Drupal/views/Plugin/views/query/Sql.php).Uncaught exceptionSql.php1515Drupal\views\Plugin\views\query\Sql->execute()
ExpandDrupal\views\Tests\DefaultViewsTest3103
MessageGroupFilenameLineFunctionStatus
'Missing handler: search_node_links_to nid argument'Debugviews.module1220views_get_handler()
'Missing handler: search_node_links_to nid argument'Debugviews.module1220views_get_handler()
'Missing handler: search_node_links_to nid argument'Debugviews.module1220views_get_handler()
'Missing handler: comment nid relationship'Debugviews.module1220views_get_handler()
Undefined index: baseNoticeSql.php1554Drupal\views\Plugin\views\query\Sql->get_entity_tables()
Undefined index: baseNoticeSql.php1554Drupal\views\Plugin\views\query\Sql->get_entity_tables()
Drupal\Core\Database\DatabaseExceptionWrapper: Exception in Recent comments[comments_recent]: SQLSTATE[42000]: Syntax error or access violation: 1064 You have an error in your SQL syntax; check the manual that corresponds to your MySQL server version for the right syntax to use near &#039;= 1 OR (.uid = 1 AND 1 &lt;&gt; 0 AND 1 = 1) OR 1 = 1) )) ORDER BY comment_changed DES&#039; at line 1: SELECT comment.subject AS comment_subject, comment.cid AS cid, comment.entity_id AS comment_entity_id, comment.entity_type AS comment_entity_type, comment.changed AS comment_changed FROM {comment} comment WHERE (( (.status = 1 OR (.uid = 1 AND 1 &lt;&gt; 0 AND 1 = 1) OR 1 = 1) )) ORDER BY comment_changed DESC LIMIT 5 OFFSET 0; Array ( ) in Drupal\views\Plugin\views\query\Sql->execute() (line 1515 of /var/lib/drupaltestbot/sites/default/files/checkout/core/modules/views/lib/Drupal/views/Plugin/views/query/Sql.php).Uncaught exceptionSql.php1515Drupal\views\Plugin\views\query\Sql->execute()
ExpandDrupal\views\Tests\Entity\FieldEntityTest103
MessageGroupFilenameLineFunctionStatus
'Missing handler: comment nid relationship'Debugviews.module1220views_get_handler()
Undefined index: baseNoticeSql.php1554Drupal\views\Plugin\views\query\Sql->get_entity_tables()
Undefined index: baseNoticeSql.php1554Drupal\views\Plugin\views\query\Sql->get_entity_tables()
Drupal\Core\Database\DatabaseExceptionWrapper: Exception in test_field_get_entity[test_field_get_entity]: SQLSTATE[23000]: Integrity constraint violation: 1052 Column &#039;uid&#039; in on clause is ambiguous: SELECT COUNT(*) AS expression FROM (SELECT 1 AS expression FROM {comment} comment LEFT JOIN {users} users_node ON uid = users_node.uid) subquery; Array ( ) in Drupal\views\Plugin\views\query\Sql->execute() (line 1515 of /var/lib/drupaltestbot/sites/default/files/checkout/core/modules/views/lib/Drupal/views/Plugin/views/query/Sql.php).Uncaught exceptionSql.php1515Drupal\views\Plugin\views\query\Sql->execute()
ExpandDrupal\views\Tests\Handler\HandlerAllTest24201
MessageGroupFilenameLineFunctionStatus
'Missing handler: comment langcode field'Debugviews.module1220views_get_handler()
'Missing handler: comment langcode argument'Debugviews.module1220views_get_handler()
'Missing handler: comment langcode filter'Debugviews.module1220views_get_handler()
'Missing handler: comment langcode filter'Debugviews.module1220views_get_handler()
'Missing handler: comment entity_type sort'Debugviews.module1220views_get_handler()
'Missing handler: comment field_name sort'Debugviews.module1220views_get_handler()
'Missing handler: comment langcode field'Debugviews.module1220views_get_handler()
'Missing handler: comment langcode argument'Debugviews.module1220views_get_handler()
'Missing handler: comment entity_type sort'Debugviews.module1220views_get_handler()
'Missing handler: comment field_name sort'Debugviews.module1220views_get_handler()
'Missing handler: comment langcode filter'Debugviews.module1220views_get_handler()
'Missing handler: node langcode argument'Debugviews.module1220views_get_handler()
'Missing handler: node langcode filter'Debugviews.module1220views_get_handler()
'Missing handler: node langcode filter'Debugviews.module1220views_get_handler()
'Missing handler: node langcode argument'Debugviews.module1220views_get_handler()
'Missing handler: node langcode filter'Debugviews.module1220views_get_handler()
Undefined index: handlerNoticeFieldPluginBase.php145Drupal\views\Plugin\views\field\FieldPluginBase->add_additional_fields()
'Handler tried to add additional_field comment_count but node_comment_statistics could not be added!'DebugFieldPluginBase.php145Drupal\views\Plugin\views\field\FieldPluginBase->add_additional_fields()
'Missing handler: taxonomy_term_data langcode argument'Debugviews.module1220views_get_handler()
'Missing handler: taxonomy_term_data langcode filter'Debugviews.module1220views_get_handler()
'Missing handler: taxonomy_term_data langcode filter'Debugviews.module1220views_get_handler()
'Missing handler: taxonomy_term_data langcode argument'Debugviews.module1220views_get_handler()
'Missing handler: taxonomy_term_data langcode filter'Debugviews.module1220views_get_handler()
'Missing handler: users langcode argument'Debugviews.module1220views_get_handler()
'Missing handler: users langcode filter'Debugviews.module1220views_get_handler()
'Missing handler: users langcode filter'Debugviews.module1220views_get_handler()
'Missing handler: users langcode argument'Debugviews.module1220views_get_handler()
'Missing handler: users langcode filter'Debugviews.module1220views_get_handler()
ExpandDrupal\views\Tests\Handler\HandlerTest114212
MessageGroupFilenameLineFunctionStatus
'Missing handler: node cid relationship'Debugviews.module1220views_get_handler()
'Missing handler: comment nid relationship'Debugviews.module1220views_get_handler()
'Missing handler: node cid relationship'Debugviews.module1220views_get_handler()
Undefined index: cidNoticeadmin.inc1749views_ui_config_item_form()
'Missing handler: comment nid relationship'Debugviews.module1220views_get_handler()
Undefined index: nidNoticeadmin.inc1749views_ui_config_item_form()
Found field with name 'options[relationship]'BrowserHandlerTest.php241Drupal\views\Tests\Handler\HandlerTest->testRelationshipUI()
Value array ( ) is equal to value array ( 0 => 'none', 1 => 'nid', ).OtherHandlerTest.php254Drupal\views\Tests\Handler\HandlerTest->testRelationshipUI()
'Missing handler: node cid relationship'Debugviews.module1220views_get_handler()
'Missing handler: comment nid relationship'Debugviews.module1220views_get_handler()
'Missing handler: node cid relationship'Debugviews.module1220views_get_handler()
Undefined index: cidNoticeadmin.inc1749views_ui_config_item_form()
'Missing handler: node cid relationship'Debugviews.module1220views_get_handler()
'Missing handler: comment nid relationship'Debugviews.module1220views_get_handler()
'Missing handler: node cid relationship'Debugviews.module1220views_get_handler()
Undefined index: cidNoticeadmin.inc1749views_ui_config_item_form()
'Missing handler: node cid relationship'Debugviews.module1220views_get_handler()
'Missing handler: node cid relationship'Debugviews.module1220views_get_handler()
Undefined index: cidNoticeadmin.inc1749views_ui_config_item_form()
'Missing handler: oQB12IXb vcR5jmXT relationship'Debugviews.module1220views_get_handler()
'Missing handler: comment entity_id relationship'Debugviews.module1220views_get_handler()
'Missing handler: node cid relationship'Debugviews.module1220views_get_handler()
'Missing handler: comment nid relationship'Debugviews.module1220views_get_handler()
'Missing handler: oQB12IXb vcR5jmXT relationship'Debugviews.module1220views_get_handler()
'Missing handler: comment entity_id relationship'Debugviews.module1220views_get_handler()
Undefined index: baseNoticeSql.php1554Drupal\views\Plugin\views\query\Sql->get_entity_tables()
Undefined index: baseNoticeSql.php1554Drupal\views\Plugin\views\query\Sql->get_entity_tables()
Undefined index: baseNoticeSql.php1554Drupal\views\Plugin\views\query\Sql->get_entity_tables()
Undefined index: baseNoticeSql.php1554Drupal\views\Plugin\views\query\Sql->get_entity_tables()
Undefined index: baseNoticeSql.php1554Drupal\views\Plugin\views\query\Sql->get_entity_tables()
Undefined index: baseNoticeSql.php1554Drupal\views\Plugin\views\query\Sql->get_entity_tables()
Undefined property: Drupal\views\Plugin\views\relationship\Broken::$aliasNoticeHandlerTest.php295Drupal\views\Tests\Handler\HandlerTest->testSetRelationship()
ExpandDrupal\views\Tests\ViewExecutableTest4805
MessageGroupFilenameLineFunctionStatus
'Missing handler: node_comment_statistics last_comment_name sort'Debugviews.module1220views_get_handler()
'Missing handler: node_comment_statistics last_comment_timestamp sort'Debugviews.module1220views_get_handler()
'Missing handler: node cid relationship'Debugviews.module1220views_get_handler()
'Missing handler: node_comment_statistics last_comment_name sort'Debugviews.module1220views_get_handler()
'Missing handler: node_comment_statistics last_comment_timestamp sort'Debugviews.module1220views_get_handler()
'Missing handler: node cid relationship'Debugviews.module1220views_get_handler()
Undefined index: baseNoticeSql.php1554Drupal\views\Plugin\views\query\Sql->get_entity_tables()
Undefined index: baseNoticeSql.php1554Drupal\views\Plugin\views\query\Sql->get_entity_tables()
'Missing handler: node_comment_statistics last_comment_name sort'Debugviews.module1220views_get_handler()
'Missing handler: node_comment_statistics last_comment_timestamp sort'Debugviews.module1220views_get_handler()
'Missing handler: node cid relationship'Debugviews.module1220views_get_handler()
Undefined index: baseNoticeSql.php1554Drupal\views\Plugin\views\query\Sql->get_entity_tables()
Undefined index: baseNoticeSql.php1554Drupal\views\Plugin\views\query\Sql->get_entity_tables()
Drupal\Core\Database\DatabaseExceptionWrapper: Exception in test_destroy[test_destroy]: SQLSTATE[23000]: Integrity constraint violation: 1052 Column &#039;uid&#039; in on clause is ambiguous: SELECT COUNT(*) AS expression FROM (SELECT 1 AS expression FROM {node} node LEFT JOIN {comment} comment_comment ON pid = comment_comment.cid LEFT JOIN {users} users_comment ON uid = users_comment.uid WHERE (( (node.nid = :db_condition_placeholder_0) AND (node.status = :db_condition_placeholder_1) AND (node.title LIKE :db_condition_placeholder_2 ESCAPE &#039;\\&#039;) ))) subquery; Array ( [:db_condition_placeholder_0] =&gt; [:db_condition_placeholder_1] =&gt; 0 [:db_condition_placeholder_2] =&gt; ) in Drupal\views\Plugin\views\query\Sql->execute() (line 1515 of /var/lib/drupaltestbot/sites/default/files/checkout/core/modules/views/lib/Drupal/views/Plugin/views/query/Sql.php).Uncaught exceptionSql.php1515Drupal\views\Plugin\views\query\Sql->execute()
'Missing handler: node_comment_statistics last_comment_name sort'Debugviews.module1220views_get_handler()
'Missing handler: node_comment_statistics last_comment_timestamp sort'Debugviews.module1220views_get_handler()
'Missing handler: node cid relationship'Debugviews.module1220views_get_handler()
'Missing handler: node_comment_statistics last_comment_name sort'Debugviews.module1220views_get_handler()
'Missing handler: node_comment_statistics last_comment_timestamp sort'Debugviews.module1220views_get_handler()
'Missing handler: node cid relationship'Debugviews.module1220views_get_handler()
'Missing handler: node_comment_statistics last_comment_name sort'Debugviews.module1220views_get_handler()
'Missing handler: node_comment_statistics last_comment_timestamp sort'Debugviews.module1220views_get_handler()
'Missing handler: node cid relationship'Debugviews.module1220views_get_handler()
'Missing handler: node_comment_statistics last_comment_name sort'Debugviews.module1220views_get_handler()
'Missing handler: node_comment_statistics last_comment_timestamp sort'Debugviews.module1220views_get_handler()
'Missing handler: node cid relationship'Debugviews.module1220views_get_handler()

All

Test namePassFailException
LeafDrupal\action\Tests\ConfigurationTest3900
LeafDrupal\action\Tests\LoopTest2100
LeafDrupal\aggregator\Tests\AddFeedTest7100
LeafDrupal\aggregator\Tests\AggregatorConfigurationTest2000
LeafDrupal\aggregator\Tests\AggregatorCronTest5500
LeafDrupal\aggregator\Tests\AggregatorRenderingTest22800
LeafDrupal\aggregator\Tests\CategorizeFeedItemTest6100
LeafDrupal\aggregator\Tests\CategorizeFeedTest2100
LeafDrupal\aggregator\Tests\FeedParserTest7200
LeafDrupal\aggregator\Tests\ImportOpmlTest5500
LeafDrupal\aggregator\Tests\RemoveFeedItemTest27000
LeafDrupal\aggregator\Tests\RemoveFeedTest2500
LeafDrupal\aggregator\Tests\UpdateFeedItemTest6500
LeafDrupal\aggregator\Tests\UpdateFeedTest7600
LeafDrupal\ban\Tests\IpAddressBlockingTest4300
LeafDrupal\block\Tests\BlockAdminThemeTest1900
LeafDrupal\block\Tests\BlockCacheTest20500
LeafDrupal\block\Tests\BlockHiddenRegionTest1800
LeafDrupal\block\Tests\BlockHtmlIdTest1600
LeafDrupal\block\Tests\BlockInvalidRegionTest2400
LeafDrupal\block\Tests\BlockLanguageTest9100
LeafDrupal\block\Tests\BlockTemplateSuggestionsUnitTest300
LeafDrupal\block\Tests\BlockTest35800
LeafDrupal\block\Tests\BlockUserAccountSettingsTest1200
LeafDrupal\block\Tests\NewDefaultThemeBlocksTest2100
LeafDrupal\block\Tests\NonDefaultBlockAdminTest1100
LeafDrupal\book\Tests\BookTest51700
LeafDrupal\breakpoint\Tests\BreakpointAPITest600
LeafDrupal\breakpoint\Tests\BreakpointCRUDTest2100
LeafDrupal\breakpoint\Tests\BreakpointGroupAPITest400
LeafDrupal\breakpoint\Tests\BreakpointGroupCRUDTest1200
LeafDrupal\breakpoint\Tests\BreakpointMediaQueryTest6300
LeafDrupal\breakpoint\Tests\BreakpointThemeTest2300
LeafDrupal\color\Tests\ColorTest8700
LeafDrupal\comment\Tests\CommentActionsTest3000
LeafDrupal\comment\Tests\CommentAnonymousTest16300
LeafDrupal\comment\Tests\CommentApprovalTest15200
LeafDrupal\comment\Tests\CommentBlockTest11800
LeafDrupal\comment\Tests\CommentContentRebuildTest3300
LeafDrupal\comment\Tests\CommentCSSTest50100
LeafDrupal\comment\Tests\CommentFieldsTest4100
LeafDrupal\comment\Tests\CommentInterfaceTest25100
LeafDrupal\comment\Tests\CommentLanguageTest7200
ExpandDrupal\comment\Tests\CommentLinksTest122100
MessageGroupFilenameLineFunctionStatus
Changed environment:array ( 'authenticated' => false, 'comment count' => false, 'form' => 'below', 'user_register' => 'visitors', 'contact' => 'optional', 'comments' => 'open', 'access comments' => 0, 'post comments' => 0, 'skip comment approval' => 1, 'edit own comments' => 0, )DebugCommentLinksTest.php195Drupal\comment\Tests\CommentLinksTest->setEnvironment()
Changed environment:array ( 'authenticated' => true, 'comment count' => false, 'form' => 'below', 'user_register' => 'visitors', 'contact' => 'optional', 'comments' => 'open', 'access comments' => 0, 'post comments' => 0, 'skip comment approval' => 1, 'edit own comments' => 0, )DebugCommentLinksTest.php195Drupal\comment\Tests\CommentLinksTest->setEnvironment()
Changed environment:array ( 'authenticated' => false, 'comment count' => true, 'form' => 'below', 'user_register' => 'visitors', 'contact' => 'optional', 'comments' => 'open', 'access comments' => 0, 'post comments' => 0, 'skip comment approval' => 1, 'edit own comments' => 0, )DebugCommentLinksTest.php195Drupal\comment\Tests\CommentLinksTest->setEnvironment()
Changed environment:array ( 'authenticated' => true, 'comment count' => true, 'form' => 'below', 'user_register' => 'visitors', 'contact' => 'optional', 'comments' => 'open', 'access comments' => 0, 'post comments' => 0, 'skip comment approval' => 1, 'edit own comments' => 0, )DebugCommentLinksTest.php195Drupal\comment\Tests\CommentLinksTest->setEnvironment()
Changed environment:array ( 'authenticated' => false, 'comment count' => false, 'form' => 'below', 'user_register' => 'visitors', 'contact' => 'optional', 'comments' => 'open', 'access comments' => 1, 'post comments' => 0, 'skip comment approval' => 1, 'edit own comments' => 0, )DebugCommentLinksTest.php195Drupal\comment\Tests\CommentLinksTest->setEnvironment()
Changed environment:array ( 'authenticated' => true, 'comment count' => false, 'form' => 'below', 'user_register' => 'visitors', 'contact' => 'optional', 'comments' => 'open', 'access comments' => 1, 'post comments' => 0, 'skip comment approval' => 1, 'edit own comments' => 0, )DebugCommentLinksTest.php195Drupal\comment\Tests\CommentLinksTest->setEnvironment()
Changed environment:array ( 'authenticated' => false, 'comment count' => true, 'form' => 'below', 'user_register' => 'visitors', 'contact' => 'optional', 'comments' => 'open', 'access comments' => 1, 'post comments' => 0, 'skip comment approval' => 1, 'edit own comments' => 0, )DebugCommentLinksTest.php195Drupal\comment\Tests\CommentLinksTest->setEnvironment()
Changed environment:array ( 'authenticated' => true, 'comment count' => true, 'form' => 'below', 'user_register' => 'visitors', 'contact' => 'optional', 'comments' => 'open', 'access comments' => 1, 'post comments' => 0, 'skip comment approval' => 1, 'edit own comments' => 0, )DebugCommentLinksTest.php195Drupal\comment\Tests\CommentLinksTest->setEnvironment()
Changed environment:array ( 'authenticated' => false, 'comment count' => false, 'form' => 'below', 'user_register' => 'visitors', 'contact' => 'optional', 'comments' => 'open', 'access comments' => 0, 'post comments' => 1, 'skip comment approval' => 1, 'edit own comments' => 0, )DebugCommentLinksTest.php195Drupal\comment\Tests\CommentLinksTest->setEnvironment()
Changed environment:array ( 'authenticated' => true, 'comment count' => false, 'form' => 'below', 'user_register' => 'visitors', 'contact' => 'optional', 'comments' => 'open', 'access comments' => 0, 'post comments' => 1, 'skip comment approval' => 1, 'edit own comments' => 0, )DebugCommentLinksTest.php195Drupal\comment\Tests\CommentLinksTest->setEnvironment()
Changed environment:array ( 'authenticated' => false, 'comment count' => true, 'form' => 'below', 'user_register' => 'visitors', 'contact' => 'optional', 'comments' => 'open', 'access comments' => 0, 'post comments' => 1, 'skip comment approval' => 1, 'edit own comments' => 0, )DebugCommentLinksTest.php195Drupal\comment\Tests\CommentLinksTest->setEnvironment()
Changed environment:array ( 'authenticated' => true, 'comment count' => true, 'form' => 'below', 'user_register' => 'visitors', 'contact' => 'optional', 'comments' => 'open', 'access comments' => 0, 'post comments' => 1, 'skip comment approval' => 1, 'edit own comments' => 0, )DebugCommentLinksTest.php195Drupal\comment\Tests\CommentLinksTest->setEnvironment()
Changed environment:array ( 'authenticated' => false, 'comment count' => false, 'form' => 'below', 'user_register' => 'visitors', 'contact' => 'optional', 'comments' => 'open', 'access comments' => 1, 'post comments' => 1, 'skip comment approval' => 1, 'edit own comments' => 0, )DebugCommentLinksTest.php195Drupal\comment\Tests\CommentLinksTest->setEnvironment()
Changed environment:array ( 'authenticated' => true, 'comment count' => false, 'form' => 'below', 'user_register' => 'visitors', 'contact' => 'optional', 'comments' => 'open', 'access comments' => 1, 'post comments' => 1, 'skip comment approval' => 1, 'edit own comments' => 0, )DebugCommentLinksTest.php195Drupal\comment\Tests\CommentLinksTest->setEnvironment()
Changed environment:array ( 'authenticated' => false, 'comment count' => true, 'form' => 'below', 'user_register' => 'visitors', 'contact' => 'optional', 'comments' => 'open', 'access comments' => 1, 'post comments' => 1, 'skip comment approval' => 1, 'edit own comments' => 0, )DebugCommentLinksTest.php195Drupal\comment\Tests\CommentLinksTest->setEnvironment()
Changed environment:array ( 'authenticated' => true, 'comment count' => true, 'form' => 'below', 'user_register' => 'visitors', 'contact' => 'optional', 'comments' => 'open', 'access comments' => 1, 'post comments' => 1, 'skip comment approval' => 1, 'edit own comments' => 0, )DebugCommentLinksTest.php195Drupal\comment\Tests\CommentLinksTest->setEnvironment()
Changed environment:array ( 'authenticated' => false, 'comment count' => false, 'form' => 'separate page', 'user_register' => 'visitors', 'contact' => 'optional', 'comments' => 'open', 'access comments' => 0, 'post comments' => 0, 'skip comment approval' => 1, 'edit own comments' => 0, )DebugCommentLinksTest.php195Drupal\comment\Tests\CommentLinksTest->setEnvironment()
Changed environment:array ( 'authenticated' => true, 'comment count' => false, 'form' => 'separate page', 'user_register' => 'visitors', 'contact' => 'optional', 'comments' => 'open', 'access comments' => 0, 'post comments' => 0, 'skip comment approval' => 1, 'edit own comments' => 0, )DebugCommentLinksTest.php195Drupal\comment\Tests\CommentLinksTest->setEnvironment()
Changed environment:array ( 'authenticated' => false, 'comment count' => true, 'form' => 'separate page', 'user_register' => 'visitors', 'contact' => 'optional', 'comments' => 'open', 'access comments' => 0, 'post comments' => 0, 'skip comment approval' => 1, 'edit own comments' => 0, )DebugCommentLinksTest.php195Drupal\comment\Tests\CommentLinksTest->setEnvironment()
Changed environment:array ( 'authenticated' => true, 'comment count' => true, 'form' => 'separate page', 'user_register' => 'visitors', 'contact' => 'optional', 'comments' => 'open', 'access comments' => 0, 'post comments' => 0, 'skip comment approval' => 1, 'edit own comments' => 0, )DebugCommentLinksTest.php195Drupal\comment\Tests\CommentLinksTest->setEnvironment()
Changed environment:array ( 'authenticated' => false, 'comment count' => false, 'form' => 'separate page', 'user_register' => 'visitors', 'contact' => 'optional', 'comments' => 'open', 'access comments' => 1, 'post comments' => 0, 'skip comment approval' => 1, 'edit own comments' => 0, )DebugCommentLinksTest.php195Drupal\comment\Tests\CommentLinksTest->setEnvironment()
Changed environment:array ( 'authenticated' => true, 'comment count' => false, 'form' => 'separate page', 'user_register' => 'visitors', 'contact' => 'optional', 'comments' => 'open', 'access comments' => 1, 'post comments' => 0, 'skip comment approval' => 1, 'edit own comments' => 0, )DebugCommentLinksTest.php195Drupal\comment\Tests\CommentLinksTest->setEnvironment()
Changed environment:array ( 'authenticated' => false, 'comment count' => true, 'form' => 'separate page', 'user_register' => 'visitors', 'contact' => 'optional', 'comments' => 'open', 'access comments' => 1, 'post comments' => 0, 'skip comment approval' => 1, 'edit own comments' => 0, )DebugCommentLinksTest.php195Drupal\comment\Tests\CommentLinksTest->setEnvironment()
Changed environment:array ( 'authenticated' => true, 'comment count' => true, 'form' => 'separate page', 'user_register' => 'visitors', 'contact' => 'optional', 'comments' => 'open', 'access comments' => 1, 'post comments' => 0, 'skip comment approval' => 1, 'edit own comments' => 0, )DebugCommentLinksTest.php195Drupal\comment\Tests\CommentLinksTest->setEnvironment()
Changed environment:array ( 'authenticated' => false, 'comment count' => false, 'form' => 'separate page', 'user_register' => 'visitors', 'contact' => 'optional', 'comments' => 'open', 'access comments' => 0, 'post comments' => 1, 'skip comment approval' => 1, 'edit own comments' => 0, )DebugCommentLinksTest.php195Drupal\comment\Tests\CommentLinksTest->setEnvironment()
Changed environment:array ( 'authenticated' => true, 'comment count' => false, 'form' => 'separate page', 'user_register' => 'visitors', 'contact' => 'optional', 'comments' => 'open', 'access comments' => 0, 'post comments' => 1, 'skip comment approval' => 1, 'edit own comments' => 0, )DebugCommentLinksTest.php195Drupal\comment\Tests\CommentLinksTest->setEnvironment()
Changed environment:array ( 'authenticated' => false, 'comment count' => true, 'form' => 'separate page', 'user_register' => 'visitors', 'contact' => 'optional', 'comments' => 'open', 'access comments' => 0, 'post comments' => 1, 'skip comment approval' => 1, 'edit own comments' => 0, )DebugCommentLinksTest.php195Drupal\comment\Tests\CommentLinksTest->setEnvironment()
Changed environment:array ( 'authenticated' => true, 'comment count' => true, 'form' => 'separate page', 'user_register' => 'visitors', 'contact' => 'optional', 'comments' => 'open', 'access comments' => 0, 'post comments' => 1, 'skip comment approval' => 1, 'edit own comments' => 0, )DebugCommentLinksTest.php195Drupal\comment\Tests\CommentLinksTest->setEnvironment()
Changed environment:array ( 'authenticated' => false, 'comment count' => false, 'form' => 'separate page', 'user_register' => 'visitors', 'contact' => 'optional', 'comments' => 'open', 'access comments' => 1, 'post comments' => 1, 'skip comment approval' => 1, 'edit own comments' => 0, )DebugCommentLinksTest.php195Drupal\comment\Tests\CommentLinksTest->setEnvironment()
Changed environment:array ( 'authenticated' => true, 'comment count' => false, 'form' => 'separate page', 'user_register' => 'visitors', 'contact' => 'optional', 'comments' => 'open', 'access comments' => 1, 'post comments' => 1, 'skip comment approval' => 1, 'edit own comments' => 0, )DebugCommentLinksTest.php195Drupal\comment\Tests\CommentLinksTest->setEnvironment()
Changed environment:array ( 'authenticated' => false, 'comment count' => true, 'form' => 'separate page', 'user_register' => 'visitors', 'contact' => 'optional', 'comments' => 'open', 'access comments' => 1, 'post comments' => 1, 'skip comment approval' => 1, 'edit own comments' => 0, )DebugCommentLinksTest.php195Drupal\comment\Tests\CommentLinksTest->setEnvironment()
Changed environment:array ( 'authenticated' => true, 'comment count' => true, 'form' => 'separate page', 'user_register' => 'visitors', 'contact' => 'optional', 'comments' => 'open', 'access comments' => 1, 'post comments' => 1, 'skip comment approval' => 1, 'edit own comments' => 0, )DebugCommentLinksTest.php195Drupal\comment\Tests\CommentLinksTest->setEnvironment()
Changed environment:array ( 'authenticated' => false, 'comment count' => false, 'form' => 'below', 'user_register' => 'admin_only', 'contact' => 'optional', 'comments' => 'open', 'access comments' => 0, 'post comments' => 0, 'skip comment approval' => 1, 'edit own comments' => 0, )DebugCommentLinksTest.php195Drupal\comment\Tests\CommentLinksTest->setEnvironment()
Changed environment:array ( 'authenticated' => true, 'comment count' => false, 'form' => 'below', 'user_register' => 'admin_only', 'contact' => 'optional', 'comments' => 'open', 'access comments' => 0, 'post comments' => 0, 'skip comment approval' => 1, 'edit own comments' => 0, )DebugCommentLinksTest.php195Drupal\comment\Tests\CommentLinksTest->setEnvironment()
Changed environment:array ( 'authenticated' => false, 'comment count' => true, 'form' => 'below', 'user_register' => 'admin_only', 'contact' => 'optional', 'comments' => 'open', 'access comments' => 0, 'post comments' => 0, 'skip comment approval' => 1, 'edit own comments' => 0, )DebugCommentLinksTest.php195Drupal\comment\Tests\CommentLinksTest->setEnvironment()
Changed environment:array ( 'authenticated' => true, 'comment count' => true, 'form' => 'below', 'user_register' => 'admin_only', 'contact' => 'optional', 'comments' => 'open', 'access comments' => 0, 'post comments' => 0, 'skip comment approval' => 1, 'edit own comments' => 0, )DebugCommentLinksTest.php195Drupal\comment\Tests\CommentLinksTest->setEnvironment()
Changed environment:array ( 'authenticated' => false, 'comment count' => false, 'form' => 'below', 'user_register' => 'admin_only', 'contact' => 'optional', 'comments' => 'open', 'access comments' => 1, 'post comments' => 0, 'skip comment approval' => 1, 'edit own comments' => 0, )DebugCommentLinksTest.php195Drupal\comment\Tests\CommentLinksTest->setEnvironment()
Changed environment:array ( 'authenticated' => true, 'comment count' => false, 'form' => 'below', 'user_register' => 'admin_only', 'contact' => 'optional', 'comments' => 'open', 'access comments' => 1, 'post comments' => 0, 'skip comment approval' => 1, 'edit own comments' => 0, )DebugCommentLinksTest.php195Drupal\comment\Tests\CommentLinksTest->setEnvironment()
Changed environment:array ( 'authenticated' => false, 'comment count' => true, 'form' => 'below', 'user_register' => 'admin_only', 'contact' => 'optional', 'comments' => 'open', 'access comments' => 1, 'post comments' => 0, 'skip comment approval' => 1, 'edit own comments' => 0, )DebugCommentLinksTest.php195Drupal\comment\Tests\CommentLinksTest->setEnvironment()
Changed environment:array ( 'authenticated' => true, 'comment count' => true, 'form' => 'below', 'user_register' => 'admin_only', 'contact' => 'optional', 'comments' => 'open', 'access comments' => 1, 'post comments' => 0, 'skip comment approval' => 1, 'edit own comments' => 0, )DebugCommentLinksTest.php195Drupal\comment\Tests\CommentLinksTest->setEnvironment()
Changed environment:array ( 'authenticated' => false, 'comment count' => false, 'form' => 'below', 'user_register' => 'admin_only', 'contact' => 'optional', 'comments' => 'open', 'access comments' => 0, 'post comments' => 1, 'skip comment approval' => 1, 'edit own comments' => 0, )DebugCommentLinksTest.php195Drupal\comment\Tests\CommentLinksTest->setEnvironment()
Changed environment:array ( 'authenticated' => true, 'comment count' => false, 'form' => 'below', 'user_register' => 'admin_only', 'contact' => 'optional', 'comments' => 'open', 'access comments' => 0, 'post comments' => 1, 'skip comment approval' => 1, 'edit own comments' => 0, )DebugCommentLinksTest.php195Drupal\comment\Tests\CommentLinksTest->setEnvironment()
Changed environment:array ( 'authenticated' => false, 'comment count' => true, 'form' => 'below', 'user_register' => 'admin_only', 'contact' => 'optional', 'comments' => 'open', 'access comments' => 0, 'post comments' => 1, 'skip comment approval' => 1, 'edit own comments' => 0, )DebugCommentLinksTest.php195Drupal\comment\Tests\CommentLinksTest->setEnvironment()
Changed environment:array ( 'authenticated' => true, 'comment count' => true, 'form' => 'below', 'user_register' => 'admin_only', 'contact' => 'optional', 'comments' => 'open', 'access comments' => 0, 'post comments' => 1, 'skip comment approval' => 1, 'edit own comments' => 0, )DebugCommentLinksTest.php195Drupal\comment\Tests\CommentLinksTest->setEnvironment()
Changed environment:array ( 'authenticated' => false, 'comment count' => false, 'form' => 'below', 'user_register' => 'admin_only', 'contact' => 'optional', 'comments' => 'open', 'access comments' => 1, 'post comments' => 1, 'skip comment approval' => 1, 'edit own comments' => 0, )DebugCommentLinksTest.php195Drupal\comment\Tests\CommentLinksTest->setEnvironment()
Changed environment:array ( 'authenticated' => true, 'comment count' => false, 'form' => 'below', 'user_register' => 'admin_only', 'contact' => 'optional', 'comments' => 'open', 'access comments' => 1, 'post comments' => 1, 'skip comment approval' => 1, 'edit own comments' => 0, )DebugCommentLinksTest.php195Drupal\comment\Tests\CommentLinksTest->setEnvironment()
Changed environment:array ( 'authenticated' => false, 'comment count' => true, 'form' => 'below', 'user_register' => 'admin_only', 'contact' => 'optional', 'comments' => 'open', 'access comments' => 1, 'post comments' => 1, 'skip comment approval' => 1, 'edit own comments' => 0, )DebugCommentLinksTest.php195Drupal\comment\Tests\CommentLinksTest->setEnvironment()
Changed environment:array ( 'authenticated' => true, 'comment count' => true, 'form' => 'below', 'user_register' => 'admin_only', 'contact' => 'optional', 'comments' => 'open', 'access comments' => 1, 'post comments' => 1, 'skip comment approval' => 1, 'edit own comments' => 0, )DebugCommentLinksTest.php195Drupal\comment\Tests\CommentLinksTest->setEnvironment()
Changed environment:array ( 'authenticated' => false, 'comment count' => false, 'form' => 'separate page', 'user_register' => 'admin_only', 'contact' => 'optional', 'comments' => 'open', 'access comments' => 0, 'post comments' => 0, 'skip comment approval' => 1, 'edit own comments' => 0, )DebugCommentLinksTest.php195Drupal\comment\Tests\CommentLinksTest->setEnvironment()
Changed environment:array ( 'authenticated' => true, 'comment count' => false, 'form' => 'separate page', 'user_register' => 'admin_only', 'contact' => 'optional', 'comments' => 'open', 'access comments' => 0, 'post comments' => 0, 'skip comment approval' => 1, 'edit own comments' => 0, )DebugCommentLinksTest.php195Drupal\comment\Tests\CommentLinksTest->setEnvironment()
Changed environment:array ( 'authenticated' => false, 'comment count' => true, 'form' => 'separate page', 'user_register' => 'admin_only', 'contact' => 'optional', 'comments' => 'open', 'access comments' => 0, 'post comments' => 0, 'skip comment approval' => 1, 'edit own comments' => 0, )DebugCommentLinksTest.php195Drupal\comment\Tests\CommentLinksTest->setEnvironment()
Changed environment:array ( 'authenticated' => true, 'comment count' => true, 'form' => 'separate page', 'user_register' => 'admin_only', 'contact' => 'optional', 'comments' => 'open', 'access comments' => 0, 'post comments' => 0, 'skip comment approval' => 1, 'edit own comments' => 0, )DebugCommentLinksTest.php195Drupal\comment\Tests\CommentLinksTest->setEnvironment()
Changed environment:array ( 'authenticated' => false, 'comment count' => false, 'form' => 'separate page', 'user_register' => 'admin_only', 'contact' => 'optional', 'comments' => 'open', 'access comments' => 1, 'post comments' => 0, 'skip comment approval' => 1, 'edit own comments' => 0, )DebugCommentLinksTest.php195Drupal\comment\Tests\CommentLinksTest->setEnvironment()
Changed environment:array ( 'authenticated' => true, 'comment count' => false, 'form' => 'separate page', 'user_register' => 'admin_only', 'contact' => 'optional', 'comments' => 'open', 'access comments' => 1, 'post comments' => 0, 'skip comment approval' => 1, 'edit own comments' => 0, )DebugCommentLinksTest.php195Drupal\comment\Tests\CommentLinksTest->setEnvironment()
Changed environment:array ( 'authenticated' => false, 'comment count' => true, 'form' => 'separate page', 'user_register' => 'admin_only', 'contact' => 'optional', 'comments' => 'open', 'access comments' => 1, 'post comments' => 0, 'skip comment approval' => 1, 'edit own comments' => 0, )DebugCommentLinksTest.php195Drupal\comment\Tests\CommentLinksTest->setEnvironment()
Changed environment:array ( 'authenticated' => true, 'comment count' => true, 'form' => 'separate page', 'user_register' => 'admin_only', 'contact' => 'optional', 'comments' => 'open', 'access comments' => 1, 'post comments' => 0, 'skip comment approval' => 1, 'edit own comments' => 0, )DebugCommentLinksTest.php195Drupal\comment\Tests\CommentLinksTest->setEnvironment()
Changed environment:array ( 'authenticated' => false, 'comment count' => false, 'form' => 'separate page', 'user_register' => 'admin_only', 'contact' => 'optional', 'comments' => 'open', 'access comments' => 0, 'post comments' => 1, 'skip comment approval' => 1, 'edit own comments' => 0, )DebugCommentLinksTest.php195Drupal\comment\Tests\CommentLinksTest->setEnvironment()
Changed environment:array ( 'authenticated' => true, 'comment count' => false, 'form' => 'separate page', 'user_register' => 'admin_only', 'contact' => 'optional', 'comments' => 'open', 'access comments' => 0, 'post comments' => 1, 'skip comment approval' => 1, 'edit own comments' => 0, )DebugCommentLinksTest.php195Drupal\comment\Tests\CommentLinksTest->setEnvironment()
Changed environment:array ( 'authenticated' => false, 'comment count' => true, 'form' => 'separate page', 'user_register' => 'admin_only', 'contact' => 'optional', 'comments' => 'open', 'access comments' => 0, 'post comments' => 1, 'skip comment approval' => 1, 'edit own comments' => 0, )DebugCommentLinksTest.php195Drupal\comment\Tests\CommentLinksTest->setEnvironment()
Changed environment:array ( 'authenticated' => true, 'comment count' => true, 'form' => 'separate page', 'user_register' => 'admin_only', 'contact' => 'optional', 'comments' => 'open', 'access comments' => 0, 'post comments' => 1, 'skip comment approval' => 1, 'edit own comments' => 0, )DebugCommentLinksTest.php195Drupal\comment\Tests\CommentLinksTest->setEnvironment()
Changed environment:array ( 'authenticated' => false, 'comment count' => false, 'form' => 'separate page', 'user_register' => 'admin_only', 'contact' => 'optional', 'comments' => 'open', 'access comments' => 1, 'post comments' => 1, 'skip comment approval' => 1, 'edit own comments' => 0, )DebugCommentLinksTest.php195Drupal\comment\Tests\CommentLinksTest->setEnvironment()
Changed environment:array ( 'authenticated' => true, 'comment count' => false, 'form' => 'separate page', 'user_register' => 'admin_only', 'contact' => 'optional', 'comments' => 'open', 'access comments' => 1, 'post comments' => 1, 'skip comment approval' => 1, 'edit own comments' => 0, )DebugCommentLinksTest.php195Drupal\comment\Tests\CommentLinksTest->setEnvironment()
Changed environment:array ( 'authenticated' => false, 'comment count' => true, 'form' => 'separate page', 'user_register' => 'admin_only', 'contact' => 'optional', 'comments' => 'open', 'access comments' => 1, 'post comments' => 1, 'skip comment approval' => 1, 'edit own comments' => 0, )DebugCommentLinksTest.php195Drupal\comment\Tests\CommentLinksTest->setEnvironment()
Changed environment:array ( 'authenticated' => true, 'comment count' => true, 'form' => 'separate page', 'user_register' => 'admin_only', 'contact' => 'optional', 'comments' => 'open', 'access comments' => 1, 'post comments' => 1, 'skip comment approval' => 1, 'edit own comments' => 0, )DebugCommentLinksTest.php195Drupal\comment\Tests\CommentLinksTest->setEnvironment()
LeafDrupal\comment\Tests\CommentNewIndicatorTest4200
LeafDrupal\comment\Tests\CommentNodeAccessTest5700
LeafDrupal\comment\Tests\CommentNodeChangesTest2400
LeafDrupal\comment\Tests\CommentPagerTest21300
LeafDrupal\comment\Tests\CommentPreviewTest9800
LeafDrupal\comment\Tests\CommentRssTest2600
LeafDrupal\comment\Tests\CommentStatisticsTest9800
LeafDrupal\comment\Tests\CommentThreadingTest15100
LeafDrupal\comment\Tests\CommentTokenReplaceTest6600
ExpandDrupal\comment\Tests\CommentUserTest8330
MessageGroupFilenameLineFunctionStatus
Comments were displayed.OtherCommentUserTest.php305Drupal\comment\Tests\CommentUserTest->testCommentUser()
Link to log in was found.OtherCommentUserTest.php306Drupal\comment\Tests\CommentUserTest->testCommentUser()
Link to register was found.OtherCommentUserTest.php307Drupal\comment\Tests\CommentUserTest->testCommentUser()
LeafDrupal\config\Tests\ConfigCRUDTest1800
LeafDrupal\config\Tests\ConfigEntityListTest6800
LeafDrupal\config\Tests\ConfigEntityTest3700
LeafDrupal\config\Tests\ConfigFileContentTest3100
LeafDrupal\config\Tests\ConfigImportTest5200
LeafDrupal\config\Tests\ConfigInstallTest1100
LeafDrupal\config\Tests\ConfigOverrideTest1300
LeafDrupal\config\Tests\ConfigUpgradeTest1100
LeafDrupal\config\Tests\LocaleConfigOverride300
LeafDrupal\config\Tests\Storage\DatabaseStorageTest1900
LeafDrupal\config\Tests\Storage\FileStorageTest2000
LeafDrupal\contact\Tests\ContactAuthenticatedUserTest1300
LeafDrupal\contact\Tests\ContactPersonalTest16300
LeafDrupal\contact\Tests\ContactSitewideTest24600
LeafDrupal\contextual\Tests\ContextualDynamicContextTest1600
LeafDrupal\dblog\Tests\DBLogTest37400
LeafDrupal\email\Tests\EmailFieldTest1800
LeafDrupal\field\Tests\BulkDeleteTest7500
LeafDrupal\field\Tests\CrudTest6900
LeafDrupal\field\Tests\DisplayApiTest4600
LeafDrupal\field\Tests\EntityPropertiesTest400
LeafDrupal\field\Tests\FieldAccessTest2100
LeafDrupal\field\Tests\FieldAttachOtherTest5400
LeafDrupal\field\Tests\FieldAttachStorageTest9200
LeafDrupal\field\Tests\FieldInfoTest6900
LeafDrupal\field\Tests\FieldInstanceCrudTest3800
LeafDrupal\field\Tests\FormTest26500
LeafDrupal\field\Tests\TranslationTest10200
LeafDrupal\field_sql_storage\Tests\FieldSqlStorageTest9200
LeafDrupal\field_ui\Tests\AlterTest2100
LeafDrupal\field_ui\Tests\ManageDisplayTest10900
LeafDrupal\field_ui\Tests\ManageFieldsTest20100
LeafDrupal\file\Tests\CopyTest11000
LeafDrupal\file\Tests\DeleteTest2400
LeafDrupal\file\Tests\DownloadTest4500
LeafDrupal\file\Tests\FileFieldDisplayTest5000
LeafDrupal\file\Tests\FileFieldPathTest2700
LeafDrupal\file\Tests\FileFieldRevisionTest6700
LeafDrupal\file\Tests\FileFieldRSSContentTest2300
LeafDrupal\file\Tests\FileFieldValidateTest11800
ExpandDrupal\file\Tests\FileFieldWidgetTest289189
MessageGroupFilenameLineFunctionStatus
Failed to set field fields[_add_new_field][label] to rgd7oh5zOtherFileFieldWidgetTest.php262Drupal\file\Tests\FileFieldWidgetTest->testPrivateFileComment()
Failed to set field fields[_add_new_field][field_name] to umwecobeOtherFileFieldWidgetTest.php262Drupal\file\Tests\FileFieldWidgetTest->testPrivateFileComment()
Failed to set field fields[_add_new_field][type] to fileOtherFileFieldWidgetTest.php262Drupal\file\Tests\FileFieldWidgetTest->testPrivateFileComment()
Failed to set field fields[_add_new_field][widget_type] to file_genericOtherFileFieldWidgetTest.php262Drupal\file\Tests\FileFieldWidgetTest->testPrivateFileComment()
Found the Save buttonOtherFileFieldWidgetTest.php262Drupal\file\Tests\FileFieldWidgetTest->testPrivateFileComment()
Found the requested form fields at admin/structure/comments/comment/fieldsOtherFileFieldWidgetTest.php262Drupal\file\Tests\FileFieldWidgetTest->testPrivateFileComment()
Failed to set field field[settings][uri_scheme] to privateOtherFileFieldWidgetTest.php264Drupal\file\Tests\FileFieldWidgetTest->testPrivateFileComment()
Found the Save field settings buttonOtherFileFieldWidgetTest.php264Drupal\file\Tests\FileFieldWidgetTest->testPrivateFileComment()
Found the requested form fields at OtherFileFieldWidgetTest.php264Drupal\file\Tests\FileFieldWidgetTest->testPrivateFileComment()
Found the Save settings buttonOtherFileFieldWidgetTest.php265Drupal\file\Tests\FileFieldWidgetTest->testPrivateFileComment()
Found the requested form fields at OtherFileFieldWidgetTest.php265Drupal\file\Tests\FileFieldWidgetTest->testPrivateFileComment()
Failed to set field files[field_umwecobe_und_0] to /var/lib/drupaltestbot/sites/default/files/checkout/sites/default/files/simpletest/505935/text-0.txtOtherFileFieldWidgetTest.php281Drupal\file\Tests\FileFieldWidgetTest->testPrivateFileComment()
Failed to set field comment_body[und][0][value] to v7Zz4eXBOtherFileFieldWidgetTest.php281Drupal\file\Tests\FileFieldWidgetTest->testPrivateFileComment()
Found the Save buttonOtherFileFieldWidgetTest.php281Drupal\file\Tests\FileFieldWidgetTest->testPrivateFileComment()
Found the requested form fields at OtherFileFieldWidgetTest.php281Drupal\file\Tests\FileFieldWidgetTest->testPrivateFileComment()
Undefined offset: 1NoticeFileFieldWidgetTest.php285Drupal\file\Tests\FileFieldWidgetTest->testPrivateFileComment()
array_flip(): Can only flip STRING and INTEGER values!WarningDatabaseStorageController.php167Drupal\Core\Entity\DatabaseStorageController->load()
Trying to get property of non-objectNoticeFileFieldWidgetTest.php291Drupal\file\Tests\FileFieldWidgetTest->testPrivateFileComment()
array_flip(): Can only flip STRING and INTEGER values!WarningDatabaseStorageController.php167Drupal\Core\Entity\DatabaseStorageController->load()
Trying to get property of non-objectNoticeFileFieldTestBase.php189Drupal\file\Tests\FileFieldTestBase->assertFileExists()
New file saved to disk on node creation.OtherFileFieldWidgetTest.php292Drupal\file\Tests\FileFieldWidgetTest->testPrivateFileComment()
Trying to get property of non-objectNoticeFileFieldWidgetTest.php294Drupal\file\Tests\FileFieldWidgetTest->testPrivateFileComment()
Trying to get property of non-objectNoticeFileFieldWidgetTest.php296Drupal\file\Tests\FileFieldWidgetTest->testPrivateFileComment()
Trying to get property of non-objectNoticeFileFieldWidgetTest.php301Drupal\file\Tests\FileFieldWidgetTest->testPrivateFileComment()
Confirmed that access is denied for the file without the needed permission.BrowserFileFieldWidgetTest.php302Drupal\file\Tests\FileFieldWidgetTest->testPrivateFileComment()
Trying to get property of non-objectNoticeFileFieldWidgetTest.php313Drupal\file\Tests\FileFieldWidgetTest->testPrivateFileComment()
Confirmed that access is denied for the file without the needed permission.BrowserFileFieldWidgetTest.php314Drupal\file\Tests\FileFieldWidgetTest->testPrivateFileComment()
LeafDrupal\file\Tests\FileManagedFileElementTest26800
LeafDrupal\file\Tests\FilePrivateTest3700
LeafDrupal\file\Tests\FileTokenReplaceTest3500
LeafDrupal\file\Tests\LoadTest3400
LeafDrupal\file\Tests\MoveTest11000
LeafDrupal\file\Tests\RemoteFileSaveUploadTest27000
LeafDrupal\file\Tests\SaveDataTest9300
LeafDrupal\file\Tests\SaveTest1600
LeafDrupal\file\Tests\SaveUploadTest27000
LeafDrupal\file\Tests\SpaceUsedTest1200
LeafDrupal\file\Tests\UsageTest3400
LeafDrupal\file\Tests\ValidateTest1200
LeafDrupal\file\Tests\ValidatorTest2900
LeafDrupal\filter\Tests\FilterAdminTest17800
LeafDrupal\filter\Tests\FilterAPITest500
LeafDrupal\filter\Tests\FilterCrudTest23900
LeafDrupal\filter\Tests\FilterDefaultFormatTest3300
LeafDrupal\filter\Tests\FilterFormatAccessTest27200
LeafDrupal\filter\Tests\FilterHooksTest3300
ExpandDrupal\filter\Tests\FilterHtmlImageSecureTest12140
MessageGroupFilenameLineFunctionStatus
Failed to set field comment_body[und][0][value] to http://drupaltestbot654-mysql/checkout/core/misc/druplicon.png: <img src="http://drupaltestbot654-mysql/checkout/core/misc/druplicon.png" testattribute="c04a6d965266c2f249da58bfbc042a61" /> https://drupaltestbot654-mysql/checkout/core/misc/druplicon.png: <img src="https://drupaltestbot654-mysql/checkout/core/misc/druplicon.png" testattribute="151255dccb1bacb3147b934833992c29" /> /checkout/core/misc/druplicon.png: <img src="/checkout/core/misc/druplicon.png" testattribute="7095199e8ffffe10c0b06c8b057556de" /> /checkout/sites/default/files/simpletest/244770/image-test.png: <img src="/checkout/sites/default/files/simpletest/244770/image-test.png" testattribute="d7fc01a67a4249a3cc9105c425f107de" /> http://drupaltestbot654-mysql/checkout/sites/default/files/simpletest/244770/image-test.png: <img src="http://drupaltestbot654-mysql/checkout/sites/default/files/simpletest/244770/image-test.png" testattribute="6d8c73b2b04edb6cf01f24b91e74300d" /> https://drupaltestbot654-mysql/checkout/sites/default/files/simpletest/244770/image-test.png: <img src="https://drupaltestbot654-mysql/checkout/sites/default/files/simpletest/244770/image-test.png" testattribute="a806e14599085f173e5c803c9db43e0f" /> /checkout/sites/default/files/simpletest/244770/example.png: <img src="/checkout/sites/default/files/simpletest/244770/example.png" testattribute="bbb5eecc44b26d2c167b1fef9b16ec86" /> http://example.com/core/misc/druplicon.png: <img src="http://example.com/core/misc/druplicon.png" testattribute="49acc5a6300d320b55ca1c7965e67984" /> https://example.com/core/misc/druplicon.png: <img src="https://example.com/core/misc/druplicon.png" testattribute="413c0c1c1c388afb869f127880afebc9" /> javascript:druplicon.png: <img src="javascript:druplicon.png" testattribute="83f76f48013e52cd57f8f6c8bae93da0" /> sites/default/files/simpletest/244770/../../../../../logout: <img src="sites/default/files/simpletest/244770/../../../../../logout" testattribute="7bcfe764adb06ffe58790a3f92f71c0c" />OtherFilterHtmlImageSecureTest.php122Drupal\filter\Tests\FilterHtmlImageSecureTest->testImageSource()
Found the Save buttonOtherFilterHtmlImageSecureTest.php122Drupal\filter\Tests\FilterHtmlImageSecureTest->testImageSource()
Found the requested form fields at node/1OtherFilterHtmlImageSecureTest.php122Drupal\filter\Tests\FilterHtmlImageSecureTest->testImageSource()
http://drupaltestbot654-mysql/checkout/core/misc/druplicon.png was found.OtherFilterHtmlImageSecureTest.php136Drupal\filter\Tests\FilterHtmlImageSecureTest->testImageSource()
https://drupaltestbot654-mysql/checkout/core/misc/druplicon.png was found.OtherFilterHtmlImageSecureTest.php136Drupal\filter\Tests\FilterHtmlImageSecureTest->testImageSource()
/checkout/core/misc/druplicon.png was found.OtherFilterHtmlImageSecureTest.php136Drupal\filter\Tests\FilterHtmlImageSecureTest->testImageSource()
/checkout/sites/default/files/simpletest/244770/image-test.png was found.OtherFilterHtmlImageSecureTest.php136Drupal\filter\Tests\FilterHtmlImageSecureTest->testImageSource()
http://drupaltestbot654-mysql/checkout/sites/default/files/simpletest/244770/image-test.png was found.OtherFilterHtmlImageSecureTest.php136Drupal\filter\Tests\FilterHtmlImageSecureTest->testImageSource()
https://drupaltestbot654-mysql/checkout/sites/default/files/simpletest/244770/image-test.png was found.OtherFilterHtmlImageSecureTest.php136Drupal\filter\Tests\FilterHtmlImageSecureTest->testImageSource()
/checkout/sites/default/files/simpletest/244770/example.png was found.OtherFilterHtmlImageSecureTest.php136Drupal\filter\Tests\FilterHtmlImageSecureTest->testImageSource()
http://example.com/core/misc/druplicon.png was found.OtherFilterHtmlImageSecureTest.php136Drupal\filter\Tests\FilterHtmlImageSecureTest->testImageSource()
https://example.com/core/misc/druplicon.png was found.OtherFilterHtmlImageSecureTest.php136Drupal\filter\Tests\FilterHtmlImageSecureTest->testImageSource()
javascript:druplicon.png was found.OtherFilterHtmlImageSecureTest.php136Drupal\filter\Tests\FilterHtmlImageSecureTest->testImageSource()
sites/default/files/simpletest/244770/../../../../../logout was found.OtherFilterHtmlImageSecureTest.php136Drupal\filter\Tests\FilterHtmlImageSecureTest->testImageSource()
LeafDrupal\filter\Tests\FilterNoFormatTest100
LeafDrupal\filter\Tests\FilterSecurityTest4000
LeafDrupal\filter\Tests\FilterSettingsTest1200
LeafDrupal\filter\Tests\FilterUnitTest21500
LeafDrupal\forum\Tests\ForumBlockTest14800
LeafDrupal\forum\Tests\ForumIndexTest2700
LeafDrupal\forum\Tests\ForumNodeAccessTest6300
LeafDrupal\forum\Tests\ForumTest69800
LeafDrupal\help\Tests\HelpTest40600
LeafDrupal\help\Tests\NoHelpTest1200
LeafDrupal\image\Tests\ImageAdminStylesTest25700
LeafDrupal\image\Tests\ImageDimensionsScaleUnitTest1500
LeafDrupal\image\Tests\ImageDimensionsTest5600
LeafDrupal\image\Tests\ImageEffectsTest4900
LeafDrupal\image\Tests\ImageFieldDefaultImagesTest6100
LeafDrupal\image\Tests\ImageFieldDisplayTest17700
LeafDrupal\image\Tests\ImageFieldValidateTest4000
LeafDrupal\image\Tests\ImageStylesPathAndUrlTest6500
LeafDrupal\image\Tests\ImageThemeFunctionTest500
LeafDrupal\language\Tests\LanguageBrowserDetectionUnitTest10700
LeafDrupal\language\Tests\LanguageConfigurationElementTest5400
LeafDrupal\language\Tests\LanguageConfigurationTest4600
LeafDrupal\language\Tests\LanguageCustomLanguageConfigurationTest3600
LeafDrupal\language\Tests\LanguageDependencyInjectionTest1700
LeafDrupal\language\Tests\LanguageListTest10000
LeafDrupal\language\Tests\LanguageNegotiationInfoTest4900
LeafDrupal\language\Tests\LanguagePathMonolingualTest3500
LeafDrupal\language\Tests\LanguageSwitchingTest2600
LeafDrupal\language\Tests\LanguageUILanguageNegotiationTest13300
LeafDrupal\language\Tests\LanguageUrlRewritingTest4400
LeafDrupal\layout\Tests\LayoutDerivativesTest2400
LeafDrupal\link\Tests\LinkFieldTest13300
LeafDrupal\link\Tests\LinkFieldUITest2100
LeafDrupal\locale\Tests\LocaleCompareTest6800
LeafDrupal\locale\Tests\LocaleContentTest12700
LeafDrupal\locale\Tests\LocaleExportTest5700
LeafDrupal\locale\Tests\LocaleFileImportStatus9100
LeafDrupal\locale\Tests\LocaleImportFunctionalTest20100
LeafDrupal\locale\Tests\LocaleInstallTest200
LeafDrupal\locale\Tests\LocaleJavascriptTranslation6600
LeafDrupal\locale\Tests\LocaleLibraryInfoAlterTest200
LeafDrupal\locale\Tests\LocalePathTest4700
LeafDrupal\locale\Tests\LocalePluralFormatTest16000
LeafDrupal\locale\Tests\LocaleStringTest2600
LeafDrupal\locale\Tests\LocaleUninstallFrenchTest3600
LeafDrupal\locale\Tests\LocaleUninstallTest3600
LeafDrupal\menu\Tests\MenuNodeTest6100
LeafDrupal\menu\Tests\MenuTest316000
LeafDrupal\node\Tests\MultiStepNodeFormBasicOptionsTest1600
LeafDrupal\node\Tests\NodeAccessBaseTableTest15900
LeafDrupal\node\Tests\NodeAccessFieldTest5000
LeafDrupal\node\Tests\NodeAccessLanguageTest2500
ExpandDrupal\node\Tests\NodeAccessPagerTest2820
MessageGroupFilenameLineFunctionStatus
"Comments" foundOtherNodeAccessPagerTest.php69Drupal\node\Tests\NodeAccessPagerTest->testCommentPager()
Raw "page=1" foundOtherNodeAccessPagerTest.php70Drupal\node\Tests\NodeAccessPagerTest->testCommentPager()
LeafDrupal\node\Tests\NodeAccessRebuildTest1900
LeafDrupal\node\Tests\NodeAccessRecordsTest2600
LeafDrupal\node\Tests\NodeAccessTest3400
LeafDrupal\node\Tests\NodeAdminTest14500
LeafDrupal\node\Tests\NodeBlockFunctionalTest8400
LeafDrupal\node\Tests\NodeBlockTest2100
LeafDrupal\node\Tests\NodeBuildContentTest400
LeafDrupal\node\Tests\NodeCreationTest4900
LeafDrupal\node\Tests\NodeEntityFieldQueryAlterTest3200
LeafDrupal\node\Tests\NodeEntityViewModeAlterTest2000
LeafDrupal\node\Tests\NodeFeedTest100
LeafDrupal\node\Tests\NodeFieldMultilingualTestCase6400
LeafDrupal\node\Tests\NodeLoadHooksTest700
LeafDrupal\node\Tests\NodeLoadMultipleTest2700
LeafDrupal\node\Tests\NodePostSettingsTest4000
LeafDrupal\node\Tests\NodeQueryAlterTest9900
LeafDrupal\node\Tests\NodeRevisionPermissionsTest3300
LeafDrupal\node\Tests\NodeRevisionsTest6400
LeafDrupal\node\Tests\NodeRSSContentTest2100
LeafDrupal\node\Tests\NodeSaveTest6000
ExpandDrupal\node\Tests\NodeTitleTest2301
MessageGroupFilenameLineFunctionStatus
reset() expects parameter 1 to be array, boolean givenWarningcomment.pages.inc105comment_reply()
LeafDrupal\node\Tests\NodeTitleXSSTest2300
LeafDrupal\node\Tests\NodeTokenReplaceTest3700
LeafDrupal\node\Tests\NodeTypeInitialLanguageTest8000
LeafDrupal\node\Tests\NodeTypePersistenceTest6500
LeafDrupal\node\Tests\NodeTypeTest13600
LeafDrupal\node\Tests\PageEditTest9700
LeafDrupal\node\Tests\PagePreviewTest4100
LeafDrupal\node\Tests\PageViewTest3400
LeafDrupal\node\Tests\SummaryLengthTest1800
LeafDrupal\number\Tests\NumberFieldTest8700
LeafDrupal\openid\Tests\OpenIDFunctionalTest31300
LeafDrupal\openid\Tests\OpenIDRegistrationTest15600
LeafDrupal\openid\Tests\OpenIDTest6400
LeafDrupal\options\Tests\OptionsDynamicValuesValidationTest900
LeafDrupal\options\Tests\OptionsFieldTest1600
LeafDrupal\options\Tests\OptionsFieldUITest20700
LeafDrupal\options\Tests\OptionsSelectDynamicValuesTest1600
LeafDrupal\options\Tests\OptionsWidgetsTest26100
LeafDrupal\path\Tests\PathAliasTest18900
LeafDrupal\path\Tests\PathLanguageTest12400
LeafDrupal\path\Tests\PathLanguageUiTest7800
LeafDrupal\path\Tests\PathTaxonomyTermTest3700
LeafDrupal\php\Tests\PhpAccessTest3800
LeafDrupal\php\Tests\PhpFilterTest4200
LeafDrupal\poll\Tests\PollBlockTest17200
LeafDrupal\poll\Tests\PollCreateTest26900
LeafDrupal\poll\Tests\PollDeleteChoiceTest5400
LeafDrupal\poll\Tests\PollExpirationTest5200
LeafDrupal\poll\Tests\PollJsAddChoiceTest1600
LeafDrupal\poll\Tests\PollTokenReplaceTest12500
LeafDrupal\poll\Tests\PollTranslateTest7300
LeafDrupal\poll\Tests\PollVoteCheckHostnameTest14000
LeafDrupal\poll\Tests\PollVoteTest14600
ExpandDrupal\rdf\Tests\CommentAttributesTest1812
MessageGroupFilenameLineFunctionStatus
The test did not complete due to a fatal error.Completion checkCommentAttributesTest.php75Drupal\rdf\Tests\CommentAttributesTest->testNumberOfCommentsRdfaMarkup()
Undefined index: field_nameNoticefield.crud.inc540field_update_instance()
Undefined index: field_nameNoticefield.crud.inc542field_update_instance()
LeafDrupal\rdf\Tests\CrudTest1000
LeafDrupal\rdf\Tests\GetNamespacesTest700
LeafDrupal\rdf\Tests\GetRdfNamespacesTest500
LeafDrupal\rdf\Tests\MappingDefinitionTest5900
LeafDrupal\rdf\Tests\MappingHookTest600
LeafDrupal\rdf\Tests\RdfaMarkupTest2900
ExpandDrupal\rdf\Tests\TrackerAttributesTest112
MessageGroupFilenameLineFunctionStatus
The test did not complete due to a fatal error.Completion checkTrackerAttributesTest.php57Drupal\rdf\Tests\TrackerAttributesTest->testAttributesInTracker()
Undefined index: field_nameNoticefield.crud.inc540field_update_instance()
Undefined index: field_nameNoticefield.crud.inc542field_update_instance()
LeafDrupal\search\Tests\SearchAdvancedSearchFormTest3400
LeafDrupal\search\Tests\SearchBlockTest6400
ExpandDrupal\search\Tests\SearchCommentCountToggleTest2683
MessageGroupFilenameLineFunctionStatus
Undefined property: Drupal\node\Node::$comment_articleNoticecomment.pages.inc97comment_reply()
reset() expects parameter 1 to be array, boolean givenWarningcomment.pages.inc105comment_reply()
Undefined index: comment_bodyNoticeCommentFormController.php220Drupal\comment\CommentFormController->actions()
Failed to set field subject to jHmt8NYHOtherSearchCommentCountToggleTest.php70Drupal\search\Tests\SearchCommentCountToggleTest->setUp()
Failed to set field comment_body[und][0][value] to sPH3nzaPOtherSearchCommentCountToggleTest.php70Drupal\search\Tests\SearchCommentCountToggleTest->setUp()
Failed to set field comment_body[und][0][format] to filtered_htmlOtherSearchCommentCountToggleTest.php70Drupal\search\Tests\SearchCommentCountToggleTest->setUp()
Found the Save buttonOtherSearchCommentCountToggleTest.php70Drupal\search\Tests\SearchCommentCountToggleTest->setUp()
Found the requested form fields at comment/reply/node/1/comment_articleOtherSearchCommentCountToggleTest.php70Drupal\search\Tests\SearchCommentCountToggleTest->setUp()
Empty comment count displays for nodes with comment status set to OpenOtherSearchCommentCountToggleTest.php92Drupal\search\Tests\SearchCommentCountToggleTest->testSearchCommentCountToggle()
Non-empty comment count displays for nodes with comment status set to OpenOtherSearchCommentCountToggleTest.php93Drupal\search\Tests\SearchCommentCountToggleTest->testSearchCommentCountToggle()
Non-empty comment count displays for nodes with comment status set to ClosedOtherSearchCommentCountToggleTest.php107Drupal\search\Tests\SearchCommentCountToggleTest->testSearchCommentCountToggle()
ExpandDrupal\search\Tests\SearchCommentTest10786
MessageGroupFilenameLineFunctionStatus
Undefined property: Drupal\node\Node::$comment_articleNoticecomment.pages.inc97comment_reply()
reset() expects parameter 1 to be array, boolean givenWarningcomment.pages.inc105comment_reply()
Undefined index: comment_bodyNoticeCommentFormController.php220Drupal\comment\CommentFormController->actions()
Failed to set field comment_body[und][0][value] to <h1>Test comment body</h1>OtherSearchCommentTest.php88Drupal\search\Tests\SearchCommentTest->testSearchResultsComment()
Failed to set field comment_body[und][0][format] to full_htmlOtherSearchCommentTest.php88Drupal\search\Tests\SearchCommentTest->testSearchResultsComment()
Found the requested form fields at comment/reply/node/1/comment_articleOtherSearchCommentTest.php88Drupal\search\Tests\SearchCommentTest->testSearchResultsComment()
Node found in search results.OtherSearchCommentTest.php100Drupal\search\Tests\SearchCommentTest->testSearchResultsComment()
Comment subject found in search results.OtherSearchCommentTest.php101Drupal\search\Tests\SearchCommentTest->testSearchResultsComment()
Node found in search results.OtherSearchCommentTest.php108Drupal\search\Tests\SearchCommentTest->testSearchResultsComment()
Comment body text found in search results.OtherSearchCommentTest.php111Drupal\search\Tests\SearchCommentTest->testSearchResultsComment()
Undefined index: field_nameNoticefield.crud.inc540field_update_instance()
Undefined index: field_nameNoticefield.crud.inc542field_update_instance()
Drupal\field\FieldException: Attempt to update an instance of a nonexistent field . in field_update_instance() (line 542 of /var/lib/drupaltestbot/sites/default/files/checkout/core/modules/field/field.crud.inc).Uncaught exceptionfield.crud.inc542field_update_instance()
Add new comment appears on node pageOtherSearchCommentTest.php256Drupal\search\Tests\SearchCommentTest->testAddNewComment()
LeafDrupal\search\Tests\SearchConfigSettingsFormTest13200
LeafDrupal\search\Tests\SearchEmbedFormTest3200
LeafDrupal\search\Tests\SearchExactTest2500
LeafDrupal\search\Tests\SearchExcerptTest1800
LeafDrupal\search\Tests\SearchExpressionInsertExtractTest2400
LeafDrupal\search\Tests\SearchKeywordsConditionsTest2800
LeafDrupal\search\Tests\SearchLanguageTest4100
LeafDrupal\search\Tests\SearchMatchTest14700
LeafDrupal\search\Tests\SearchMultilingualEntityTest1000
LeafDrupal\search\Tests\SearchNodeAccessTest1600
LeafDrupal\search\Tests\SearchNumberMatchingTest29500
LeafDrupal\search\Tests\SearchNumbersTest17500
LeafDrupal\search\Tests\SearchPageOverrideTest1500
LeafDrupal\search\Tests\SearchPageTextTest3700
LeafDrupal\search\Tests\SearchPreprocessLangcodeTest3900
ExpandDrupal\search\Tests\SearchRankingTest3303
MessageGroupFilenameLineFunctionStatus
Drupal\Core\Database\DatabaseExceptionWrapper: SQLSTATE[42S02]: Base table or view not found: 1146 Table 'drupaltestbotmysql.simpletest89360node_comment_statistics' doesn't exist: SELECT MAX(comment_count) FROM {node_comment_statistics}; Array ( ) in Drupal\Core\Database\Connection->query() (line 548 of /var/lib/drupaltestbot/sites/default/files/checkout/core/lib/Drupal/Core/Database/Connection.php).Uncaught exceptionConnection.php548Drupal\Core\Database\Connection->query()
Drupal\Core\Database\DatabaseExceptionWrapper: SQLSTATE[42S02]: Base table or view not found: 1146 Table 'drupaltestbotmysql.simpletest86197node_comment_statistics' doesn't exist: SELECT MAX(comment_count) FROM {node_comment_statistics}; Array ( ) in Drupal\Core\Database\Connection->query() (line 548 of /var/lib/drupaltestbot/sites/default/files/checkout/core/lib/Drupal/Core/Database/Connection.php).Uncaught exceptionConnection.php548Drupal\Core\Database\Connection->query()
Drupal\Core\Database\DatabaseExceptionWrapper: SQLSTATE[42S02]: Base table or view not found: 1146 Table 'drupaltestbotmysql.simpletest563944node_comment_statistics' doesn't exist: SELECT MAX(comment_count) FROM {node_comment_statistics}; Array ( ) in Drupal\Core\Database\Connection->query() (line 548 of /var/lib/drupaltestbot/sites/default/files/checkout/core/lib/Drupal/Core/Database/Connection.php).Uncaught exceptionConnection.php548Drupal\Core\Database\Connection->query()
LeafDrupal\search\Tests\SearchSimplifyTest65700
LeafDrupal\search\Tests\SearchTokenizerTest800
LeafDrupal\shortcut\Tests\ShortcutLinksTest14800
LeafDrupal\shortcut\Tests\ShortcutSetsTest21600
LeafDrupal\simpletest\Tests\BrokenSetUpTest2100
LeafDrupal\simpletest\Tests\BrowserTest1600
LeafDrupal\simpletest\Tests\FolderTest200
LeafDrupal\simpletest\Tests\InstallationProfileModuleTestsTest1900
LeafDrupal\simpletest\Tests\MailCaptureTest1300
LeafDrupal\simpletest\Tests\MissingCheckedRequirementsTest1900
LeafDrupal\simpletest\Tests\OtherInstallationProfileModuleTestsTest1200
LeafDrupal\simpletest\Tests\SimpleTestTest11400
LeafDrupal\statistics\Tests\StatisticsAdminTest11100
LeafDrupal\statistics\Tests\StatisticsBlockVisitorsTest4600
LeafDrupal\statistics\Tests\StatisticsLoggingTest3500
LeafDrupal\statistics\Tests\StatisticsReportsTest9200
LeafDrupal\statistics\Tests\StatisticsTokenReplaceTest3000
LeafDrupal\syslog\Tests\SyslogTest1700
LeafDrupal\system\Tests\Ajax\CommandsTest7300
LeafDrupal\system\Tests\Ajax\ElementValidationTest700
LeafDrupal\system\Tests\Ajax\FormValuesTest2900
LeafDrupal\system\Tests\Ajax\FrameworkTest3400
LeafDrupal\system\Tests\Ajax\MultiFormTest3600
LeafDrupal\system\Tests\Batch\PageTest1600
LeafDrupal\system\Tests\Batch\PercentagesUnitTest1800
LeafDrupal\system\Tests\Batch\ProcessingTest16100
LeafDrupal\system\Tests\Bootstrap\GetFilenameUnitTest500
LeafDrupal\system\Tests\Bootstrap\HookBootExitTest1900
LeafDrupal\system\Tests\Bootstrap\IpAddressTest1100
LeafDrupal\system\Tests\Bootstrap\MiscUnitTest500
LeafDrupal\system\Tests\Bootstrap\OverrideServerVariablesUnitTest600
LeafDrupal\system\Tests\Bootstrap\PageCacheTest7900
LeafDrupal\system\Tests\Bootstrap\ResettableStaticUnitTest500
LeafDrupal\system\Tests\Bootstrap\TimerUnitTest500
LeafDrupal\system\Tests\Bootstrap\VariableTest900
LeafDrupal\system\Tests\Bundle\BundleTest600
LeafDrupal\system\Tests\Cache\BackendChainImplementationUnitTest4800
LeafDrupal\system\Tests\Cache\BackendChainUnitTest8600
LeafDrupal\system\Tests\Cache\ClearTest900
LeafDrupal\system\Tests\Cache\DatabaseBackendUnitTest8600
LeafDrupal\system\Tests\Cache\InstallTest1500
LeafDrupal\system\Tests\Cache\MemoryBackendUnitTest8600
LeafDrupal\system\Tests\Cache\NullBackendTest200
LeafDrupal\system\Tests\Common\AddFeedTest700
LeafDrupal\system\Tests\Common\AlterTest700
LeafDrupal\system\Tests\Common\ArrayUnitTest1300
LeafDrupal\system\Tests\Common\AttributesUnitTest700
LeafDrupal\system\Tests\Common\AutocompleteTagsUnitTest800
LeafDrupal\system\Tests\Common\CascadingStylesheetsTest4100
LeafDrupal\system\Tests\Common\CascadingStylesheetsUnitTest1200
LeafDrupal\system\Tests\Common\ColorTest8500
LeafDrupal\system\Tests\Common\FormatDateTest7100
LeafDrupal\system\Tests\Common\GotoTest2100
LeafDrupal\system\Tests\Common\HtmlIdentifierUnitTest1000
LeafDrupal\system\Tests\Common\HttpRequestTest3500
LeafDrupal\system\Tests\Common\InstallerLanguageTest800
LeafDrupal\system\Tests\Common\JavaScriptTest9900
LeafDrupal\system\Tests\Common\JsonUnitTest2100
LeafDrupal\system\Tests\Common\ParseInfoFileUnitTest300
LeafDrupal\system\Tests\Common\RegionContentTest1800
LeafDrupal\system\Tests\Common\RenderTest5400
LeafDrupal\system\Tests\Common\SchemaTest58800
LeafDrupal\system\Tests\Common\SimpleTestErrorCollectorTest1600
LeafDrupal\system\Tests\Common\SizeUnitTest3500
LeafDrupal\system\Tests\Common\SystemListingTest600
LeafDrupal\system\Tests\Common\TableSortExtenderUnitTest600
LeafDrupal\system\Tests\Common\UrlTest5600
LeafDrupal\system\Tests\Common\ValidNumberStepUnitTest2400
LeafDrupal\system\Tests\Common\ValidUrlUnitTest7900
LeafDrupal\system\Tests\Common\WriteRecordTest3400
LeafDrupal\system\Tests\Common\XssUnitTest1700
LeafDrupal\system\Tests\Database\AlterTest6200
LeafDrupal\system\Tests\Database\BasicSyntaxTest3000
LeafDrupal\system\Tests\Database\CaseSensitivityTest800
LeafDrupal\system\Tests\Database\ConnectionTest3800
LeafDrupal\system\Tests\Database\ConnectionUnitTest1200
LeafDrupal\system\Tests\Database\DeleteTruncateTest2300
LeafDrupal\system\Tests\Database\EmptyStatementTest400
LeafDrupal\system\Tests\Database\FetchTest6600
LeafDrupal\system\Tests\Database\InsertDefaultsTest2200
LeafDrupal\system\Tests\Database\InsertLobTest1500
LeafDrupal\system\Tests\Database\InsertTest5100
LeafDrupal\system\Tests\Database\InvalidDataTest800
LeafDrupal\system\Tests\Database\LoggingTest4400
LeafDrupal\system\Tests\Database\MergeTest11400
LeafDrupal\system\Tests\Database\NextIdTest200
LeafDrupal\system\Tests\Database\QueryTest700
LeafDrupal\system\Tests\Database\RangeQueryTest800
LeafDrupal\system\Tests\Database\RegressionTest3100
LeafDrupal\system\Tests\Database\SelectComplexTest19700
LeafDrupal\system\Tests\Database\SelectOrderedTest2900
LeafDrupal\system\Tests\Database\SelectPagerDefaultTest7000
LeafDrupal\system\Tests\Database\SelectSubqueryTest7800
LeafDrupal\system\Tests\Database\SelectTableSortDefaultTest7200
LeafDrupal\system\Tests\Database\SelectTest20500
LeafDrupal\system\Tests\Database\SerializeQueryTest1400
LeafDrupal\system\Tests\Database\TaggingTest6400
LeafDrupal\system\Tests\Database\TemporaryQueryTest2200
LeafDrupal\system\Tests\Database\TransactionTest9800
LeafDrupal\system\Tests\Database\UpdateComplexTest7600
LeafDrupal\system\Tests\Database\UpdateLobTest3000
LeafDrupal\system\Tests\Database\UpdateTest6400
LeafDrupal\system\Tests\DrupalKernel\DrupalKernelTest1000
LeafDrupal\system\Tests\Entity\EntityApiInfoTest500
LeafDrupal\system\Tests\Entity\EntityApiTest800
LeafDrupal\system\Tests\Entity\EntityCrudHookTest11400
LeafDrupal\system\Tests\Entity\EntityFieldQueryTest15500
LeafDrupal\system\Tests\Entity\EntityFieldTest13700
LeafDrupal\system\Tests\Entity\EntityFormTest2600
LeafDrupal\system\Tests\Entity\EntityTranslationFormTest3600
LeafDrupal\system\Tests\Entity\EntityTranslationTest5100
LeafDrupal\system\Tests\Entity\EntityUUIDTest1900
LeafDrupal\system\Tests\FileTransfer\FileTransferTest200
LeafDrupal\system\Tests\File\DirectoryTest2000
LeafDrupal\system\Tests\File\MimeTypeTest4200
LeafDrupal\system\Tests\File\NameMungingTest500
LeafDrupal\system\Tests\File\RemoteFileDirectoryTest2400
LeafDrupal\system\Tests\File\RemoteFileScanDirectoryTest2900
LeafDrupal\system\Tests\File\RemoteFileUnmanagedCopyTest3200
LeafDrupal\system\Tests\File\RemoteFileUnmanagedDeleteRecursiveTest2100
LeafDrupal\system\Tests\File\RemoteFileUnmanagedDeleteTest1000
LeafDrupal\system\Tests\File\RemoteFileUnmanagedMoveTest2300
LeafDrupal\system\Tests\File\RemoteFileUnmanagedSaveDataTest800
LeafDrupal\system\Tests\File\ScanDirectoryTest2900
LeafDrupal\system\Tests\File\StreamWrapperTest1900
LeafDrupal\system\Tests\File\UnmanagedCopyTest2900
LeafDrupal\system\Tests\File\UnmanagedDeleteRecursiveTest1700
LeafDrupal\system\Tests\File\UnmanagedDeleteTest700
LeafDrupal\system\Tests\File\UnmanagedMoveTest2000
LeafDrupal\system\Tests\File\UnmanagedSaveDataTest700
LeafDrupal\system\Tests\File\UrlRewritingTest1400
LeafDrupal\system\Tests\Form\AlterTest400
LeafDrupal\system\Tests\Form\ArbitraryRebuildTest1600
LeafDrupal\system\Tests\Form\CheckboxTest9700
LeafDrupal\system\Tests\Form\ElementsLabelsTest2000
LeafDrupal\system\Tests\Form\ElementsTableSelectTest6900
LeafDrupal\system\Tests\Form\ElementsVerticalTabsTest3900
LeafDrupal\system\Tests\Form\ElementTest3700
LeafDrupal\system\Tests\Form\EmailTest1700
LeafDrupal\system\Tests\Form\FileInclusionTest1100
LeafDrupal\system\Tests\Form\FormTest66800
LeafDrupal\system\Tests\Form\HTMLIdTest700
LeafDrupal\system\Tests\Form\LanguageSelectElementTest4700
LeafDrupal\system\Tests\Form\ProgrammaticTest2400
LeafDrupal\system\Tests\Form\RebuildTest5300
LeafDrupal\system\Tests\Form\RedirectTest3100
LeafDrupal\system\Tests\Form\StateValuesCleanAdvancedTest700
LeafDrupal\system\Tests\Form\StateValuesCleanTest1400
LeafDrupal\system\Tests\Form\StorageTest12000
LeafDrupal\system\Tests\Form\TriggeringElementTest5000
LeafDrupal\system\Tests\Form\UrlTest1700
LeafDrupal\system\Tests\Form\ValidationTest11200
LeafDrupal\system\Tests\Form\WrapperTest500
LeafDrupal\system\Tests\Graph\GraphUnitTest2800
LeafDrupal\system\Tests\Image\FileMoveTest400
LeafDrupal\system\Tests\Image\ToolkitGdTest20400
LeafDrupal\system\Tests\Image\ToolkitTest5300
LeafDrupal\system\Tests\KeyValueStore\DatabaseStorageExpirableTest6800
LeafDrupal\system\Tests\KeyValueStore\DatabaseStorageTest3600
LeafDrupal\system\Tests\KeyValueStore\GarbageCollectionTest200
LeafDrupal\system\Tests\KeyValueStore\MemoryStorageTest3600
LeafDrupal\system\Tests\Lock\LockFunctionalTest2900
LeafDrupal\system\Tests\Mail\HtmlToTextTest8300
LeafDrupal\system\Tests\Mail\MailTest400
LeafDrupal\system\Tests\Menu\BreadcrumbTest40300
LeafDrupal\system\Tests\Menu\LinksTest5000
LeafDrupal\system\Tests\Menu\RebuildTest500
LeafDrupal\system\Tests\Menu\RouterTest22600
LeafDrupal\system\Tests\Menu\TrailTest6800
LeafDrupal\system\Tests\Menu\TreeDataUnitTest400
LeafDrupal\system\Tests\Menu\TreeOutputTest700
LeafDrupal\system\Tests\Module\ClassLoaderTest1000
ExpandDrupal\system\Tests\Module\DependencyTest152101
MessageGroupFilenameLineFunctionStatus
Failed to set field modules[Core][comment][enable] to OtherDependencyTest.php177Drupal\system\Tests\Module\DependencyTest->testUninstallDependents()
Found the requested form fields at admin/modulesOtherDependencyTest.php177Drupal\system\Tests\Module\DependencyTest->testUninstallDependents()
Module "comment" is not enabled.OtherDependencyTest.php178Drupal\system\Tests\Module\DependencyTest->testUninstallDependents()
Checkbox for uninstalling the comment module is disabled.OtherDependencyTest.php183Drupal\system\Tests\Module\DependencyTest->testUninstallDependents()
Failed to set field uninstall[comment] to commentOtherDependencyTest.php192Drupal\system\Tests\Module\DependencyTest->testUninstallDependents()
Found the Uninstall buttonOtherDependencyTest.php192Drupal\system\Tests\Module\DependencyTest->testUninstallDependents()
Found the requested form fields at admin/modules/uninstallOtherDependencyTest.php192Drupal\system\Tests\Module\DependencyTest->testUninstallDependents()
Invalid argument supplied for foreach()WarningWebTestBase.php1224Drupal\simpletest\WebTestBase->drupalPost()
Found the Uninstall buttonOtherDependencyTest.php193Drupal\system\Tests\Module\DependencyTest->testUninstallDependents()
Found the requested form fields at OtherDependencyTest.php193Drupal\system\Tests\Module\DependencyTest->testUninstallDependents()
Modules status has been updated.OtherDependencyTest.php194Drupal\system\Tests\Module\DependencyTest->testUninstallDependents()
ExpandDrupal\system\Tests\Module\EnableDisableTest1687110
MessageGroupFilenameLineFunctionStatus
Modules status has been updated.OtherEnableDisableTest.php120Drupal\system\Tests\Module\EnableDisableTest->testEnableDisable()
"hook_modules_uninstalled fired for comment" foundOtherEnableDisableTest.php120Drupal\system\Tests\Module\EnableDisableTest->testEnableDisable()
watchdog table contains 0 rows for %module module uninstalled.OtherEnableDisableTest.php120Drupal\system\Tests\Module\EnableDisableTest->testEnableDisable()
None of the database tables defined by the comment module exist.OtherEnableDisableTest.php120Drupal\system\Tests\Module\EnableDisableTest->testEnableDisable()
None of the database tables defined by the comment module exist.OtherEnableDisableTest.php86Drupal\system\Tests\Module\EnableDisableTest->testEnableDisable()
"hook_modules_installed fired for comment" foundOtherEnableDisableTest.php105Drupal\system\Tests\Module\EnableDisableTest->testEnableDisable()
Remaining modules could not be disabled.OtherEnableDisableTest.php143Drupal\system\Tests\Module\EnableDisableTest->testEnableDisable()
Failed to set field modules[Core][comment][enable] to commentOtherEnableDisableTest.php164Drupal\system\Tests\Module\EnableDisableTest->testEnableDisable()
Failed to set field modules[Core][node][enable] to nodeOtherEnableDisableTest.php164Drupal\system\Tests\Module\EnableDisableTest->testEnableDisable()
Found the requested form fields at admin/modulesOtherEnableDisableTest.php164Drupal\system\Tests\Module\EnableDisableTest->testEnableDisable()
Modules status has been updated.OtherEnableDisableTest.php165Drupal\system\Tests\Module\EnableDisableTest->testEnableDisable()
LeafDrupal\system\Tests\Module\HookRequirementsTest1600
LeafDrupal\system\Tests\Module\InstallTest300
ExpandDrupal\system\Tests\Module\ModuleApiTest6401
MessageGroupFilenameLineFunctionStatus
Drupal\field\FieldException: Attempt to create field name <em class="placeholder">comment_forum</em> which already exists, although it is inactive. in field_create_field() (line 87 of /var/lib/drupaltestbot/sites/default/files/checkout/core/modules/field/field.crud.inc).Uncaught exceptionfield.crud.inc87field_create_field()
LeafDrupal\system\Tests\Module\ModuleEnable300
LeafDrupal\system\Tests\Module\RequiredTest1800
LeafDrupal\system\Tests\Module\UninstallTest200
LeafDrupal\system\Tests\Module\VersionTest5100
LeafDrupal\system\Tests\Pager\PagerTest12300
LeafDrupal\system\Tests\Path\LookupTest1300
LeafDrupal\system\Tests\Path\MatchPathTest4100
LeafDrupal\system\Tests\Path\SaveTest400
LeafDrupal\system\Tests\Path\UrlAlterFunctionalTest3400
LeafDrupal\system\Tests\PhpStorage\FileStorageTest1200
LeafDrupal\system\Tests\PhpStorage\MTimeProtectedFastFileStorageTest1900
LeafDrupal\system\Tests\PhpStorage\MTimeProtectedFileStorageTest1900
LeafDrupal\system\Tests\Plugin\AlterDecoratorTest300
LeafDrupal\system\Tests\Plugin\DerivativeTest900
LeafDrupal\system\Tests\Plugin\Discovery\AnnotatedClassDiscoveryTest600
LeafDrupal\system\Tests\Plugin\Discovery\StaticDiscoveryTest600
LeafDrupal\system\Tests\Plugin\FactoryTest900
LeafDrupal\system\Tests\Plugin\InspectionTest1000
LeafDrupal\system\Tests\Queue\QueueTest1400
LeafDrupal\system\Tests\Routing\ChainMatcherTest300
LeafDrupal\system\Tests\Routing\ControllerResolverTest100
LeafDrupal\system\Tests\Routing\FirstEntryFinalMatcherTest800
LeafDrupal\system\Tests\Routing\HttpMethodMatcherTest800
LeafDrupal\system\Tests\Routing\MatcherDumperTest800
LeafDrupal\system\Tests\Routing\NestedMatcherTest100
LeafDrupal\system\Tests\Routing\PathMatcherTest2700
LeafDrupal\system\Tests\Routing\RouterTest2100
LeafDrupal\system\Tests\Routing\RouteTest600
LeafDrupal\system\Tests\Session\SessionHttpsTest8300
LeafDrupal\system\Tests\Session\SessionTest19000
LeafDrupal\system\Tests\System\AccessDeniedTest6800
LeafDrupal\system\Tests\System\AdminMetaTagTest300
LeafDrupal\system\Tests\System\AdminTest18100
LeafDrupal\system\Tests\System\CronRunTest4000
LeafDrupal\system\Tests\System\DateFormatsLanguageTest3700
LeafDrupal\system\Tests\System\DateTimeTest11300
LeafDrupal\system\Tests\System\DefaultMobileMetaTagsTest1200
LeafDrupal\system\Tests\System\ErrorHandlerTest4000
LeafDrupal\system\Tests\System\FloodTest600
LeafDrupal\system\Tests\System\FrontPageTest3700
LeafDrupal\system\Tests\System\IndexPhpTest600
LeafDrupal\system\Tests\System\InfoAlterTest1000
LeafDrupal\system\Tests\System\InfoFileParserUnitTest900
LeafDrupal\system\Tests\System\MainContentFallbackTest6000
LeafDrupal\system\Tests\System\PageNotFoundTest1800
LeafDrupal\system\Tests\System\PageTitleFilteringTest4400
LeafDrupal\system\Tests\System\PasswordHashingTest1000
LeafDrupal\system\Tests\System\RetrieveFileTest700
LeafDrupal\system\Tests\System\ShutdownFunctionsTest500
LeafDrupal\system\Tests\System\SiteMaintenanceTest7800
LeafDrupal\system\Tests\System\SystemAuthorizeTest1600
LeafDrupal\system\Tests\System\ThemeTest20500
LeafDrupal\system\Tests\System\TokenReplaceTest3600
LeafDrupal\system\Tests\System\UnicodeUnitTest18200
ExpandDrupal\system\Tests\Theme\EntityFilteringThemeTest811
MessageGroupFilenameLineFunctionStatus
The test did not complete due to a fatal error.Completion checkEntityFilteringThemeTest.php122Drupal\system\Tests\Theme\EntityFilteringThemeTest->testThemedEntity()
Undefined index: controller classNoticeentity.inc314entity_get_controller()
LeafDrupal\system\Tests\Theme\FastTest1200
LeafDrupal\system\Tests\Theme\FunctionsTest2500
LeafDrupal\system\Tests\Theme\HookInitTest500
LeafDrupal\system\Tests\Theme\HtmlTagUnitTest200
LeafDrupal\system\Tests\Theme\HtmlTplPhpAttributesTest500
LeafDrupal\system\Tests\Theme\RegistryTest600
LeafDrupal\system\Tests\Theme\TableTest600
LeafDrupal\system\Tests\Theme\ThemeTest5100
LeafDrupal\system\Tests\TypedData\TypedDataTest6100
LeafDrupal\system\Tests\Update\DependencyHookInvocationTest800
LeafDrupal\system\Tests\Update\DependencyMissingTest800
LeafDrupal\system\Tests\Update\DependencyOrderingTest700
LeafDrupal\system\Tests\Update\UpdateScriptTest25700
LeafDrupal\system\Tests\Upgrade\BareMinimalUpgradePathTest7100
ExpandDrupal\system\Tests\Upgrade\BareStandardUpgradePathTest2511
MessageGroupFilenameLineFunctionStatus
Failed: Drupal\Core\Database\DatabaseExceptionWrapper: SQLSTATE[42000]: Syntax error or access violation: 1072 Key column 'entity_id' doesn't exist in table: ALTER TABLE {comment} ADD INDEX `comment_entity_langcode` (`entity_id`, `entity_type`, `field_name`, `langcode`); Array ( ) in Drupal\Core\Database\Connection->query() (line 548 of /var/lib/drupaltestbot/sites/default/files/checkout/core/lib/Drupal/Core/Database/Connection.php).OtherUpgradePathTestBase.php222Drupal\system\Tests\Upgrade\UpgradePathTestBase->performUpgrade()
Exception: Errors during update process. in Drupal\system\Tests\Upgrade\UpgradePathTestBase->performUpgrade() (line 228 of /var/lib/drupaltestbot/sites/default/files/checkout/core/modules/system/lib/Drupal/system/Tests/Upgrade/UpgradePathTestBase.php).Uncaught exceptionUpgradePathTestBase.php228Drupal\system\Tests\Upgrade\UpgradePathTestBase->performUpgrade()
LeafDrupal\system\Tests\Upgrade\FilledMinimalUpgradePathTest6900
ExpandDrupal\system\Tests\Upgrade\FilledStandardUpgradePathTest1811
MessageGroupFilenameLineFunctionStatus
Failed: Drupal\Core\Database\DatabaseExceptionWrapper: SQLSTATE[42000]: Syntax error or access violation: 1072 Key column 'entity_id' doesn't exist in table: ALTER TABLE {comment} ADD INDEX `comment_entity_langcode` (`entity_id`, `entity_type`, `field_name`, `langcode`); Array ( ) in Drupal\Core\Database\Connection->query() (line 548 of /var/lib/drupaltestbot/sites/default/files/checkout/core/lib/Drupal/Core/Database/Connection.php).OtherUpgradePathTestBase.php222Drupal\system\Tests\Upgrade\UpgradePathTestBase->performUpgrade()
Exception: Errors during update process. in Drupal\system\Tests\Upgrade\UpgradePathTestBase->performUpgrade() (line 228 of /var/lib/drupaltestbot/sites/default/files/checkout/core/modules/system/lib/Drupal/system/Tests/Upgrade/UpgradePathTestBase.php).Uncaught exceptionUpgradePathTestBase.php228Drupal\system\Tests\Upgrade\UpgradePathTestBase->performUpgrade()
ExpandDrupal\system\Tests\Upgrade\ImageUpgradePathTest2011
MessageGroupFilenameLineFunctionStatus
Failed: Drupal\Core\Database\DatabaseExceptionWrapper: SQLSTATE[42000]: Syntax error or access violation: 1072 Key column 'entity_id' doesn't exist in table: ALTER TABLE {comment} ADD INDEX `comment_entity_langcode` (`entity_id`, `entity_type`, `field_name`, `langcode`); Array ( ) in Drupal\Core\Database\Connection->query() (line 548 of /var/lib/drupaltestbot/sites/default/files/checkout/core/lib/Drupal/Core/Database/Connection.php).OtherUpgradePathTestBase.php222Drupal\system\Tests\Upgrade\UpgradePathTestBase->performUpgrade()
Exception: Errors during update process. in Drupal\system\Tests\Upgrade\UpgradePathTestBase->performUpgrade() (line 228 of /var/lib/drupaltestbot/sites/default/files/checkout/core/modules/system/lib/Drupal/system/Tests/Upgrade/UpgradePathTestBase.php).Uncaught exceptionUpgradePathTestBase.php228Drupal\system\Tests\Upgrade\UpgradePathTestBase->performUpgrade()
ExpandDrupal\system\Tests\Upgrade\LanguageUpgradePathTest7644
MessageGroupFilenameLineFunctionStatus
Failed: Drupal\Core\Database\DatabaseExceptionWrapper: SQLSTATE[42000]: Syntax error or access violation: 1072 Key column 'entity_id' doesn't exist in table: ALTER TABLE {comment} ADD INDEX `comment_entity_langcode` (`entity_id`, `entity_type`, `field_name`, `langcode`); Array ( ) in Drupal\Core\Database\Connection->query() (line 548 of /var/lib/drupaltestbot/sites/default/files/checkout/core/lib/Drupal/Core/Database/Connection.php).OtherUpgradePathTestBase.php222Drupal\system\Tests\Upgrade\UpgradePathTestBase->performUpgrade()
Exception: Errors during update process. in Drupal\system\Tests\Upgrade\UpgradePathTestBase->performUpgrade() (line 228 of /var/lib/drupaltestbot/sites/default/files/checkout/core/modules/system/lib/Drupal/system/Tests/Upgrade/UpgradePathTestBase.php).Uncaught exceptionUpgradePathTestBase.php228Drupal\system\Tests\Upgrade\UpgradePathTestBase->performUpgrade()
Failed: Drupal\Core\Database\DatabaseExceptionWrapper: SQLSTATE[42000]: Syntax error or access violation: 1072 Key column 'entity_id' doesn't exist in table: ALTER TABLE {comment} ADD INDEX `comment_entity_langcode` (`entity_id`, `entity_type`, `field_name`, `langcode`); Array ( ) in Drupal\Core\Database\Connection->query() (line 548 of /var/lib/drupaltestbot/sites/default/files/checkout/core/lib/Drupal/Core/Database/Connection.php).OtherUpgradePathTestBase.php222Drupal\system\Tests\Upgrade\UpgradePathTestBase->performUpgrade()
Exception: Errors during update process. in Drupal\system\Tests\Upgrade\UpgradePathTestBase->performUpgrade() (line 228 of /var/lib/drupaltestbot/sites/default/files/checkout/core/modules/system/lib/Drupal/system/Tests/Upgrade/UpgradePathTestBase.php).Uncaught exceptionUpgradePathTestBase.php228Drupal\system\Tests\Upgrade\UpgradePathTestBase->performUpgrade()
Failed: Drupal\Core\Database\DatabaseExceptionWrapper: SQLSTATE[42000]: Syntax error or access violation: 1072 Key column 'entity_id' doesn't exist in table: ALTER TABLE {comment} ADD INDEX `comment_entity_langcode` (`entity_id`, `entity_type`, `field_name`, `langcode`); Array ( ) in Drupal\Core\Database\Connection->query() (line 548 of /var/lib/drupaltestbot/sites/default/files/checkout/core/lib/Drupal/Core/Database/Connection.php).OtherUpgradePathTestBase.php222Drupal\system\Tests\Upgrade\UpgradePathTestBase->performUpgrade()
Exception: Errors during update process. in Drupal\system\Tests\Upgrade\UpgradePathTestBase->performUpgrade() (line 228 of /var/lib/drupaltestbot/sites/default/files/checkout/core/modules/system/lib/Drupal/system/Tests/Upgrade/UpgradePathTestBase.php).Uncaught exceptionUpgradePathTestBase.php228Drupal\system\Tests\Upgrade\UpgradePathTestBase->performUpgrade()
Failed: Drupal\Core\Database\DatabaseExceptionWrapper: SQLSTATE[42000]: Syntax error or access violation: 1072 Key column 'entity_id' doesn't exist in table: ALTER TABLE {comment} ADD INDEX `comment_entity_langcode` (`entity_id`, `entity_type`, `field_name`, `langcode`); Array ( ) in Drupal\Core\Database\Connection->query() (line 548 of /var/lib/drupaltestbot/sites/default/files/checkout/core/lib/Drupal/Core/Database/Connection.php).OtherUpgradePathTestBase.php222Drupal\system\Tests\Upgrade\UpgradePathTestBase->performUpgrade()
Exception: Errors during update process. in Drupal\system\Tests\Upgrade\UpgradePathTestBase->performUpgrade() (line 228 of /var/lib/drupaltestbot/sites/default/files/checkout/core/modules/system/lib/Drupal/system/Tests/Upgrade/UpgradePathTestBase.php).Uncaught exceptionUpgradePathTestBase.php228Drupal\system\Tests\Upgrade\UpgradePathTestBase->performUpgrade()
ExpandDrupal\system\Tests\Upgrade\ModulesDisabledUpgradePathTest2211
MessageGroupFilenameLineFunctionStatus
Failed: Drupal\Core\Database\DatabaseExceptionWrapper: SQLSTATE[42000]: Syntax error or access violation: 1072 Key column 'entity_id' doesn't exist in table: ALTER TABLE {comment} ADD INDEX `comment_entity_langcode` (`entity_id`, `entity_type`, `field_name`, `langcode`); Array ( ) in Drupal\Core\Database\Connection->query() (line 548 of /var/lib/drupaltestbot/sites/default/files/checkout/core/lib/Drupal/Core/Database/Connection.php).OtherUpgradePathTestBase.php222Drupal\system\Tests\Upgrade\UpgradePathTestBase->performUpgrade()
Exception: Errors during update process. in Drupal\system\Tests\Upgrade\UpgradePathTestBase->performUpgrade() (line 228 of /var/lib/drupaltestbot/sites/default/files/checkout/core/modules/system/lib/Drupal/system/Tests/Upgrade/UpgradePathTestBase.php).Uncaught exceptionUpgradePathTestBase.php228Drupal\system\Tests\Upgrade\UpgradePathTestBase->performUpgrade()
ExpandDrupal\system\Tests\Upgrade\SystemUpgradePathTest2211
MessageGroupFilenameLineFunctionStatus
Failed: Drupal\Core\Database\DatabaseExceptionWrapper: SQLSTATE[42000]: Syntax error or access violation: 1072 Key column 'entity_id' doesn't exist in table: ALTER TABLE {comment} ADD INDEX `comment_entity_langcode` (`entity_id`, `entity_type`, `field_name`, `langcode`); Array ( ) in Drupal\Core\Database\Connection->query() (line 548 of /var/lib/drupaltestbot/sites/default/files/checkout/core/lib/Drupal/Core/Database/Connection.php).OtherUpgradePathTestBase.php222Drupal\system\Tests\Upgrade\UpgradePathTestBase->performUpgrade()
Exception: Errors during update process. in Drupal\system\Tests\Upgrade\UpgradePathTestBase->performUpgrade() (line 228 of /var/lib/drupaltestbot/sites/default/files/checkout/core/modules/system/lib/Drupal/system/Tests/Upgrade/UpgradePathTestBase.php).Uncaught exceptionUpgradePathTestBase.php228Drupal\system\Tests\Upgrade\UpgradePathTestBase->performUpgrade()
ExpandDrupal\system\Tests\Upgrade\UserRoleUpgradePathTest2211
MessageGroupFilenameLineFunctionStatus
Failed: Drupal\Core\Database\DatabaseExceptionWrapper: SQLSTATE[42000]: Syntax error or access violation: 1072 Key column 'entity_id' doesn't exist in table: ALTER TABLE {comment} ADD INDEX `comment_entity_langcode` (`entity_id`, `entity_type`, `field_name`, `langcode`); Array ( ) in Drupal\Core\Database\Connection->query() (line 548 of /var/lib/drupaltestbot/sites/default/files/checkout/core/lib/Drupal/Core/Database/Connection.php).OtherUpgradePathTestBase.php222Drupal\system\Tests\Upgrade\UpgradePathTestBase->performUpgrade()
Exception: Errors during update process. in Drupal\system\Tests\Upgrade\UpgradePathTestBase->performUpgrade() (line 228 of /var/lib/drupaltestbot/sites/default/files/checkout/core/modules/system/lib/Drupal/system/Tests/Upgrade/UpgradePathTestBase.php).Uncaught exceptionUpgradePathTestBase.php228Drupal\system\Tests\Upgrade\UpgradePathTestBase->performUpgrade()
ExpandDrupal\system\Tests\Upgrade\UuidUpgradePathTest2011
MessageGroupFilenameLineFunctionStatus
Failed: Drupal\Core\Database\DatabaseExceptionWrapper: SQLSTATE[42000]: Syntax error or access violation: 1072 Key column 'entity_id' doesn't exist in table: ALTER TABLE {comment} ADD INDEX `comment_entity_langcode` (`entity_id`, `entity_type`, `field_name`, `langcode`); Array ( ) in Drupal\Core\Database\Connection->query() (line 548 of /var/lib/drupaltestbot/sites/default/files/checkout/core/lib/Drupal/Core/Database/Connection.php).OtherUpgradePathTestBase.php222Drupal\system\Tests\Upgrade\UpgradePathTestBase->performUpgrade()
Exception: Errors during update process. in Drupal\system\Tests\Upgrade\UpgradePathTestBase->performUpgrade() (line 228 of /var/lib/drupaltestbot/sites/default/files/checkout/core/modules/system/lib/Drupal/system/Tests/Upgrade/UpgradePathTestBase.php).Uncaught exceptionUpgradePathTestBase.php228Drupal\system\Tests\Upgrade\UpgradePathTestBase->performUpgrade()
LeafDrupal\system\Tests\Uuid\UuidUnitTest700
LeafDrupal\taxonomy\Tests\EfqTest1300
LeafDrupal\taxonomy\Tests\HooksTest2300
LeafDrupal\taxonomy\Tests\LegacyTest1400
LeafDrupal\taxonomy\Tests\LoadMultipleTest1800
LeafDrupal\taxonomy\Tests\RssTest2600
LeafDrupal\taxonomy\Tests\TermFieldMultipleVocabularyTest2600
LeafDrupal\taxonomy\Tests\TermFieldTest4500
LeafDrupal\taxonomy\Tests\TermIndexTest4600
LeafDrupal\taxonomy\Tests\TermLanguageTest6400
LeafDrupal\taxonomy\Tests\TermTest26300
LeafDrupal\taxonomy\Tests\TermUnitTest1100
LeafDrupal\taxonomy\Tests\ThemeTest1900
LeafDrupal\taxonomy\Tests\TokenReplaceTest5500
LeafDrupal\taxonomy\Tests\VocabularyLanguageTest6100
LeafDrupal\taxonomy\Tests\VocabularyTest11000
LeafDrupal\taxonomy\Tests\VocabularyUnitTest8300
LeafDrupal\text\Tests\TextFieldTest18400
LeafDrupal\text\Tests\TextSummaryTest13800
LeafDrupal\text\Tests\TextTranslationTest10400
LeafDrupal\tracker\Tests\TrackerNodeAccessTest2800
LeafDrupal\tracker\Tests\TrackerTest25400
LeafDrupal\translation\Tests\TranslationTest69200
LeafDrupal\update\Tests\UpdateContribTest21700
LeafDrupal\update\Tests\UpdateCoreTest23300
LeafDrupal\update\Tests\UpdateCoreUnitTest400
LeafDrupal\update\Tests\UpdateUploadTest9500
LeafDrupal\user\Tests\TempStoreDatabaseTest1900
LeafDrupal\user\Tests\UserAccountLinksTests6100
LeafDrupal\user\Tests\UserAdminSettingsFormTest400
LeafDrupal\user\Tests\UserAdminTest6200
LeafDrupal\user\Tests\UserAuthmapAssignmentTest600
LeafDrupal\user\Tests\UserAutocompleteTest2500
LeafDrupal\user\Tests\UserBlocksTests4800
ExpandDrupal\user\Tests\UserCancelTest256511
MessageGroupFilenameLineFunctionStatus
Undefined property: Drupal\node\Node::$comment_pageNoticecomment.pages.inc97comment_reply()
reset() expects parameter 1 to be array, boolean givenWarningcomment.pages.inc105comment_reply()
Undefined index: comment_bodyNoticeCommentFormController.php220Drupal\comment\CommentFormController->actions()
Failed to set field comment_body[und][0][value] to qzcIlt5iMiP81uy9OtherUserCancelTest.php311Drupal\user\Tests\UserCancelTest->testUserDelete()
Found the Preview buttonOtherUserCancelTest.php311Drupal\user\Tests\UserCancelTest->testUserDelete()
Found the requested form fields at comment/reply/node/1/comment_pageOtherUserCancelTest.php311Drupal\user\Tests\UserCancelTest->testUserDelete()
Undefined property: Drupal\node\Node::$comment_pageNoticecomment.pages.inc97comment_reply()
reset() expects parameter 1 to be array, boolean givenWarningcomment.pages.inc105comment_reply()
Undefined index: comment_bodyNoticeCommentFormController.php220Drupal\comment\CommentFormController->actions()
Undefined property: Drupal\comment\Comment::$comment_bodyNoticeCommentFormController.php295Drupal\comment\CommentFormController->submit()
reset() expects parameter 1 to be array, boolean givenWarningCommentFormController.php337Drupal\comment\CommentFormController->save()
"Your comment has been posted." foundOtherUserCancelTest.php313Drupal\user\Tests\UserCancelTest->testUserDelete()
Trying to get property of non-objectNoticeUserCancelTest.php316Drupal\user\Tests\UserCancelTest->testUserDelete()
Comment found.OtherUserCancelTest.php316Drupal\user\Tests\UserCancelTest->testUserDelete()
Trying to get property of non-objectNoticeUserCancelTest.php346Drupal\user\Tests\UserCancelTest->testUserDelete()
array_flip(): Can only flip STRING and INTEGER values!WarningDatabaseStorageController.php167Drupal\Core\Entity\DatabaseStorageController->load()
LeafDrupal\user\Tests\UserCreateTest3400
LeafDrupal\user\Tests\UserDeleteTest1500
LeafDrupal\user\Tests\UserEditedOwnAccountTest2200
LeafDrupal\user\Tests\UserEditTest7800
LeafDrupal\user\Tests\UserEntityCallbacksTest700
LeafDrupal\user\Tests\UserLanguageCreationTest6900
LeafDrupal\user\Tests\UserLanguageTest3900
LeafDrupal\user\Tests\UserLoginTest15900
LeafDrupal\user\Tests\UserPasswordResetTest3100
LeafDrupal\user\Tests\UserPermissionsTest5000
LeafDrupal\user\Tests\UserPictureTest12600
LeafDrupal\user\Tests\UserRegistrationTest13400
LeafDrupal\user\Tests\UserRoleAdminTest5400
LeafDrupal\user\Tests\UserRolesAssignmentTest5100
LeafDrupal\user\Tests\UserSaveTest200
LeafDrupal\user\Tests\UserSearchTest3700
ExpandDrupal\user\Tests\UserSignatureTest4364
MessageGroupFilenameLineFunctionStatus
reset() expects parameter 1 to be array, boolean givenWarningcomment.pages.inc105comment_reply()
reset() expects parameter 1 to be array, boolean givenWarningcomment.pages.inc105comment_reply()
reset() expects parameter 1 to be array, boolean givenWarningCommentFormController.php337Drupal\comment\CommentFormController->save()
Undefined offset: 1NoticeUserSignatureTest.php111Drupal\user\Tests\UserSignatureTest->testUserSignature()
Failed to set field subject to iv0uBwNVOtherUserSignatureTest.php117Drupal\user\Tests\UserSignatureTest->testUserSignature()
Failed to set field comment_body[und][0][value] to hrEQ4ronh8TnZG4EOtherUserSignatureTest.php117Drupal\user\Tests\UserSignatureTest->testUserSignature()
Failed to set field comment_body[und][0][format] to full_htmlOtherUserSignatureTest.php117Drupal\user\Tests\UserSignatureTest->testUserSignature()
Found the Save buttonOtherUserSignatureTest.php117Drupal\user\Tests\UserSignatureTest->testUserSignature()
Found the requested form fields at comment//editOtherUserSignatureTest.php117Drupal\user\Tests\UserSignatureTest->testUserSignature()
Filtered signature text found.OtherUserSignatureTest.php122Drupal\user\Tests\UserSignatureTest->testUserSignature()
LeafDrupal\user\Tests\UserTimeZoneTest2900
LeafDrupal\user\Tests\UserTokenReplaceTest4700
LeafDrupal\user\Tests\UserValidateCurrentPassCustomFormTest1700
LeafDrupal\user\Tests\UserValidationTest1600
LeafDrupal\views\Tests\AnalyzeTest1800
LeafDrupal\views\Tests\BasicTest1100
LeafDrupal\views\Tests\Comment\ArgumentUserUIDTest900
ExpandDrupal\views\Tests\Comment\DefaultViewRecentComments406
MessageGroupFilenameLineFunctionStatus
'Missing handler: views_test_data age field'Debugviews.module1220views_get_handler()
'Missing handler: views_test_data id field'Debugviews.module1220views_get_handler()
'Missing handler: views_test_data name field'Debugviews.module1220views_get_handler()
'Missing handler: comment nid relationship'Debugviews.module1220views_get_handler()
Undefined index: baseNoticeSql.php1554Drupal\views\Plugin\views\query\Sql->get_entity_tables()
Undefined index: baseNoticeSql.php1554Drupal\views\Plugin\views\query\Sql->get_entity_tables()
Drupal\Core\Database\DatabaseExceptionWrapper: Exception in Recent comments[comments_recent]: SQLSTATE[42000]: Syntax error or access violation: 1064 You have an error in your SQL syntax; check the manual that corresponds to your MySQL server version for the right syntax to use near &#039;= 1 OR (.uid = 1 AND 1 &lt;&gt; 0 AND 1 = 1) OR 1 = 1) ))) subquery&#039; at line 1: SELECT COUNT(*) AS expression FROM (SELECT 1 AS expression FROM {comment} comment WHERE (( (.status = 1 OR (.uid = 1 AND 1 &lt;&gt; 0 AND 1 = 1) OR 1 = 1) ))) subquery; Array ( ) in Drupal\views\Plugin\views\query\Sql->execute() (line 1515 of /var/lib/drupaltestbot/sites/default/files/checkout/core/modules/views/lib/Drupal/views/Plugin/views/query/Sql.php).Uncaught exceptionSql.php1515Drupal\views\Plugin\views\query\Sql->execute()
'Missing handler: views_test_data age field'Debugviews.module1220views_get_handler()
'Missing handler: views_test_data id field'Debugviews.module1220views_get_handler()
'Missing handler: views_test_data name field'Debugviews.module1220views_get_handler()
'Missing handler: comment nid relationship'Debugviews.module1220views_get_handler()
Undefined index: baseNoticeSql.php1554Drupal\views\Plugin\views\query\Sql->get_entity_tables()
Undefined index: baseNoticeSql.php1554Drupal\views\Plugin\views\query\Sql->get_entity_tables()
Drupal\Core\Database\DatabaseExceptionWrapper: Exception in Recent comments[comments_recent]: SQLSTATE[42000]: Syntax error or access violation: 1064 You have an error in your SQL syntax; check the manual that corresponds to your MySQL server version for the right syntax to use near &#039;= 1 OR (.uid = 1 AND 1 &lt;&gt; 0 AND 1 = 1) OR 1 = 1) ))) subquery&#039; at line 1: SELECT COUNT(*) AS expression FROM (SELECT 1 AS expression FROM {comment} comment WHERE (( (.status = 1 OR (.uid = 1 AND 1 &lt;&gt; 0 AND 1 = 1) OR 1 = 1) ))) subquery; Array ( ) in Drupal\views\Plugin\views\query\Sql->execute() (line 1515 of /var/lib/drupaltestbot/sites/default/files/checkout/core/modules/views/lib/Drupal/views/Plugin/views/query/Sql.php).Uncaught exceptionSql.php1515Drupal\views\Plugin\views\query\Sql->execute()
ExpandDrupal\views\Tests\Comment\FilterUserUIDTest801
MessageGroupFilenameLineFunctionStatus
Drupal\Core\Database\DatabaseExceptionWrapper: Exception in test_comment_user_uid[test_comment_user_uid]: SQLSTATE[42S22]: Column not found: 1054 Unknown column &#039;c.nid&#039; in &#039;where clause&#039;: SELECT COUNT(*) AS expression FROM (SELECT 1 AS expression FROM {node} node WHERE ((( (node.uid = :db_condition_placeholder_0_0) OR ( EXISTS (SELECT c.cid AS cid FROM {comment} c WHERE (c.uid = :db_condition_placeholder_1_0) AND (c.nid = node.nid) )) )))) subquery; Array ( [:db_condition_placeholder_0_0] =&gt; 2 [:db_condition_placeholder_1_0] =&gt; 2 ) in Drupal\views\Plugin\views\query\Sql->execute() (line 1515 of /var/lib/drupaltestbot/sites/default/files/checkout/core/modules/views/lib/Drupal/views/Plugin/views/query/Sql.php).Uncaught exceptionSql.php1515Drupal\views\Plugin\views\query\Sql->execute()
ExpandDrupal\views\Tests\Comment\WizardTest3500
MessageGroupFilenameLineFunctionStatus
'Missing handler: comment node relationship'Debugviews.module1220views_get_handler()
'Missing handler: comment node relationship'Debugviews.module1220views_get_handler()
'Missing handler: comment node relationship'Debugviews.module1220views_get_handler()
'Missing handler: comment node relationship'Debugviews.module1220views_get_handler()
'Missing handler: comment node relationship'Debugviews.module1220views_get_handler()
'Missing handler: comment node relationship'Debugviews.module1220views_get_handler()
'Missing handler: comment node relationship'Debugviews.module1220views_get_handler()
'Missing handler: comment node relationship'Debugviews.module1220views_get_handler()
'Missing handler: comment node relationship'Debugviews.module1220views_get_handler()
'Missing handler: comment node relationship'Debugviews.module1220views_get_handler()
'Missing handler: comment node relationship'Debugviews.module1220views_get_handler()
'Missing handler: views_test_data age field'Debugviews.module1220views_get_handler()
'Missing handler: views_test_data id field'Debugviews.module1220views_get_handler()
'Missing handler: views_test_data name field'Debugviews.module1220views_get_handler()
'Missing handler: comment node relationship'Debugviews.module1220views_get_handler()
'Missing handler: comment node relationship'Debugviews.module1220views_get_handler()
'Missing handler: comment node relationship'Debugviews.module1220views_get_handler()
ExpandDrupal\views\Tests\DefaultViewsTest3103
MessageGroupFilenameLineFunctionStatus
'Missing handler: search_node_links_to nid argument'Debugviews.module1220views_get_handler()
'Missing handler: search_node_links_to nid argument'Debugviews.module1220views_get_handler()
'Missing handler: search_node_links_to nid argument'Debugviews.module1220views_get_handler()
'Missing handler: comment nid relationship'Debugviews.module1220views_get_handler()
Undefined index: baseNoticeSql.php1554Drupal\views\Plugin\views\query\Sql->get_entity_tables()
Undefined index: baseNoticeSql.php1554Drupal\views\Plugin\views\query\Sql->get_entity_tables()
Drupal\Core\Database\DatabaseExceptionWrapper: Exception in Recent comments[comments_recent]: SQLSTATE[42000]: Syntax error or access violation: 1064 You have an error in your SQL syntax; check the manual that corresponds to your MySQL server version for the right syntax to use near &#039;= 1 OR (.uid = 1 AND 1 &lt;&gt; 0 AND 1 = 1) OR 1 = 1) )) ORDER BY comment_changed DES&#039; at line 1: SELECT comment.subject AS comment_subject, comment.cid AS cid, comment.entity_id AS comment_entity_id, comment.entity_type AS comment_entity_type, comment.changed AS comment_changed FROM {comment} comment WHERE (( (.status = 1 OR (.uid = 1 AND 1 &lt;&gt; 0 AND 1 = 1) OR 1 = 1) )) ORDER BY comment_changed DESC LIMIT 5 OFFSET 0; Array ( ) in Drupal\views\Plugin\views\query\Sql->execute() (line 1515 of /var/lib/drupaltestbot/sites/default/files/checkout/core/modules/views/lib/Drupal/views/Plugin/views/query/Sql.php).Uncaught exceptionSql.php1515Drupal\views\Plugin\views\query\Sql->execute()
ExpandDrupal\views\Tests\Entity\FieldEntityTest103
MessageGroupFilenameLineFunctionStatus
'Missing handler: comment nid relationship'Debugviews.module1220views_get_handler()
Undefined index: baseNoticeSql.php1554Drupal\views\Plugin\views\query\Sql->get_entity_tables()
Undefined index: baseNoticeSql.php1554Drupal\views\Plugin\views\query\Sql->get_entity_tables()
Drupal\Core\Database\DatabaseExceptionWrapper: Exception in test_field_get_entity[test_field_get_entity]: SQLSTATE[23000]: Integrity constraint violation: 1052 Column &#039;uid&#039; in on clause is ambiguous: SELECT COUNT(*) AS expression FROM (SELECT 1 AS expression FROM {comment} comment LEFT JOIN {users} users_node ON uid = users_node.uid) subquery; Array ( ) in Drupal\views\Plugin\views\query\Sql->execute() (line 1515 of /var/lib/drupaltestbot/sites/default/files/checkout/core/modules/views/lib/Drupal/views/Plugin/views/query/Sql.php).Uncaught exceptionSql.php1515Drupal\views\Plugin\views\query\Sql->execute()
LeafDrupal\views\Tests\Field\ApiDataTest1500
LeafDrupal\views\Tests\Field\HandlerFieldFieldTest2400
ExpandDrupal\views\Tests\GlossaryTest800
MessageGroupFilenameLineFunctionStatus
'Missing handler: views_test_data age field'Debugviews.module1220views_get_handler()
'Missing handler: views_test_data id field'Debugviews.module1220views_get_handler()
'Missing handler: views_test_data name field'Debugviews.module1220views_get_handler()
LeafDrupal\views\Tests\Handler\AreaTest5800
LeafDrupal\views\Tests\Handler\AreaTextTest500
LeafDrupal\views\Tests\Handler\ArgumentNullTest500
LeafDrupal\views\Tests\Handler\ArgumentStringTest400
LeafDrupal\views\Tests\Handler\FieldBooleanTest1100
LeafDrupal\views\Tests\Handler\FieldCounterTest800
LeafDrupal\views\Tests\Handler\FieldCustomTest200
LeafDrupal\views\Tests\Handler\FieldDateTest1500
LeafDrupal\views\Tests\Handler\FieldFileSizeTest900
LeafDrupal\views\Tests\Handler\FieldTest20600
LeafDrupal\views\Tests\Handler\FieldUrlTest300
LeafDrupal\views\Tests\Handler\FieldXssTest400
LeafDrupal\views\Tests\Handler\FilterCombineTest200
ExpandDrupal\views\Tests\Handler\FilterDateTest2400
MessageGroupFilenameLineFunctionStatus
'Missing handler: views_test_data age field'Debugviews.module1220views_get_handler()
'Missing handler: views_test_data id field'Debugviews.module1220views_get_handler()
'Missing handler: views_test_data name field'Debugviews.module1220views_get_handler()
'Missing handler: views_test_data age field'Debugviews.module1220views_get_handler()
'Missing handler: views_test_data id field'Debugviews.module1220views_get_handler()
'Missing handler: views_test_data name field'Debugviews.module1220views_get_handler()
LeafDrupal\views\Tests\Handler\FilterEqualityTest800
LeafDrupal\views\Tests\Handler\FilterInOperatorTest1100
LeafDrupal\views\Tests\Handler\FilterNumericTest2300
LeafDrupal\views\Tests\Handler\FilterStringTest5000
LeafDrupal\views\Tests\Handler\HandlerAliasTest1000
ExpandDrupal\views\Tests\Handler\HandlerAllTest24201
MessageGroupFilenameLineFunctionStatus
'Missing handler: comment langcode field'Debugviews.module1220views_get_handler()
'Missing handler: comment langcode argument'Debugviews.module1220views_get_handler()
'Missing handler: comment langcode filter'Debugviews.module1220views_get_handler()
'Missing handler: comment langcode filter'Debugviews.module1220views_get_handler()
'Missing handler: comment entity_type sort'Debugviews.module1220views_get_handler()
'Missing handler: comment field_name sort'Debugviews.module1220views_get_handler()
'Missing handler: comment langcode field'Debugviews.module1220views_get_handler()
'Missing handler: comment langcode argument'Debugviews.module1220views_get_handler()
'Missing handler: comment entity_type sort'Debugviews.module1220views_get_handler()
'Missing handler: comment field_name sort'Debugviews.module1220views_get_handler()
'Missing handler: comment langcode filter'Debugviews.module1220views_get_handler()
'Missing handler: node langcode argument'Debugviews.module1220views_get_handler()
'Missing handler: node langcode filter'Debugviews.module1220views_get_handler()
'Missing handler: node langcode filter'Debugviews.module1220views_get_handler()
'Missing handler: node langcode argument'Debugviews.module1220views_get_handler()
'Missing handler: node langcode filter'Debugviews.module1220views_get_handler()
Undefined index: handlerNoticeFieldPluginBase.php145Drupal\views\Plugin\views\field\FieldPluginBase->add_additional_fields()
'Handler tried to add additional_field comment_count but node_comment_statistics could not be added!'DebugFieldPluginBase.php145Drupal\views\Plugin\views\field\FieldPluginBase->add_additional_fields()
'Missing handler: taxonomy_term_data langcode argument'Debugviews.module1220views_get_handler()
'Missing handler: taxonomy_term_data langcode filter'Debugviews.module1220views_get_handler()
'Missing handler: taxonomy_term_data langcode filter'Debugviews.module1220views_get_handler()
'Missing handler: taxonomy_term_data langcode argument'Debugviews.module1220views_get_handler()
'Missing handler: taxonomy_term_data langcode filter'Debugviews.module1220views_get_handler()
'Missing handler: users langcode argument'Debugviews.module1220views_get_handler()
'Missing handler: users langcode filter'Debugviews.module1220views_get_handler()
'Missing handler: users langcode filter'Debugviews.module1220views_get_handler()
'Missing handler: users langcode argument'Debugviews.module1220views_get_handler()
'Missing handler: users langcode filter'Debugviews.module1220views_get_handler()
ExpandDrupal\views\Tests\Handler\HandlerTest114212
MessageGroupFilenameLineFunctionStatus
'Missing handler: node cid relationship'Debugviews.module1220views_get_handler()
'Missing handler: comment nid relationship'Debugviews.module1220views_get_handler()
'Missing handler: node cid relationship'Debugviews.module1220views_get_handler()
Undefined index: cidNoticeadmin.inc1749views_ui_config_item_form()
'Missing handler: comment nid relationship'Debugviews.module1220views_get_handler()
Undefined index: nidNoticeadmin.inc1749views_ui_config_item_form()
Found field with name 'options[relationship]'BrowserHandlerTest.php241Drupal\views\Tests\Handler\HandlerTest->testRelationshipUI()
Value array ( ) is equal to value array ( 0 => 'none', 1 => 'nid', ).OtherHandlerTest.php254Drupal\views\Tests\Handler\HandlerTest->testRelationshipUI()
'Missing handler: node cid relationship'Debugviews.module1220views_get_handler()
'Missing handler: comment nid relationship'Debugviews.module1220views_get_handler()
'Missing handler: node cid relationship'Debugviews.module1220views_get_handler()
Undefined index: cidNoticeadmin.inc1749views_ui_config_item_form()
'Missing handler: node cid relationship'Debugviews.module1220views_get_handler()
'Missing handler: comment nid relationship'Debugviews.module1220views_get_handler()
'Missing handler: node cid relationship'Debugviews.module1220views_get_handler()
Undefined index: cidNoticeadmin.inc1749views_ui_config_item_form()
'Missing handler: node cid relationship'Debugviews.module1220views_get_handler()
'Missing handler: node cid relationship'Debugviews.module1220views_get_handler()
Undefined index: cidNoticeadmin.inc1749views_ui_config_item_form()
'Missing handler: oQB12IXb vcR5jmXT relationship'Debugviews.module1220views_get_handler()
'Missing handler: comment entity_id relationship'Debugviews.module1220views_get_handler()
'Missing handler: node cid relationship'Debugviews.module1220views_get_handler()
'Missing handler: comment nid relationship'Debugviews.module1220views_get_handler()
'Missing handler: oQB12IXb vcR5jmXT relationship'Debugviews.module1220views_get_handler()
'Missing handler: comment entity_id relationship'Debugviews.module1220views_get_handler()
Undefined index: baseNoticeSql.php1554Drupal\views\Plugin\views\query\Sql->get_entity_tables()
Undefined index: baseNoticeSql.php1554Drupal\views\Plugin\views\query\Sql->get_entity_tables()
Undefined index: baseNoticeSql.php1554Drupal\views\Plugin\views\query\Sql->get_entity_tables()
Undefined index: baseNoticeSql.php1554Drupal\views\Plugin\views\query\Sql->get_entity_tables()
Undefined index: baseNoticeSql.php1554Drupal\views\Plugin\views\query\Sql->get_entity_tables()
Undefined index: baseNoticeSql.php1554Drupal\views\Plugin\views\query\Sql->get_entity_tables()
Undefined property: Drupal\views\Plugin\views\relationship\Broken::$aliasNoticeHandlerTest.php295Drupal\views\Tests\Handler\HandlerTest->testSetRelationship()
LeafDrupal\views\Tests\Handler\RelationshipTest500
LeafDrupal\views\Tests\Handler\SortDateTest2500
LeafDrupal\views\Tests\Handler\SortRandomTest700
LeafDrupal\views\Tests\Handler\SortTest1000
ExpandDrupal\views\Tests\ModuleTest5200
MessageGroupFilenameLineFunctionStatus
'Missing handler: aGffOVnZ iDGN1HYu field'Debugviews.module1220views_get_handler()
'Missing handler: w09tlkzC sRsmrOiq area'Debugviews.module1220views_get_handler()
'Missing handler: xwhx1rXU gDk05QhV filter'Debugviews.module1220views_get_handler()
LeafDrupal\views\Tests\Node\FieldTypeTest200
LeafDrupal\views\Tests\Node\FilterUidRevisionTest400
LeafDrupal\views\Tests\Node\RevisionRelationships300
LeafDrupal\views\Tests\PluginInstanceTest25500
LeafDrupal\views\Tests\PluginTypeListTest100
LeafDrupal\views\Tests\Plugin\AccessTest3900
LeafDrupal\views\Tests\Plugin\ArgumentDefaultTest2400
LeafDrupal\views\Tests\Plugin\ArgumentValidatorTest600
LeafDrupal\views\Tests\Plugin\CacheTest1200
LeafDrupal\views\Tests\Plugin\DisplayExtenderTest600
LeafDrupal\views\Tests\Plugin\DisplayFeedTest2800
LeafDrupal\views\Tests\Plugin\DisplayPageTest700
LeafDrupal\views\Tests\Plugin\DisplayTest3900
LeafDrupal\views\Tests\Plugin\ExposedFormTest8500
LeafDrupal\views\Tests\Plugin\FilterTest1300
ExpandDrupal\views\Tests\Plugin\JoinTest1400
MessageGroupFilenameLineFunctionStatus
array ( 'join type' => 'LEFT', 'table' => 'users', 'alias' => 'users', 'condition' => 'node.uid = users.uid AND (node.uid = 651)', 'arguments' => array ( ), )DebugJoinTest.php70Drupal\views\Tests\Plugin\JoinTest->testExamplePlugin()
ExpandDrupal\views\Tests\Plugin\PagerTest9200
MessageGroupFilenameLineFunctionStatus
'Missing handler: views_test_data age field'Debugviews.module1220views_get_handler()
'Missing handler: views_test_data id field'Debugviews.module1220views_get_handler()
'Missing handler: views_test_data name field'Debugviews.module1220views_get_handler()
LeafDrupal\views\Tests\Plugin\QueryTest300
LeafDrupal\views\Tests\Plugin\StyleMappingTest4300
LeafDrupal\views\Tests\Plugin\StyleTest2400
LeafDrupal\views\Tests\Plugin\StyleUnformattedTest1800
ExpandDrupal\views\Tests\QueryGroupByTest4000
MessageGroupFilenameLineFunctionStatus
'Missing handler: views_test_data age field'Debugviews.module1220views_get_handler()
'Missing handler: views_test_data id field'Debugviews.module1220views_get_handler()
'Missing handler: views_test_data name field'Debugviews.module1220views_get_handler()
'Missing handler: views_test_data age field'Debugviews.module1220views_get_handler()
'Missing handler: views_test_data id field'Debugviews.module1220views_get_handler()
'Missing handler: views_test_data name field'Debugviews.module1220views_get_handler()
'Missing handler: views_test_data age field'Debugviews.module1220views_get_handler()
'Missing handler: views_test_data id field'Debugviews.module1220views_get_handler()
'Missing handler: views_test_data name field'Debugviews.module1220views_get_handler()
'Missing handler: views_test_data age field'Debugviews.module1220views_get_handler()
'Missing handler: views_test_data id field'Debugviews.module1220views_get_handler()
'Missing handler: views_test_data name field'Debugviews.module1220views_get_handler()
'Missing handler: views_test_data age field'Debugviews.module1220views_get_handler()
'Missing handler: views_test_data id field'Debugviews.module1220views_get_handler()
'Missing handler: views_test_data name field'Debugviews.module1220views_get_handler()
'Missing handler: views_test_data age field'Debugviews.module1220views_get_handler()
'Missing handler: views_test_data id field'Debugviews.module1220views_get_handler()
'Missing handler: views_test_data name field'Debugviews.module1220views_get_handler()
'Missing handler: views_test_data age field'Debugviews.module1220views_get_handler()
'Missing handler: views_test_data id field'Debugviews.module1220views_get_handler()
'Missing handler: views_test_data name field'Debugviews.module1220views_get_handler()
'Missing handler: views_test_data age field'Debugviews.module1220views_get_handler()
'Missing handler: views_test_data id field'Debugviews.module1220views_get_handler()
'Missing handler: views_test_data name field'Debugviews.module1220views_get_handler()
'Missing handler: views_test_data age field'Debugviews.module1220views_get_handler()
'Missing handler: views_test_data id field'Debugviews.module1220views_get_handler()
'Missing handler: views_test_data name field'Debugviews.module1220views_get_handler()
'Missing handler: views_test_data age field'Debugviews.module1220views_get_handler()
'Missing handler: views_test_data id field'Debugviews.module1220views_get_handler()
'Missing handler: views_test_data name field'Debugviews.module1220views_get_handler()
'Missing handler: views_test_data age field'Debugviews.module1220views_get_handler()
'Missing handler: views_test_data id field'Debugviews.module1220views_get_handler()
'Missing handler: views_test_data name field'Debugviews.module1220views_get_handler()
'Missing handler: views_test_data age field'Debugviews.module1220views_get_handler()
'Missing handler: views_test_data id field'Debugviews.module1220views_get_handler()
'Missing handler: views_test_data name field'Debugviews.module1220views_get_handler()
'Missing handler: views_test_data age field'Debugviews.module1220views_get_handler()
'Missing handler: views_test_data id field'Debugviews.module1220views_get_handler()
'Missing handler: views_test_data name field'Debugviews.module1220views_get_handler()
ExpandDrupal\views\Tests\Taxonomy\RelationshipNodeTermDataTest200
MessageGroupFilenameLineFunctionStatus
'Missing handler: nid nid sort'Debugviews.module1220views_get_handler()
LeafDrupal\views\Tests\Taxonomy\RelationshipRepresentativeNode200
LeafDrupal\views\Tests\TokenReplaceTest1200
LeafDrupal\views\Tests\UI\DefaultViewsTest5900
LeafDrupal\views\Tests\UI\DisplayExtenderUITest2300
LeafDrupal\views\Tests\UI\DisplayTest18300
LeafDrupal\views\Tests\UI\GroupByTest2600
LeafDrupal\views\Tests\UI\OverrideDisplaysTest16700
LeafDrupal\views\Tests\UI\RedirectTest2600
LeafDrupal\views\Tests\UI\RowUITest3000
LeafDrupal\views\Tests\UI\SettingsTest6600
LeafDrupal\views\Tests\UI\StorageTest2100
LeafDrupal\views\Tests\UI\StyleUITest3000
LeafDrupal\views\Tests\UI\TagTest2300
LeafDrupal\views\Tests\User\AccessPermissionTest1400
LeafDrupal\views\Tests\User\AccessRoleTest1400
LeafDrupal\views\Tests\User\ArgumentDefaultTest900
LeafDrupal\views\Tests\User\ArgumentValidateTest1900
LeafDrupal\views\Tests\User\HandlerFieldUserNameTest700
LeafDrupal\views\Tests\User\RelationshipRepresentativeNode300
LeafDrupal\views\Tests\ViewElementTest1500
ExpandDrupal\views\Tests\ViewExecutableTest4805
MessageGroupFilenameLineFunctionStatus
'Missing handler: node_comment_statistics last_comment_name sort'Debugviews.module1220views_get_handler()
'Missing handler: node_comment_statistics last_comment_timestamp sort'Debugviews.module1220views_get_handler()
'Missing handler: node cid relationship'Debugviews.module1220views_get_handler()
'Missing handler: node_comment_statistics last_comment_name sort'Debugviews.module1220views_get_handler()
'Missing handler: node_comment_statistics last_comment_timestamp sort'Debugviews.module1220views_get_handler()
'Missing handler: node cid relationship'Debugviews.module1220views_get_handler()
Undefined index: baseNoticeSql.php1554Drupal\views\Plugin\views\query\Sql->get_entity_tables()
Undefined index: baseNoticeSql.php1554Drupal\views\Plugin\views\query\Sql->get_entity_tables()
'Missing handler: node_comment_statistics last_comment_name sort'Debugviews.module1220views_get_handler()
'Missing handler: node_comment_statistics last_comment_timestamp sort'Debugviews.module1220views_get_handler()
'Missing handler: node cid relationship'Debugviews.module1220views_get_handler()
Undefined index: baseNoticeSql.php1554Drupal\views\Plugin\views\query\Sql->get_entity_tables()
Undefined index: baseNoticeSql.php1554Drupal\views\Plugin\views\query\Sql->get_entity_tables()
Drupal\Core\Database\DatabaseExceptionWrapper: Exception in test_destroy[test_destroy]: SQLSTATE[23000]: Integrity constraint violation: 1052 Column &#039;uid&#039; in on clause is ambiguous: SELECT COUNT(*) AS expression FROM (SELECT 1 AS expression FROM {node} node LEFT JOIN {comment} comment_comment ON pid = comment_comment.cid LEFT JOIN {users} users_comment ON uid = users_comment.uid WHERE (( (node.nid = :db_condition_placeholder_0) AND (node.status = :db_condition_placeholder_1) AND (node.title LIKE :db_condition_placeholder_2 ESCAPE &#039;\\&#039;) ))) subquery; Array ( [:db_condition_placeholder_0] =&gt; [:db_condition_placeholder_1] =&gt; 0 [:db_condition_placeholder_2] =&gt; ) in Drupal\views\Plugin\views\query\Sql->execute() (line 1515 of /var/lib/drupaltestbot/sites/default/files/checkout/core/modules/views/lib/Drupal/views/Plugin/views/query/Sql.php).Uncaught exceptionSql.php1515Drupal\views\Plugin\views\query\Sql->execute()
'Missing handler: node_comment_statistics last_comment_name sort'Debugviews.module1220views_get_handler()
'Missing handler: node_comment_statistics last_comment_timestamp sort'Debugviews.module1220views_get_handler()
'Missing handler: node cid relationship'Debugviews.module1220views_get_handler()
'Missing handler: node_comment_statistics last_comment_name sort'Debugviews.module1220views_get_handler()
'Missing handler: node_comment_statistics last_comment_timestamp sort'Debugviews.module1220views_get_handler()
'Missing handler: node cid relationship'Debugviews.module1220views_get_handler()
'Missing handler: node_comment_statistics last_comment_name sort'Debugviews.module1220views_get_handler()
'Missing handler: node_comment_statistics last_comment_timestamp sort'Debugviews.module1220views_get_handler()
'Missing handler: node cid relationship'Debugviews.module1220views_get_handler()
'Missing handler: node_comment_statistics last_comment_name sort'Debugviews.module1220views_get_handler()
'Missing handler: node_comment_statistics last_comment_timestamp sort'Debugviews.module1220views_get_handler()
'Missing handler: node cid relationship'Debugviews.module1220views_get_handler()
ExpandDrupal\views\Tests\ViewsDataTest1400
MessageGroupFilenameLineFunctionStatus
'Missing handler: views_test_data id field'Debugviews.module1220views_get_handler()
'Missing handler: views_test_data id field'Debugviews.module1220views_get_handler()
'Missing handler: views_test_data id field'Debugviews.module1220views_get_handler()
'Missing handler: views_test_data id field'Debugviews.module1220views_get_handler()
'Missing handler: views_test_data id field'Debugviews.module1220views_get_handler()
'Missing handler: views_test_data id field'Debugviews.module1220views_get_handler()
ExpandDrupal\views\Tests\ViewStorageTest11600
MessageGroupFilenameLineFunctionStatus
'Missing handler: views_test_data id field'Debugviews.module1220views_get_handler()
'Missing handler: views_test_data name field'Debugviews.module1220views_get_handler()
ExpandDrupal\views\Tests\Wizard\BasicTest7800
MessageGroupFilenameLineFunctionStatus
'Missing handler: views_test_data age field'Debugviews.module1220views_get_handler()
'Missing handler: views_test_data id field'Debugviews.module1220views_get_handler()
'Missing handler: views_test_data name field'Debugviews.module1220views_get_handler()
'Missing handler: views_test_data age field'Debugviews.module1220views_get_handler()
'Missing handler: views_test_data id field'Debugviews.module1220views_get_handler()
'Missing handler: views_test_data name field'Debugviews.module1220views_get_handler()
'Missing handler: views_test_data age field'Debugviews.module1220views_get_handler()
'Missing handler: views_test_data id field'Debugviews.module1220views_get_handler()
'Missing handler: views_test_data name field'Debugviews.module1220views_get_handler()
'Missing handler: views_test_data age field'Debugviews.module1220views_get_handler()
'Missing handler: views_test_data id field'Debugviews.module1220views_get_handler()
'Missing handler: views_test_data name field'Debugviews.module1220views_get_handler()
'Missing handler: views_test_data age field'Debugviews.module1220views_get_handler()
'Missing handler: views_test_data id field'Debugviews.module1220views_get_handler()
'Missing handler: views_test_data name field'Debugviews.module1220views_get_handler()
ExpandDrupal\views\Tests\Wizard\ItemsPerPageTest4000
MessageGroupFilenameLineFunctionStatus
'Missing handler: views_test_data age field'Debugviews.module1220views_get_handler()
'Missing handler: views_test_data id field'Debugviews.module1220views_get_handler()
'Missing handler: views_test_data name field'Debugviews.module1220views_get_handler()
'Missing handler: views_test_data age field'Debugviews.module1220views_get_handler()
'Missing handler: views_test_data id field'Debugviews.module1220views_get_handler()
'Missing handler: views_test_data name field'Debugviews.module1220views_get_handler()
ExpandDrupal\views\Tests\Wizard\MenuTest2000
MessageGroupFilenameLineFunctionStatus
'Missing handler: views_test_data age field'Debugviews.module1220views_get_handler()
'Missing handler: views_test_data id field'Debugviews.module1220views_get_handler()
'Missing handler: views_test_data name field'Debugviews.module1220views_get_handler()
ExpandDrupal\views\Tests\Wizard\SortingTest3100
MessageGroupFilenameLineFunctionStatus
'Missing handler: views_test_data age field'Debugviews.module1220views_get_handler()
'Missing handler: views_test_data id field'Debugviews.module1220views_get_handler()
'Missing handler: views_test_data name field'Debugviews.module1220views_get_handler()
'Missing handler: views_test_data age field'Debugviews.module1220views_get_handler()
'Missing handler: views_test_data id field'Debugviews.module1220views_get_handler()
'Missing handler: views_test_data name field'Debugviews.module1220views_get_handler()
ExpandDrupal\views\Tests\Wizard\TaggedWithTest7800
MessageGroupFilenameLineFunctionStatus
'Missing handler: views_test_data age field'Debugviews.module1220views_get_handler()
'Missing handler: views_test_data id field'Debugviews.module1220views_get_handler()
'Missing handler: views_test_data name field'Debugviews.module1220views_get_handler()
'Missing handler: views_test_data age field'Debugviews.module1220views_get_handler()
'Missing handler: views_test_data id field'Debugviews.module1220views_get_handler()
'Missing handler: views_test_data name field'Debugviews.module1220views_get_handler()
'Missing handler: views_test_data age field'Debugviews.module1220views_get_handler()
'Missing handler: views_test_data id field'Debugviews.module1220views_get_handler()
'Missing handler: views_test_data name field'Debugviews.module1220views_get_handler()
'Missing handler: views_test_data age field'Debugviews.module1220views_get_handler()
'Missing handler: views_test_data id field'Debugviews.module1220views_get_handler()
'Missing handler: views_test_data name field'Debugviews.module1220views_get_handler()
'Missing handler: views_test_data age field'Debugviews.module1220views_get_handler()
'Missing handler: views_test_data id field'Debugviews.module1220views_get_handler()
'Missing handler: views_test_data name field'Debugviews.module1220views_get_handler()
'Missing handler: views_test_data age field'Debugviews.module1220views_get_handler()
'Missing handler: views_test_data id field'Debugviews.module1220views_get_handler()
'Missing handler: views_test_data name field'Debugviews.module1220views_get_handler()
LeafDrupal\xmlrpc\Tests\XmlRpcBasicTest900
LeafDrupal\xmlrpc\Tests\XmlRpcMessagesTest700
LeafDrupal\xmlrpc\Tests\XmlRpcValidatorTest1000