1552396-core-voc-78.patch

Test status
StatusResult
Last receivedThu, 10/11/2012 - 13:12:50
Last requestedThu, 10/11/2012 - 13:32:39
Last testedThu, 10/11/2012 - 14:03:05
Test count1
Environment status
MySQLfail
File information
File1552396-core-voc-78.patch
BranchDrupal core - 8.x
LinkIssue Link
SummaryFAILED: [[SimpleTest]]: [MySQL] 41,796 pass(es), 213 fail(s), and 245 exception(s).
Details

MySQL

  1. Setup environment
  2. Detect an invalid patch URL
  3. Detect invalid repository information
  4. Detect invalid patch format
  5. Detect a non-applicable patch
  6. Detect invalid PHP syntax
  7. Detect a Drupal installation failure
  8. Detect a test run failure
  9. Detect a failing test
    Review the test failures below then if necessary run them locally until the problem has been fixed.
  10. Complete test suite with all tests passing
41,796 pass(es), 213 fail(s), and 245 exception(s)

Non-pass

Test namePassFailException
ExpandDrupal\comment\Tests\CommentLanguageTest424424
MessageGroupFilenameLineFunctionStatus
Trying to get property of non-objectNoticeCommentLanguageTest.php113Drupal\comment\Tests\CommentLanguageTest->testCommentLanguage()
Failed to set field subject to dTt8smOtOtherCommentLanguageTest.php113Drupal\comment\Tests\CommentLanguageTest->testCommentLanguage()
Failed to set field comment_body[en][0][value] to pT8PhqT8OtherCommentLanguageTest.php113Drupal\comment\Tests\CommentLanguageTest->testCommentLanguage()
Found the Preview buttonOtherCommentLanguageTest.php113Drupal\comment\Tests\CommentLanguageTest->testCommentLanguage()
Found the requested form fields at node/OtherCommentLanguageTest.php113Drupal\comment\Tests\CommentLanguageTest->testCommentLanguage()
Failed to set field subject to dTt8smOtOtherCommentLanguageTest.php114Drupal\comment\Tests\CommentLanguageTest->testCommentLanguage()
Failed to set field comment_body[en][0][value] to pT8PhqT8OtherCommentLanguageTest.php114Drupal\comment\Tests\CommentLanguageTest->testCommentLanguage()
Found the Save buttonOtherCommentLanguageTest.php114Drupal\comment\Tests\CommentLanguageTest->testCommentLanguage()
Found the requested form fields at OtherCommentLanguageTest.php114Drupal\comment\Tests\CommentLanguageTest->testCommentLanguage()
Trying to get property of non-objectNoticeCommentLanguageTest.php119Drupal\comment\Tests\CommentLanguageTest->testCommentLanguage()
array_flip(): Can only flip STRING and INTEGER values!WarningDatabaseStorageController.php165Drupal\Core\Entity\DatabaseStorageController->load()
Trying to get property of non-objectNoticeCommentLanguageTest.php125Drupal\comment\Tests\CommentLanguageTest->testCommentLanguage()
Trying to get property of non-objectNoticeCommentLanguageTest.php126Drupal\comment\Tests\CommentLanguageTest->testCommentLanguage()
The comment posted with content language en and belonging to the node with language en has language OtherCommentLanguageTest.php126Drupal\comment\Tests\CommentLanguageTest->testCommentLanguage()
Trying to get property of non-objectNoticeCommentLanguageTest.php127Drupal\comment\Tests\CommentLanguageTest->testCommentLanguage()
Comment body correctly stored.OtherCommentLanguageTest.php127Drupal\comment\Tests\CommentLanguageTest->testCommentLanguage()
Trying to get property of non-objectNoticeCommentLanguageTest.php113Drupal\comment\Tests\CommentLanguageTest->testCommentLanguage()
Failed to set field subject to fgFd6ZFtOtherCommentLanguageTest.php113Drupal\comment\Tests\CommentLanguageTest->testCommentLanguage()
Failed to set field comment_body[fr][0][value] to hbbk4TaCOtherCommentLanguageTest.php113Drupal\comment\Tests\CommentLanguageTest->testCommentLanguage()
Found the Preview buttonOtherCommentLanguageTest.php113Drupal\comment\Tests\CommentLanguageTest->testCommentLanguage()
Found the requested form fields at fr/node/OtherCommentLanguageTest.php113Drupal\comment\Tests\CommentLanguageTest->testCommentLanguage()
Failed to set field subject to fgFd6ZFtOtherCommentLanguageTest.php114Drupal\comment\Tests\CommentLanguageTest->testCommentLanguage()
Failed to set field comment_body[fr][0][value] to hbbk4TaCOtherCommentLanguageTest.php114Drupal\comment\Tests\CommentLanguageTest->testCommentLanguage()
Found the Save buttonOtherCommentLanguageTest.php114Drupal\comment\Tests\CommentLanguageTest->testCommentLanguage()
Found the requested form fields at OtherCommentLanguageTest.php114Drupal\comment\Tests\CommentLanguageTest->testCommentLanguage()
Trying to get property of non-objectNoticeCommentLanguageTest.php119Drupal\comment\Tests\CommentLanguageTest->testCommentLanguage()
array_flip(): Can only flip STRING and INTEGER values!WarningDatabaseStorageController.php165Drupal\Core\Entity\DatabaseStorageController->load()
Trying to get property of non-objectNoticeCommentLanguageTest.php125Drupal\comment\Tests\CommentLanguageTest->testCommentLanguage()
Trying to get property of non-objectNoticeCommentLanguageTest.php126Drupal\comment\Tests\CommentLanguageTest->testCommentLanguage()
The comment posted with content language fr and belonging to the node with language en has language OtherCommentLanguageTest.php126Drupal\comment\Tests\CommentLanguageTest->testCommentLanguage()
Trying to get property of non-objectNoticeCommentLanguageTest.php127Drupal\comment\Tests\CommentLanguageTest->testCommentLanguage()
Comment body correctly stored.OtherCommentLanguageTest.php127Drupal\comment\Tests\CommentLanguageTest->testCommentLanguage()
Trying to get property of non-objectNoticeCommentLanguageTest.php113Drupal\comment\Tests\CommentLanguageTest->testCommentLanguage()
Failed to set field subject to fLXAQya6OtherCommentLanguageTest.php113Drupal\comment\Tests\CommentLanguageTest->testCommentLanguage()
Failed to set field comment_body[en][0][value] to dF2bnkNVOtherCommentLanguageTest.php113Drupal\comment\Tests\CommentLanguageTest->testCommentLanguage()
Found the Preview buttonOtherCommentLanguageTest.php113Drupal\comment\Tests\CommentLanguageTest->testCommentLanguage()
Found the requested form fields at node/OtherCommentLanguageTest.php113Drupal\comment\Tests\CommentLanguageTest->testCommentLanguage()
Failed to set field subject to fLXAQya6OtherCommentLanguageTest.php114Drupal\comment\Tests\CommentLanguageTest->testCommentLanguage()
Failed to set field comment_body[en][0][value] to dF2bnkNVOtherCommentLanguageTest.php114Drupal\comment\Tests\CommentLanguageTest->testCommentLanguage()
Found the Save buttonOtherCommentLanguageTest.php114Drupal\comment\Tests\CommentLanguageTest->testCommentLanguage()
Found the requested form fields at OtherCommentLanguageTest.php114Drupal\comment\Tests\CommentLanguageTest->testCommentLanguage()
Trying to get property of non-objectNoticeCommentLanguageTest.php119Drupal\comment\Tests\CommentLanguageTest->testCommentLanguage()
array_flip(): Can only flip STRING and INTEGER values!WarningDatabaseStorageController.php165Drupal\Core\Entity\DatabaseStorageController->load()
Trying to get property of non-objectNoticeCommentLanguageTest.php125Drupal\comment\Tests\CommentLanguageTest->testCommentLanguage()
Trying to get property of non-objectNoticeCommentLanguageTest.php126Drupal\comment\Tests\CommentLanguageTest->testCommentLanguage()
The comment posted with content language en and belonging to the node with language fr has language OtherCommentLanguageTest.php126Drupal\comment\Tests\CommentLanguageTest->testCommentLanguage()
Trying to get property of non-objectNoticeCommentLanguageTest.php127Drupal\comment\Tests\CommentLanguageTest->testCommentLanguage()
Comment body correctly stored.OtherCommentLanguageTest.php127Drupal\comment\Tests\CommentLanguageTest->testCommentLanguage()
Trying to get property of non-objectNoticeCommentLanguageTest.php113Drupal\comment\Tests\CommentLanguageTest->testCommentLanguage()
Failed to set field subject to mOQj5grFOtherCommentLanguageTest.php113Drupal\comment\Tests\CommentLanguageTest->testCommentLanguage()
Failed to set field comment_body[fr][0][value] to iMrzxmeuOtherCommentLanguageTest.php113Drupal\comment\Tests\CommentLanguageTest->testCommentLanguage()
Found the Preview buttonOtherCommentLanguageTest.php113Drupal\comment\Tests\CommentLanguageTest->testCommentLanguage()
Found the requested form fields at fr/node/OtherCommentLanguageTest.php113Drupal\comment\Tests\CommentLanguageTest->testCommentLanguage()
Failed to set field subject to mOQj5grFOtherCommentLanguageTest.php114Drupal\comment\Tests\CommentLanguageTest->testCommentLanguage()
Failed to set field comment_body[fr][0][value] to iMrzxmeuOtherCommentLanguageTest.php114Drupal\comment\Tests\CommentLanguageTest->testCommentLanguage()
Found the Save buttonOtherCommentLanguageTest.php114Drupal\comment\Tests\CommentLanguageTest->testCommentLanguage()
Found the requested form fields at OtherCommentLanguageTest.php114Drupal\comment\Tests\CommentLanguageTest->testCommentLanguage()
Trying to get property of non-objectNoticeCommentLanguageTest.php119Drupal\comment\Tests\CommentLanguageTest->testCommentLanguage()
array_flip(): Can only flip STRING and INTEGER values!WarningDatabaseStorageController.php165Drupal\Core\Entity\DatabaseStorageController->load()
Trying to get property of non-objectNoticeCommentLanguageTest.php125Drupal\comment\Tests\CommentLanguageTest->testCommentLanguage()
Trying to get property of non-objectNoticeCommentLanguageTest.php126Drupal\comment\Tests\CommentLanguageTest->testCommentLanguage()
The comment posted with content language fr and belonging to the node with language fr has language OtherCommentLanguageTest.php126Drupal\comment\Tests\CommentLanguageTest->testCommentLanguage()
Trying to get property of non-objectNoticeCommentLanguageTest.php127Drupal\comment\Tests\CommentLanguageTest->testCommentLanguage()
Comment body correctly stored.OtherCommentLanguageTest.php127Drupal\comment\Tests\CommentLanguageTest->testCommentLanguage()
Raw "pT8PhqT8" foundOtherCommentLanguageTest.php135Drupal\comment\Tests\CommentLanguageTest->testCommentLanguage()
Raw "hbbk4TaC" foundOtherCommentLanguageTest.php135Drupal\comment\Tests\CommentLanguageTest->testCommentLanguage()
Raw "dF2bnkNV" foundOtherCommentLanguageTest.php135Drupal\comment\Tests\CommentLanguageTest->testCommentLanguage()
Raw "iMrzxmeu" foundOtherCommentLanguageTest.php135Drupal\comment\Tests\CommentLanguageTest->testCommentLanguage()
ExpandDrupal\dblog\Tests\DBLogTest494268
MessageGroupFilenameLineFunctionStatus
HTTP response expected 200, actual 500BrowserDBLogTest.php304Drupal\dblog\Tests\DBLogTest->doNode()
Node gQdWRZrL was loadedOtherDBLogTest.php307Drupal\dblog\Tests\DBLogTest->doNode()
Trying to get property of non-objectNoticeDBLogTest.php310Drupal\dblog\Tests\DBLogTest->doNode()
Failed to set field body[und][0][value] to qrZr542DgSrmRL3KnVESDRse0FBYCib0OtherDBLogTest.php310Drupal\dblog\Tests\DBLogTest->doNode()
Found the Save buttonOtherDBLogTest.php310Drupal\dblog\Tests\DBLogTest->doNode()
Found the requested form fields at node//editOtherDBLogTest.php310Drupal\dblog\Tests\DBLogTest->doNode()
HTTP response expected 200, actual 404BrowserDBLogTest.php311Drupal\dblog\Tests\DBLogTest->doNode()
Trying to get property of non-objectNoticeDBLogTest.php313Drupal\dblog\Tests\DBLogTest->doNode()
Found the Delete buttonOtherDBLogTest.php313Drupal\dblog\Tests\DBLogTest->doNode()
Found the requested form fields at node//deleteOtherDBLogTest.php313Drupal\dblog\Tests\DBLogTest->doNode()
HTTP response expected 200, actual 404BrowserDBLogTest.php314Drupal\dblog\Tests\DBLogTest->doNode()
Trying to get property of non-objectNoticeDBLogTest.php316Drupal\dblog\Tests\DBLogTest->doNode()
HTTP response expected 404, actual 200BrowserDBLogTest.php317Drupal\dblog\Tests\DBLogTest->doNode()
DBLog event was recorded: [content added]OtherDBLogTest.php330Drupal\dblog\Tests\DBLogTest->doNode()
DBLog event was recorded: [content updated]OtherDBLogTest.php332Drupal\dblog\Tests\DBLogTest->doNode()
DBLog event was recorded: [content deleted]OtherDBLogTest.php334Drupal\dblog\Tests\DBLogTest->doNode()
Trying to get property of non-objectNoticeDBLogTest.php346Drupal\dblog\Tests\DBLogTest->doNode()
HTTP response expected 200, actual 500BrowserDBLogTest.php304Drupal\dblog\Tests\DBLogTest->doNode()
Node gQdWRZrL was loadedOtherDBLogTest.php307Drupal\dblog\Tests\DBLogTest->doNode()
Trying to get property of non-objectNoticeDBLogTest.php310Drupal\dblog\Tests\DBLogTest->doNode()
Failed to set field body[und][0][value] to qrZr542DgSrmRL3KnVESDRse0FBYCib0OtherDBLogTest.php310Drupal\dblog\Tests\DBLogTest->doNode()
Found the Save buttonOtherDBLogTest.php310Drupal\dblog\Tests\DBLogTest->doNode()
Found the requested form fields at node//editOtherDBLogTest.php310Drupal\dblog\Tests\DBLogTest->doNode()
HTTP response expected 200, actual 404BrowserDBLogTest.php311Drupal\dblog\Tests\DBLogTest->doNode()
Trying to get property of non-objectNoticeDBLogTest.php313Drupal\dblog\Tests\DBLogTest->doNode()
Found the Delete buttonOtherDBLogTest.php313Drupal\dblog\Tests\DBLogTest->doNode()
Found the requested form fields at node//deleteOtherDBLogTest.php313Drupal\dblog\Tests\DBLogTest->doNode()
HTTP response expected 200, actual 404BrowserDBLogTest.php314Drupal\dblog\Tests\DBLogTest->doNode()
Trying to get property of non-objectNoticeDBLogTest.php316Drupal\dblog\Tests\DBLogTest->doNode()
HTTP response expected 404, actual 200BrowserDBLogTest.php317Drupal\dblog\Tests\DBLogTest->doNode()
DBLog event was recorded: [content added]OtherDBLogTest.php330Drupal\dblog\Tests\DBLogTest->doNode()
DBLog event was recorded: [content updated]OtherDBLogTest.php332Drupal\dblog\Tests\DBLogTest->doNode()
DBLog event was recorded: [content deleted]OtherDBLogTest.php334Drupal\dblog\Tests\DBLogTest->doNode()
Trying to get property of non-objectNoticeDBLogTest.php346Drupal\dblog\Tests\DBLogTest->doNode()
ExpandDrupal\file\Tests\FileFieldDisplayTest47118
MessageGroupFilenameLineFunctionStatus
Undefined index: undNoticeFileFieldDisplayTest.php61Drupal\file\Tests\FileFieldDisplayTest->testNodeDisplay()
array_flip(): Can only flip STRING and INTEGER values!WarningDatabaseStorageController.php165Drupal\Core\Entity\DatabaseStorageController->load()
Trying to get property of non-objectNoticefile.module1408theme_file_link()
Trying to get property of non-objectNoticefile.module1410theme_file_link()
array_flip(): Can only flip STRING and INTEGER values!WarningDatabaseStorageController.php165Drupal\Core\Entity\DatabaseStorageController->load()
Trying to get property of non-objectNoticefile.module1447theme_file_icon()
Argument 1 passed to file_icon_url() must be an instance of Drupal\file\File, boolean given, called in /var/lib/drupaltestbot/sites/default/files/checkout/core/modules/file/file.module on line 1448 and definedRecoverable errorfile.module1464file_icon_url()
Argument 1 passed to file_icon_path() must be an instance of Drupal\file\File, boolean given, called in /var/lib/drupaltestbot/sites/default/files/checkout/core/modules/file/file.module on line 1465 and definedRecoverable errorfile.module1484file_icon_path()
Trying to get property of non-objectNoticefile.module1491file_icon_path()
Argument 1 passed to file_icon_map() must be an instance of Drupal\file\File, boolean given, called in /var/lib/drupaltestbot/sites/default/files/checkout/core/modules/file/file.module on line 1498 and definedRecoverable errorfile.module1533file_icon_map()
Trying to get property of non-objectNoticefile.module1534file_icon_map()
Trying to get property of non-objectNoticefile.module1506file_icon_path()
Trying to get property of non-objectNoticefile.module1506file_icon_path()
Trying to get property of non-objectNoticefile.module1506file_icon_path()
Trying to get property of non-objectNoticefile.module1506file_icon_path()
Trying to get property of non-objectNoticefile.module1416theme_file_link()
Trying to get property of non-objectNoticefile.module1416theme_file_link()
Trying to get property of non-objectNoticefile.module1422theme_file_link()
Default formatter displaying correctly on full node view.OtherFileFieldDisplayTest.php63Drupal\file\Tests\FileFieldDisplayTest->testNodeDisplay()
ExpandDrupal\file\Tests\FileFieldPathTest21312
MessageGroupFilenameLineFunctionStatus
Undefined index: undNoticeFileFieldPathTest.php36Drupal\file\Tests\FileFieldPathTest->testUploadPath()
array_flip(): Can only flip STRING and INTEGER values!WarningDatabaseStorageController.php165Drupal\Core\Entity\DatabaseStorageController->load()
Trying to get property of non-objectNoticeFileFieldPathTest.php37Drupal\file\Tests\FileFieldPathTest->testUploadPath()
Trying to get property of non-objectNoticeFileFieldPathTest.php37Drupal\file\Tests\FileFieldPathTest->testUploadPath()
The file was uploaded to the correct path.OtherFileFieldPathTest.php37Drupal\file\Tests\FileFieldPathTest->testUploadPath()
Undefined index: undNoticeFileFieldPathTest.php47Drupal\file\Tests\FileFieldPathTest->testUploadPath()
array_flip(): Can only flip STRING and INTEGER values!WarningDatabaseStorageController.php165Drupal\Core\Entity\DatabaseStorageController->load()
Trying to get property of non-objectNoticeFileFieldPathTest.php48Drupal\file\Tests\FileFieldPathTest->testUploadPath()
Trying to get property of non-objectNoticeFileFieldPathTest.php48Drupal\file\Tests\FileFieldPathTest->testUploadPath()
The file was uploaded to the correct path.OtherFileFieldPathTest.php48Drupal\file\Tests\FileFieldPathTest->testUploadPath()
Undefined index: undNoticeFileFieldPathTest.php59Drupal\file\Tests\FileFieldPathTest->testUploadPath()
array_flip(): Can only flip STRING and INTEGER values!WarningDatabaseStorageController.php165Drupal\Core\Entity\DatabaseStorageController->load()
Trying to get property of non-objectNoticeFileFieldPathTest.php64Drupal\file\Tests\FileFieldPathTest->testUploadPath()
Trying to get property of non-objectNoticeFileFieldPathTest.php64Drupal\file\Tests\FileFieldPathTest->testUploadPath()
The file was uploaded to the correct path with token replacements.OtherFileFieldPathTest.php64Drupal\file\Tests\FileFieldPathTest->testUploadPath()
ExpandDrupal\file\Tests\FileFieldRevisionTest311641
MessageGroupFilenameLineFunctionStatus
Undefined index: undNoticeFileFieldRevisionTest.php50Drupal\file\Tests\FileFieldRevisionTest->testRevisions()
array_flip(): Can only flip STRING and INTEGER values!WarningDatabaseStorageController.php165Drupal\Core\Entity\DatabaseStorageController->load()
Trying to get property of non-objectNoticeFileFieldTestBase.php189Drupal\file\Tests\FileFieldTestBase->assertFileExists()
New file saved to disk on node creation.OtherFileFieldRevisionTest.php52Drupal\file\Tests\FileFieldRevisionTest->testRevisions()
Trying to get property of non-objectNoticeFileFieldTestBase.php197Drupal\file\Tests\FileFieldTestBase->assertFileEntryExists()
array_flip(): Can only flip STRING and INTEGER values!WarningDatabaseStorageController.php165Drupal\Core\Entity\DatabaseStorageController->load()
Trying to get property of non-objectNoticeFileFieldTestBase.php199Drupal\file\Tests\FileFieldTestBase->assertFileEntryExists()
Trying to get property of non-objectNoticeFileFieldTestBase.php199Drupal\file\Tests\FileFieldTestBase->assertFileEntryExists()
Trying to get property of non-objectNoticeFileFieldTestBase.php224Drupal\file\Tests\FileFieldTestBase->assertFileIsPermanent()
File is permanent.OtherFileFieldRevisionTest.php54Drupal\file\Tests\FileFieldRevisionTest->testRevisions()
Found the Remove buttonOtherFileFieldTestBase.php180Drupal\file\Tests\FileFieldTestBase->replaceNodeFile()
Found the requested form fields at node/1/editOtherFileFieldTestBase.php180Drupal\file\Tests\FileFieldTestBase->replaceNodeFile()
Undefined index: undNoticeFileFieldRevisionTest.php59Drupal\file\Tests\FileFieldRevisionTest->testRevisions()
array_flip(): Can only flip STRING and INTEGER values!WarningDatabaseStorageController.php165Drupal\Core\Entity\DatabaseStorageController->load()
Trying to get property of non-objectNoticeFileFieldTestBase.php189Drupal\file\Tests\FileFieldTestBase->assertFileExists()
Replacement file exists on disk after creating new revision.OtherFileFieldRevisionTest.php61Drupal\file\Tests\FileFieldRevisionTest->testRevisions()
Trying to get property of non-objectNoticeFileFieldTestBase.php197Drupal\file\Tests\FileFieldTestBase->assertFileEntryExists()
array_flip(): Can only flip STRING and INTEGER values!WarningDatabaseStorageController.php165Drupal\Core\Entity\DatabaseStorageController->load()
Trying to get property of non-objectNoticeFileFieldTestBase.php199Drupal\file\Tests\FileFieldTestBase->assertFileEntryExists()
Trying to get property of non-objectNoticeFileFieldTestBase.php199Drupal\file\Tests\FileFieldTestBase->assertFileEntryExists()
Trying to get property of non-objectNoticeFileFieldTestBase.php224Drupal\file\Tests\FileFieldTestBase->assertFileIsPermanent()
Replacement file is permanent.OtherFileFieldRevisionTest.php63Drupal\file\Tests\FileFieldRevisionTest->testRevisions()
Undefined index: undNoticeFileFieldRevisionTest.php67Drupal\file\Tests\FileFieldRevisionTest->testRevisions()
array_flip(): Can only flip STRING and INTEGER values!WarningDatabaseStorageController.php165Drupal\Core\Entity\DatabaseStorageController->load()
Trying to get property of non-objectNoticeFileFieldTestBase.php189Drupal\file\Tests\FileFieldTestBase->assertFileExists()
Original file still in place after replacing file in new revision.OtherFileFieldRevisionTest.php68Drupal\file\Tests\FileFieldRevisionTest->testRevisions()
Trying to get property of non-objectNoticeFileFieldTestBase.php197Drupal\file\Tests\FileFieldTestBase->assertFileEntryExists()
array_flip(): Can only flip STRING and INTEGER values!WarningDatabaseStorageController.php165Drupal\Core\Entity\DatabaseStorageController->load()
Trying to get property of non-objectNoticeFileFieldTestBase.php199Drupal\file\Tests\FileFieldTestBase->assertFileEntryExists()
Trying to get property of non-objectNoticeFileFieldTestBase.php199Drupal\file\Tests\FileFieldTestBase->assertFileEntryExists()
Trying to get property of non-objectNoticeFileFieldTestBase.php224Drupal\file\Tests\FileFieldTestBase->assertFileIsPermanent()
Original file is still permanent.OtherFileFieldRevisionTest.php70Drupal\file\Tests\FileFieldRevisionTest->testRevisions()
Undefined index: undNoticeFileFieldRevisionTest.php76Drupal\file\Tests\FileFieldRevisionTest->testRevisions()
array_flip(): Can only flip STRING and INTEGER values!WarningDatabaseStorageController.php165Drupal\Core\Entity\DatabaseStorageController->load()
Trying to get property of non-objectNoticeFileFieldTestBase.php224Drupal\file\Tests\FileFieldTestBase->assertFileIsPermanent()
New revision file is permanent.OtherFileFieldRevisionTest.php79Drupal\file\Tests\FileFieldRevisionTest->testRevisions()
Found the Revert buttonOtherFileFieldRevisionTest.php82Drupal\file\Tests\FileFieldRevisionTest->testRevisions()
Found the requested form fields at node/1/revisions/2/revertOtherFileFieldRevisionTest.php82Drupal\file\Tests\FileFieldRevisionTest->testRevisions()
Undefined index: undNoticeFileFieldRevisionTest.php84Drupal\file\Tests\FileFieldRevisionTest->testRevisions()
array_flip(): Can only flip STRING and INTEGER values!WarningDatabaseStorageController.php165Drupal\Core\Entity\DatabaseStorageController->load()
Trying to get property of non-objectNoticeFileFieldTestBase.php224Drupal\file\Tests\FileFieldTestBase->assertFileIsPermanent()
Original revision file still permanent after reverting to the original revision.OtherFileFieldRevisionTest.php87Drupal\file\Tests\FileFieldRevisionTest->testRevisions()
Found the Delete buttonOtherFileFieldRevisionTest.php91Drupal\file\Tests\FileFieldRevisionTest->testRevisions()
Found the requested form fields at node/1/revisions/2/deleteOtherFileFieldRevisionTest.php91Drupal\file\Tests\FileFieldRevisionTest->testRevisions()
Trying to get property of non-objectNoticeFileFieldTestBase.php189Drupal\file\Tests\FileFieldTestBase->assertFileExists()
Second file is still available after deleting second revision, since it is being used by the third revision.OtherFileFieldRevisionTest.php92Drupal\file\Tests\FileFieldRevisionTest->testRevisions()
Trying to get property of non-objectNoticeFileFieldTestBase.php197Drupal\file\Tests\FileFieldTestBase->assertFileEntryExists()
array_flip(): Can only flip STRING and INTEGER values!WarningDatabaseStorageController.php165Drupal\Core\Entity\DatabaseStorageController->load()
Trying to get property of non-objectNoticeFileFieldTestBase.php199Drupal\file\Tests\FileFieldTestBase->assertFileEntryExists()
Trying to get property of non-objectNoticeFileFieldTestBase.php199Drupal\file\Tests\FileFieldTestBase->assertFileEntryExists()
Trying to get property of non-objectNoticeFileFieldTestBase.php224Drupal\file\Tests\FileFieldTestBase->assertFileIsPermanent()
Second file entry is still permanent after deleting second revision, since it is being used by the third revision.OtherFileFieldRevisionTest.php94Drupal\file\Tests\FileFieldRevisionTest->testRevisions()
Trying to get property of non-objectNoticeFileFieldRevisionTest.php98Drupal\file\Tests\FileFieldRevisionTest->testRevisions()
array_flip(): Can only flip STRING and INTEGER values!WarningDatabaseStorageController.php165Drupal\Core\Entity\DatabaseStorageController->load()
Argument 1 passed to file_usage_add() must be an instance of Drupal\file\File, boolean given, called in /var/lib/drupaltestbot/sites/default/files/checkout/core/modules/file/file.field.inc on line 263 and definedRecoverable errorfile.module193file_usage_add()
Trying to get property of non-objectNoticefile.module196file_usage_add()
Drupal\Core\Entity\EntityStorageException: SQLSTATE[23000]: Integrity constraint violation: 1048 Column 'fid' cannot be null: INSERT INTO {file_usage} (fid, module, type, id, count) VALUES (:db_insert_placeholder_0, :db_insert_placeholder_1, :db_insert_placeholder_2, :db_insert_placeholder_3, :db_insert_placeholder_4); Array ( [:db_insert_placeholder_0] => [:db_insert_placeholder_1] => file [:db_insert_placeholder_2] => user [:db_insert_placeholder_3] => 3 [:db_insert_placeholder_4] => 1 ) in Drupal\Core\Entity\DatabaseStorageController->save() (line 505 of /var/lib/drupaltestbot/sites/default/files/checkout/core/lib/Drupal/Core/Entity/DatabaseStorageController.php).Uncaught exceptionDatabaseStorageController.php505Drupal\Core\Entity\DatabaseStorageController->save()
ExpandDrupal\file\Tests\FileFieldValidateTest901456
MessageGroupFilenameLineFunctionStatus
Node save failed when required file field was empty.OtherFileFieldValidateTest.php41Drupal\file\Tests\FileFieldValidateTest->testRequired()
Undefined index: undNoticeFileFieldValidateTest.php49Drupal\file\Tests\FileFieldValidateTest->testRequired()
array_flip(): Can only flip STRING and INTEGER values!WarningDatabaseStorageController.php165Drupal\Core\Entity\DatabaseStorageController->load()
Trying to get property of non-objectNoticeFileFieldTestBase.php189Drupal\file\Tests\FileFieldTestBase->assertFileExists()
File exists after uploading to the required field.OtherFileFieldValidateTest.php50Drupal\file\Tests\FileFieldValidateTest->testRequired()
Trying to get property of non-objectNoticeFileFieldTestBase.php197Drupal\file\Tests\FileFieldTestBase->assertFileEntryExists()
array_flip(): Can only flip STRING and INTEGER values!WarningDatabaseStorageController.php165Drupal\Core\Entity\DatabaseStorageController->load()
Trying to get property of non-objectNoticeFileFieldTestBase.php199Drupal\file\Tests\FileFieldTestBase->assertFileEntryExists()
Trying to get property of non-objectNoticeFileFieldTestBase.php199Drupal\file\Tests\FileFieldTestBase->assertFileEntryExists()
Node save failed when required multiple value file field was empty.OtherFileFieldValidateTest.php60Drupal\file\Tests\FileFieldValidateTest->testRequired()
Undefined index: undNoticeFileFieldValidateTest.php65Drupal\file\Tests\FileFieldValidateTest->testRequired()
array_flip(): Can only flip STRING and INTEGER values!WarningDatabaseStorageController.php165Drupal\Core\Entity\DatabaseStorageController->load()
Trying to get property of non-objectNoticeFileFieldTestBase.php189Drupal\file\Tests\FileFieldTestBase->assertFileExists()
File exists after uploading to the required multiple value field.OtherFileFieldValidateTest.php66Drupal\file\Tests\FileFieldValidateTest->testRequired()
Trying to get property of non-objectNoticeFileFieldTestBase.php197Drupal\file\Tests\FileFieldTestBase->assertFileEntryExists()
array_flip(): Can only flip STRING and INTEGER values!WarningDatabaseStorageController.php165Drupal\Core\Entity\DatabaseStorageController->load()
Trying to get property of non-objectNoticeFileFieldTestBase.php199Drupal\file\Tests\FileFieldTestBase->assertFileEntryExists()
Trying to get property of non-objectNoticeFileFieldTestBase.php199Drupal\file\Tests\FileFieldTestBase->assertFileEntryExists()
Undefined index: undNoticeFileFieldValidateTest.php101Drupal\file\Tests\FileFieldValidateTest->testFileMaxSize()
array_flip(): Can only flip STRING and INTEGER values!WarningDatabaseStorageController.php165Drupal\Core\Entity\DatabaseStorageController->load()
Trying to get property of non-objectNoticeFileFieldTestBase.php189Drupal\file\Tests\FileFieldTestBase->assertFileExists()
File exists after uploading a file (128 KB) under the max limit (1M).OtherFileFieldValidateTest.php102Drupal\file\Tests\FileFieldValidateTest->testFileMaxSize()
Trying to get property of non-objectNoticeFileFieldTestBase.php197Drupal\file\Tests\FileFieldTestBase->assertFileEntryExists()
array_flip(): Can only flip STRING and INTEGER values!WarningDatabaseStorageController.php165Drupal\Core\Entity\DatabaseStorageController->load()
Trying to get property of non-objectNoticeFileFieldTestBase.php199Drupal\file\Tests\FileFieldTestBase->assertFileEntryExists()
Trying to get property of non-objectNoticeFileFieldTestBase.php199Drupal\file\Tests\FileFieldTestBase->assertFileEntryExists()
Node save failed when file (1.25 MB) exceeded the max upload size (1M).OtherFileFieldValidateTest.php108Drupal\file\Tests\FileFieldValidateTest->testFileMaxSize()
Undefined index: undNoticeFileFieldValidateTest.php101Drupal\file\Tests\FileFieldValidateTest->testFileMaxSize()
array_flip(): Can only flip STRING and INTEGER values!WarningDatabaseStorageController.php165Drupal\Core\Entity\DatabaseStorageController->load()
Trying to get property of non-objectNoticeFileFieldTestBase.php189Drupal\file\Tests\FileFieldTestBase->assertFileExists()
File exists after uploading a file (128 KB) under the max limit (1024K).OtherFileFieldValidateTest.php102Drupal\file\Tests\FileFieldValidateTest->testFileMaxSize()
Trying to get property of non-objectNoticeFileFieldTestBase.php197Drupal\file\Tests\FileFieldTestBase->assertFileEntryExists()
array_flip(): Can only flip STRING and INTEGER values!WarningDatabaseStorageController.php165Drupal\Core\Entity\DatabaseStorageController->load()
Trying to get property of non-objectNoticeFileFieldTestBase.php199Drupal\file\Tests\FileFieldTestBase->assertFileEntryExists()
Trying to get property of non-objectNoticeFileFieldTestBase.php199Drupal\file\Tests\FileFieldTestBase->assertFileEntryExists()
Node save failed when file (1.25 MB) exceeded the max upload size (1024K).OtherFileFieldValidateTest.php108Drupal\file\Tests\FileFieldValidateTest->testFileMaxSize()
Undefined index: undNoticeFileFieldValidateTest.php101Drupal\file\Tests\FileFieldValidateTest->testFileMaxSize()
array_flip(): Can only flip STRING and INTEGER values!WarningDatabaseStorageController.php165Drupal\Core\Entity\DatabaseStorageController->load()
Trying to get property of non-objectNoticeFileFieldTestBase.php189Drupal\file\Tests\FileFieldTestBase->assertFileExists()
File exists after uploading a file (128 KB) under the max limit (1048576).OtherFileFieldValidateTest.php102Drupal\file\Tests\FileFieldValidateTest->testFileMaxSize()
Trying to get property of non-objectNoticeFileFieldTestBase.php197Drupal\file\Tests\FileFieldTestBase->assertFileEntryExists()
array_flip(): Can only flip STRING and INTEGER values!WarningDatabaseStorageController.php165Drupal\Core\Entity\DatabaseStorageController->load()
Trying to get property of non-objectNoticeFileFieldTestBase.php199Drupal\file\Tests\FileFieldTestBase->assertFileEntryExists()
Trying to get property of non-objectNoticeFileFieldTestBase.php199Drupal\file\Tests\FileFieldTestBase->assertFileEntryExists()
Node save failed when file (1.25 MB) exceeded the max upload size (1048576).OtherFileFieldValidateTest.php108Drupal\file\Tests\FileFieldValidateTest->testFileMaxSize()
Undefined index: undNoticeFileFieldValidateTest.php117Drupal\file\Tests\FileFieldValidateTest->testFileMaxSize()
array_flip(): Can only flip STRING and INTEGER values!WarningDatabaseStorageController.php165Drupal\Core\Entity\DatabaseStorageController->load()
Trying to get property of non-objectNoticeFileFieldTestBase.php189Drupal\file\Tests\FileFieldTestBase->assertFileExists()
File exists after uploading a file (1.25 MB) with no max limit.OtherFileFieldValidateTest.php118Drupal\file\Tests\FileFieldValidateTest->testFileMaxSize()
Trying to get property of non-objectNoticeFileFieldTestBase.php197Drupal\file\Tests\FileFieldTestBase->assertFileEntryExists()
array_flip(): Can only flip STRING and INTEGER values!WarningDatabaseStorageController.php165Drupal\Core\Entity\DatabaseStorageController->load()
Trying to get property of non-objectNoticeFileFieldTestBase.php199Drupal\file\Tests\FileFieldTestBase->assertFileEntryExists()
Trying to get property of non-objectNoticeFileFieldTestBase.php199Drupal\file\Tests\FileFieldTestBase->assertFileEntryExists()
Undefined index: undNoticeFileFieldValidateTest.php144Drupal\file\Tests\FileFieldValidateTest->testFileExtension()
array_flip(): Can only flip STRING and INTEGER values!WarningDatabaseStorageController.php165Drupal\Core\Entity\DatabaseStorageController->load()
Trying to get property of non-objectNoticeFileFieldTestBase.php189Drupal\file\Tests\FileFieldTestBase->assertFileExists()
File exists after uploading a file with no extension checking.OtherFileFieldValidateTest.php145Drupal\file\Tests\FileFieldValidateTest->testFileExtension()
Trying to get property of non-objectNoticeFileFieldTestBase.php197Drupal\file\Tests\FileFieldTestBase->assertFileEntryExists()
array_flip(): Can only flip STRING and INTEGER values!WarningDatabaseStorageController.php165Drupal\Core\Entity\DatabaseStorageController->load()
Trying to get property of non-objectNoticeFileFieldTestBase.php199Drupal\file\Tests\FileFieldTestBase->assertFileEntryExists()
Trying to get property of non-objectNoticeFileFieldTestBase.php199Drupal\file\Tests\FileFieldTestBase->assertFileEntryExists()
Node save failed when file uploaded with the wrong extension.OtherFileFieldValidateTest.php154Drupal\file\Tests\FileFieldValidateTest->testFileExtension()
Undefined index: undNoticeFileFieldValidateTest.php162Drupal\file\Tests\FileFieldValidateTest->testFileExtension()
array_flip(): Can only flip STRING and INTEGER values!WarningDatabaseStorageController.php165Drupal\Core\Entity\DatabaseStorageController->load()
Trying to get property of non-objectNoticeFileFieldTestBase.php189Drupal\file\Tests\FileFieldTestBase->assertFileExists()
File exists after uploading a file with extension checking.OtherFileFieldValidateTest.php163Drupal\file\Tests\FileFieldValidateTest->testFileExtension()
Trying to get property of non-objectNoticeFileFieldTestBase.php197Drupal\file\Tests\FileFieldTestBase->assertFileEntryExists()
array_flip(): Can only flip STRING and INTEGER values!WarningDatabaseStorageController.php165Drupal\Core\Entity\DatabaseStorageController->load()
Trying to get property of non-objectNoticeFileFieldTestBase.php199Drupal\file\Tests\FileFieldTestBase->assertFileEntryExists()
Trying to get property of non-objectNoticeFileFieldTestBase.php199Drupal\file\Tests\FileFieldTestBase->assertFileEntryExists()
ExpandDrupal\file\Tests\FileFieldWidgetTest293711
MessageGroupFilenameLineFunctionStatus
simplexml_import_dom(): Invalid Nodetype to importWarningWebTestBase.php1039Drupal\simpletest\WebTestBase->parse()
Parsed page successfully.BrowserFileFieldWidgetTest.php280Drupal\file\Tests\FileFieldWidgetTest->testPrivateFileComment()
Undefined offset: 1NoticeFileFieldWidgetTest.php284Drupal\file\Tests\FileFieldWidgetTest->testPrivateFileComment()
array_flip(): Can only flip STRING and INTEGER values!WarningDatabaseStorageController.php165Drupal\Core\Entity\DatabaseStorageController->load()
Trying to get property of non-objectNoticeFileFieldWidgetTest.php290Drupal\file\Tests\FileFieldWidgetTest->testPrivateFileComment()
array_flip(): Can only flip STRING and INTEGER values!WarningDatabaseStorageController.php165Drupal\Core\Entity\DatabaseStorageController->load()
Trying to get property of non-objectNoticeFileFieldTestBase.php189Drupal\file\Tests\FileFieldTestBase->assertFileExists()
New file saved to disk on node creation.OtherFileFieldWidgetTest.php291Drupal\file\Tests\FileFieldWidgetTest->testPrivateFileComment()
Trying to get property of non-objectNoticeFileFieldWidgetTest.php293Drupal\file\Tests\FileFieldWidgetTest->testPrivateFileComment()
Trying to get property of non-objectNoticeFileFieldWidgetTest.php295Drupal\file\Tests\FileFieldWidgetTest->testPrivateFileComment()
Trying to get property of non-objectNoticeFileFieldWidgetTest.php300Drupal\file\Tests\FileFieldWidgetTest->testPrivateFileComment()
Confirmed that access is denied for the file without the needed permission.BrowserFileFieldWidgetTest.php301Drupal\file\Tests\FileFieldWidgetTest->testPrivateFileComment()
Trying to get property of non-objectNoticeFileFieldWidgetTest.php308Drupal\file\Tests\FileFieldWidgetTest->testPrivateFileComment()
Failed to set field status to OtherFileFieldWidgetTest.php308Drupal\file\Tests\FileFieldWidgetTest->testPrivateFileComment()
Found the Save buttonOtherFileFieldWidgetTest.php308Drupal\file\Tests\FileFieldWidgetTest->testPrivateFileComment()
Found the requested form fields at node//editOtherFileFieldWidgetTest.php308Drupal\file\Tests\FileFieldWidgetTest->testPrivateFileComment()
Trying to get property of non-objectNoticeFileFieldWidgetTest.php312Drupal\file\Tests\FileFieldWidgetTest->testPrivateFileComment()
Confirmed that access is denied for the file without the needed permission.BrowserFileFieldWidgetTest.php313Drupal\file\Tests\FileFieldWidgetTest->testPrivateFileComment()
ExpandDrupal\file\Tests\FileTokenReplaceTest132119
MessageGroupFilenameLineFunctionStatus
Undefined index: undNoticeFileTokenReplaceTest.php49Drupal\file\Tests\FileTokenReplaceTest->testFileTokenReplacement()
array_flip(): Can only flip STRING and INTEGER values!WarningDatabaseStorageController.php165Drupal\Core\Entity\DatabaseStorageController->load()
Trying to get property of non-objectNoticeFileTokenReplaceTest.php53Drupal\file\Tests\FileTokenReplaceTest->testFileTokenReplacement()
Trying to get property of non-objectNoticeFileTokenReplaceTest.php54Drupal\file\Tests\FileTokenReplaceTest->testFileTokenReplacement()
Trying to get property of non-objectNoticeFileTokenReplaceTest.php55Drupal\file\Tests\FileTokenReplaceTest->testFileTokenReplacement()
Trying to get property of non-objectNoticeFileTokenReplaceTest.php56Drupal\file\Tests\FileTokenReplaceTest->testFileTokenReplacement()
Trying to get property of non-objectNoticeFileTokenReplaceTest.php57Drupal\file\Tests\FileTokenReplaceTest->testFileTokenReplacement()
Trying to get property of non-objectNoticeFileTokenReplaceTest.php58Drupal\file\Tests\FileTokenReplaceTest->testFileTokenReplacement()
Trying to get property of non-objectNoticeFileTokenReplaceTest.php59Drupal\file\Tests\FileTokenReplaceTest->testFileTokenReplacement()
date_timezone_set() expects parameter 1 to be DateTime, boolean givenWarningcommon.inc1981format_date()
date_format() expects parameter 1 to be DateTime, boolean givenWarningcommon.inc1991format_date()
Trying to get property of non-objectNoticeFileTokenReplaceTest.php60Drupal\file\Tests\FileTokenReplaceTest->testFileTokenReplacement()
date_timezone_set() expects parameter 1 to be DateTime, boolean givenWarningcommon.inc1981format_date()
date_format() expects parameter 1 to be DateTime, boolean givenWarningcommon.inc1991format_date()
Trying to get property of non-objectNoticeFileTokenReplaceTest.php62Drupal\file\Tests\FileTokenReplaceTest->testFileTokenReplacement()
No empty tokens generated.OtherFileTokenReplaceTest.php65Drupal\file\Tests\FileTokenReplaceTest->testFileTokenReplacement()
Sanitized file token [file:fid] replaced.OtherFileTokenReplaceTest.php69Drupal\file\Tests\FileTokenReplaceTest->testFileTokenReplacement()
Sanitized file token [file:name] replaced.OtherFileTokenReplaceTest.php69Drupal\file\Tests\FileTokenReplaceTest->testFileTokenReplacement()
Sanitized file token [file:path] replaced.OtherFileTokenReplaceTest.php69Drupal\file\Tests\FileTokenReplaceTest->testFileTokenReplacement()
Sanitized file token [file:mime] replaced.OtherFileTokenReplaceTest.php69Drupal\file\Tests\FileTokenReplaceTest->testFileTokenReplacement()
Sanitized file token [file:size] replaced.OtherFileTokenReplaceTest.php69Drupal\file\Tests\FileTokenReplaceTest->testFileTokenReplacement()
Sanitized file token [file:url] replaced.OtherFileTokenReplaceTest.php69Drupal\file\Tests\FileTokenReplaceTest->testFileTokenReplacement()
Sanitized file token [file:timestamp] replaced.OtherFileTokenReplaceTest.php69Drupal\file\Tests\FileTokenReplaceTest->testFileTokenReplacement()
Sanitized file token [file:timestamp:short] replaced.OtherFileTokenReplaceTest.php69Drupal\file\Tests\FileTokenReplaceTest->testFileTokenReplacement()
Sanitized file token [file:owner] replaced.OtherFileTokenReplaceTest.php69Drupal\file\Tests\FileTokenReplaceTest->testFileTokenReplacement()
Sanitized file token [file:owner:uid] replaced.OtherFileTokenReplaceTest.php69Drupal\file\Tests\FileTokenReplaceTest->testFileTokenReplacement()
Trying to get property of non-objectNoticeFileTokenReplaceTest.php73Drupal\file\Tests\FileTokenReplaceTest->testFileTokenReplacement()
Trying to get property of non-objectNoticeFileTokenReplaceTest.php74Drupal\file\Tests\FileTokenReplaceTest->testFileTokenReplacement()
Trying to get property of non-objectNoticeFileTokenReplaceTest.php75Drupal\file\Tests\FileTokenReplaceTest->testFileTokenReplacement()
Trying to get property of non-objectNoticeFileTokenReplaceTest.php76Drupal\file\Tests\FileTokenReplaceTest->testFileTokenReplacement()
Unsanitized file token [file:fid] replaced.OtherFileTokenReplaceTest.php80Drupal\file\Tests\FileTokenReplaceTest->testFileTokenReplacement()
Unsanitized file token [file:name] replaced.OtherFileTokenReplaceTest.php80Drupal\file\Tests\FileTokenReplaceTest->testFileTokenReplacement()
Unsanitized file token [file:path] replaced.OtherFileTokenReplaceTest.php80Drupal\file\Tests\FileTokenReplaceTest->testFileTokenReplacement()
Unsanitized file token [file:mime] replaced.OtherFileTokenReplaceTest.php80Drupal\file\Tests\FileTokenReplaceTest->testFileTokenReplacement()
Unsanitized file token [file:size] replaced.OtherFileTokenReplaceTest.php80Drupal\file\Tests\FileTokenReplaceTest->testFileTokenReplacement()
Unsanitized file token [file:url] replaced.OtherFileTokenReplaceTest.php80Drupal\file\Tests\FileTokenReplaceTest->testFileTokenReplacement()
Unsanitized file token [file:timestamp] replaced.OtherFileTokenReplaceTest.php80Drupal\file\Tests\FileTokenReplaceTest->testFileTokenReplacement()
Unsanitized file token [file:timestamp:short] replaced.OtherFileTokenReplaceTest.php80Drupal\file\Tests\FileTokenReplaceTest->testFileTokenReplacement()
Unsanitized file token [file:owner] replaced.OtherFileTokenReplaceTest.php80Drupal\file\Tests\FileTokenReplaceTest->testFileTokenReplacement()
Unsanitized file token [file:owner:uid] replaced.OtherFileTokenReplaceTest.php80Drupal\file\Tests\FileTokenReplaceTest->testFileTokenReplacement()
ExpandDrupal\node\Tests\NodeAccessBaseTableTest101140
MessageGroupFilenameLineFunctionStatus
The private status of the node was properly set in the node_access_test table.OtherNodeAccessBaseTableTest.php87Drupal\node\Tests\NodeAccessBaseTableTest->testNodeAccessBasic()
The private status of the node was properly set in the node_access_test table.OtherNodeAccessBaseTableTest.php87Drupal\node\Tests\NodeAccessBaseTableTest->testNodeAccessBasic()
Public tid was foundOtherNodeAccessBaseTableTest.php97Drupal\node\Tests\NodeAccessBaseTableTest->testNodeAccessBasic()
Private tid was foundOtherNodeAccessBaseTableTest.php98Drupal\node\Tests\NodeAccessBaseTableTest->testNodeAccessBasic()
A private node by user 2 is visible for user 2.BrowserNodeAccessBaseTableTest.php116Drupal\node\Tests\NodeAccessBaseTableTest->testNodeAccessBasic()
A private node by user 3 is not visible for user 2.BrowserNodeAccessBaseTableTest.php116Drupal\node\Tests\NodeAccessBaseTableTest->testNodeAccessBasic()
A private node by user 2 is not visible for user 2 on the private page.OtherNodeAccessBaseTableTest.php122Drupal\node\Tests\NodeAccessBaseTableTest->testNodeAccessBasic()
A private node by user 2 is not visible for user 3.BrowserNodeAccessBaseTableTest.php116Drupal\node\Tests\NodeAccessBaseTableTest->testNodeAccessBasic()
A private node by user 3 is visible for user 3.BrowserNodeAccessBaseTableTest.php116Drupal\node\Tests\NodeAccessBaseTableTest->testNodeAccessBasic()
A private node by user 3 is not visible for user 3 on the private page.OtherNodeAccessBaseTableTest.php122Drupal\node\Tests\NodeAccessBaseTableTest->testNodeAccessBasic()
HTTP response expected 200, actual 404BrowserNodeAccessBaseTableTest.php132Drupal\node\Tests\NodeAccessBaseTableTest->testNodeAccessBasic()
HTTP response expected 200, actual 404BrowserNodeAccessBaseTableTest.php132Drupal\node\Tests\NodeAccessBaseTableTest->testNodeAccessBasic()
A private node by user 2 is not visible for user 3 on the private page.OtherNodeAccessBaseTableTest.php138Drupal\node\Tests\NodeAccessBaseTableTest->testNodeAccessBasic()
A private node by user 3 is not visible for user 3 on the private page.OtherNodeAccessBaseTableTest.php138Drupal\node\Tests\NodeAccessBaseTableTest->testNodeAccessBasic()
ExpandDrupal\rdf\Tests\RdfaMarkupTest2562
MessageGroupFilenameLineFunctionStatus
Attribute 'rel' set on file field. Attribute 'resource' is also set.OtherRdfaMarkupTest.php161Drupal\rdf\Tests\RdfaMarkupTest->testAttributesInMarkupFile()
Attribute 'rel' set on image field. Attribute 'resource' is also set.OtherRdfaMarkupTest.php167Drupal\rdf\Tests\RdfaMarkupTest->testAttributesInMarkupFile()
simplexml_import_dom(): Invalid Nodetype to importWarningWebTestBase.php1039Drupal\simpletest\WebTestBase->parse()
Parsed page successfully.BrowserRdfaMarkupTest.php180Drupal\rdf\Tests\RdfaMarkupTest->testAttributesInMarkupFile()
Property dc:subject is present for the tag1 field item.OtherRdfaMarkupTest.php181Drupal\rdf\Tests\RdfaMarkupTest->testAttributesInMarkupFile()
simplexml_import_dom(): Invalid Nodetype to importWarningWebTestBase.php1039Drupal\simpletest\WebTestBase->parse()
Parsed page successfully.BrowserRdfaMarkupTest.php185Drupal\rdf\Tests\RdfaMarkupTest->testAttributesInMarkupFile()
Property dc:subject is present for the tag2 field item.OtherRdfaMarkupTest.php186Drupal\rdf\Tests\RdfaMarkupTest->testAttributesInMarkupFile()
ExpandDrupal\system\Tests\Menu\BreadcrumbTest3882121
MessageGroupFilenameLineFunctionStatus
simplexml_import_dom(): Invalid Nodetype to importWarningWebTestBase.php1039Drupal\simpletest\WebTestBase->parse()
Parsed page successfully.BrowserMenuTestBase.php107Drupal\system\Tests\Menu\MenuTestBase->getParts()
Breadcrumb Home » Root found on http://drupaltestbot813.2-mysql.osuosl.test/checkout/node/4/edit.OtherBreadcrumbTest.php286Drupal\system\Tests\Menu\BreadcrumbTest->testBreadCrumbs()
simplexml_import_dom(): Invalid Nodetype to importWarningWebTestBase.php1039Drupal\simpletest\WebTestBase->parse()
Parsed page successfully.BrowserBreadcrumbTest.php286Drupal\system\Tests\Menu\BreadcrumbTest->testBreadCrumbs()
current() expects parameter 1 to be array, boolean givenWarningWebTestBase.php2303Drupal\simpletest\WebTestBase->assertTitle()
Page title '' is equal to 'hxn96kPD | Drupal'.OtherBreadcrumbTest.php286Drupal\system\Tests\Menu\BreadcrumbTest->testBreadCrumbs()
simplexml_import_dom(): Invalid Nodetype to importWarningWebTestBase.php1039Drupal\simpletest\WebTestBase->parse()
Parsed page successfully.BrowserBreadcrumbTest.php286Drupal\system\Tests\Menu\BreadcrumbTest->testBreadCrumbs()
Active trail to current page was found in menu tree.OtherBreadcrumbTest.php286Drupal\system\Tests\Menu\BreadcrumbTest->testBreadCrumbs()
simplexml_import_dom(): Invalid Nodetype to importWarningWebTestBase.php1039Drupal\simpletest\WebTestBase->parse()
Parsed page successfully.BrowserBreadcrumbTest.php286Drupal\system\Tests\Menu\BreadcrumbTest->testBreadCrumbs()
Active link Parent hxn96kPD was found in menu tree, including active trail links Root.OtherBreadcrumbTest.php286Drupal\system\Tests\Menu\BreadcrumbTest->testBreadCrumbs()
Breadcrumb Home » Root » Parent hxn96kPD found on http://drupaltestbot813.2-mysql.osuosl.test/checkout/node/5.OtherBreadcrumbTest.php293Drupal\system\Tests\Menu\BreadcrumbTest->testBreadCrumbs()
Active trail to current page was found in menu tree.OtherBreadcrumbTest.php293Drupal\system\Tests\Menu\BreadcrumbTest->testBreadCrumbs()
Active link Child xcewllN7 was found in menu tree, including active trail links Root » Parent hxn96kPD.OtherBreadcrumbTest.php293Drupal\system\Tests\Menu\BreadcrumbTest->testBreadCrumbs()
Trying to get property of non-objectNoticeBreadcrumbTest.php320Drupal\system\Tests\Menu\BreadcrumbTest->testBreadCrumbs()
Trying to get property of non-objectNoticeBreadcrumbTest.php320Drupal\system\Tests\Menu\BreadcrumbTest->testBreadCrumbs()
Trying to get property of non-objectNoticeBreadcrumbTest.php327Drupal\system\Tests\Menu\BreadcrumbTest->testBreadCrumbs()
Undefined index: mlidNoticeBreadcrumbTest.php336Drupal\system\Tests\Menu\BreadcrumbTest->testBreadCrumbs()
Trying to get property of non-objectNoticeBreadcrumbTest.php327Drupal\system\Tests\Menu\BreadcrumbTest->testBreadCrumbs()
Failed to set field parent to navigation:OtherBreadcrumbTest.php330Drupal\system\Tests\Menu\BreadcrumbTest->testBreadCrumbs()
Found the requested form fields at admin/structure/menu/manage/navigation/addOtherBreadcrumbTest.php330Drupal\system\Tests\Menu\BreadcrumbTest->testBreadCrumbs()
Undefined index: mlidNoticeBreadcrumbTest.php336Drupal\system\Tests\Menu\BreadcrumbTest->testBreadCrumbs()
Undefined index: link_titleNoticeBreadcrumbTest.php347Drupal\system\Tests\Menu\BreadcrumbTest->testBreadCrumbs()
Trying to get property of non-objectNoticeBreadcrumbTest.php349Drupal\system\Tests\Menu\BreadcrumbTest->testBreadCrumbs()
Breadcrumb Home found on http://drupaltestbot813.2-mysql.osuosl.test/checkout/taxonomy/term/.OtherBreadcrumbTest.php349Drupal\system\Tests\Menu\BreadcrumbTest->testBreadCrumbs()
SimpleXMLElement::xpath(): Invalid expressionWarningWebTestBase.php1696Drupal\simpletest\WebTestBase->xpath()
SimpleXMLElement::xpath(): xmlXPathEval: evaluation failedWarningWebTestBase.php1696Drupal\simpletest\WebTestBase->xpath()
Active link was found in menu tree, including active trail links .OtherBreadcrumbTest.php349Drupal\system\Tests\Menu\BreadcrumbTest->testBreadCrumbs()
Tagged node found.OtherBreadcrumbTest.php350Drupal\system\Tests\Menu\BreadcrumbTest->testBreadCrumbs()
Link to taxonomy/term/ appears only once.OtherBreadcrumbTest.php360Drupal\system\Tests\Menu\BreadcrumbTest->testBreadCrumbs()
Trying to get property of non-objectNoticeBreadcrumbTest.php365Drupal\system\Tests\Menu\BreadcrumbTest->testBreadCrumbs()
Undefined index: link_titleNoticeBreadcrumbTest.php347Drupal\system\Tests\Menu\BreadcrumbTest->testBreadCrumbs()
Trying to get property of non-objectNoticeBreadcrumbTest.php349Drupal\system\Tests\Menu\BreadcrumbTest->testBreadCrumbs()
Breadcrumb Home » found on http://drupaltestbot813.2-mysql.osuosl.test/checkout/taxonomy/term/.OtherBreadcrumbTest.php349Drupal\system\Tests\Menu\BreadcrumbTest->testBreadCrumbs()
SimpleXMLElement::xpath(): Invalid expressionWarningWebTestBase.php1696Drupal\simpletest\WebTestBase->xpath()
SimpleXMLElement::xpath(): xmlXPathEval: evaluation failedWarningWebTestBase.php1696Drupal\simpletest\WebTestBase->xpath()
Active link was found in menu tree, including active trail links .OtherBreadcrumbTest.php349Drupal\system\Tests\Menu\BreadcrumbTest->testBreadCrumbs()
Tagged node found.OtherBreadcrumbTest.php350Drupal\system\Tests\Menu\BreadcrumbTest->testBreadCrumbs()
Link to taxonomy/term/ appears only once.OtherBreadcrumbTest.php360Drupal\system\Tests\Menu\BreadcrumbTest->testBreadCrumbs()
Trying to get property of non-objectNoticeBreadcrumbTest.php365Drupal\system\Tests\Menu\BreadcrumbTest->testBreadCrumbs()
ExpandDrupal\taxonomy\Tests\LegacyTest1211
MessageGroupFilenameLineFunctionStatus
Trying to get property of non-objectNoticeLegacyTest.php45Drupal\taxonomy\Tests\LegacyTest->testTaxonomyLegacyNode()
Legacy node was saved with the right date.OtherLegacyTest.php45Drupal\taxonomy\Tests\LegacyTest->testTaxonomyLegacyNode()
ExpandDrupal\taxonomy\Tests\TermTest2362427
MessageGroupFilenameLineFunctionStatus
The term appears on the node previewOtherTermTest.php165Drupal\taxonomy\Tests\TermTest->testNodeTermCreationAndDeletion()
The term appears on the node previewOtherTermTest.php165Drupal\taxonomy\Tests\TermTest->testNodeTermCreationAndDeletion()
The term appears on the node previewOtherTermTest.php165Drupal\taxonomy\Tests\TermTest->testNodeTermCreationAndDeletion()
The term appears on the node previewOtherTermTest.php165Drupal\taxonomy\Tests\TermTest->testNodeTermCreationAndDeletion()
The node was created successfully.OtherTermTest.php175Drupal\taxonomy\Tests\TermTest->testNodeTermCreationAndDeletion()
The term was saved and appears on the node page.OtherTermTest.php177Drupal\taxonomy\Tests\TermTest->testNodeTermCreationAndDeletion()
The term was saved and appears on the node page.OtherTermTest.php177Drupal\taxonomy\Tests\TermTest->testNodeTermCreationAndDeletion()
The term was saved and appears on the node page.OtherTermTest.php177Drupal\taxonomy\Tests\TermTest->testNodeTermCreationAndDeletion()
The term was saved and appears on the node page.OtherTermTest.php177Drupal\taxonomy\Tests\TermTest->testNodeTermCreationAndDeletion()
Trying to get property of non-objectNoticeTermTest.php188Drupal\taxonomy\Tests\TermTest->testNodeTermCreationAndDeletion()
Found the Delete buttonOtherTermTest.php188Drupal\taxonomy\Tests\TermTest->testNodeTermCreationAndDeletion()
Found the requested form fields at taxonomy/term//editOtherTermTest.php188Drupal\taxonomy\Tests\TermTest->testNodeTermCreationAndDeletion()
Invalid argument supplied for foreach()WarningWebTestBase.php1233Drupal\simpletest\WebTestBase->drupalPost()
Found the Delete buttonOtherTermTest.php189Drupal\taxonomy\Tests\TermTest->testNodeTermCreationAndDeletion()
Found the requested form fields at OtherTermTest.php189Drupal\taxonomy\Tests\TermTest->testNodeTermCreationAndDeletion()
Trying to get property of non-objectNoticeTermTest.php192Drupal\taxonomy\Tests\TermTest->testNodeTermCreationAndDeletion()
Found the Delete buttonOtherTermTest.php192Drupal\taxonomy\Tests\TermTest->testNodeTermCreationAndDeletion()
Found the requested form fields at taxonomy/term//deleteOtherTermTest.php192Drupal\taxonomy\Tests\TermTest->testNodeTermCreationAndDeletion()
Trying to get property of non-objectNoticeTermTest.php193Drupal\taxonomy\Tests\TermTest->testNodeTermCreationAndDeletion()
Trying to get property of non-objectNoticeTermTest.php193Drupal\taxonomy\Tests\TermTest->testNodeTermCreationAndDeletion()
Trying to get property of non-objectNoticeTermTest.php197Drupal\taxonomy\Tests\TermTest->testNodeTermCreationAndDeletion()
Trying to get property of non-objectNoticeTermTest.php200Drupal\taxonomy\Tests\TermTest->testNodeTermCreationAndDeletion()
Trying to get property of non-objectNoticeTermTest.php200Drupal\taxonomy\Tests\TermTest->testNodeTermCreationAndDeletion()
The term appears on the node page after two terms, and , were deletedOtherTermTest.php200Drupal\taxonomy\Tests\TermTest->testNodeTermCreationAndDeletion()
Trying to get property of non-objectNoticeTermTest.php200Drupal\taxonomy\Tests\TermTest->testNodeTermCreationAndDeletion()
Trying to get property of non-objectNoticeTermTest.php200Drupal\taxonomy\Tests\TermTest->testNodeTermCreationAndDeletion()
The term appears on the node page after two terms, and , were deletedOtherTermTest.php200Drupal\taxonomy\Tests\TermTest->testNodeTermCreationAndDeletion()
Trying to get property of non-objectNoticeTermTest.php202Drupal\taxonomy\Tests\TermTest->testNodeTermCreationAndDeletion()
Trying to get property of non-objectNoticeTermTest.php202Drupal\taxonomy\Tests\TermTest->testNodeTermCreationAndDeletion()
Trying to get property of non-objectNoticeTermTest.php203Drupal\taxonomy\Tests\TermTest->testNodeTermCreationAndDeletion()
Trying to get property of non-objectNoticeTermTest.php203Drupal\taxonomy\Tests\TermTest->testNodeTermCreationAndDeletion()
Trying to get property of non-objectNoticeTermTest.php207Drupal\taxonomy\Tests\TermTest->testNodeTermCreationAndDeletion()
Undefined variable: term_matchesNoticetaxonomy.pages.inc172taxonomy_autocomplete()
Trying to get property of non-objectNoticeTermTest.php209Drupal\taxonomy\Tests\TermTest->testNodeTermCreationAndDeletion()
Trying to get property of non-objectNoticeTermTest.php209Drupal\taxonomy\Tests\TermTest->testNodeTermCreationAndDeletion()
Trying to get property of non-objectNoticeTermTest.php209Drupal\taxonomy\Tests\TermTest->testNodeTermCreationAndDeletion()
Autocomplete returns term after typing the first 3 letters.OtherTermTest.php209Drupal\taxonomy\Tests\TermTest->testNodeTermCreationAndDeletion()
Trying to get property of non-objectNoticeTermTest.php213Drupal\taxonomy\Tests\TermTest->testNodeTermCreationAndDeletion()
Undefined variable: term_matchesNoticetaxonomy.pages.inc172taxonomy_autocomplete()
Trying to get property of non-objectNoticeTermTest.php215Drupal\taxonomy\Tests\TermTest->testNodeTermCreationAndDeletion()
Trying to get property of non-objectNoticeTermTest.php215Drupal\taxonomy\Tests\TermTest->testNodeTermCreationAndDeletion()
Trying to get property of non-objectNoticeTermTest.php215Drupal\taxonomy\Tests\TermTest->testNodeTermCreationAndDeletion()
Autocomplete returns term after typing the first 3 letters.OtherTermTest.php215Drupal\taxonomy\Tests\TermTest->testNodeTermCreationAndDeletion()
simplexml_import_dom(): Invalid Nodetype to importWarningWebTestBase.php1039Drupal\simpletest\WebTestBase->parse()
Parsed page successfully.BrowserTermTest.php517Drupal\taxonomy\Tests\TermTest->testReSavingTags()
Undefined variable: url_targetNoticeWebTestBase.php1835Drupal\simpletest\WebTestBase->clickLink()
Clicked link Edit () from http://drupaltestbot813.2-mysql.osuosl.test/checkout/node/add/articleBrowserTermTest.php517Drupal\taxonomy\Tests\TermTest->testReSavingTags()
Term is displayed when editing the node.OtherTermTest.php518Drupal\taxonomy\Tests\TermTest->testReSavingTags()
simplexml_import_dom(): Invalid Nodetype to importWarningWebTestBase.php1039Drupal\simpletest\WebTestBase->parse()
Parsed page successfully.BrowserTermTest.php519Drupal\taxonomy\Tests\TermTest->testReSavingTags()
Term is displayed after saving the node with no changes.OtherTermTest.php520Drupal\taxonomy\Tests\TermTest->testReSavingTags()
ExpandDrupal\text\Tests\TextSummaryTest13611
MessageGroupFilenameLineFunctionStatus
Trying to get property of non-objectNoticeTextSummaryTest.php181Drupal\text\Tests\TextSummaryTest->testOnlyTextSummary()
Article with with summary and no body has been submitted.OtherTextSummaryTest.php181Drupal\text\Tests\TextSummaryTest->testOnlyTextSummary()
ExpandDrupal\text\Tests\TextTranslationTest88144
MessageGroupFilenameLineFunctionStatus
Trying to get property of non-objectNoticeTextTranslationTest.php82Drupal\text\Tests\TextTranslationTest->testTextField()
Undefined variable: url_targetNoticeWebTestBase.php1835Drupal\simpletest\WebTestBase->clickLink()
Clicked link add translation () from http://drupaltestbot813.2-mysql.osuosl.test/checkout/node//translateBrowserTextTranslationTest.php83Drupal\text\Tests\TextTranslationTest->testTextField()
The textfield widget is populated.OtherTextTranslationTest.php84Drupal\text\Tests\TextTranslationTest->testTextField()
Failed to set field body[und][0][value] to ttNnQj4POtherTextTranslationTest.php120Drupal\text\Tests\TextTranslationTest->testTextFieldFormatted()
Failed to set field body[und][0][format] to full_htmlOtherTextTranslationTest.php120Drupal\text\Tests\TextTranslationTest->testTextFieldFormatted()
Found the Save buttonOtherTextTranslationTest.php120Drupal\text\Tests\TextTranslationTest->testTextFieldFormatted()
Found the requested form fields at node/1/editOtherTextTranslationTest.php120Drupal\text\Tests\TextTranslationTest->testTextFieldFormatted()
The body field with delta 0 has been saved.OtherTextTranslationTest.php121Drupal\text\Tests\TextTranslationTest->testTextFieldFormatted()
Failed to set field body[und][1][value] to fdQOduozOtherTextTranslationTest.php120Drupal\text\Tests\TextTranslationTest->testTextFieldFormatted()
Failed to set field body[und][1][format] to filtered_htmlOtherTextTranslationTest.php120Drupal\text\Tests\TextTranslationTest->testTextFieldFormatted()
Found the Save buttonOtherTextTranslationTest.php120Drupal\text\Tests\TextTranslationTest->testTextFieldFormatted()
Found the requested form fields at node/1/editOtherTextTranslationTest.php120Drupal\text\Tests\TextTranslationTest->testTextFieldFormatted()
The body field with delta 1 has been saved.OtherTextTranslationTest.php121Drupal\text\Tests\TextTranslationTest->testTextFieldFormatted()
Trying to get property of non-objectNoticeTextTranslationTest.php129Drupal\text\Tests\TextTranslationTest->testTextFieldFormatted()
Undefined variable: url_targetNoticeWebTestBase.php1835Drupal\simpletest\WebTestBase->clickLink()
Clicked link add translation () from http://drupaltestbot813.2-mysql.osuosl.test/checkout/node//translateBrowserTextTranslationTest.php130Drupal\text\Tests\TextTranslationTest->testTextFieldFormatted()
The body field with delta 1 is shown.OtherTextTranslationTest.php132Drupal\text\Tests\TextTranslationTest->testTextFieldFormatted()

All

Test namePassFailException
LeafDrupal\action\Tests\ConfigurationTest3900
LeafDrupal\action\Tests\LoopTest2100
LeafDrupal\aggregator\Tests\AddFeedTest7100
LeafDrupal\aggregator\Tests\AggregatorConfigurationTest2000
LeafDrupal\aggregator\Tests\AggregatorCronTest5500
LeafDrupal\aggregator\Tests\AggregatorRenderingTest22800
LeafDrupal\aggregator\Tests\CategorizeFeedItemTest6100
LeafDrupal\aggregator\Tests\CategorizeFeedTest2100
LeafDrupal\aggregator\Tests\FeedParserTest7200
LeafDrupal\aggregator\Tests\ImportOpmlTest5500
LeafDrupal\aggregator\Tests\RemoveFeedItemTest27000
LeafDrupal\aggregator\Tests\RemoveFeedTest2500
LeafDrupal\aggregator\Tests\UpdateFeedItemTest6500
LeafDrupal\aggregator\Tests\UpdateFeedTest7600
LeafDrupal\ban\Tests\IpAddressBlockingTest4300
LeafDrupal\block\Tests\BlockAdminThemeTest1900
LeafDrupal\block\Tests\BlockCacheTest20500
LeafDrupal\block\Tests\BlockHiddenRegionTest1800
LeafDrupal\block\Tests\BlockHtmlIdTest1600
LeafDrupal\block\Tests\BlockInvalidRegionTest2400
LeafDrupal\block\Tests\BlockLanguageTest9100
LeafDrupal\block\Tests\BlockTemplateSuggestionsUnitTest300
LeafDrupal\block\Tests\BlockTest35800
LeafDrupal\block\Tests\BlockUserAccountSettingsTest1200
LeafDrupal\block\Tests\NewDefaultThemeBlocksTest2200
LeafDrupal\block\Tests\NonDefaultBlockAdminTest1100
LeafDrupal\book\Tests\BookTest51700
LeafDrupal\color\Tests\ColorTest8700
LeafDrupal\comment\Tests\CommentActionsTest2900
LeafDrupal\comment\Tests\CommentAnonymousTest16200
LeafDrupal\comment\Tests\CommentApprovalTest15000
LeafDrupal\comment\Tests\CommentBlockTest11400
LeafDrupal\comment\Tests\CommentContentRebuildTest3200
LeafDrupal\comment\Tests\CommentFieldsTest10500
ExpandDrupal\comment\Tests\CommentInterfaceTest200400
MessageGroupFilenameLineFunctionStatus
Changed environment:array ( 'authenticated' => false, 'comment count' => false, 'form' => 'below', 'user_register' => 'visitors', 'contact' => 'optional', 'comments' => 'open', 'access comments' => 0, 'post comments' => 0, 'skip comment approval' => 1, 'edit own comments' => 0, )DebugCommentInterfaceTest.php589Drupal\comment\Tests\CommentInterfaceTest->setEnvironment()
Changed environment:array ( 'authenticated' => true, 'comment count' => false, 'form' => 'below', 'user_register' => 'visitors', 'contact' => 'optional', 'comments' => 'open', 'access comments' => 0, 'post comments' => 0, 'skip comment approval' => 1, 'edit own comments' => 0, )DebugCommentInterfaceTest.php589Drupal\comment\Tests\CommentInterfaceTest->setEnvironment()
Changed environment:array ( 'authenticated' => false, 'comment count' => true, 'form' => 'below', 'user_register' => 'visitors', 'contact' => 'optional', 'comments' => 'open', 'access comments' => 0, 'post comments' => 0, 'skip comment approval' => 1, 'edit own comments' => 0, )DebugCommentInterfaceTest.php589Drupal\comment\Tests\CommentInterfaceTest->setEnvironment()
Changed environment:array ( 'authenticated' => true, 'comment count' => true, 'form' => 'below', 'user_register' => 'visitors', 'contact' => 'optional', 'comments' => 'open', 'access comments' => 0, 'post comments' => 0, 'skip comment approval' => 1, 'edit own comments' => 0, )DebugCommentInterfaceTest.php589Drupal\comment\Tests\CommentInterfaceTest->setEnvironment()
Changed environment:array ( 'authenticated' => false, 'comment count' => false, 'form' => 'below', 'user_register' => 'visitors', 'contact' => 'optional', 'comments' => 'open', 'access comments' => 1, 'post comments' => 0, 'skip comment approval' => 1, 'edit own comments' => 0, )DebugCommentInterfaceTest.php589Drupal\comment\Tests\CommentInterfaceTest->setEnvironment()
Changed environment:array ( 'authenticated' => true, 'comment count' => false, 'form' => 'below', 'user_register' => 'visitors', 'contact' => 'optional', 'comments' => 'open', 'access comments' => 1, 'post comments' => 0, 'skip comment approval' => 1, 'edit own comments' => 0, )DebugCommentInterfaceTest.php589Drupal\comment\Tests\CommentInterfaceTest->setEnvironment()
Changed environment:array ( 'authenticated' => false, 'comment count' => true, 'form' => 'below', 'user_register' => 'visitors', 'contact' => 'optional', 'comments' => 'open', 'access comments' => 1, 'post comments' => 0, 'skip comment approval' => 1, 'edit own comments' => 0, )DebugCommentInterfaceTest.php589Drupal\comment\Tests\CommentInterfaceTest->setEnvironment()
Changed environment:array ( 'authenticated' => true, 'comment count' => true, 'form' => 'below', 'user_register' => 'visitors', 'contact' => 'optional', 'comments' => 'open', 'access comments' => 1, 'post comments' => 0, 'skip comment approval' => 1, 'edit own comments' => 0, )DebugCommentInterfaceTest.php589Drupal\comment\Tests\CommentInterfaceTest->setEnvironment()
Changed environment:array ( 'authenticated' => false, 'comment count' => false, 'form' => 'below', 'user_register' => 'visitors', 'contact' => 'optional', 'comments' => 'open', 'access comments' => 0, 'post comments' => 1, 'skip comment approval' => 1, 'edit own comments' => 0, )DebugCommentInterfaceTest.php589Drupal\comment\Tests\CommentInterfaceTest->setEnvironment()
Changed environment:array ( 'authenticated' => true, 'comment count' => false, 'form' => 'below', 'user_register' => 'visitors', 'contact' => 'optional', 'comments' => 'open', 'access comments' => 0, 'post comments' => 1, 'skip comment approval' => 1, 'edit own comments' => 0, )DebugCommentInterfaceTest.php589Drupal\comment\Tests\CommentInterfaceTest->setEnvironment()
Changed environment:array ( 'authenticated' => false, 'comment count' => true, 'form' => 'below', 'user_register' => 'visitors', 'contact' => 'optional', 'comments' => 'open', 'access comments' => 0, 'post comments' => 1, 'skip comment approval' => 1, 'edit own comments' => 0, )DebugCommentInterfaceTest.php589Drupal\comment\Tests\CommentInterfaceTest->setEnvironment()
Changed environment:array ( 'authenticated' => true, 'comment count' => true, 'form' => 'below', 'user_register' => 'visitors', 'contact' => 'optional', 'comments' => 'open', 'access comments' => 0, 'post comments' => 1, 'skip comment approval' => 1, 'edit own comments' => 0, )DebugCommentInterfaceTest.php589Drupal\comment\Tests\CommentInterfaceTest->setEnvironment()
Changed environment:array ( 'authenticated' => false, 'comment count' => false, 'form' => 'below', 'user_register' => 'visitors', 'contact' => 'optional', 'comments' => 'open', 'access comments' => 1, 'post comments' => 1, 'skip comment approval' => 1, 'edit own comments' => 0, )DebugCommentInterfaceTest.php589Drupal\comment\Tests\CommentInterfaceTest->setEnvironment()
Changed environment:array ( 'authenticated' => true, 'comment count' => false, 'form' => 'below', 'user_register' => 'visitors', 'contact' => 'optional', 'comments' => 'open', 'access comments' => 1, 'post comments' => 1, 'skip comment approval' => 1, 'edit own comments' => 0, )DebugCommentInterfaceTest.php589Drupal\comment\Tests\CommentInterfaceTest->setEnvironment()
Changed environment:array ( 'authenticated' => false, 'comment count' => true, 'form' => 'below', 'user_register' => 'visitors', 'contact' => 'optional', 'comments' => 'open', 'access comments' => 1, 'post comments' => 1, 'skip comment approval' => 1, 'edit own comments' => 0, )DebugCommentInterfaceTest.php589Drupal\comment\Tests\CommentInterfaceTest->setEnvironment()
Changed environment:array ( 'authenticated' => true, 'comment count' => true, 'form' => 'below', 'user_register' => 'visitors', 'contact' => 'optional', 'comments' => 'open', 'access comments' => 1, 'post comments' => 1, 'skip comment approval' => 1, 'edit own comments' => 0, )DebugCommentInterfaceTest.php589Drupal\comment\Tests\CommentInterfaceTest->setEnvironment()
Changed environment:array ( 'authenticated' => false, 'comment count' => false, 'form' => 'separate page', 'user_register' => 'visitors', 'contact' => 'optional', 'comments' => 'open', 'access comments' => 0, 'post comments' => 0, 'skip comment approval' => 1, 'edit own comments' => 0, )DebugCommentInterfaceTest.php589Drupal\comment\Tests\CommentInterfaceTest->setEnvironment()
Changed environment:array ( 'authenticated' => true, 'comment count' => false, 'form' => 'separate page', 'user_register' => 'visitors', 'contact' => 'optional', 'comments' => 'open', 'access comments' => 0, 'post comments' => 0, 'skip comment approval' => 1, 'edit own comments' => 0, )DebugCommentInterfaceTest.php589Drupal\comment\Tests\CommentInterfaceTest->setEnvironment()
Changed environment:array ( 'authenticated' => false, 'comment count' => true, 'form' => 'separate page', 'user_register' => 'visitors', 'contact' => 'optional', 'comments' => 'open', 'access comments' => 0, 'post comments' => 0, 'skip comment approval' => 1, 'edit own comments' => 0, )DebugCommentInterfaceTest.php589Drupal\comment\Tests\CommentInterfaceTest->setEnvironment()
Changed environment:array ( 'authenticated' => true, 'comment count' => true, 'form' => 'separate page', 'user_register' => 'visitors', 'contact' => 'optional', 'comments' => 'open', 'access comments' => 0, 'post comments' => 0, 'skip comment approval' => 1, 'edit own comments' => 0, )DebugCommentInterfaceTest.php589Drupal\comment\Tests\CommentInterfaceTest->setEnvironment()
Changed environment:array ( 'authenticated' => false, 'comment count' => false, 'form' => 'separate page', 'user_register' => 'visitors', 'contact' => 'optional', 'comments' => 'open', 'access comments' => 1, 'post comments' => 0, 'skip comment approval' => 1, 'edit own comments' => 0, )DebugCommentInterfaceTest.php589Drupal\comment\Tests\CommentInterfaceTest->setEnvironment()
Changed environment:array ( 'authenticated' => true, 'comment count' => false, 'form' => 'separate page', 'user_register' => 'visitors', 'contact' => 'optional', 'comments' => 'open', 'access comments' => 1, 'post comments' => 0, 'skip comment approval' => 1, 'edit own comments' => 0, )DebugCommentInterfaceTest.php589Drupal\comment\Tests\CommentInterfaceTest->setEnvironment()
Changed environment:array ( 'authenticated' => false, 'comment count' => true, 'form' => 'separate page', 'user_register' => 'visitors', 'contact' => 'optional', 'comments' => 'open', 'access comments' => 1, 'post comments' => 0, 'skip comment approval' => 1, 'edit own comments' => 0, )DebugCommentInterfaceTest.php589Drupal\comment\Tests\CommentInterfaceTest->setEnvironment()
Changed environment:array ( 'authenticated' => true, 'comment count' => true, 'form' => 'separate page', 'user_register' => 'visitors', 'contact' => 'optional', 'comments' => 'open', 'access comments' => 1, 'post comments' => 0, 'skip comment approval' => 1, 'edit own comments' => 0, )DebugCommentInterfaceTest.php589Drupal\comment\Tests\CommentInterfaceTest->setEnvironment()
Changed environment:array ( 'authenticated' => false, 'comment count' => false, 'form' => 'separate page', 'user_register' => 'visitors', 'contact' => 'optional', 'comments' => 'open', 'access comments' => 0, 'post comments' => 1, 'skip comment approval' => 1, 'edit own comments' => 0, )DebugCommentInterfaceTest.php589Drupal\comment\Tests\CommentInterfaceTest->setEnvironment()
Changed environment:array ( 'authenticated' => true, 'comment count' => false, 'form' => 'separate page', 'user_register' => 'visitors', 'contact' => 'optional', 'comments' => 'open', 'access comments' => 0, 'post comments' => 1, 'skip comment approval' => 1, 'edit own comments' => 0, )DebugCommentInterfaceTest.php589Drupal\comment\Tests\CommentInterfaceTest->setEnvironment()
Changed environment:array ( 'authenticated' => false, 'comment count' => true, 'form' => 'separate page', 'user_register' => 'visitors', 'contact' => 'optional', 'comments' => 'open', 'access comments' => 0, 'post comments' => 1, 'skip comment approval' => 1, 'edit own comments' => 0, )DebugCommentInterfaceTest.php589Drupal\comment\Tests\CommentInterfaceTest->setEnvironment()
Changed environment:array ( 'authenticated' => true, 'comment count' => true, 'form' => 'separate page', 'user_register' => 'visitors', 'contact' => 'optional', 'comments' => 'open', 'access comments' => 0, 'post comments' => 1, 'skip comment approval' => 1, 'edit own comments' => 0, )DebugCommentInterfaceTest.php589Drupal\comment\Tests\CommentInterfaceTest->setEnvironment()
Changed environment:array ( 'authenticated' => false, 'comment count' => false, 'form' => 'separate page', 'user_register' => 'visitors', 'contact' => 'optional', 'comments' => 'open', 'access comments' => 1, 'post comments' => 1, 'skip comment approval' => 1, 'edit own comments' => 0, )DebugCommentInterfaceTest.php589Drupal\comment\Tests\CommentInterfaceTest->setEnvironment()
Changed environment:array ( 'authenticated' => true, 'comment count' => false, 'form' => 'separate page', 'user_register' => 'visitors', 'contact' => 'optional', 'comments' => 'open', 'access comments' => 1, 'post comments' => 1, 'skip comment approval' => 1, 'edit own comments' => 0, )DebugCommentInterfaceTest.php589Drupal\comment\Tests\CommentInterfaceTest->setEnvironment()
Changed environment:array ( 'authenticated' => false, 'comment count' => true, 'form' => 'separate page', 'user_register' => 'visitors', 'contact' => 'optional', 'comments' => 'open', 'access comments' => 1, 'post comments' => 1, 'skip comment approval' => 1, 'edit own comments' => 0, )DebugCommentInterfaceTest.php589Drupal\comment\Tests\CommentInterfaceTest->setEnvironment()
Changed environment:array ( 'authenticated' => true, 'comment count' => true, 'form' => 'separate page', 'user_register' => 'visitors', 'contact' => 'optional', 'comments' => 'open', 'access comments' => 1, 'post comments' => 1, 'skip comment approval' => 1, 'edit own comments' => 0, )DebugCommentInterfaceTest.php589Drupal\comment\Tests\CommentInterfaceTest->setEnvironment()
Changed environment:array ( 'authenticated' => false, 'comment count' => false, 'form' => 'below', 'user_register' => 'admin_only', 'contact' => 'optional', 'comments' => 'open', 'access comments' => 0, 'post comments' => 0, 'skip comment approval' => 1, 'edit own comments' => 0, )DebugCommentInterfaceTest.php589Drupal\comment\Tests\CommentInterfaceTest->setEnvironment()
Changed environment:array ( 'authenticated' => true, 'comment count' => false, 'form' => 'below', 'user_register' => 'admin_only', 'contact' => 'optional', 'comments' => 'open', 'access comments' => 0, 'post comments' => 0, 'skip comment approval' => 1, 'edit own comments' => 0, )DebugCommentInterfaceTest.php589Drupal\comment\Tests\CommentInterfaceTest->setEnvironment()
Changed environment:array ( 'authenticated' => false, 'comment count' => true, 'form' => 'below', 'user_register' => 'admin_only', 'contact' => 'optional', 'comments' => 'open', 'access comments' => 0, 'post comments' => 0, 'skip comment approval' => 1, 'edit own comments' => 0, )DebugCommentInterfaceTest.php589Drupal\comment\Tests\CommentInterfaceTest->setEnvironment()
Changed environment:array ( 'authenticated' => true, 'comment count' => true, 'form' => 'below', 'user_register' => 'admin_only', 'contact' => 'optional', 'comments' => 'open', 'access comments' => 0, 'post comments' => 0, 'skip comment approval' => 1, 'edit own comments' => 0, )DebugCommentInterfaceTest.php589Drupal\comment\Tests\CommentInterfaceTest->setEnvironment()
Changed environment:array ( 'authenticated' => false, 'comment count' => false, 'form' => 'below', 'user_register' => 'admin_only', 'contact' => 'optional', 'comments' => 'open', 'access comments' => 1, 'post comments' => 0, 'skip comment approval' => 1, 'edit own comments' => 0, )DebugCommentInterfaceTest.php589Drupal\comment\Tests\CommentInterfaceTest->setEnvironment()
Changed environment:array ( 'authenticated' => true, 'comment count' => false, 'form' => 'below', 'user_register' => 'admin_only', 'contact' => 'optional', 'comments' => 'open', 'access comments' => 1, 'post comments' => 0, 'skip comment approval' => 1, 'edit own comments' => 0, )DebugCommentInterfaceTest.php589Drupal\comment\Tests\CommentInterfaceTest->setEnvironment()
Changed environment:array ( 'authenticated' => false, 'comment count' => true, 'form' => 'below', 'user_register' => 'admin_only', 'contact' => 'optional', 'comments' => 'open', 'access comments' => 1, 'post comments' => 0, 'skip comment approval' => 1, 'edit own comments' => 0, )DebugCommentInterfaceTest.php589Drupal\comment\Tests\CommentInterfaceTest->setEnvironment()
Changed environment:array ( 'authenticated' => true, 'comment count' => true, 'form' => 'below', 'user_register' => 'admin_only', 'contact' => 'optional', 'comments' => 'open', 'access comments' => 1, 'post comments' => 0, 'skip comment approval' => 1, 'edit own comments' => 0, )DebugCommentInterfaceTest.php589Drupal\comment\Tests\CommentInterfaceTest->setEnvironment()
Changed environment:array ( 'authenticated' => false, 'comment count' => false, 'form' => 'below', 'user_register' => 'admin_only', 'contact' => 'optional', 'comments' => 'open', 'access comments' => 0, 'post comments' => 1, 'skip comment approval' => 1, 'edit own comments' => 0, )DebugCommentInterfaceTest.php589Drupal\comment\Tests\CommentInterfaceTest->setEnvironment()
Changed environment:array ( 'authenticated' => true, 'comment count' => false, 'form' => 'below', 'user_register' => 'admin_only', 'contact' => 'optional', 'comments' => 'open', 'access comments' => 0, 'post comments' => 1, 'skip comment approval' => 1, 'edit own comments' => 0, )DebugCommentInterfaceTest.php589Drupal\comment\Tests\CommentInterfaceTest->setEnvironment()
Changed environment:array ( 'authenticated' => false, 'comment count' => true, 'form' => 'below', 'user_register' => 'admin_only', 'contact' => 'optional', 'comments' => 'open', 'access comments' => 0, 'post comments' => 1, 'skip comment approval' => 1, 'edit own comments' => 0, )DebugCommentInterfaceTest.php589Drupal\comment\Tests\CommentInterfaceTest->setEnvironment()
Changed environment:array ( 'authenticated' => true, 'comment count' => true, 'form' => 'below', 'user_register' => 'admin_only', 'contact' => 'optional', 'comments' => 'open', 'access comments' => 0, 'post comments' => 1, 'skip comment approval' => 1, 'edit own comments' => 0, )DebugCommentInterfaceTest.php589Drupal\comment\Tests\CommentInterfaceTest->setEnvironment()
Changed environment:array ( 'authenticated' => false, 'comment count' => false, 'form' => 'below', 'user_register' => 'admin_only', 'contact' => 'optional', 'comments' => 'open', 'access comments' => 1, 'post comments' => 1, 'skip comment approval' => 1, 'edit own comments' => 0, )DebugCommentInterfaceTest.php589Drupal\comment\Tests\CommentInterfaceTest->setEnvironment()
Changed environment:array ( 'authenticated' => true, 'comment count' => false, 'form' => 'below', 'user_register' => 'admin_only', 'contact' => 'optional', 'comments' => 'open', 'access comments' => 1, 'post comments' => 1, 'skip comment approval' => 1, 'edit own comments' => 0, )DebugCommentInterfaceTest.php589Drupal\comment\Tests\CommentInterfaceTest->setEnvironment()
Changed environment:array ( 'authenticated' => false, 'comment count' => true, 'form' => 'below', 'user_register' => 'admin_only', 'contact' => 'optional', 'comments' => 'open', 'access comments' => 1, 'post comments' => 1, 'skip comment approval' => 1, 'edit own comments' => 0, )DebugCommentInterfaceTest.php589Drupal\comment\Tests\CommentInterfaceTest->setEnvironment()
Changed environment:array ( 'authenticated' => true, 'comment count' => true, 'form' => 'below', 'user_register' => 'admin_only', 'contact' => 'optional', 'comments' => 'open', 'access comments' => 1, 'post comments' => 1, 'skip comment approval' => 1, 'edit own comments' => 0, )DebugCommentInterfaceTest.php589Drupal\comment\Tests\CommentInterfaceTest->setEnvironment()
Changed environment:array ( 'authenticated' => false, 'comment count' => false, 'form' => 'separate page', 'user_register' => 'admin_only', 'contact' => 'optional', 'comments' => 'open', 'access comments' => 0, 'post comments' => 0, 'skip comment approval' => 1, 'edit own comments' => 0, )DebugCommentInterfaceTest.php589Drupal\comment\Tests\CommentInterfaceTest->setEnvironment()
Changed environment:array ( 'authenticated' => true, 'comment count' => false, 'form' => 'separate page', 'user_register' => 'admin_only', 'contact' => 'optional', 'comments' => 'open', 'access comments' => 0, 'post comments' => 0, 'skip comment approval' => 1, 'edit own comments' => 0, )DebugCommentInterfaceTest.php589Drupal\comment\Tests\CommentInterfaceTest->setEnvironment()
Changed environment:array ( 'authenticated' => false, 'comment count' => true, 'form' => 'separate page', 'user_register' => 'admin_only', 'contact' => 'optional', 'comments' => 'open', 'access comments' => 0, 'post comments' => 0, 'skip comment approval' => 1, 'edit own comments' => 0, )DebugCommentInterfaceTest.php589Drupal\comment\Tests\CommentInterfaceTest->setEnvironment()
Changed environment:array ( 'authenticated' => true, 'comment count' => true, 'form' => 'separate page', 'user_register' => 'admin_only', 'contact' => 'optional', 'comments' => 'open', 'access comments' => 0, 'post comments' => 0, 'skip comment approval' => 1, 'edit own comments' => 0, )DebugCommentInterfaceTest.php589Drupal\comment\Tests\CommentInterfaceTest->setEnvironment()
Changed environment:array ( 'authenticated' => false, 'comment count' => false, 'form' => 'separate page', 'user_register' => 'admin_only', 'contact' => 'optional', 'comments' => 'open', 'access comments' => 1, 'post comments' => 0, 'skip comment approval' => 1, 'edit own comments' => 0, )DebugCommentInterfaceTest.php589Drupal\comment\Tests\CommentInterfaceTest->setEnvironment()
Changed environment:array ( 'authenticated' => true, 'comment count' => false, 'form' => 'separate page', 'user_register' => 'admin_only', 'contact' => 'optional', 'comments' => 'open', 'access comments' => 1, 'post comments' => 0, 'skip comment approval' => 1, 'edit own comments' => 0, )DebugCommentInterfaceTest.php589Drupal\comment\Tests\CommentInterfaceTest->setEnvironment()
Changed environment:array ( 'authenticated' => false, 'comment count' => true, 'form' => 'separate page', 'user_register' => 'admin_only', 'contact' => 'optional', 'comments' => 'open', 'access comments' => 1, 'post comments' => 0, 'skip comment approval' => 1, 'edit own comments' => 0, )DebugCommentInterfaceTest.php589Drupal\comment\Tests\CommentInterfaceTest->setEnvironment()
Changed environment:array ( 'authenticated' => true, 'comment count' => true, 'form' => 'separate page', 'user_register' => 'admin_only', 'contact' => 'optional', 'comments' => 'open', 'access comments' => 1, 'post comments' => 0, 'skip comment approval' => 1, 'edit own comments' => 0, )DebugCommentInterfaceTest.php589Drupal\comment\Tests\CommentInterfaceTest->setEnvironment()
Changed environment:array ( 'authenticated' => false, 'comment count' => false, 'form' => 'separate page', 'user_register' => 'admin_only', 'contact' => 'optional', 'comments' => 'open', 'access comments' => 0, 'post comments' => 1, 'skip comment approval' => 1, 'edit own comments' => 0, )DebugCommentInterfaceTest.php589Drupal\comment\Tests\CommentInterfaceTest->setEnvironment()
Changed environment:array ( 'authenticated' => true, 'comment count' => false, 'form' => 'separate page', 'user_register' => 'admin_only', 'contact' => 'optional', 'comments' => 'open', 'access comments' => 0, 'post comments' => 1, 'skip comment approval' => 1, 'edit own comments' => 0, )DebugCommentInterfaceTest.php589Drupal\comment\Tests\CommentInterfaceTest->setEnvironment()
Changed environment:array ( 'authenticated' => false, 'comment count' => true, 'form' => 'separate page', 'user_register' => 'admin_only', 'contact' => 'optional', 'comments' => 'open', 'access comments' => 0, 'post comments' => 1, 'skip comment approval' => 1, 'edit own comments' => 0, )DebugCommentInterfaceTest.php589Drupal\comment\Tests\CommentInterfaceTest->setEnvironment()
Changed environment:array ( 'authenticated' => true, 'comment count' => true, 'form' => 'separate page', 'user_register' => 'admin_only', 'contact' => 'optional', 'comments' => 'open', 'access comments' => 0, 'post comments' => 1, 'skip comment approval' => 1, 'edit own comments' => 0, )DebugCommentInterfaceTest.php589Drupal\comment\Tests\CommentInterfaceTest->setEnvironment()
Changed environment:array ( 'authenticated' => false, 'comment count' => false, 'form' => 'separate page', 'user_register' => 'admin_only', 'contact' => 'optional', 'comments' => 'open', 'access comments' => 1, 'post comments' => 1, 'skip comment approval' => 1, 'edit own comments' => 0, )DebugCommentInterfaceTest.php589Drupal\comment\Tests\CommentInterfaceTest->setEnvironment()
Changed environment:array ( 'authenticated' => true, 'comment count' => false, 'form' => 'separate page', 'user_register' => 'admin_only', 'contact' => 'optional', 'comments' => 'open', 'access comments' => 1, 'post comments' => 1, 'skip comment approval' => 1, 'edit own comments' => 0, )DebugCommentInterfaceTest.php589Drupal\comment\Tests\CommentInterfaceTest->setEnvironment()
Changed environment:array ( 'authenticated' => false, 'comment count' => true, 'form' => 'separate page', 'user_register' => 'admin_only', 'contact' => 'optional', 'comments' => 'open', 'access comments' => 1, 'post comments' => 1, 'skip comment approval' => 1, 'edit own comments' => 0, )DebugCommentInterfaceTest.php589Drupal\comment\Tests\CommentInterfaceTest->setEnvironment()
Changed environment:array ( 'authenticated' => true, 'comment count' => true, 'form' => 'separate page', 'user_register' => 'admin_only', 'contact' => 'optional', 'comments' => 'open', 'access comments' => 1, 'post comments' => 1, 'skip comment approval' => 1, 'edit own comments' => 0, )DebugCommentInterfaceTest.php589Drupal\comment\Tests\CommentInterfaceTest->setEnvironment()
ExpandDrupal\comment\Tests\CommentLanguageTest424424
MessageGroupFilenameLineFunctionStatus
Trying to get property of non-objectNoticeCommentLanguageTest.php113Drupal\comment\Tests\CommentLanguageTest->testCommentLanguage()
Failed to set field subject to dTt8smOtOtherCommentLanguageTest.php113Drupal\comment\Tests\CommentLanguageTest->testCommentLanguage()
Failed to set field comment_body[en][0][value] to pT8PhqT8OtherCommentLanguageTest.php113Drupal\comment\Tests\CommentLanguageTest->testCommentLanguage()
Found the Preview buttonOtherCommentLanguageTest.php113Drupal\comment\Tests\CommentLanguageTest->testCommentLanguage()
Found the requested form fields at node/OtherCommentLanguageTest.php113Drupal\comment\Tests\CommentLanguageTest->testCommentLanguage()
Failed to set field subject to dTt8smOtOtherCommentLanguageTest.php114Drupal\comment\Tests\CommentLanguageTest->testCommentLanguage()
Failed to set field comment_body[en][0][value] to pT8PhqT8OtherCommentLanguageTest.php114Drupal\comment\Tests\CommentLanguageTest->testCommentLanguage()
Found the Save buttonOtherCommentLanguageTest.php114Drupal\comment\Tests\CommentLanguageTest->testCommentLanguage()
Found the requested form fields at OtherCommentLanguageTest.php114Drupal\comment\Tests\CommentLanguageTest->testCommentLanguage()
Trying to get property of non-objectNoticeCommentLanguageTest.php119Drupal\comment\Tests\CommentLanguageTest->testCommentLanguage()
array_flip(): Can only flip STRING and INTEGER values!WarningDatabaseStorageController.php165Drupal\Core\Entity\DatabaseStorageController->load()
Trying to get property of non-objectNoticeCommentLanguageTest.php125Drupal\comment\Tests\CommentLanguageTest->testCommentLanguage()
Trying to get property of non-objectNoticeCommentLanguageTest.php126Drupal\comment\Tests\CommentLanguageTest->testCommentLanguage()
The comment posted with content language en and belonging to the node with language en has language OtherCommentLanguageTest.php126Drupal\comment\Tests\CommentLanguageTest->testCommentLanguage()
Trying to get property of non-objectNoticeCommentLanguageTest.php127Drupal\comment\Tests\CommentLanguageTest->testCommentLanguage()
Comment body correctly stored.OtherCommentLanguageTest.php127Drupal\comment\Tests\CommentLanguageTest->testCommentLanguage()
Trying to get property of non-objectNoticeCommentLanguageTest.php113Drupal\comment\Tests\CommentLanguageTest->testCommentLanguage()
Failed to set field subject to fgFd6ZFtOtherCommentLanguageTest.php113Drupal\comment\Tests\CommentLanguageTest->testCommentLanguage()
Failed to set field comment_body[fr][0][value] to hbbk4TaCOtherCommentLanguageTest.php113Drupal\comment\Tests\CommentLanguageTest->testCommentLanguage()
Found the Preview buttonOtherCommentLanguageTest.php113Drupal\comment\Tests\CommentLanguageTest->testCommentLanguage()
Found the requested form fields at fr/node/OtherCommentLanguageTest.php113Drupal\comment\Tests\CommentLanguageTest->testCommentLanguage()
Failed to set field subject to fgFd6ZFtOtherCommentLanguageTest.php114Drupal\comment\Tests\CommentLanguageTest->testCommentLanguage()
Failed to set field comment_body[fr][0][value] to hbbk4TaCOtherCommentLanguageTest.php114Drupal\comment\Tests\CommentLanguageTest->testCommentLanguage()
Found the Save buttonOtherCommentLanguageTest.php114Drupal\comment\Tests\CommentLanguageTest->testCommentLanguage()
Found the requested form fields at OtherCommentLanguageTest.php114Drupal\comment\Tests\CommentLanguageTest->testCommentLanguage()
Trying to get property of non-objectNoticeCommentLanguageTest.php119Drupal\comment\Tests\CommentLanguageTest->testCommentLanguage()
array_flip(): Can only flip STRING and INTEGER values!WarningDatabaseStorageController.php165Drupal\Core\Entity\DatabaseStorageController->load()
Trying to get property of non-objectNoticeCommentLanguageTest.php125Drupal\comment\Tests\CommentLanguageTest->testCommentLanguage()
Trying to get property of non-objectNoticeCommentLanguageTest.php126Drupal\comment\Tests\CommentLanguageTest->testCommentLanguage()
The comment posted with content language fr and belonging to the node with language en has language OtherCommentLanguageTest.php126Drupal\comment\Tests\CommentLanguageTest->testCommentLanguage()
Trying to get property of non-objectNoticeCommentLanguageTest.php127Drupal\comment\Tests\CommentLanguageTest->testCommentLanguage()
Comment body correctly stored.OtherCommentLanguageTest.php127Drupal\comment\Tests\CommentLanguageTest->testCommentLanguage()
Trying to get property of non-objectNoticeCommentLanguageTest.php113Drupal\comment\Tests\CommentLanguageTest->testCommentLanguage()
Failed to set field subject to fLXAQya6OtherCommentLanguageTest.php113Drupal\comment\Tests\CommentLanguageTest->testCommentLanguage()
Failed to set field comment_body[en][0][value] to dF2bnkNVOtherCommentLanguageTest.php113Drupal\comment\Tests\CommentLanguageTest->testCommentLanguage()
Found the Preview buttonOtherCommentLanguageTest.php113Drupal\comment\Tests\CommentLanguageTest->testCommentLanguage()
Found the requested form fields at node/OtherCommentLanguageTest.php113Drupal\comment\Tests\CommentLanguageTest->testCommentLanguage()
Failed to set field subject to fLXAQya6OtherCommentLanguageTest.php114Drupal\comment\Tests\CommentLanguageTest->testCommentLanguage()
Failed to set field comment_body[en][0][value] to dF2bnkNVOtherCommentLanguageTest.php114Drupal\comment\Tests\CommentLanguageTest->testCommentLanguage()
Found the Save buttonOtherCommentLanguageTest.php114Drupal\comment\Tests\CommentLanguageTest->testCommentLanguage()
Found the requested form fields at OtherCommentLanguageTest.php114Drupal\comment\Tests\CommentLanguageTest->testCommentLanguage()
Trying to get property of non-objectNoticeCommentLanguageTest.php119Drupal\comment\Tests\CommentLanguageTest->testCommentLanguage()
array_flip(): Can only flip STRING and INTEGER values!WarningDatabaseStorageController.php165Drupal\Core\Entity\DatabaseStorageController->load()
Trying to get property of non-objectNoticeCommentLanguageTest.php125Drupal\comment\Tests\CommentLanguageTest->testCommentLanguage()
Trying to get property of non-objectNoticeCommentLanguageTest.php126Drupal\comment\Tests\CommentLanguageTest->testCommentLanguage()
The comment posted with content language en and belonging to the node with language fr has language OtherCommentLanguageTest.php126Drupal\comment\Tests\CommentLanguageTest->testCommentLanguage()
Trying to get property of non-objectNoticeCommentLanguageTest.php127Drupal\comment\Tests\CommentLanguageTest->testCommentLanguage()
Comment body correctly stored.OtherCommentLanguageTest.php127Drupal\comment\Tests\CommentLanguageTest->testCommentLanguage()
Trying to get property of non-objectNoticeCommentLanguageTest.php113Drupal\comment\Tests\CommentLanguageTest->testCommentLanguage()
Failed to set field subject to mOQj5grFOtherCommentLanguageTest.php113Drupal\comment\Tests\CommentLanguageTest->testCommentLanguage()
Failed to set field comment_body[fr][0][value] to iMrzxmeuOtherCommentLanguageTest.php113Drupal\comment\Tests\CommentLanguageTest->testCommentLanguage()
Found the Preview buttonOtherCommentLanguageTest.php113Drupal\comment\Tests\CommentLanguageTest->testCommentLanguage()
Found the requested form fields at fr/node/OtherCommentLanguageTest.php113Drupal\comment\Tests\CommentLanguageTest->testCommentLanguage()
Failed to set field subject to mOQj5grFOtherCommentLanguageTest.php114Drupal\comment\Tests\CommentLanguageTest->testCommentLanguage()
Failed to set field comment_body[fr][0][value] to iMrzxmeuOtherCommentLanguageTest.php114Drupal\comment\Tests\CommentLanguageTest->testCommentLanguage()
Found the Save buttonOtherCommentLanguageTest.php114Drupal\comment\Tests\CommentLanguageTest->testCommentLanguage()
Found the requested form fields at OtherCommentLanguageTest.php114Drupal\comment\Tests\CommentLanguageTest->testCommentLanguage()
Trying to get property of non-objectNoticeCommentLanguageTest.php119Drupal\comment\Tests\CommentLanguageTest->testCommentLanguage()
array_flip(): Can only flip STRING and INTEGER values!WarningDatabaseStorageController.php165Drupal\Core\Entity\DatabaseStorageController->load()
Trying to get property of non-objectNoticeCommentLanguageTest.php125Drupal\comment\Tests\CommentLanguageTest->testCommentLanguage()
Trying to get property of non-objectNoticeCommentLanguageTest.php126Drupal\comment\Tests\CommentLanguageTest->testCommentLanguage()
The comment posted with content language fr and belonging to the node with language fr has language OtherCommentLanguageTest.php126Drupal\comment\Tests\CommentLanguageTest->testCommentLanguage()
Trying to get property of non-objectNoticeCommentLanguageTest.php127Drupal\comment\Tests\CommentLanguageTest->testCommentLanguage()
Comment body correctly stored.OtherCommentLanguageTest.php127Drupal\comment\Tests\CommentLanguageTest->testCommentLanguage()
Raw "pT8PhqT8" foundOtherCommentLanguageTest.php135Drupal\comment\Tests\CommentLanguageTest->testCommentLanguage()
Raw "hbbk4TaC" foundOtherCommentLanguageTest.php135Drupal\comment\Tests\CommentLanguageTest->testCommentLanguage()
Raw "dF2bnkNV" foundOtherCommentLanguageTest.php135Drupal\comment\Tests\CommentLanguageTest->testCommentLanguage()
Raw "iMrzxmeu" foundOtherCommentLanguageTest.php135Drupal\comment\Tests\CommentLanguageTest->testCommentLanguage()
LeafDrupal\comment\Tests\CommentNodeAccessTest5600
LeafDrupal\comment\Tests\CommentNodeChangesTest2300
LeafDrupal\comment\Tests\CommentPagerTest21000
LeafDrupal\comment\Tests\CommentPreviewTest9800
LeafDrupal\comment\Tests\CommentRssTest2500
LeafDrupal\comment\Tests\CommentThreadingTest15000
LeafDrupal\comment\Tests\CommentTokenReplaceTest6500
LeafDrupal\config\Tests\ConfigCRUDTest1800
LeafDrupal\config\Tests\ConfigEntityListTest6800
LeafDrupal\config\Tests\ConfigEntityTest3700
LeafDrupal\config\Tests\ConfigFileContentTest3100
LeafDrupal\config\Tests\ConfigImportTest5200
LeafDrupal\config\Tests\ConfigInstallTest1100
LeafDrupal\config\Tests\ConfigOverrideTest1300
LeafDrupal\config\Tests\ConfigUpgradeTest1100
LeafDrupal\config\Tests\LocaleConfigOverride300
LeafDrupal\config\Tests\Storage\DatabaseStorageTest1900
LeafDrupal\config\Tests\Storage\FileStorageTest2000
LeafDrupal\contact\Tests\ContactAuthenticatedUserTest1300
LeafDrupal\contact\Tests\ContactPersonalTest16300
LeafDrupal\contact\Tests\ContactSitewideTest24100
LeafDrupal\contextual\Tests\ContextualDynamicContextTest1600
ExpandDrupal\dblog\Tests\DBLogTest494268
MessageGroupFilenameLineFunctionStatus
HTTP response expected 200, actual 500BrowserDBLogTest.php304Drupal\dblog\Tests\DBLogTest->doNode()
Node gQdWRZrL was loadedOtherDBLogTest.php307Drupal\dblog\Tests\DBLogTest->doNode()
Trying to get property of non-objectNoticeDBLogTest.php310Drupal\dblog\Tests\DBLogTest->doNode()
Failed to set field body[und][0][value] to qrZr542DgSrmRL3KnVESDRse0FBYCib0OtherDBLogTest.php310Drupal\dblog\Tests\DBLogTest->doNode()
Found the Save buttonOtherDBLogTest.php310Drupal\dblog\Tests\DBLogTest->doNode()
Found the requested form fields at node//editOtherDBLogTest.php310Drupal\dblog\Tests\DBLogTest->doNode()
HTTP response expected 200, actual 404BrowserDBLogTest.php311Drupal\dblog\Tests\DBLogTest->doNode()
Trying to get property of non-objectNoticeDBLogTest.php313Drupal\dblog\Tests\DBLogTest->doNode()
Found the Delete buttonOtherDBLogTest.php313Drupal\dblog\Tests\DBLogTest->doNode()
Found the requested form fields at node//deleteOtherDBLogTest.php313Drupal\dblog\Tests\DBLogTest->doNode()
HTTP response expected 200, actual 404BrowserDBLogTest.php314Drupal\dblog\Tests\DBLogTest->doNode()
Trying to get property of non-objectNoticeDBLogTest.php316Drupal\dblog\Tests\DBLogTest->doNode()
HTTP response expected 404, actual 200BrowserDBLogTest.php317Drupal\dblog\Tests\DBLogTest->doNode()
DBLog event was recorded: [content added]OtherDBLogTest.php330Drupal\dblog\Tests\DBLogTest->doNode()
DBLog event was recorded: [content updated]OtherDBLogTest.php332Drupal\dblog\Tests\DBLogTest->doNode()
DBLog event was recorded: [content deleted]OtherDBLogTest.php334Drupal\dblog\Tests\DBLogTest->doNode()
Trying to get property of non-objectNoticeDBLogTest.php346Drupal\dblog\Tests\DBLogTest->doNode()
HTTP response expected 200, actual 500BrowserDBLogTest.php304Drupal\dblog\Tests\DBLogTest->doNode()
Node gQdWRZrL was loadedOtherDBLogTest.php307Drupal\dblog\Tests\DBLogTest->doNode()
Trying to get property of non-objectNoticeDBLogTest.php310Drupal\dblog\Tests\DBLogTest->doNode()
Failed to set field body[und][0][value] to qrZr542DgSrmRL3KnVESDRse0FBYCib0OtherDBLogTest.php310Drupal\dblog\Tests\DBLogTest->doNode()
Found the Save buttonOtherDBLogTest.php310Drupal\dblog\Tests\DBLogTest->doNode()
Found the requested form fields at node//editOtherDBLogTest.php310Drupal\dblog\Tests\DBLogTest->doNode()
HTTP response expected 200, actual 404BrowserDBLogTest.php311Drupal\dblog\Tests\DBLogTest->doNode()
Trying to get property of non-objectNoticeDBLogTest.php313Drupal\dblog\Tests\DBLogTest->doNode()
Found the Delete buttonOtherDBLogTest.php313Drupal\dblog\Tests\DBLogTest->doNode()
Found the requested form fields at node//deleteOtherDBLogTest.php313Drupal\dblog\Tests\DBLogTest->doNode()
HTTP response expected 200, actual 404BrowserDBLogTest.php314Drupal\dblog\Tests\DBLogTest->doNode()
Trying to get property of non-objectNoticeDBLogTest.php316Drupal\dblog\Tests\DBLogTest->doNode()
HTTP response expected 404, actual 200BrowserDBLogTest.php317Drupal\dblog\Tests\DBLogTest->doNode()
DBLog event was recorded: [content added]OtherDBLogTest.php330Drupal\dblog\Tests\DBLogTest->doNode()
DBLog event was recorded: [content updated]OtherDBLogTest.php332Drupal\dblog\Tests\DBLogTest->doNode()
DBLog event was recorded: [content deleted]OtherDBLogTest.php334Drupal\dblog\Tests\DBLogTest->doNode()
Trying to get property of non-objectNoticeDBLogTest.php346Drupal\dblog\Tests\DBLogTest->doNode()
LeafDrupal\email\Tests\EmailFieldTest1800
LeafDrupal\field\Tests\BulkDeleteTest7500
LeafDrupal\field\Tests\CrudTest6900
LeafDrupal\field\Tests\DisplayApiTest4600
LeafDrupal\field\Tests\EntityPropertiesTest400
LeafDrupal\field\Tests\FieldAttachOtherTest5400
LeafDrupal\field\Tests\FieldAttachStorageTest9200
LeafDrupal\field\Tests\FieldInfoTest8300
LeafDrupal\field\Tests\FieldInstanceCrudTest3800
LeafDrupal\field\Tests\FormTest26400
LeafDrupal\field\Tests\TranslationTest10200
LeafDrupal\field_sql_storage\Tests\FieldSqlStorageTest9200
LeafDrupal\field_ui\Tests\AlterTest2100
LeafDrupal\field_ui\Tests\ManageDisplayTest10900
LeafDrupal\field_ui\Tests\ManageFieldsTest20100
LeafDrupal\file\Tests\CopyTest11000
LeafDrupal\file\Tests\DeleteTest2400
LeafDrupal\file\Tests\DownloadTest4500
ExpandDrupal\file\Tests\FileFieldDisplayTest47118
MessageGroupFilenameLineFunctionStatus
Undefined index: undNoticeFileFieldDisplayTest.php61Drupal\file\Tests\FileFieldDisplayTest->testNodeDisplay()
array_flip(): Can only flip STRING and INTEGER values!WarningDatabaseStorageController.php165Drupal\Core\Entity\DatabaseStorageController->load()
Trying to get property of non-objectNoticefile.module1408theme_file_link()
Trying to get property of non-objectNoticefile.module1410theme_file_link()
array_flip(): Can only flip STRING and INTEGER values!WarningDatabaseStorageController.php165Drupal\Core\Entity\DatabaseStorageController->load()
Trying to get property of non-objectNoticefile.module1447theme_file_icon()
Argument 1 passed to file_icon_url() must be an instance of Drupal\file\File, boolean given, called in /var/lib/drupaltestbot/sites/default/files/checkout/core/modules/file/file.module on line 1448 and definedRecoverable errorfile.module1464file_icon_url()
Argument 1 passed to file_icon_path() must be an instance of Drupal\file\File, boolean given, called in /var/lib/drupaltestbot/sites/default/files/checkout/core/modules/file/file.module on line 1465 and definedRecoverable errorfile.module1484file_icon_path()
Trying to get property of non-objectNoticefile.module1491file_icon_path()
Argument 1 passed to file_icon_map() must be an instance of Drupal\file\File, boolean given, called in /var/lib/drupaltestbot/sites/default/files/checkout/core/modules/file/file.module on line 1498 and definedRecoverable errorfile.module1533file_icon_map()
Trying to get property of non-objectNoticefile.module1534file_icon_map()
Trying to get property of non-objectNoticefile.module1506file_icon_path()
Trying to get property of non-objectNoticefile.module1506file_icon_path()
Trying to get property of non-objectNoticefile.module1506file_icon_path()
Trying to get property of non-objectNoticefile.module1506file_icon_path()
Trying to get property of non-objectNoticefile.module1416theme_file_link()
Trying to get property of non-objectNoticefile.module1416theme_file_link()
Trying to get property of non-objectNoticefile.module1422theme_file_link()
Default formatter displaying correctly on full node view.OtherFileFieldDisplayTest.php63Drupal\file\Tests\FileFieldDisplayTest->testNodeDisplay()
ExpandDrupal\file\Tests\FileFieldPathTest21312
MessageGroupFilenameLineFunctionStatus
Undefined index: undNoticeFileFieldPathTest.php36Drupal\file\Tests\FileFieldPathTest->testUploadPath()
array_flip(): Can only flip STRING and INTEGER values!WarningDatabaseStorageController.php165Drupal\Core\Entity\DatabaseStorageController->load()
Trying to get property of non-objectNoticeFileFieldPathTest.php37Drupal\file\Tests\FileFieldPathTest->testUploadPath()
Trying to get property of non-objectNoticeFileFieldPathTest.php37Drupal\file\Tests\FileFieldPathTest->testUploadPath()
The file was uploaded to the correct path.OtherFileFieldPathTest.php37Drupal\file\Tests\FileFieldPathTest->testUploadPath()
Undefined index: undNoticeFileFieldPathTest.php47Drupal\file\Tests\FileFieldPathTest->testUploadPath()
array_flip(): Can only flip STRING and INTEGER values!WarningDatabaseStorageController.php165Drupal\Core\Entity\DatabaseStorageController->load()
Trying to get property of non-objectNoticeFileFieldPathTest.php48Drupal\file\Tests\FileFieldPathTest->testUploadPath()
Trying to get property of non-objectNoticeFileFieldPathTest.php48Drupal\file\Tests\FileFieldPathTest->testUploadPath()
The file was uploaded to the correct path.OtherFileFieldPathTest.php48Drupal\file\Tests\FileFieldPathTest->testUploadPath()
Undefined index: undNoticeFileFieldPathTest.php59Drupal\file\Tests\FileFieldPathTest->testUploadPath()
array_flip(): Can only flip STRING and INTEGER values!WarningDatabaseStorageController.php165Drupal\Core\Entity\DatabaseStorageController->load()
Trying to get property of non-objectNoticeFileFieldPathTest.php64Drupal\file\Tests\FileFieldPathTest->testUploadPath()
Trying to get property of non-objectNoticeFileFieldPathTest.php64Drupal\file\Tests\FileFieldPathTest->testUploadPath()
The file was uploaded to the correct path with token replacements.OtherFileFieldPathTest.php64Drupal\file\Tests\FileFieldPathTest->testUploadPath()
ExpandDrupal\file\Tests\FileFieldRevisionTest311641
MessageGroupFilenameLineFunctionStatus
Undefined index: undNoticeFileFieldRevisionTest.php50Drupal\file\Tests\FileFieldRevisionTest->testRevisions()
array_flip(): Can only flip STRING and INTEGER values!WarningDatabaseStorageController.php165Drupal\Core\Entity\DatabaseStorageController->load()
Trying to get property of non-objectNoticeFileFieldTestBase.php189Drupal\file\Tests\FileFieldTestBase->assertFileExists()
New file saved to disk on node creation.OtherFileFieldRevisionTest.php52Drupal\file\Tests\FileFieldRevisionTest->testRevisions()
Trying to get property of non-objectNoticeFileFieldTestBase.php197Drupal\file\Tests\FileFieldTestBase->assertFileEntryExists()
array_flip(): Can only flip STRING and INTEGER values!WarningDatabaseStorageController.php165Drupal\Core\Entity\DatabaseStorageController->load()
Trying to get property of non-objectNoticeFileFieldTestBase.php199Drupal\file\Tests\FileFieldTestBase->assertFileEntryExists()
Trying to get property of non-objectNoticeFileFieldTestBase.php199Drupal\file\Tests\FileFieldTestBase->assertFileEntryExists()
Trying to get property of non-objectNoticeFileFieldTestBase.php224Drupal\file\Tests\FileFieldTestBase->assertFileIsPermanent()
File is permanent.OtherFileFieldRevisionTest.php54Drupal\file\Tests\FileFieldRevisionTest->testRevisions()
Found the Remove buttonOtherFileFieldTestBase.php180Drupal\file\Tests\FileFieldTestBase->replaceNodeFile()
Found the requested form fields at node/1/editOtherFileFieldTestBase.php180Drupal\file\Tests\FileFieldTestBase->replaceNodeFile()
Undefined index: undNoticeFileFieldRevisionTest.php59Drupal\file\Tests\FileFieldRevisionTest->testRevisions()
array_flip(): Can only flip STRING and INTEGER values!WarningDatabaseStorageController.php165Drupal\Core\Entity\DatabaseStorageController->load()
Trying to get property of non-objectNoticeFileFieldTestBase.php189Drupal\file\Tests\FileFieldTestBase->assertFileExists()
Replacement file exists on disk after creating new revision.OtherFileFieldRevisionTest.php61Drupal\file\Tests\FileFieldRevisionTest->testRevisions()
Trying to get property of non-objectNoticeFileFieldTestBase.php197Drupal\file\Tests\FileFieldTestBase->assertFileEntryExists()
array_flip(): Can only flip STRING and INTEGER values!WarningDatabaseStorageController.php165Drupal\Core\Entity\DatabaseStorageController->load()
Trying to get property of non-objectNoticeFileFieldTestBase.php199Drupal\file\Tests\FileFieldTestBase->assertFileEntryExists()
Trying to get property of non-objectNoticeFileFieldTestBase.php199Drupal\file\Tests\FileFieldTestBase->assertFileEntryExists()
Trying to get property of non-objectNoticeFileFieldTestBase.php224Drupal\file\Tests\FileFieldTestBase->assertFileIsPermanent()
Replacement file is permanent.OtherFileFieldRevisionTest.php63Drupal\file\Tests\FileFieldRevisionTest->testRevisions()
Undefined index: undNoticeFileFieldRevisionTest.php67Drupal\file\Tests\FileFieldRevisionTest->testRevisions()
array_flip(): Can only flip STRING and INTEGER values!WarningDatabaseStorageController.php165Drupal\Core\Entity\DatabaseStorageController->load()
Trying to get property of non-objectNoticeFileFieldTestBase.php189Drupal\file\Tests\FileFieldTestBase->assertFileExists()
Original file still in place after replacing file in new revision.OtherFileFieldRevisionTest.php68Drupal\file\Tests\FileFieldRevisionTest->testRevisions()
Trying to get property of non-objectNoticeFileFieldTestBase.php197Drupal\file\Tests\FileFieldTestBase->assertFileEntryExists()
array_flip(): Can only flip STRING and INTEGER values!WarningDatabaseStorageController.php165Drupal\Core\Entity\DatabaseStorageController->load()
Trying to get property of non-objectNoticeFileFieldTestBase.php199Drupal\file\Tests\FileFieldTestBase->assertFileEntryExists()
Trying to get property of non-objectNoticeFileFieldTestBase.php199Drupal\file\Tests\FileFieldTestBase->assertFileEntryExists()
Trying to get property of non-objectNoticeFileFieldTestBase.php224Drupal\file\Tests\FileFieldTestBase->assertFileIsPermanent()
Original file is still permanent.OtherFileFieldRevisionTest.php70Drupal\file\Tests\FileFieldRevisionTest->testRevisions()
Undefined index: undNoticeFileFieldRevisionTest.php76Drupal\file\Tests\FileFieldRevisionTest->testRevisions()
array_flip(): Can only flip STRING and INTEGER values!WarningDatabaseStorageController.php165Drupal\Core\Entity\DatabaseStorageController->load()
Trying to get property of non-objectNoticeFileFieldTestBase.php224Drupal\file\Tests\FileFieldTestBase->assertFileIsPermanent()
New revision file is permanent.OtherFileFieldRevisionTest.php79Drupal\file\Tests\FileFieldRevisionTest->testRevisions()
Found the Revert buttonOtherFileFieldRevisionTest.php82Drupal\file\Tests\FileFieldRevisionTest->testRevisions()
Found the requested form fields at node/1/revisions/2/revertOtherFileFieldRevisionTest.php82Drupal\file\Tests\FileFieldRevisionTest->testRevisions()
Undefined index: undNoticeFileFieldRevisionTest.php84Drupal\file\Tests\FileFieldRevisionTest->testRevisions()
array_flip(): Can only flip STRING and INTEGER values!WarningDatabaseStorageController.php165Drupal\Core\Entity\DatabaseStorageController->load()
Trying to get property of non-objectNoticeFileFieldTestBase.php224Drupal\file\Tests\FileFieldTestBase->assertFileIsPermanent()
Original revision file still permanent after reverting to the original revision.OtherFileFieldRevisionTest.php87Drupal\file\Tests\FileFieldRevisionTest->testRevisions()
Found the Delete buttonOtherFileFieldRevisionTest.php91Drupal\file\Tests\FileFieldRevisionTest->testRevisions()
Found the requested form fields at node/1/revisions/2/deleteOtherFileFieldRevisionTest.php91Drupal\file\Tests\FileFieldRevisionTest->testRevisions()
Trying to get property of non-objectNoticeFileFieldTestBase.php189Drupal\file\Tests\FileFieldTestBase->assertFileExists()
Second file is still available after deleting second revision, since it is being used by the third revision.OtherFileFieldRevisionTest.php92Drupal\file\Tests\FileFieldRevisionTest->testRevisions()
Trying to get property of non-objectNoticeFileFieldTestBase.php197Drupal\file\Tests\FileFieldTestBase->assertFileEntryExists()
array_flip(): Can only flip STRING and INTEGER values!WarningDatabaseStorageController.php165Drupal\Core\Entity\DatabaseStorageController->load()
Trying to get property of non-objectNoticeFileFieldTestBase.php199Drupal\file\Tests\FileFieldTestBase->assertFileEntryExists()
Trying to get property of non-objectNoticeFileFieldTestBase.php199Drupal\file\Tests\FileFieldTestBase->assertFileEntryExists()
Trying to get property of non-objectNoticeFileFieldTestBase.php224Drupal\file\Tests\FileFieldTestBase->assertFileIsPermanent()
Second file entry is still permanent after deleting second revision, since it is being used by the third revision.OtherFileFieldRevisionTest.php94Drupal\file\Tests\FileFieldRevisionTest->testRevisions()
Trying to get property of non-objectNoticeFileFieldRevisionTest.php98Drupal\file\Tests\FileFieldRevisionTest->testRevisions()
array_flip(): Can only flip STRING and INTEGER values!WarningDatabaseStorageController.php165Drupal\Core\Entity\DatabaseStorageController->load()
Argument 1 passed to file_usage_add() must be an instance of Drupal\file\File, boolean given, called in /var/lib/drupaltestbot/sites/default/files/checkout/core/modules/file/file.field.inc on line 263 and definedRecoverable errorfile.module193file_usage_add()
Trying to get property of non-objectNoticefile.module196file_usage_add()
Drupal\Core\Entity\EntityStorageException: SQLSTATE[23000]: Integrity constraint violation: 1048 Column 'fid' cannot be null: INSERT INTO {file_usage} (fid, module, type, id, count) VALUES (:db_insert_placeholder_0, :db_insert_placeholder_1, :db_insert_placeholder_2, :db_insert_placeholder_3, :db_insert_placeholder_4); Array ( [:db_insert_placeholder_0] => [:db_insert_placeholder_1] => file [:db_insert_placeholder_2] => user [:db_insert_placeholder_3] => 3 [:db_insert_placeholder_4] => 1 ) in Drupal\Core\Entity\DatabaseStorageController->save() (line 505 of /var/lib/drupaltestbot/sites/default/files/checkout/core/lib/Drupal/Core/Entity/DatabaseStorageController.php).Uncaught exceptionDatabaseStorageController.php505Drupal\Core\Entity\DatabaseStorageController->save()
ExpandDrupal\file\Tests\FileFieldValidateTest901456
MessageGroupFilenameLineFunctionStatus
Node save failed when required file field was empty.OtherFileFieldValidateTest.php41Drupal\file\Tests\FileFieldValidateTest->testRequired()
Undefined index: undNoticeFileFieldValidateTest.php49Drupal\file\Tests\FileFieldValidateTest->testRequired()
array_flip(): Can only flip STRING and INTEGER values!WarningDatabaseStorageController.php165Drupal\Core\Entity\DatabaseStorageController->load()
Trying to get property of non-objectNoticeFileFieldTestBase.php189Drupal\file\Tests\FileFieldTestBase->assertFileExists()
File exists after uploading to the required field.OtherFileFieldValidateTest.php50Drupal\file\Tests\FileFieldValidateTest->testRequired()
Trying to get property of non-objectNoticeFileFieldTestBase.php197Drupal\file\Tests\FileFieldTestBase->assertFileEntryExists()
array_flip(): Can only flip STRING and INTEGER values!WarningDatabaseStorageController.php165Drupal\Core\Entity\DatabaseStorageController->load()
Trying to get property of non-objectNoticeFileFieldTestBase.php199Drupal\file\Tests\FileFieldTestBase->assertFileEntryExists()
Trying to get property of non-objectNoticeFileFieldTestBase.php199Drupal\file\Tests\FileFieldTestBase->assertFileEntryExists()
Node save failed when required multiple value file field was empty.OtherFileFieldValidateTest.php60Drupal\file\Tests\FileFieldValidateTest->testRequired()
Undefined index: undNoticeFileFieldValidateTest.php65Drupal\file\Tests\FileFieldValidateTest->testRequired()
array_flip(): Can only flip STRING and INTEGER values!WarningDatabaseStorageController.php165Drupal\Core\Entity\DatabaseStorageController->load()
Trying to get property of non-objectNoticeFileFieldTestBase.php189Drupal\file\Tests\FileFieldTestBase->assertFileExists()
File exists after uploading to the required multiple value field.OtherFileFieldValidateTest.php66Drupal\file\Tests\FileFieldValidateTest->testRequired()
Trying to get property of non-objectNoticeFileFieldTestBase.php197Drupal\file\Tests\FileFieldTestBase->assertFileEntryExists()
array_flip(): Can only flip STRING and INTEGER values!WarningDatabaseStorageController.php165Drupal\Core\Entity\DatabaseStorageController->load()
Trying to get property of non-objectNoticeFileFieldTestBase.php199Drupal\file\Tests\FileFieldTestBase->assertFileEntryExists()
Trying to get property of non-objectNoticeFileFieldTestBase.php199Drupal\file\Tests\FileFieldTestBase->assertFileEntryExists()
Undefined index: undNoticeFileFieldValidateTest.php101Drupal\file\Tests\FileFieldValidateTest->testFileMaxSize()
array_flip(): Can only flip STRING and INTEGER values!WarningDatabaseStorageController.php165Drupal\Core\Entity\DatabaseStorageController->load()
Trying to get property of non-objectNoticeFileFieldTestBase.php189Drupal\file\Tests\FileFieldTestBase->assertFileExists()
File exists after uploading a file (128 KB) under the max limit (1M).OtherFileFieldValidateTest.php102Drupal\file\Tests\FileFieldValidateTest->testFileMaxSize()
Trying to get property of non-objectNoticeFileFieldTestBase.php197Drupal\file\Tests\FileFieldTestBase->assertFileEntryExists()
array_flip(): Can only flip STRING and INTEGER values!WarningDatabaseStorageController.php165Drupal\Core\Entity\DatabaseStorageController->load()
Trying to get property of non-objectNoticeFileFieldTestBase.php199Drupal\file\Tests\FileFieldTestBase->assertFileEntryExists()
Trying to get property of non-objectNoticeFileFieldTestBase.php199Drupal\file\Tests\FileFieldTestBase->assertFileEntryExists()
Node save failed when file (1.25 MB) exceeded the max upload size (1M).OtherFileFieldValidateTest.php108Drupal\file\Tests\FileFieldValidateTest->testFileMaxSize()
Undefined index: undNoticeFileFieldValidateTest.php101Drupal\file\Tests\FileFieldValidateTest->testFileMaxSize()
array_flip(): Can only flip STRING and INTEGER values!WarningDatabaseStorageController.php165Drupal\Core\Entity\DatabaseStorageController->load()
Trying to get property of non-objectNoticeFileFieldTestBase.php189Drupal\file\Tests\FileFieldTestBase->assertFileExists()
File exists after uploading a file (128 KB) under the max limit (1024K).OtherFileFieldValidateTest.php102Drupal\file\Tests\FileFieldValidateTest->testFileMaxSize()
Trying to get property of non-objectNoticeFileFieldTestBase.php197Drupal\file\Tests\FileFieldTestBase->assertFileEntryExists()
array_flip(): Can only flip STRING and INTEGER values!WarningDatabaseStorageController.php165Drupal\Core\Entity\DatabaseStorageController->load()
Trying to get property of non-objectNoticeFileFieldTestBase.php199Drupal\file\Tests\FileFieldTestBase->assertFileEntryExists()
Trying to get property of non-objectNoticeFileFieldTestBase.php199Drupal\file\Tests\FileFieldTestBase->assertFileEntryExists()
Node save failed when file (1.25 MB) exceeded the max upload size (1024K).OtherFileFieldValidateTest.php108Drupal\file\Tests\FileFieldValidateTest->testFileMaxSize()
Undefined index: undNoticeFileFieldValidateTest.php101Drupal\file\Tests\FileFieldValidateTest->testFileMaxSize()
array_flip(): Can only flip STRING and INTEGER values!WarningDatabaseStorageController.php165Drupal\Core\Entity\DatabaseStorageController->load()
Trying to get property of non-objectNoticeFileFieldTestBase.php189Drupal\file\Tests\FileFieldTestBase->assertFileExists()
File exists after uploading a file (128 KB) under the max limit (1048576).OtherFileFieldValidateTest.php102Drupal\file\Tests\FileFieldValidateTest->testFileMaxSize()
Trying to get property of non-objectNoticeFileFieldTestBase.php197Drupal\file\Tests\FileFieldTestBase->assertFileEntryExists()
array_flip(): Can only flip STRING and INTEGER values!WarningDatabaseStorageController.php165Drupal\Core\Entity\DatabaseStorageController->load()
Trying to get property of non-objectNoticeFileFieldTestBase.php199Drupal\file\Tests\FileFieldTestBase->assertFileEntryExists()
Trying to get property of non-objectNoticeFileFieldTestBase.php199Drupal\file\Tests\FileFieldTestBase->assertFileEntryExists()
Node save failed when file (1.25 MB) exceeded the max upload size (1048576).OtherFileFieldValidateTest.php108Drupal\file\Tests\FileFieldValidateTest->testFileMaxSize()
Undefined index: undNoticeFileFieldValidateTest.php117Drupal\file\Tests\FileFieldValidateTest->testFileMaxSize()
array_flip(): Can only flip STRING and INTEGER values!WarningDatabaseStorageController.php165Drupal\Core\Entity\DatabaseStorageController->load()
Trying to get property of non-objectNoticeFileFieldTestBase.php189Drupal\file\Tests\FileFieldTestBase->assertFileExists()
File exists after uploading a file (1.25 MB) with no max limit.OtherFileFieldValidateTest.php118Drupal\file\Tests\FileFieldValidateTest->testFileMaxSize()
Trying to get property of non-objectNoticeFileFieldTestBase.php197Drupal\file\Tests\FileFieldTestBase->assertFileEntryExists()
array_flip(): Can only flip STRING and INTEGER values!WarningDatabaseStorageController.php165Drupal\Core\Entity\DatabaseStorageController->load()
Trying to get property of non-objectNoticeFileFieldTestBase.php199Drupal\file\Tests\FileFieldTestBase->assertFileEntryExists()
Trying to get property of non-objectNoticeFileFieldTestBase.php199Drupal\file\Tests\FileFieldTestBase->assertFileEntryExists()
Undefined index: undNoticeFileFieldValidateTest.php144Drupal\file\Tests\FileFieldValidateTest->testFileExtension()
array_flip(): Can only flip STRING and INTEGER values!WarningDatabaseStorageController.php165Drupal\Core\Entity\DatabaseStorageController->load()
Trying to get property of non-objectNoticeFileFieldTestBase.php189Drupal\file\Tests\FileFieldTestBase->assertFileExists()
File exists after uploading a file with no extension checking.OtherFileFieldValidateTest.php145Drupal\file\Tests\FileFieldValidateTest->testFileExtension()
Trying to get property of non-objectNoticeFileFieldTestBase.php197Drupal\file\Tests\FileFieldTestBase->assertFileEntryExists()
array_flip(): Can only flip STRING and INTEGER values!WarningDatabaseStorageController.php165Drupal\Core\Entity\DatabaseStorageController->load()
Trying to get property of non-objectNoticeFileFieldTestBase.php199Drupal\file\Tests\FileFieldTestBase->assertFileEntryExists()
Trying to get property of non-objectNoticeFileFieldTestBase.php199Drupal\file\Tests\FileFieldTestBase->assertFileEntryExists()
Node save failed when file uploaded with the wrong extension.OtherFileFieldValidateTest.php154Drupal\file\Tests\FileFieldValidateTest->testFileExtension()
Undefined index: undNoticeFileFieldValidateTest.php162Drupal\file\Tests\FileFieldValidateTest->testFileExtension()
array_flip(): Can only flip STRING and INTEGER values!WarningDatabaseStorageController.php165Drupal\Core\Entity\DatabaseStorageController->load()
Trying to get property of non-objectNoticeFileFieldTestBase.php189Drupal\file\Tests\FileFieldTestBase->assertFileExists()
File exists after uploading a file with extension checking.OtherFileFieldValidateTest.php163Drupal\file\Tests\FileFieldValidateTest->testFileExtension()
Trying to get property of non-objectNoticeFileFieldTestBase.php197Drupal\file\Tests\FileFieldTestBase->assertFileEntryExists()
array_flip(): Can only flip STRING and INTEGER values!WarningDatabaseStorageController.php165Drupal\Core\Entity\DatabaseStorageController->load()
Trying to get property of non-objectNoticeFileFieldTestBase.php199Drupal\file\Tests\FileFieldTestBase->assertFileEntryExists()
Trying to get property of non-objectNoticeFileFieldTestBase.php199Drupal\file\Tests\FileFieldTestBase->assertFileEntryExists()
ExpandDrupal\file\Tests\FileFieldWidgetTest293711
MessageGroupFilenameLineFunctionStatus
simplexml_import_dom(): Invalid Nodetype to importWarningWebTestBase.php1039Drupal\simpletest\WebTestBase->parse()
Parsed page successfully.BrowserFileFieldWidgetTest.php280Drupal\file\Tests\FileFieldWidgetTest->testPrivateFileComment()
Undefined offset: 1NoticeFileFieldWidgetTest.php284Drupal\file\Tests\FileFieldWidgetTest->testPrivateFileComment()
array_flip(): Can only flip STRING and INTEGER values!WarningDatabaseStorageController.php165Drupal\Core\Entity\DatabaseStorageController->load()
Trying to get property of non-objectNoticeFileFieldWidgetTest.php290Drupal\file\Tests\FileFieldWidgetTest->testPrivateFileComment()
array_flip(): Can only flip STRING and INTEGER values!WarningDatabaseStorageController.php165Drupal\Core\Entity\DatabaseStorageController->load()
Trying to get property of non-objectNoticeFileFieldTestBase.php189Drupal\file\Tests\FileFieldTestBase->assertFileExists()
New file saved to disk on node creation.OtherFileFieldWidgetTest.php291Drupal\file\Tests\FileFieldWidgetTest->testPrivateFileComment()
Trying to get property of non-objectNoticeFileFieldWidgetTest.php293Drupal\file\Tests\FileFieldWidgetTest->testPrivateFileComment()
Trying to get property of non-objectNoticeFileFieldWidgetTest.php295Drupal\file\Tests\FileFieldWidgetTest->testPrivateFileComment()
Trying to get property of non-objectNoticeFileFieldWidgetTest.php300Drupal\file\Tests\FileFieldWidgetTest->testPrivateFileComment()
Confirmed that access is denied for the file without the needed permission.BrowserFileFieldWidgetTest.php301Drupal\file\Tests\FileFieldWidgetTest->testPrivateFileComment()
Trying to get property of non-objectNoticeFileFieldWidgetTest.php308Drupal\file\Tests\FileFieldWidgetTest->testPrivateFileComment()
Failed to set field status to OtherFileFieldWidgetTest.php308Drupal\file\Tests\FileFieldWidgetTest->testPrivateFileComment()
Found the Save buttonOtherFileFieldWidgetTest.php308Drupal\file\Tests\FileFieldWidgetTest->testPrivateFileComment()
Found the requested form fields at node//editOtherFileFieldWidgetTest.php308Drupal\file\Tests\FileFieldWidgetTest->testPrivateFileComment()
Trying to get property of non-objectNoticeFileFieldWidgetTest.php312Drupal\file\Tests\FileFieldWidgetTest->testPrivateFileComment()
Confirmed that access is denied for the file without the needed permission.BrowserFileFieldWidgetTest.php313Drupal\file\Tests\FileFieldWidgetTest->testPrivateFileComment()
LeafDrupal\file\Tests\FileManagedFileElementTest26800
LeafDrupal\file\Tests\FilePrivateTest3700
ExpandDrupal\file\Tests\FileTokenReplaceTest132119
MessageGroupFilenameLineFunctionStatus
Undefined index: undNoticeFileTokenReplaceTest.php49Drupal\file\Tests\FileTokenReplaceTest->testFileTokenReplacement()
array_flip(): Can only flip STRING and INTEGER values!WarningDatabaseStorageController.php165Drupal\Core\Entity\DatabaseStorageController->load()
Trying to get property of non-objectNoticeFileTokenReplaceTest.php53Drupal\file\Tests\FileTokenReplaceTest->testFileTokenReplacement()
Trying to get property of non-objectNoticeFileTokenReplaceTest.php54Drupal\file\Tests\FileTokenReplaceTest->testFileTokenReplacement()
Trying to get property of non-objectNoticeFileTokenReplaceTest.php55Drupal\file\Tests\FileTokenReplaceTest->testFileTokenReplacement()
Trying to get property of non-objectNoticeFileTokenReplaceTest.php56Drupal\file\Tests\FileTokenReplaceTest->testFileTokenReplacement()
Trying to get property of non-objectNoticeFileTokenReplaceTest.php57Drupal\file\Tests\FileTokenReplaceTest->testFileTokenReplacement()
Trying to get property of non-objectNoticeFileTokenReplaceTest.php58Drupal\file\Tests\FileTokenReplaceTest->testFileTokenReplacement()
Trying to get property of non-objectNoticeFileTokenReplaceTest.php59Drupal\file\Tests\FileTokenReplaceTest->testFileTokenReplacement()
date_timezone_set() expects parameter 1 to be DateTime, boolean givenWarningcommon.inc1981format_date()
date_format() expects parameter 1 to be DateTime, boolean givenWarningcommon.inc1991format_date()
Trying to get property of non-objectNoticeFileTokenReplaceTest.php60Drupal\file\Tests\FileTokenReplaceTest->testFileTokenReplacement()
date_timezone_set() expects parameter 1 to be DateTime, boolean givenWarningcommon.inc1981format_date()
date_format() expects parameter 1 to be DateTime, boolean givenWarningcommon.inc1991format_date()
Trying to get property of non-objectNoticeFileTokenReplaceTest.php62Drupal\file\Tests\FileTokenReplaceTest->testFileTokenReplacement()
No empty tokens generated.OtherFileTokenReplaceTest.php65Drupal\file\Tests\FileTokenReplaceTest->testFileTokenReplacement()
Sanitized file token [file:fid] replaced.OtherFileTokenReplaceTest.php69Drupal\file\Tests\FileTokenReplaceTest->testFileTokenReplacement()
Sanitized file token [file:name] replaced.OtherFileTokenReplaceTest.php69Drupal\file\Tests\FileTokenReplaceTest->testFileTokenReplacement()
Sanitized file token [file:path] replaced.OtherFileTokenReplaceTest.php69Drupal\file\Tests\FileTokenReplaceTest->testFileTokenReplacement()
Sanitized file token [file:mime] replaced.OtherFileTokenReplaceTest.php69Drupal\file\Tests\FileTokenReplaceTest->testFileTokenReplacement()
Sanitized file token [file:size] replaced.OtherFileTokenReplaceTest.php69Drupal\file\Tests\FileTokenReplaceTest->testFileTokenReplacement()
Sanitized file token [file:url] replaced.OtherFileTokenReplaceTest.php69Drupal\file\Tests\FileTokenReplaceTest->testFileTokenReplacement()
Sanitized file token [file:timestamp] replaced.OtherFileTokenReplaceTest.php69Drupal\file\Tests\FileTokenReplaceTest->testFileTokenReplacement()
Sanitized file token [file:timestamp:short] replaced.OtherFileTokenReplaceTest.php69Drupal\file\Tests\FileTokenReplaceTest->testFileTokenReplacement()
Sanitized file token [file:owner] replaced.OtherFileTokenReplaceTest.php69Drupal\file\Tests\FileTokenReplaceTest->testFileTokenReplacement()
Sanitized file token [file:owner:uid] replaced.OtherFileTokenReplaceTest.php69Drupal\file\Tests\FileTokenReplaceTest->testFileTokenReplacement()
Trying to get property of non-objectNoticeFileTokenReplaceTest.php73Drupal\file\Tests\FileTokenReplaceTest->testFileTokenReplacement()
Trying to get property of non-objectNoticeFileTokenReplaceTest.php74Drupal\file\Tests\FileTokenReplaceTest->testFileTokenReplacement()
Trying to get property of non-objectNoticeFileTokenReplaceTest.php75Drupal\file\Tests\FileTokenReplaceTest->testFileTokenReplacement()
Trying to get property of non-objectNoticeFileTokenReplaceTest.php76Drupal\file\Tests\FileTokenReplaceTest->testFileTokenReplacement()
Unsanitized file token [file:fid] replaced.OtherFileTokenReplaceTest.php80Drupal\file\Tests\FileTokenReplaceTest->testFileTokenReplacement()
Unsanitized file token [file:name] replaced.OtherFileTokenReplaceTest.php80Drupal\file\Tests\FileTokenReplaceTest->testFileTokenReplacement()
Unsanitized file token [file:path] replaced.OtherFileTokenReplaceTest.php80Drupal\file\Tests\FileTokenReplaceTest->testFileTokenReplacement()
Unsanitized file token [file:mime] replaced.OtherFileTokenReplaceTest.php80Drupal\file\Tests\FileTokenReplaceTest->testFileTokenReplacement()
Unsanitized file token [file:size] replaced.OtherFileTokenReplaceTest.php80Drupal\file\Tests\FileTokenReplaceTest->testFileTokenReplacement()
Unsanitized file token [file:url] replaced.OtherFileTokenReplaceTest.php80Drupal\file\Tests\FileTokenReplaceTest->testFileTokenReplacement()
Unsanitized file token [file:timestamp] replaced.OtherFileTokenReplaceTest.php80Drupal\file\Tests\FileTokenReplaceTest->testFileTokenReplacement()
Unsanitized file token [file:timestamp:short] replaced.OtherFileTokenReplaceTest.php80Drupal\file\Tests\FileTokenReplaceTest->testFileTokenReplacement()
Unsanitized file token [file:owner] replaced.OtherFileTokenReplaceTest.php80Drupal\file\Tests\FileTokenReplaceTest->testFileTokenReplacement()
Unsanitized file token [file:owner:uid] replaced.OtherFileTokenReplaceTest.php80Drupal\file\Tests\FileTokenReplaceTest->testFileTokenReplacement()
LeafDrupal\file\Tests\LoadTest3400
LeafDrupal\file\Tests\MoveTest11000
LeafDrupal\file\Tests\RemoteFileSaveUploadTest27000
LeafDrupal\file\Tests\SaveDataTest9300
LeafDrupal\file\Tests\SaveTest1600
LeafDrupal\file\Tests\SaveUploadTest27000
LeafDrupal\file\Tests\SpaceUsedTest1200
LeafDrupal\file\Tests\UsageTest3400
LeafDrupal\file\Tests\ValidateTest1200
LeafDrupal\file\Tests\ValidatorTest2900
LeafDrupal\filter\Tests\FilterAdminTest17800
LeafDrupal\filter\Tests\FilterCrudTest21500
LeafDrupal\filter\Tests\FilterDefaultFormatTest3300
LeafDrupal\filter\Tests\FilterFormatAccessTest27200
LeafDrupal\filter\Tests\FilterHooksTest3300
LeafDrupal\filter\Tests\FilterNoFormatTest100
LeafDrupal\filter\Tests\FilterSecurityTest2800
LeafDrupal\filter\Tests\FilterSettingsTest1000
LeafDrupal\filter\Tests\FilterUnitTest21500
LeafDrupal\forum\Tests\ForumIndexTest2700
LeafDrupal\forum\Tests\ForumNodeAccessTest6300
LeafDrupal\forum\Tests\ForumTest86200
LeafDrupal\help\Tests\HelpTest27800
LeafDrupal\help\Tests\NoHelpTest1200
LeafDrupal\image\Tests\ImageAdminStylesTest22800
LeafDrupal\image\Tests\ImageDimensionsScaleUnitTest1500
LeafDrupal\image\Tests\ImageDimensionsTest5600
LeafDrupal\image\Tests\ImageEffectsTest5000
LeafDrupal\image\Tests\ImageFieldDefaultImagesTest3600
LeafDrupal\image\Tests\ImageFieldDisplayTest20400
LeafDrupal\image\Tests\ImageFieldValidateTest2100
LeafDrupal\image\Tests\ImageStylesPathAndUrlTest7700
LeafDrupal\image\Tests\ImageThemeFunctionTest700
LeafDrupal\language\Tests\LanguageBrowserDetectionUnitTest10700
LeafDrupal\language\Tests\LanguageConfigurationTest4600
LeafDrupal\language\Tests\LanguageCustomLanguageConfigurationTest3600
LeafDrupal\language\Tests\LanguageDependencyInjectionTest1700
LeafDrupal\language\Tests\LanguageListTest10000
LeafDrupal\language\Tests\LanguageNegotiationInfoTest4900
LeafDrupal\language\Tests\LanguagePathMonolingualTest3500
LeafDrupal\language\Tests\LanguageSwitchingTest2600
LeafDrupal\language\Tests\LanguageUILanguageNegotiationTest13300
LeafDrupal\language\Tests\LanguageUrlRewritingTest4400
LeafDrupal\link\Tests\LinkFieldTest13300
LeafDrupal\link\Tests\LinkFieldUITest2100
LeafDrupal\locale\Tests\LocaleCompareTest1600
LeafDrupal\locale\Tests\LocaleContentTest13000
LeafDrupal\locale\Tests\LocaleExportTest5700
LeafDrupal\locale\Tests\LocaleFileImportStatus9100
LeafDrupal\locale\Tests\LocaleImportFunctionalTest20100
LeafDrupal\locale\Tests\LocaleInstallTest200
LeafDrupal\locale\Tests\LocaleJavascriptTranslation6600
LeafDrupal\locale\Tests\LocaleLibraryInfoAlterTest200
LeafDrupal\locale\Tests\LocalePathTest4700
LeafDrupal\locale\Tests\LocalePluralFormatTest16000
LeafDrupal\locale\Tests\LocaleStringTest2600
LeafDrupal\locale\Tests\LocaleUninstallFrenchTest3600
LeafDrupal\locale\Tests\LocaleUninstallTest3600
LeafDrupal\menu\Tests\MenuNodeTest6100
LeafDrupal\menu\Tests\MenuTest315700
LeafDrupal\node\Tests\MultiStepNodeFormBasicOptionsTest1600
ExpandDrupal\node\Tests\NodeAccessBaseTableTest101140
MessageGroupFilenameLineFunctionStatus
The private status of the node was properly set in the node_access_test table.OtherNodeAccessBaseTableTest.php87Drupal\node\Tests\NodeAccessBaseTableTest->testNodeAccessBasic()
The private status of the node was properly set in the node_access_test table.OtherNodeAccessBaseTableTest.php87Drupal\node\Tests\NodeAccessBaseTableTest->testNodeAccessBasic()
Public tid was foundOtherNodeAccessBaseTableTest.php97Drupal\node\Tests\NodeAccessBaseTableTest->testNodeAccessBasic()
Private tid was foundOtherNodeAccessBaseTableTest.php98Drupal\node\Tests\NodeAccessBaseTableTest->testNodeAccessBasic()
A private node by user 2 is visible for user 2.BrowserNodeAccessBaseTableTest.php116Drupal\node\Tests\NodeAccessBaseTableTest->testNodeAccessBasic()
A private node by user 3 is not visible for user 2.BrowserNodeAccessBaseTableTest.php116Drupal\node\Tests\NodeAccessBaseTableTest->testNodeAccessBasic()
A private node by user 2 is not visible for user 2 on the private page.OtherNodeAccessBaseTableTest.php122Drupal\node\Tests\NodeAccessBaseTableTest->testNodeAccessBasic()
A private node by user 2 is not visible for user 3.BrowserNodeAccessBaseTableTest.php116Drupal\node\Tests\NodeAccessBaseTableTest->testNodeAccessBasic()
A private node by user 3 is visible for user 3.BrowserNodeAccessBaseTableTest.php116Drupal\node\Tests\NodeAccessBaseTableTest->testNodeAccessBasic()
A private node by user 3 is not visible for user 3 on the private page.OtherNodeAccessBaseTableTest.php122Drupal\node\Tests\NodeAccessBaseTableTest->testNodeAccessBasic()
HTTP response expected 200, actual 404BrowserNodeAccessBaseTableTest.php132Drupal\node\Tests\NodeAccessBaseTableTest->testNodeAccessBasic()
HTTP response expected 200, actual 404BrowserNodeAccessBaseTableTest.php132Drupal\node\Tests\NodeAccessBaseTableTest->testNodeAccessBasic()
A private node by user 2 is not visible for user 3 on the private page.OtherNodeAccessBaseTableTest.php138Drupal\node\Tests\NodeAccessBaseTableTest->testNodeAccessBasic()
A private node by user 3 is not visible for user 3 on the private page.OtherNodeAccessBaseTableTest.php138Drupal\node\Tests\NodeAccessBaseTableTest->testNodeAccessBasic()
LeafDrupal\node\Tests\NodeAccessFieldTest5000
LeafDrupal\node\Tests\NodeAccessLanguageTest2500
LeafDrupal\node\Tests\NodeAccessPagerTest3000
LeafDrupal\node\Tests\NodeAccessRebuildTest1900
LeafDrupal\node\Tests\NodeAccessRecordsTest2600
LeafDrupal\node\Tests\NodeAccessTest3400
LeafDrupal\node\Tests\NodeAdminTest14500
LeafDrupal\node\Tests\NodeBlockFunctionalTest8400
LeafDrupal\node\Tests\NodeBlockTest2100
LeafDrupal\node\Tests\NodeBuildContentTest400
LeafDrupal\node\Tests\NodeCreationTest4700
LeafDrupal\node\Tests\NodeEntityFieldQueryAlterTest3200
LeafDrupal\node\Tests\NodeFeedTest100
LeafDrupal\node\Tests\NodeFieldMultilingualTestCase6400
LeafDrupal\node\Tests\NodeLoadHooksTest700
LeafDrupal\node\Tests\NodeLoadMultipleTest2700
LeafDrupal\node\Tests\NodePostSettingsTest4000
LeafDrupal\node\Tests\NodeQueryAlterTest9900
LeafDrupal\node\Tests\NodeRevisionPermissionsTest3300
LeafDrupal\node\Tests\NodeRevisionsTest6400
LeafDrupal\node\Tests\NodeRSSContentTest2100
LeafDrupal\node\Tests\NodeSaveTest4800
LeafDrupal\node\Tests\NodeTitleTest2300
LeafDrupal\node\Tests\NodeTitleXSSTest2300
LeafDrupal\node\Tests\NodeTokenReplaceTest3700
LeafDrupal\node\Tests\NodeTypeInitialLanguageTest8000
LeafDrupal\node\Tests\NodeTypePersistenceTest6500
LeafDrupal\node\Tests\NodeTypeTest13600
LeafDrupal\node\Tests\PageEditTest9700
LeafDrupal\node\Tests\PagePreviewTest4100
LeafDrupal\node\Tests\PageViewTest3400
LeafDrupal\node\Tests\SummaryLengthTest1800
LeafDrupal\number\Tests\NumberFieldTest8700
LeafDrupal\openid\Tests\OpenIDFunctionalTest33000
LeafDrupal\openid\Tests\OpenIDRegistrationTest16000
LeafDrupal\openid\Tests\OpenIDTest4500
LeafDrupal\options\Tests\OptionsDynamicValuesValidationTest900
LeafDrupal\options\Tests\OptionsFieldTest1600
LeafDrupal\options\Tests\OptionsFieldUITest20700
LeafDrupal\options\Tests\OptionsSelectDynamicValuesTest1600
LeafDrupal\options\Tests\OptionsWidgetsTest26100
LeafDrupal\path\Tests\PathAliasTest13800
LeafDrupal\path\Tests\PathLanguageTest6600
LeafDrupal\path\Tests\PathLanguageUiTest10400
LeafDrupal\path\Tests\PathTaxonomyTermTest3700
LeafDrupal\php\Tests\PhpAccessTest4500
LeafDrupal\php\Tests\PhpFilterTest4300
LeafDrupal\poll\Tests\PollBlockTest17200
LeafDrupal\poll\Tests\PollCreateTest26900
LeafDrupal\poll\Tests\PollDeleteChoiceTest5400
LeafDrupal\poll\Tests\PollExpirationTest5200
LeafDrupal\poll\Tests\PollJsAddChoiceTest1600
LeafDrupal\poll\Tests\PollTokenReplaceTest12500
LeafDrupal\poll\Tests\PollTranslateTest7300
LeafDrupal\poll\Tests\PollVoteCheckHostnameTest14000
LeafDrupal\poll\Tests\PollVoteTest14600
LeafDrupal\rdf\Tests\CommentAttributesTest20300
LeafDrupal\rdf\Tests\CrudTest1000
LeafDrupal\rdf\Tests\GetNamespacesTest700
LeafDrupal\rdf\Tests\GetRdfNamespacesTest500
LeafDrupal\rdf\Tests\MappingDefinitionTest5900
LeafDrupal\rdf\Tests\MappingHookTest600
ExpandDrupal\rdf\Tests\RdfaMarkupTest2562
MessageGroupFilenameLineFunctionStatus
Attribute 'rel' set on file field. Attribute 'resource' is also set.OtherRdfaMarkupTest.php161Drupal\rdf\Tests\RdfaMarkupTest->testAttributesInMarkupFile()
Attribute 'rel' set on image field. Attribute 'resource' is also set.OtherRdfaMarkupTest.php167Drupal\rdf\Tests\RdfaMarkupTest->testAttributesInMarkupFile()
simplexml_import_dom(): Invalid Nodetype to importWarningWebTestBase.php1039Drupal\simpletest\WebTestBase->parse()
Parsed page successfully.BrowserRdfaMarkupTest.php180Drupal\rdf\Tests\RdfaMarkupTest->testAttributesInMarkupFile()
Property dc:subject is present for the tag1 field item.OtherRdfaMarkupTest.php181Drupal\rdf\Tests\RdfaMarkupTest->testAttributesInMarkupFile()
simplexml_import_dom(): Invalid Nodetype to importWarningWebTestBase.php1039Drupal\simpletest\WebTestBase->parse()
Parsed page successfully.BrowserRdfaMarkupTest.php185Drupal\rdf\Tests\RdfaMarkupTest->testAttributesInMarkupFile()
Property dc:subject is present for the tag2 field item.OtherRdfaMarkupTest.php186Drupal\rdf\Tests\RdfaMarkupTest->testAttributesInMarkupFile()
LeafDrupal\rdf\Tests\TrackerAttributesTest3300
LeafDrupal\search\Tests\SearchAdvancedSearchFormTest3400
LeafDrupal\search\Tests\SearchBlockTest6400
LeafDrupal\search\Tests\SearchCommentCountToggleTest3100
LeafDrupal\search\Tests\SearchCommentTest19300
LeafDrupal\search\Tests\SearchConfigSettingsFormTest13200
LeafDrupal\search\Tests\SearchEmbedFormTest3200
LeafDrupal\search\Tests\SearchExactTest2500
LeafDrupal\search\Tests\SearchExcerptTest1800
LeafDrupal\search\Tests\SearchExpressionInsertExtractTest2400
LeafDrupal\search\Tests\SearchKeywordsConditionsTest2800
LeafDrupal\search\Tests\SearchLanguageTest4100
LeafDrupal\search\Tests\SearchMatchTest14700
LeafDrupal\search\Tests\SearchMultilingualEntityTest1000
LeafDrupal\search\Tests\SearchNodeAccessTest1600
LeafDrupal\search\Tests\SearchNumberMatchingTest29500
LeafDrupal\search\Tests\SearchNumbersTest17500
LeafDrupal\search\Tests\SearchPageOverrideTest1500
LeafDrupal\search\Tests\SearchPageTextTest3700
LeafDrupal\search\Tests\SearchPreprocessLangcodeTest3900
LeafDrupal\search\Tests\SearchRankingTest5900
LeafDrupal\search\Tests\SearchSimplifyTest65700
LeafDrupal\search\Tests\SearchTokenizerTest800
LeafDrupal\shortcut\Tests\ShortcutLinksTest14800
LeafDrupal\shortcut\Tests\ShortcutSetsTest21600
LeafDrupal\simpletest\Tests\BrokenSetUpTest2100
LeafDrupal\simpletest\Tests\BrowserTest1600
LeafDrupal\simpletest\Tests\FolderTest200
LeafDrupal\simpletest\Tests\InstallationProfileModuleTestsTest1900
LeafDrupal\simpletest\Tests\MailCaptureTest1300
LeafDrupal\simpletest\Tests\MissingCheckedRequirementsTest1900
LeafDrupal\simpletest\Tests\OtherInstallationProfileModuleTestsTest1200
LeafDrupal\simpletest\Tests\SimpleTestTest11400
LeafDrupal\statistics\Tests\StatisticsAdminTest11100
LeafDrupal\statistics\Tests\StatisticsBlockVisitorsTest4600
LeafDrupal\statistics\Tests\StatisticsLoggingTest3500
LeafDrupal\statistics\Tests\StatisticsReportsTest9200
LeafDrupal\statistics\Tests\StatisticsTokenReplaceTest3000
LeafDrupal\syslog\Tests\SyslogTest1700
LeafDrupal\system\Tests\Ajax\CommandsTest7300
LeafDrupal\system\Tests\Ajax\ElementValidationTest700
LeafDrupal\system\Tests\Ajax\FormValuesTest2900
LeafDrupal\system\Tests\Ajax\FrameworkTest3400
LeafDrupal\system\Tests\Ajax\MultiFormTest3600
LeafDrupal\system\Tests\Batch\PageTest1600
LeafDrupal\system\Tests\Batch\PercentagesUnitTest1800
LeafDrupal\system\Tests\Batch\ProcessingTest16100
LeafDrupal\system\Tests\Bootstrap\GetFilenameUnitTest500
LeafDrupal\system\Tests\Bootstrap\HookBootExitTest1900
LeafDrupal\system\Tests\Bootstrap\IpAddressTest1100
LeafDrupal\system\Tests\Bootstrap\MiscUnitTest500
LeafDrupal\system\Tests\Bootstrap\OverrideServerVariablesUnitTest600
LeafDrupal\system\Tests\Bootstrap\PageCacheTest7900
LeafDrupal\system\Tests\Bootstrap\ResettableStaticUnitTest500
LeafDrupal\system\Tests\Bootstrap\TimerUnitTest500
LeafDrupal\system\Tests\Bootstrap\VariableTest900
LeafDrupal\system\Tests\Bundle\BundleTest500
LeafDrupal\system\Tests\Cache\ClearTest900
LeafDrupal\system\Tests\Cache\DatabaseBackendUnitTest8600
LeafDrupal\system\Tests\Cache\InstallTest1500
LeafDrupal\system\Tests\Cache\MemoryBackendUnitTest8600
LeafDrupal\system\Tests\Cache\NullBackendTest200
LeafDrupal\system\Tests\Common\AddFeedTest700
LeafDrupal\system\Tests\Common\AlterTest700
LeafDrupal\system\Tests\Common\ArrayUnitTest1300
LeafDrupal\system\Tests\Common\AttributesUnitTest700
LeafDrupal\system\Tests\Common\AutocompleteTagsUnitTest800
LeafDrupal\system\Tests\Common\CascadingStylesheetsTest4100
LeafDrupal\system\Tests\Common\CascadingStylesheetsUnitTest1200
LeafDrupal\system\Tests\Common\ColorTest8500
LeafDrupal\system\Tests\Common\FormatDateTest7100
LeafDrupal\system\Tests\Common\GotoTest2100
LeafDrupal\system\Tests\Common\HtmlIdentifierUnitTest1000
LeafDrupal\system\Tests\Common\HttpRequestTest3500
LeafDrupal\system\Tests\Common\InstallerLanguageTest800
LeafDrupal\system\Tests\Common\JavaScriptTest9500
LeafDrupal\system\Tests\Common\JsonUnitTest2100
LeafDrupal\system\Tests\Common\ParseInfoFileUnitTest300
LeafDrupal\system\Tests\Common\RegionContentTest1800
LeafDrupal\system\Tests\Common\RenderTest5400
LeafDrupal\system\Tests\Common\SchemaTest58800
LeafDrupal\system\Tests\Common\SimpleTestErrorCollectorTest1600
LeafDrupal\system\Tests\Common\SizeUnitTest3500
LeafDrupal\system\Tests\Common\SystemListingTest600
LeafDrupal\system\Tests\Common\TableSortExtenderUnitTest600
LeafDrupal\system\Tests\Common\UrlTest5600
LeafDrupal\system\Tests\Common\ValidNumberStepUnitTest2400
LeafDrupal\system\Tests\Common\ValidUrlUnitTest7900
LeafDrupal\system\Tests\Common\WriteRecordTest3400
LeafDrupal\system\Tests\Common\XssUnitTest1700
LeafDrupal\system\Tests\Database\AlterTest6200
LeafDrupal\system\Tests\Database\BasicSyntaxTest3000
LeafDrupal\system\Tests\Database\CaseSensitivityTest800
LeafDrupal\system\Tests\Database\ConnectionTest3800
LeafDrupal\system\Tests\Database\DeleteTruncateTest2300
LeafDrupal\system\Tests\Database\EmptyStatementTest400
LeafDrupal\system\Tests\Database\FetchTest6600
LeafDrupal\system\Tests\Database\InsertDefaultsTest2200
LeafDrupal\system\Tests\Database\InsertLobTest1500
LeafDrupal\system\Tests\Database\InsertTest5100
LeafDrupal\system\Tests\Database\InvalidDataTest800
LeafDrupal\system\Tests\Database\LoggingTest4400
LeafDrupal\system\Tests\Database\MergeTest8300
LeafDrupal\system\Tests\Database\NextIdTest200
LeafDrupal\system\Tests\Database\QueryTest700
LeafDrupal\system\Tests\Database\RangeQueryTest800
LeafDrupal\system\Tests\Database\RegressionTest3100
LeafDrupal\system\Tests\Database\SelectComplexTest17900
LeafDrupal\system\Tests\Database\SelectOrderedTest2900
LeafDrupal\system\Tests\Database\SelectPagerDefaultTest4700
LeafDrupal\system\Tests\Database\SelectSubqueryTest4300
LeafDrupal\system\Tests\Database\SelectTableSortDefaultTest4500
LeafDrupal\system\Tests\Database\SelectTest18900
LeafDrupal\system\Tests\Database\SerializeQueryTest700
LeafDrupal\system\Tests\Database\TaggingTest3200
LeafDrupal\system\Tests\Database\TemporaryQueryTest1100
LeafDrupal\system\Tests\Database\TransactionTest10500
LeafDrupal\system\Tests\Database\UpdateComplexTest8700
LeafDrupal\system\Tests\Database\UpdateLobTest1500
LeafDrupal\system\Tests\Database\UpdateTest8200
LeafDrupal\system\Tests\Entity\EntityApiInfoTest1000
LeafDrupal\system\Tests\Entity\EntityApiTest1600
LeafDrupal\system\Tests\Entity\EntityCrudHookTest13300
LeafDrupal\system\Tests\Entity\EntityFieldQueryTest17600
LeafDrupal\system\Tests\Entity\EntityFieldTest13800
LeafDrupal\system\Tests\Entity\EntityFormTest2600
LeafDrupal\system\Tests\Entity\EntityTranslationFormTest3600
LeafDrupal\system\Tests\Entity\EntityTranslationTest5100
LeafDrupal\system\Tests\Entity\EntityUUIDTest1900
LeafDrupal\system\Tests\FileTransfer\FileTransferTest200
LeafDrupal\system\Tests\File\DirectoryTest2000
LeafDrupal\system\Tests\File\MimeTypeTest4200
LeafDrupal\system\Tests\File\NameMungingTest500
LeafDrupal\system\Tests\File\RemoteFileDirectoryTest2400
LeafDrupal\system\Tests\File\RemoteFileScanDirectoryTest2900
LeafDrupal\system\Tests\File\RemoteFileUnmanagedCopyTest3200
LeafDrupal\system\Tests\File\RemoteFileUnmanagedDeleteRecursiveTest2100
LeafDrupal\system\Tests\File\RemoteFileUnmanagedDeleteTest1000
LeafDrupal\system\Tests\File\RemoteFileUnmanagedMoveTest2300
LeafDrupal\system\Tests\File\RemoteFileUnmanagedSaveDataTest800
LeafDrupal\system\Tests\File\ScanDirectoryTest2900
LeafDrupal\system\Tests\File\StreamWrapperTest1900
LeafDrupal\system\Tests\File\UnmanagedCopyTest2900
LeafDrupal\system\Tests\File\UnmanagedDeleteRecursiveTest1700
LeafDrupal\system\Tests\File\UnmanagedDeleteTest700
LeafDrupal\system\Tests\File\UnmanagedMoveTest2000
LeafDrupal\system\Tests\File\UnmanagedSaveDataTest700
LeafDrupal\system\Tests\File\UrlRewritingTest1400
LeafDrupal\system\Tests\Form\AlterTest400
LeafDrupal\system\Tests\Form\ArbitraryRebuildTest1600
LeafDrupal\system\Tests\Form\CheckboxTest9700
LeafDrupal\system\Tests\Form\ElementsLabelsTest2000
LeafDrupal\system\Tests\Form\ElementsTableSelectTest6900
LeafDrupal\system\Tests\Form\ElementsVerticalTabsTest3900
LeafDrupal\system\Tests\Form\ElementTest3700
LeafDrupal\system\Tests\Form\EmailTest1700
LeafDrupal\system\Tests\Form\FileInclusionTest1100
LeafDrupal\system\Tests\Form\FormTest64400
LeafDrupal\system\Tests\Form\HTMLIdTest700
LeafDrupal\system\Tests\Form\LanguageSelectElementTest4700
LeafDrupal\system\Tests\Form\ProgrammaticTest2400
LeafDrupal\system\Tests\Form\RebuildTest5300
LeafDrupal\system\Tests\Form\RedirectTest3100
LeafDrupal\system\Tests\Form\StateValuesCleanAdvancedTest700
LeafDrupal\system\Tests\Form\StateValuesCleanTest1400
LeafDrupal\system\Tests\Form\StorageTest12000
LeafDrupal\system\Tests\Form\TriggeringElementTest5000
LeafDrupal\system\Tests\Form\UrlTest1700
LeafDrupal\system\Tests\Form\ValidationTest11200
LeafDrupal\system\Tests\Form\WrapperTest500
LeafDrupal\system\Tests\Graph\GraphUnitTest2800
LeafDrupal\system\Tests\Image\FileMoveTest500
LeafDrupal\system\Tests\Image\ToolkitGdTest26400
LeafDrupal\system\Tests\Image\ToolkitTest5300
LeafDrupal\system\Tests\KeyValueStore\DatabaseStorageExpirableTest6800
LeafDrupal\system\Tests\KeyValueStore\DatabaseStorageTest3600
LeafDrupal\system\Tests\KeyValueStore\GarbageCollectionTest200
LeafDrupal\system\Tests\KeyValueStore\MemoryStorageTest3600
LeafDrupal\system\Tests\Lock\LockFunctionalTest2900
LeafDrupal\system\Tests\Mail\HtmlToTextTest8300
LeafDrupal\system\Tests\Mail\MailTest400
ExpandDrupal\system\Tests\Menu\BreadcrumbTest3882121
MessageGroupFilenameLineFunctionStatus
simplexml_import_dom(): Invalid Nodetype to importWarningWebTestBase.php1039Drupal\simpletest\WebTestBase->parse()
Parsed page successfully.BrowserMenuTestBase.php107Drupal\system\Tests\Menu\MenuTestBase->getParts()
Breadcrumb Home » Root found on http://drupaltestbot813.2-mysql.osuosl.test/checkout/node/4/edit.OtherBreadcrumbTest.php286Drupal\system\Tests\Menu\BreadcrumbTest->testBreadCrumbs()
simplexml_import_dom(): Invalid Nodetype to importWarningWebTestBase.php1039Drupal\simpletest\WebTestBase->parse()
Parsed page successfully.BrowserBreadcrumbTest.php286Drupal\system\Tests\Menu\BreadcrumbTest->testBreadCrumbs()
current() expects parameter 1 to be array, boolean givenWarningWebTestBase.php2303Drupal\simpletest\WebTestBase->assertTitle()
Page title '' is equal to 'hxn96kPD | Drupal'.OtherBreadcrumbTest.php286Drupal\system\Tests\Menu\BreadcrumbTest->testBreadCrumbs()
simplexml_import_dom(): Invalid Nodetype to importWarningWebTestBase.php1039Drupal\simpletest\WebTestBase->parse()
Parsed page successfully.BrowserBreadcrumbTest.php286Drupal\system\Tests\Menu\BreadcrumbTest->testBreadCrumbs()
Active trail to current page was found in menu tree.OtherBreadcrumbTest.php286Drupal\system\Tests\Menu\BreadcrumbTest->testBreadCrumbs()
simplexml_import_dom(): Invalid Nodetype to importWarningWebTestBase.php1039Drupal\simpletest\WebTestBase->parse()
Parsed page successfully.BrowserBreadcrumbTest.php286Drupal\system\Tests\Menu\BreadcrumbTest->testBreadCrumbs()
Active link Parent hxn96kPD was found in menu tree, including active trail links Root.OtherBreadcrumbTest.php286Drupal\system\Tests\Menu\BreadcrumbTest->testBreadCrumbs()
Breadcrumb Home » Root » Parent hxn96kPD found on http://drupaltestbot813.2-mysql.osuosl.test/checkout/node/5.OtherBreadcrumbTest.php293Drupal\system\Tests\Menu\BreadcrumbTest->testBreadCrumbs()
Active trail to current page was found in menu tree.OtherBreadcrumbTest.php293Drupal\system\Tests\Menu\BreadcrumbTest->testBreadCrumbs()
Active link Child xcewllN7 was found in menu tree, including active trail links Root » Parent hxn96kPD.OtherBreadcrumbTest.php293Drupal\system\Tests\Menu\BreadcrumbTest->testBreadCrumbs()
Trying to get property of non-objectNoticeBreadcrumbTest.php320Drupal\system\Tests\Menu\BreadcrumbTest->testBreadCrumbs()
Trying to get property of non-objectNoticeBreadcrumbTest.php320Drupal\system\Tests\Menu\BreadcrumbTest->testBreadCrumbs()
Trying to get property of non-objectNoticeBreadcrumbTest.php327Drupal\system\Tests\Menu\BreadcrumbTest->testBreadCrumbs()
Undefined index: mlidNoticeBreadcrumbTest.php336Drupal\system\Tests\Menu\BreadcrumbTest->testBreadCrumbs()
Trying to get property of non-objectNoticeBreadcrumbTest.php327Drupal\system\Tests\Menu\BreadcrumbTest->testBreadCrumbs()
Failed to set field parent to navigation:OtherBreadcrumbTest.php330Drupal\system\Tests\Menu\BreadcrumbTest->testBreadCrumbs()
Found the requested form fields at admin/structure/menu/manage/navigation/addOtherBreadcrumbTest.php330Drupal\system\Tests\Menu\BreadcrumbTest->testBreadCrumbs()
Undefined index: mlidNoticeBreadcrumbTest.php336Drupal\system\Tests\Menu\BreadcrumbTest->testBreadCrumbs()
Undefined index: link_titleNoticeBreadcrumbTest.php347Drupal\system\Tests\Menu\BreadcrumbTest->testBreadCrumbs()
Trying to get property of non-objectNoticeBreadcrumbTest.php349Drupal\system\Tests\Menu\BreadcrumbTest->testBreadCrumbs()
Breadcrumb Home found on http://drupaltestbot813.2-mysql.osuosl.test/checkout/taxonomy/term/.OtherBreadcrumbTest.php349Drupal\system\Tests\Menu\BreadcrumbTest->testBreadCrumbs()
SimpleXMLElement::xpath(): Invalid expressionWarningWebTestBase.php1696Drupal\simpletest\WebTestBase->xpath()
SimpleXMLElement::xpath(): xmlXPathEval: evaluation failedWarningWebTestBase.php1696Drupal\simpletest\WebTestBase->xpath()
Active link was found in menu tree, including active trail links .OtherBreadcrumbTest.php349Drupal\system\Tests\Menu\BreadcrumbTest->testBreadCrumbs()
Tagged node found.OtherBreadcrumbTest.php350Drupal\system\Tests\Menu\BreadcrumbTest->testBreadCrumbs()
Link to taxonomy/term/ appears only once.OtherBreadcrumbTest.php360Drupal\system\Tests\Menu\BreadcrumbTest->testBreadCrumbs()
Trying to get property of non-objectNoticeBreadcrumbTest.php365Drupal\system\Tests\Menu\BreadcrumbTest->testBreadCrumbs()
Undefined index: link_titleNoticeBreadcrumbTest.php347Drupal\system\Tests\Menu\BreadcrumbTest->testBreadCrumbs()
Trying to get property of non-objectNoticeBreadcrumbTest.php349Drupal\system\Tests\Menu\BreadcrumbTest->testBreadCrumbs()
Breadcrumb Home » found on http://drupaltestbot813.2-mysql.osuosl.test/checkout/taxonomy/term/.OtherBreadcrumbTest.php349Drupal\system\Tests\Menu\BreadcrumbTest->testBreadCrumbs()
SimpleXMLElement::xpath(): Invalid expressionWarningWebTestBase.php1696Drupal\simpletest\WebTestBase->xpath()
SimpleXMLElement::xpath(): xmlXPathEval: evaluation failedWarningWebTestBase.php1696Drupal\simpletest\WebTestBase->xpath()
Active link was found in menu tree, including active trail links .OtherBreadcrumbTest.php349Drupal\system\Tests\Menu\BreadcrumbTest->testBreadCrumbs()
Tagged node found.OtherBreadcrumbTest.php350Drupal\system\Tests\Menu\BreadcrumbTest->testBreadCrumbs()
Link to taxonomy/term/ appears only once.OtherBreadcrumbTest.php360Drupal\system\Tests\Menu\BreadcrumbTest->testBreadCrumbs()
Trying to get property of non-objectNoticeBreadcrumbTest.php365Drupal\system\Tests\Menu\BreadcrumbTest->testBreadCrumbs()
LeafDrupal\system\Tests\Menu\LinksTest5000
LeafDrupal\system\Tests\Menu\RebuildTest500
LeafDrupal\system\Tests\Menu\RouterTest22400
LeafDrupal\system\Tests\Menu\TrailTest6800
LeafDrupal\system\Tests\Menu\TreeDataUnitTest400
LeafDrupal\system\Tests\Menu\TreeOutputTest700
LeafDrupal\system\Tests\Module\ClassLoaderTest1000
LeafDrupal\system\Tests\Module\DependencyTest16000
LeafDrupal\system\Tests\Module\EnableDisableTest156200
LeafDrupal\system\Tests\Module\HookRequirementsTest1600
LeafDrupal\system\Tests\Module\InstallTest300
LeafDrupal\system\Tests\Module\ModuleApiTest6800
LeafDrupal\system\Tests\Module\ModuleEnable300
LeafDrupal\system\Tests\Module\RequiredTest1800
LeafDrupal\system\Tests\Module\UninstallTest200
LeafDrupal\system\Tests\Module\VersionTest5100
LeafDrupal\system\Tests\Pager\PagerTest12300
LeafDrupal\system\Tests\Path\LookupTest1300
LeafDrupal\system\Tests\Path\MatchPathTest6400
LeafDrupal\system\Tests\Path\SaveTest800
LeafDrupal\system\Tests\Path\UrlAlterFunctionalTest6000
LeafDrupal\system\Tests\PhpStorage\FileStorageTest2400
LeafDrupal\system\Tests\PhpStorage\MTimeProtectedFastFileStorageTest1900
LeafDrupal\system\Tests\PhpStorage\MTimeProtectedFileStorageTest1900
LeafDrupal\system\Tests\Plugin\AlterDecoratorTest300
LeafDrupal\system\Tests\Plugin\DerivativeTest900
LeafDrupal\system\Tests\Plugin\Discovery\AnnotatedClassDiscoveryTest600
LeafDrupal\system\Tests\Plugin\Discovery\StaticDiscoveryTest600
LeafDrupal\system\Tests\Plugin\FactoryTest900
LeafDrupal\system\Tests\Plugin\InspectionTest600
LeafDrupal\system\Tests\Queue\QueueTest1400
LeafDrupal\system\Tests\Routing\ChainMatcherTest300
LeafDrupal\system\Tests\Routing\ControllerResolverTest100
LeafDrupal\system\Tests\Routing\FirstEntryFinalMatcherTest800
LeafDrupal\system\Tests\Routing\HttpMethodMatcherTest800
LeafDrupal\system\Tests\Routing\MatcherDumperTest800
LeafDrupal\system\Tests\Routing\NestedMatcherTest100
LeafDrupal\system\Tests\Routing\PathMatcherTest2700
LeafDrupal\system\Tests\Routing\RouterTest2100
LeafDrupal\system\Tests\Routing\RouteTest600
LeafDrupal\system\Tests\Session\SessionHttpsTest8300
LeafDrupal\system\Tests\Session\SessionTest19000
LeafDrupal\system\Tests\System\AccessDeniedTest6800
LeafDrupal\system\Tests\System\AdminMetaTagTest300
LeafDrupal\system\Tests\System\AdminTest18100
LeafDrupal\system\Tests\System\CronRunTest4000
LeafDrupal\system\Tests\System\DateFormatsLanguageTest3700
LeafDrupal\system\Tests\System\DateTimeTest11300
LeafDrupal\system\Tests\System\DefaultMobileMetaTagsTest1200
LeafDrupal\system\Tests\System\ErrorHandlerTest4000
LeafDrupal\system\Tests\System\FloodTest600
LeafDrupal\system\Tests\System\FrontPageTest3700
LeafDrupal\system\Tests\System\IndexPhpTest600
LeafDrupal\system\Tests\System\InfoAlterTest1000
LeafDrupal\system\Tests\System\InfoFileParserUnitTest900
LeafDrupal\system\Tests\System\MainContentFallbackTest6000
LeafDrupal\system\Tests\System\PageNotFoundTest1800
LeafDrupal\system\Tests\System\PageTitleFilteringTest4400
LeafDrupal\system\Tests\System\PasswordHashingTest1000
LeafDrupal\system\Tests\System\RetrieveFileTest700
LeafDrupal\system\Tests\System\ShutdownFunctionsTest500
LeafDrupal\system\Tests\System\SiteMaintenanceTest7800
LeafDrupal\system\Tests\System\SystemAuthorizeTest1600
LeafDrupal\system\Tests\System\ThemeTest20500
LeafDrupal\system\Tests\System\TokenReplaceTest3600
LeafDrupal\system\Tests\System\UnicodeUnitTest18200
LeafDrupal\system\Tests\Theme\FastTest1200
LeafDrupal\system\Tests\Theme\FunctionsTest2500
LeafDrupal\system\Tests\Theme\HookInitTest500
LeafDrupal\system\Tests\Theme\HtmlTagUnitTest200
LeafDrupal\system\Tests\Theme\HtmlTplPhpAttributesTest500
LeafDrupal\system\Tests\Theme\RegistryTest600
LeafDrupal\system\Tests\Theme\TableTest600
LeafDrupal\system\Tests\Theme\ThemeTest4600
LeafDrupal\system\Tests\TypedData\TypedDataTest6100
LeafDrupal\system\Tests\Update\DependencyHookInvocationTest400
LeafDrupal\system\Tests\Update\DependencyMissingTest400
LeafDrupal\system\Tests\Update\DependencyOrderingTest500
LeafDrupal\system\Tests\Update\UpdateScriptTest20100
LeafDrupal\system\Tests\Upgrade\BareMinimalUpgradePathTest6000
LeafDrupal\system\Tests\Upgrade\BareStandardUpgradePathTest9200
LeafDrupal\system\Tests\Upgrade\FilledMinimalUpgradePathTest6200
LeafDrupal\system\Tests\Upgrade\FilledStandardUpgradePathTest8100
LeafDrupal\system\Tests\Upgrade\ImageUpgradePathTest3900
LeafDrupal\system\Tests\Upgrade\LanguageUpgradePathTest15400
LeafDrupal\system\Tests\Upgrade\ModulesDisabledUpgradePathTest4500
LeafDrupal\system\Tests\Upgrade\SystemUpgradePathTest5700
LeafDrupal\system\Tests\Upgrade\UserRoleUpgradePathTest5800
LeafDrupal\system\Tests\Upgrade\UuidUpgradePathTest4200
LeafDrupal\system\Tests\Uuid\UuidUnitTest700
LeafDrupal\taxonomy\Tests\EfqTest1300
LeafDrupal\taxonomy\Tests\HooksTest2300
ExpandDrupal\taxonomy\Tests\LegacyTest1211
MessageGroupFilenameLineFunctionStatus
Trying to get property of non-objectNoticeLegacyTest.php45Drupal\taxonomy\Tests\LegacyTest->testTaxonomyLegacyNode()
Legacy node was saved with the right date.OtherLegacyTest.php45Drupal\taxonomy\Tests\LegacyTest->testTaxonomyLegacyNode()
LeafDrupal\taxonomy\Tests\LoadMultipleTest1800
LeafDrupal\taxonomy\Tests\RssTest2400
LeafDrupal\taxonomy\Tests\TermFieldMultipleVocabularyTest2600
LeafDrupal\taxonomy\Tests\TermFieldTest3200
LeafDrupal\taxonomy\Tests\TermIndexTest4600
LeafDrupal\taxonomy\Tests\TermLanguageTest2600
ExpandDrupal\taxonomy\Tests\TermTest2362427
MessageGroupFilenameLineFunctionStatus
The term appears on the node previewOtherTermTest.php165Drupal\taxonomy\Tests\TermTest->testNodeTermCreationAndDeletion()
The term appears on the node previewOtherTermTest.php165Drupal\taxonomy\Tests\TermTest->testNodeTermCreationAndDeletion()
The term appears on the node previewOtherTermTest.php165Drupal\taxonomy\Tests\TermTest->testNodeTermCreationAndDeletion()
The term appears on the node previewOtherTermTest.php165Drupal\taxonomy\Tests\TermTest->testNodeTermCreationAndDeletion()
The node was created successfully.OtherTermTest.php175Drupal\taxonomy\Tests\TermTest->testNodeTermCreationAndDeletion()
The term was saved and appears on the node page.OtherTermTest.php177Drupal\taxonomy\Tests\TermTest->testNodeTermCreationAndDeletion()
The term was saved and appears on the node page.OtherTermTest.php177Drupal\taxonomy\Tests\TermTest->testNodeTermCreationAndDeletion()
The term was saved and appears on the node page.OtherTermTest.php177Drupal\taxonomy\Tests\TermTest->testNodeTermCreationAndDeletion()
The term was saved and appears on the node page.OtherTermTest.php177Drupal\taxonomy\Tests\TermTest->testNodeTermCreationAndDeletion()
Trying to get property of non-objectNoticeTermTest.php188Drupal\taxonomy\Tests\TermTest->testNodeTermCreationAndDeletion()
Found the Delete buttonOtherTermTest.php188Drupal\taxonomy\Tests\TermTest->testNodeTermCreationAndDeletion()
Found the requested form fields at taxonomy/term//editOtherTermTest.php188Drupal\taxonomy\Tests\TermTest->testNodeTermCreationAndDeletion()
Invalid argument supplied for foreach()WarningWebTestBase.php1233Drupal\simpletest\WebTestBase->drupalPost()
Found the Delete buttonOtherTermTest.php189Drupal\taxonomy\Tests\TermTest->testNodeTermCreationAndDeletion()
Found the requested form fields at OtherTermTest.php189Drupal\taxonomy\Tests\TermTest->testNodeTermCreationAndDeletion()
Trying to get property of non-objectNoticeTermTest.php192Drupal\taxonomy\Tests\TermTest->testNodeTermCreationAndDeletion()
Found the Delete buttonOtherTermTest.php192Drupal\taxonomy\Tests\TermTest->testNodeTermCreationAndDeletion()
Found the requested form fields at taxonomy/term//deleteOtherTermTest.php192Drupal\taxonomy\Tests\TermTest->testNodeTermCreationAndDeletion()
Trying to get property of non-objectNoticeTermTest.php193Drupal\taxonomy\Tests\TermTest->testNodeTermCreationAndDeletion()
Trying to get property of non-objectNoticeTermTest.php193Drupal\taxonomy\Tests\TermTest->testNodeTermCreationAndDeletion()
Trying to get property of non-objectNoticeTermTest.php197Drupal\taxonomy\Tests\TermTest->testNodeTermCreationAndDeletion()
Trying to get property of non-objectNoticeTermTest.php200Drupal\taxonomy\Tests\TermTest->testNodeTermCreationAndDeletion()
Trying to get property of non-objectNoticeTermTest.php200Drupal\taxonomy\Tests\TermTest->testNodeTermCreationAndDeletion()
The term appears on the node page after two terms, and , were deletedOtherTermTest.php200Drupal\taxonomy\Tests\TermTest->testNodeTermCreationAndDeletion()
Trying to get property of non-objectNoticeTermTest.php200Drupal\taxonomy\Tests\TermTest->testNodeTermCreationAndDeletion()
Trying to get property of non-objectNoticeTermTest.php200Drupal\taxonomy\Tests\TermTest->testNodeTermCreationAndDeletion()
The term appears on the node page after two terms, and , were deletedOtherTermTest.php200Drupal\taxonomy\Tests\TermTest->testNodeTermCreationAndDeletion()
Trying to get property of non-objectNoticeTermTest.php202Drupal\taxonomy\Tests\TermTest->testNodeTermCreationAndDeletion()
Trying to get property of non-objectNoticeTermTest.php202Drupal\taxonomy\Tests\TermTest->testNodeTermCreationAndDeletion()
Trying to get property of non-objectNoticeTermTest.php203Drupal\taxonomy\Tests\TermTest->testNodeTermCreationAndDeletion()
Trying to get property of non-objectNoticeTermTest.php203Drupal\taxonomy\Tests\TermTest->testNodeTermCreationAndDeletion()
Trying to get property of non-objectNoticeTermTest.php207Drupal\taxonomy\Tests\TermTest->testNodeTermCreationAndDeletion()
Undefined variable: term_matchesNoticetaxonomy.pages.inc172taxonomy_autocomplete()
Trying to get property of non-objectNoticeTermTest.php209Drupal\taxonomy\Tests\TermTest->testNodeTermCreationAndDeletion()
Trying to get property of non-objectNoticeTermTest.php209Drupal\taxonomy\Tests\TermTest->testNodeTermCreationAndDeletion()
Trying to get property of non-objectNoticeTermTest.php209Drupal\taxonomy\Tests\TermTest->testNodeTermCreationAndDeletion()
Autocomplete returns term after typing the first 3 letters.OtherTermTest.php209Drupal\taxonomy\Tests\TermTest->testNodeTermCreationAndDeletion()
Trying to get property of non-objectNoticeTermTest.php213Drupal\taxonomy\Tests\TermTest->testNodeTermCreationAndDeletion()
Undefined variable: term_matchesNoticetaxonomy.pages.inc172taxonomy_autocomplete()
Trying to get property of non-objectNoticeTermTest.php215Drupal\taxonomy\Tests\TermTest->testNodeTermCreationAndDeletion()
Trying to get property of non-objectNoticeTermTest.php215Drupal\taxonomy\Tests\TermTest->testNodeTermCreationAndDeletion()
Trying to get property of non-objectNoticeTermTest.php215Drupal\taxonomy\Tests\TermTest->testNodeTermCreationAndDeletion()
Autocomplete returns term after typing the first 3 letters.OtherTermTest.php215Drupal\taxonomy\Tests\TermTest->testNodeTermCreationAndDeletion()
simplexml_import_dom(): Invalid Nodetype to importWarningWebTestBase.php1039Drupal\simpletest\WebTestBase->parse()
Parsed page successfully.BrowserTermTest.php517Drupal\taxonomy\Tests\TermTest->testReSavingTags()
Undefined variable: url_targetNoticeWebTestBase.php1835Drupal\simpletest\WebTestBase->clickLink()
Clicked link Edit () from http://drupaltestbot813.2-mysql.osuosl.test/checkout/node/add/articleBrowserTermTest.php517Drupal\taxonomy\Tests\TermTest->testReSavingTags()
Term is displayed when editing the node.OtherTermTest.php518Drupal\taxonomy\Tests\TermTest->testReSavingTags()
simplexml_import_dom(): Invalid Nodetype to importWarningWebTestBase.php1039Drupal\simpletest\WebTestBase->parse()
Parsed page successfully.BrowserTermTest.php519Drupal\taxonomy\Tests\TermTest->testReSavingTags()
Term is displayed after saving the node with no changes.OtherTermTest.php520Drupal\taxonomy\Tests\TermTest->testReSavingTags()
LeafDrupal\taxonomy\Tests\TermUnitTest1100
LeafDrupal\taxonomy\Tests\ThemeTest1900
LeafDrupal\taxonomy\Tests\TokenReplaceTest5500
LeafDrupal\taxonomy\Tests\VocabularyLanguageTest2300
LeafDrupal\taxonomy\Tests\VocabularyTest11000
LeafDrupal\taxonomy\Tests\VocabularyUnitTest5500
LeafDrupal\text\Tests\TextFieldTest18400
ExpandDrupal\text\Tests\TextSummaryTest13611
MessageGroupFilenameLineFunctionStatus
Trying to get property of non-objectNoticeTextSummaryTest.php181Drupal\text\Tests\TextSummaryTest->testOnlyTextSummary()
Article with with summary and no body has been submitted.OtherTextSummaryTest.php181Drupal\text\Tests\TextSummaryTest->testOnlyTextSummary()
ExpandDrupal\text\Tests\TextTranslationTest88144
MessageGroupFilenameLineFunctionStatus
Trying to get property of non-objectNoticeTextTranslationTest.php82Drupal\text\Tests\TextTranslationTest->testTextField()
Undefined variable: url_targetNoticeWebTestBase.php1835Drupal\simpletest\WebTestBase->clickLink()
Clicked link add translation () from http://drupaltestbot813.2-mysql.osuosl.test/checkout/node//translateBrowserTextTranslationTest.php83Drupal\text\Tests\TextTranslationTest->testTextField()
The textfield widget is populated.OtherTextTranslationTest.php84Drupal\text\Tests\TextTranslationTest->testTextField()
Failed to set field body[und][0][value] to ttNnQj4POtherTextTranslationTest.php120Drupal\text\Tests\TextTranslationTest->testTextFieldFormatted()
Failed to set field body[und][0][format] to full_htmlOtherTextTranslationTest.php120Drupal\text\Tests\TextTranslationTest->testTextFieldFormatted()
Found the Save buttonOtherTextTranslationTest.php120Drupal\text\Tests\TextTranslationTest->testTextFieldFormatted()
Found the requested form fields at node/1/editOtherTextTranslationTest.php120Drupal\text\Tests\TextTranslationTest->testTextFieldFormatted()
The body field with delta 0 has been saved.OtherTextTranslationTest.php121Drupal\text\Tests\TextTranslationTest->testTextFieldFormatted()
Failed to set field body[und][1][value] to fdQOduozOtherTextTranslationTest.php120Drupal\text\Tests\TextTranslationTest->testTextFieldFormatted()
Failed to set field body[und][1][format] to filtered_htmlOtherTextTranslationTest.php120Drupal\text\Tests\TextTranslationTest->testTextFieldFormatted()
Found the Save buttonOtherTextTranslationTest.php120Drupal\text\Tests\TextTranslationTest->testTextFieldFormatted()
Found the requested form fields at node/1/editOtherTextTranslationTest.php120Drupal\text\Tests\TextTranslationTest->testTextFieldFormatted()
The body field with delta 1 has been saved.OtherTextTranslationTest.php121Drupal\text\Tests\TextTranslationTest->testTextFieldFormatted()
Trying to get property of non-objectNoticeTextTranslationTest.php129Drupal\text\Tests\TextTranslationTest->testTextFieldFormatted()
Undefined variable: url_targetNoticeWebTestBase.php1835Drupal\simpletest\WebTestBase->clickLink()
Clicked link add translation () from http://drupaltestbot813.2-mysql.osuosl.test/checkout/node//translateBrowserTextTranslationTest.php130Drupal\text\Tests\TextTranslationTest->testTextFieldFormatted()
The body field with delta 1 is shown.OtherTextTranslationTest.php132Drupal\text\Tests\TextTranslationTest->testTextFieldFormatted()
LeafDrupal\tracker\Tests\TrackerNodeAccessTest2800
LeafDrupal\tracker\Tests\TrackerTest22800
LeafDrupal\translation\Tests\TranslationTest73000
LeafDrupal\update\Tests\UpdateContribTest21500
LeafDrupal\update\Tests\UpdateCoreTest24800
LeafDrupal\update\Tests\UpdateCoreUnitTest400
LeafDrupal\update\Tests\UpdateUploadTest6400
LeafDrupal\user\Tests\TempStoreDatabaseTest1900
LeafDrupal\user\Tests\UserAccountLinksTests6100
LeafDrupal\user\Tests\UserAdminSettingsFormTest400
LeafDrupal\user\Tests\UserAdminTest6200
LeafDrupal\user\Tests\UserAuthmapAssignmentTest600
LeafDrupal\user\Tests\UserAutocompleteTest2500
LeafDrupal\user\Tests\UserBlocksTests4800
LeafDrupal\user\Tests\UserCancelTest26000
LeafDrupal\user\Tests\UserCreateTest3400
LeafDrupal\user\Tests\UserDeleteTest1500
LeafDrupal\user\Tests\UserEditedOwnAccountTest2200
LeafDrupal\user\Tests\UserEditTest7800
LeafDrupal\user\Tests\UserEntityCallbacksTest700
LeafDrupal\user\Tests\UserLanguageCreationTest6900
LeafDrupal\user\Tests\UserLanguageTest3900
LeafDrupal\user\Tests\UserLoginTest15900
LeafDrupal\user\Tests\UserPasswordResetTest3100
LeafDrupal\user\Tests\UserPermissionsTest5000
LeafDrupal\user\Tests\UserPictureTest12600
LeafDrupal\user\Tests\UserRegistrationTest13400
LeafDrupal\user\Tests\UserRoleAdminTest5400
LeafDrupal\user\Tests\UserRolesAssignmentTest5100
LeafDrupal\user\Tests\UserSaveTest200
LeafDrupal\user\Tests\UserSearchTest3700
LeafDrupal\user\Tests\UserSignatureTest4600
LeafDrupal\user\Tests\UserTimeZoneTest2900
LeafDrupal\user\Tests\UserTokenReplaceTest4700
LeafDrupal\user\Tests\UserValidateCurrentPassCustomFormTest1700
LeafDrupal\user\Tests\UserValidationTest1600
LeafDrupal\xmlrpc\Tests\XmlRpcBasicTest900
LeafDrupal\xmlrpc\Tests\XmlRpcMessagesTest700
LeafDrupal\xmlrpc\Tests\XmlRpcValidatorTest1000