locale_string_object-1785086-40.patch

Test status
StatusResult
Last receivedWed, 10/03/2012 - 07:59:06
Last requestedWed, 10/03/2012 - 08:00:02
Last testedWed, 10/03/2012 - 08:27:30
Test count1
Environment status
MySQLfail
File information
Filelocale_string_object-1785086-40.patch
BranchDrupal core - 8.x
LinkIssue Link
SummaryFAILED: [[SimpleTest]]: [MySQL] 40,776 pass(es), 774 fail(s), and 278 exception(s).
Details

MySQL

  1. Setup environment
  2. Detect an invalid patch URL
  3. Detect invalid repository information
  4. Detect invalid patch format
  5. Detect a non-applicable patch
  6. Detect invalid PHP syntax
  7. Detect a Drupal installation failure
  8. Detect a test run failure
  9. Detect a failing test
    Review the test failures below then if necessary run them locally until the problem has been fixed.
  10. Complete test suite with all tests passing
40,776 pass(es), 774 fail(s), and 278 exception(s)

Non-pass

Test namePassFailException
ExpandDrupal\language\Tests\LanguageUILanguageNegotiationTest862416
MessageGroupFilenameLineFunctionStatus
simplexml_import_dom(): Invalid Nodetype to importWarningWebTestBase.php1040Drupal\simpletest\WebTestBase->parse()
Parsed page successfully.BrowserLanguageUILanguageNegotiationTest.php120Drupal\language\Tests\LanguageUILanguageNegotiationTest->testUILanguageNegotiation()
simplexml_import_dom(): Invalid Nodetype to importWarningWebTestBase.php1040Drupal\simpletest\WebTestBase->parse()
Parsed page successfully.BrowserLanguageUILanguageNegotiationTest.php121Drupal\language\Tests\LanguageUILanguageNegotiationTest->testUILanguageNegotiation()
current() expects parameter 1 to be array, boolean givenWarningLanguageUILanguageNegotiationTest.php121Drupal\language\Tests\LanguageUILanguageNegotiationTest->testUILanguageNegotiation()
simplexml_import_dom(): Invalid Nodetype to importWarningWebTestBase.php1040Drupal\simpletest\WebTestBase->parse()
Parsed page successfully.BrowserLanguageUILanguageNegotiationTest.php126Drupal\language\Tests\LanguageUILanguageNegotiationTest->testUILanguageNegotiation()
simplexml_import_dom(): Invalid Nodetype to importWarningWebTestBase.php1040Drupal\simpletest\WebTestBase->parse()
Parsed page successfully.BrowserLanguageUILanguageNegotiationTest.php132Drupal\language\Tests\LanguageUILanguageNegotiationTest->testUILanguageNegotiation()
simplexml_import_dom(): Invalid Nodetype to importWarningWebTestBase.php1040Drupal\simpletest\WebTestBase->parse()
Parsed page successfully.BrowserLanguageUILanguageNegotiationTest.php133Drupal\language\Tests\LanguageUILanguageNegotiationTest->testUILanguageNegotiation()
current() expects parameter 1 to be array, boolean givenWarningLanguageUILanguageNegotiationTest.php133Drupal\language\Tests\LanguageUILanguageNegotiationTest->testUILanguageNegotiation()
simplexml_import_dom(): Invalid Nodetype to importWarningWebTestBase.php1040Drupal\simpletest\WebTestBase->parse()
Parsed page successfully.BrowserLanguageUILanguageNegotiationTest.php138Drupal\language\Tests\LanguageUILanguageNegotiationTest->testUILanguageNegotiation()
URL (PATH) > DEFAULT: with language prefix, UI language is switched based on path prefixOtherLanguageUILanguageNegotiationTest.php349Drupal\language\Tests\LanguageUILanguageNegotiationTest->runTest()
URL (PATH) > BROWSER: no language prefix, UI language is determined by browser language preferenceOtherLanguageUILanguageNegotiationTest.php349Drupal\language\Tests\LanguageUILanguageNegotiationTest->runTest()
URL (PATH) > BROWSER: with langage prefix, UI language is based on path prefixOtherLanguageUILanguageNegotiationTest.php349Drupal\language\Tests\LanguageUILanguageNegotiationTest->runTest()
USER > DEFAULT: defined prefereed user language setting, the UI language is based on user settingOtherLanguageUILanguageNegotiationTest.php349Drupal\language\Tests\LanguageUILanguageNegotiationTest->runTest()
USER ADMIN > DEFAULT: defined prefereed user admin language setting, the UI language is based on user settingOtherLanguageUILanguageNegotiationTest.php349Drupal\language\Tests\LanguageUILanguageNegotiationTest->runTest()
simplexml_import_dom(): Invalid Nodetype to importWarningWebTestBase.php1040Drupal\simpletest\WebTestBase->parse()
Parsed page successfully.BrowserLanguageUILanguageNegotiationTest.php304Drupal\language\Tests\LanguageUILanguageNegotiationTest->testUILanguageNegotiation()
URL (DOMAIN) > DEFAULT: domain example.cn should switch to ChineseOtherLanguageUILanguageNegotiationTest.php349Drupal\language\Tests\LanguageUILanguageNegotiationTest->runTest()
"Language negotiation method: language-url" foundOtherLanguageUILanguageNegotiationTest.php350Drupal\language\Tests\LanguageUILanguageNegotiationTest->runTest()
simplexml_import_dom(): Invalid Nodetype to importWarningWebTestBase.php1040Drupal\simpletest\WebTestBase->parse()
Parsed page successfully.BrowserLanguageUILanguageNegotiationTest.php368Drupal\language\Tests\LanguageUILanguageNegotiationTest->testUrlLanguageFallback()
simplexml_import_dom(): Invalid Nodetype to importWarningWebTestBase.php1040Drupal\simpletest\WebTestBase->parse()
Parsed page successfully.BrowserLanguageUILanguageNegotiationTest.php377Drupal\language\Tests\LanguageUILanguageNegotiationTest->testUrlLanguageFallback()
simplexml_import_dom(): Invalid Nodetype to importWarningWebTestBase.php1040Drupal\simpletest\WebTestBase->parse()
Parsed page successfully.BrowserLanguageUILanguageNegotiationTest.php382Drupal\language\Tests\LanguageUILanguageNegotiationTest->testUrlLanguageFallback()
Undefined offset: 0NoticeLanguageUILanguageNegotiationTest.php394Drupal\language\Tests\LanguageUILanguageNegotiationTest->testUrlLanguageFallback()
The browser language is the URL active languageOtherLanguageUILanguageNegotiationTest.php394Drupal\language\Tests\LanguageUILanguageNegotiationTest->testUrlLanguageFallback()
Undefined offset: 0NoticeLanguageUILanguageNegotiationTest.php398Drupal\language\Tests\LanguageUILanguageNegotiationTest->testUrlLanguageFallback()
URLs are rewritten using the browser language.OtherLanguageUILanguageNegotiationTest.php398Drupal\language\Tests\LanguageUILanguageNegotiationTest->testUrlLanguageFallback()
simplexml_import_dom(): Invalid Nodetype to importWarningWebTestBase.php1040Drupal\simpletest\WebTestBase->parse()
Parsed page successfully.BrowserLanguageUILanguageNegotiationTest.php418Drupal\language\Tests\LanguageUILanguageNegotiationTest->testLanguageDomain()
simplexml_import_dom(): Invalid Nodetype to importWarningWebTestBase.php1040Drupal\simpletest\WebTestBase->parse()
Parsed page successfully.BrowserLanguageUILanguageNegotiationTest.php425Drupal\language\Tests\LanguageUILanguageNegotiationTest->testLanguageDomain()
The url() function returns the right URL (/checkout/it/admin) in accordance with the chosen languageOtherLanguageUILanguageNegotiationTest.php437Drupal\language\Tests\LanguageUILanguageNegotiationTest->testLanguageDomain()
The url() function returns the right HTTPS URL (via options) (https://drupaltestbot813.2-mysql.osuosl.test/checkout/it/admin) in accordance with the chosen languageOtherLanguageUILanguageNegotiationTest.php443Drupal\language\Tests\LanguageUILanguageNegotiationTest->testLanguageDomain()
The url() function returns the right URL (via current URL scheme) (/checkout/it/admin) in accordance with the chosen languageOtherLanguageUILanguageNegotiationTest.php451Drupal\language\Tests\LanguageUILanguageNegotiationTest->testLanguageDomain()
ExpandDrupal\locale\Tests\LocaleContentTest992218
MessageGroupFilenameLineFunctionStatus
simplexml_import_dom(): Invalid Nodetype to importWarningWebTestBase.php1040Drupal\simpletest\WebTestBase->parse()
Parsed page successfully.BrowserLocaleContentTest.php46Drupal\locale\Tests\LocaleContentTest->testMachineNameLTR()
The machine name field is LTR when no additional language is configured.OtherLocaleContentTest.php46Drupal\locale\Tests\LocaleContentTest->testMachineNameLTR()
simplexml_import_dom(): Invalid Nodetype to importWarningWebTestBase.php1040Drupal\simpletest\WebTestBase->parse()
Parsed page successfully.BrowserLocaleContentTest.php51Drupal\locale\Tests\LocaleContentTest->testMachineNameLTR()
simplexml_import_dom(): Invalid Nodetype to importWarningWebTestBase.php1040Drupal\simpletest\WebTestBase->parse()
Parsed page successfully.BrowserLocaleContentTest.php55Drupal\locale\Tests\LocaleContentTest->testMachineNameLTR()
simplexml_import_dom(): Invalid Nodetype to importWarningWebTestBase.php1040Drupal\simpletest\WebTestBase->parse()
Parsed page successfully.BrowserLocaleContentTest.php59Drupal\locale\Tests\LocaleContentTest->testMachineNameLTR()
The machine name field is LTR when the default language is RTL.OtherLocaleContentTest.php59Drupal\locale\Tests\LocaleContentTest->testMachineNameLTR()
simplexml_import_dom(): Invalid Nodetype to importWarningWebTestBase.php1040Drupal\simpletest\WebTestBase->parse()
Parsed page successfully.BrowserLocaleContentTest.php85Drupal\locale\Tests\LocaleContentTest->testContentTypeLanguageConfiguration()
Multilingual support fieldset present on content type configuration form.OtherLocaleContentTest.php89Drupal\locale\Tests\LocaleContentTest->testContentTypeLanguageConfiguration()
simplexml_import_dom(): Invalid Nodetype to importWarningWebTestBase.php1040Drupal\simpletest\WebTestBase->parse()
Parsed page successfully.BrowserLocaleContentTest.php93Drupal\locale\Tests\LocaleContentTest->testContentTypeLanguageConfiguration()
Basic page content type has been updated.OtherLocaleContentTest.php94Drupal\locale\Tests\LocaleContentTest->testContentTypeLanguageConfiguration()
simplexml_import_dom(): Invalid Nodetype to importWarningWebTestBase.php1040Drupal\simpletest\WebTestBase->parse()
Parsed page successfully.BrowserLocaleContentTest.php101Drupal\locale\Tests\LocaleContentTest->testContentTypeLanguageConfiguration()
simplexml_import_dom(): Invalid Nodetype to importWarningWebTestBase.php1040Drupal\simpletest\WebTestBase->parse()
Parsed page successfully.BrowserLocaleContentTest.php106Drupal\locale\Tests\LocaleContentTest->testContentTypeLanguageConfiguration()
Language select present on add Basic page form.BrowserLocaleContentTest.php106Drupal\locale\Tests\LocaleContentTest->testContentTypeLanguageConfiguration()
Language present.OtherLocaleContentTest.php108Drupal\locale\Tests\LocaleContentTest->testContentTypeLanguageConfiguration()
Trying to get property of non-objectNoticeEntityFormController.php230Drupal\Core\Entity\EntityFormController->getFormLangcode()
Correct language selected.OtherLocaleContentTest.php123Drupal\locale\Tests\LocaleContentTest->testContentTypeLanguageConfiguration()
Trying to get property of non-objectNoticeEntityFormController.php230Drupal\Core\Entity\EntityFormController->getFormLangcode()
simplexml_import_dom(): Invalid Nodetype to importWarningWebTestBase.php1040Drupal\simpletest\WebTestBase->parse()
Parsed page successfully.BrowserLocaleContentTest.php128Drupal\locale\Tests\LocaleContentTest->testContentTypeLanguageConfiguration()
Basic page content updated.OtherLocaleContentTest.php129Drupal\locale\Tests\LocaleContentTest->testContentTypeLanguageConfiguration()
simplexml_import_dom(): Invalid Nodetype to importWarningWebTestBase.php1040Drupal\simpletest\WebTestBase->parse()
Parsed page successfully.BrowserLocaleContentTest.php149Drupal\locale\Tests\LocaleContentTest->testContentTypeDirLang()
simplexml_import_dom(): Invalid Nodetype to importWarningWebTestBase.php1040Drupal\simpletest\WebTestBase->parse()
Parsed page successfully.BrowserLocaleContentTest.php154Drupal\locale\Tests\LocaleContentTest->testContentTypeDirLang()
simplexml_import_dom(): Invalid Nodetype to importWarningWebTestBase.php1040Drupal\simpletest\WebTestBase->parse()
Parsed page successfully.BrowserLocaleContentTest.php161Drupal\locale\Tests\LocaleContentTest->testContentTypeDirLang()
Article content type has been updated.OtherLocaleContentTest.php162Drupal\locale\Tests\LocaleContentTest->testContentTypeDirLang()
Trying to get property of non-objectNoticelocale.module658locale_preprocess_node()
Trying to get property of non-objectNoticelocale.module663locale_preprocess_node()
Trying to get property of non-objectNoticelocale.module658locale_preprocess_node()
Trying to get property of non-objectNoticelocale.module663locale_preprocess_node()
The lang and dir tags have been assigned correctly to the Arabic node.OtherLocaleContentTest.php185Drupal\locale\Tests\LocaleContentTest->testContentTypeDirLang()
ExpandDrupal\locale\Tests\LocaleExportTest38212
MessageGroupFilenameLineFunctionStatus
simplexml_import_dom(): Invalid Nodetype to importWarningWebTestBase.php1040Drupal\simpletest\WebTestBase->parse()
Parsed page successfully.BrowserLocaleExportTest.php59Drupal\locale\Tests\LocaleExportTest->testExportTranslation()
Failed to set field langcode to frOtherLocaleExportTest.php65Drupal\locale\Tests\LocaleExportTest->testExportTranslation()
Found the requested form fields at admin/config/regional/translate/exportOtherLocaleExportTest.php65Drupal\locale\Tests\LocaleExportTest->testExportTranslation()
Exported French translation file.OtherLocaleExportTest.php68Drupal\locale\Tests\LocaleExportTest->testExportTranslation()
French translations present in exported file.OtherLocaleExportTest.php70Drupal\locale\Tests\LocaleExportTest->testExportTranslation()
simplexml_import_dom(): Invalid Nodetype to importWarningWebTestBase.php1040Drupal\simpletest\WebTestBase->parse()
Parsed page successfully.BrowserLocaleExportTest.php79Drupal\locale\Tests\LocaleExportTest->testExportTranslation()
Failed to set field langcode to frOtherLocaleExportTest.php92Drupal\locale\Tests\LocaleExportTest->testExportTranslation()
Failed to set field content_options[not_customized] to OtherLocaleExportTest.php92Drupal\locale\Tests\LocaleExportTest->testExportTranslation()
Failed to set field content_options[customized] to 1OtherLocaleExportTest.php92Drupal\locale\Tests\LocaleExportTest->testExportTranslation()
Failed to set field content_options[not_translated] to OtherLocaleExportTest.php92Drupal\locale\Tests\LocaleExportTest->testExportTranslation()
Found the requested form fields at admin/config/regional/translate/exportOtherLocaleExportTest.php92Drupal\locale\Tests\LocaleExportTest->testExportTranslation()
Exported French translation file with only customized strings.OtherLocaleExportTest.php95Drupal\locale\Tests\LocaleExportTest->testExportTranslation()
French custom translation present in exported file.OtherLocaleExportTest.php97Drupal\locale\Tests\LocaleExportTest->testExportTranslation()
Failed to set field langcode to frOtherLocaleExportTest.php107Drupal\locale\Tests\LocaleExportTest->testExportTranslation()
Failed to set field content_options[not_customized] to OtherLocaleExportTest.php107Drupal\locale\Tests\LocaleExportTest->testExportTranslation()
Failed to set field content_options[customized] to OtherLocaleExportTest.php107Drupal\locale\Tests\LocaleExportTest->testExportTranslation()
Failed to set field content_options[not_translated] to 1OtherLocaleExportTest.php107Drupal\locale\Tests\LocaleExportTest->testExportTranslation()
Found the requested form fields at admin/config/regional/translate/exportOtherLocaleExportTest.php107Drupal\locale\Tests\LocaleExportTest->testExportTranslation()
Exported French translation file with only untranslated strings.OtherLocaleExportTest.php110Drupal\locale\Tests\LocaleExportTest->testExportTranslation()
Untranslated string present in exported file.OtherLocaleExportTest.php114Drupal\locale\Tests\LocaleExportTest->testExportTranslation()
Exported translation template file.OtherLocaleExportTest.php128Drupal\locale\Tests\LocaleExportTest->testExportTranslationTemplateFile()
ExpandDrupal\locale\Tests\LocaleFileImportStatus61144
MessageGroupFilenameLineFunctionStatus
simplexml_import_dom(): Invalid Nodetype to importWarningWebTestBase.php1040Drupal\simpletest\WebTestBase->parse()
Parsed page successfully.BrowserLocaleFileImportStatus.php51Drupal\locale\Tests\LocaleFileImportStatus->addLanguage()
Language de added.OtherLocaleFileImportStatus.php53Drupal\locale\Tests\LocaleFileImportStatus->addLanguage()
Value 'Montag' is equal to value ''.OtherLocaleFileImportStatus.php67Drupal\locale\Tests\LocaleFileImportStatus->checkTranslations()
Value 'Dienstag' is equal to value ''.OtherLocaleFileImportStatus.php67Drupal\locale\Tests\LocaleFileImportStatus->checkTranslations()
simplexml_import_dom(): Invalid Nodetype to importWarningWebTestBase.php1040Drupal\simpletest\WebTestBase->parse()
Parsed page successfully.BrowserLocaleFileImportStatus.php51Drupal\locale\Tests\LocaleFileImportStatus->addLanguage()
Language de added.OtherLocaleFileImportStatus.php53Drupal\locale\Tests\LocaleFileImportStatus->addLanguage()
Value 'Montag' is equal to value ''.OtherLocaleFileImportStatus.php67Drupal\locale\Tests\LocaleFileImportStatus->checkTranslations()
Value 'Dienstag' is equal to value ''.OtherLocaleFileImportStatus.php67Drupal\locale\Tests\LocaleFileImportStatus->checkTranslations()
Timestamp on locale_file updated.OtherLocaleFileImportStatus.php156Drupal\locale\Tests\LocaleFileImportStatus->testBulkImportUpdateExisting()
simplexml_import_dom(): Invalid Nodetype to importWarningWebTestBase.php1040Drupal\simpletest\WebTestBase->parse()
Parsed page successfully.BrowserLocaleFileImportStatus.php51Drupal\locale\Tests\LocaleFileImportStatus->addLanguage()
Language de added.OtherLocaleFileImportStatus.php53Drupal\locale\Tests\LocaleFileImportStatus->addLanguage()
simplexml_import_dom(): Invalid Nodetype to importWarningWebTestBase.php1040Drupal\simpletest\WebTestBase->parse()
Parsed page successfully.BrowserLocaleFileImportStatus.php51Drupal\locale\Tests\LocaleFileImportStatus->addLanguage()
Language de added.OtherLocaleFileImportStatus.php53Drupal\locale\Tests\LocaleFileImportStatus->addLanguage()
Translation file deleted after deleting languageOtherLocaleFileImportStatus.php200Drupal\locale\Tests\LocaleFileImportStatus->testDeleteLanguage()
ExpandDrupal\locale\Tests\LocaleImportFunctionalTest834924
MessageGroupFilenameLineFunctionStatus
simplexml_import_dom(): Invalid Nodetype to importWarningWebTestBase.php1040Drupal\simpletest\WebTestBase->parse()
Parsed page successfully.BrowserLocaleImportFunctionalTest.php305Drupal\locale\Tests\LocaleImportFunctionalTest->importPoFile()
The language has been automatically created.OtherLocaleImportFunctionalTest.php58Drupal\locale\Tests\LocaleImportFunctionalTest->testStandalonePoFile()
The translation file was successfully imported.OtherLocaleImportFunctionalTest.php61Drupal\locale\Tests\LocaleImportFunctionalTest->testStandalonePoFile()
Undefined index: frNoticeLocaleImportFunctionalTest.php65Drupal\locale\Tests\LocaleImportFunctionalTest->testStandalonePoFile()
Plural number initialized.OtherLocaleImportFunctionalTest.php65Drupal\locale\Tests\LocaleImportFunctionalTest->testStandalonePoFile()
Correct page redirection.OtherLocaleImportFunctionalTest.php68Drupal\locale\Tests\LocaleImportFunctionalTest->testStandalonePoFile()
simplexml_import_dom(): Invalid Nodetype to importWarningWebTestBase.php1040Drupal\simpletest\WebTestBase->parse()
Parsed page successfully.BrowserLocaleImportFunctionalTest.php305Drupal\locale\Tests\LocaleImportFunctionalTest->importPoFile()
The translation file was successfully imported.OtherLocaleImportFunctionalTest.php77Drupal\locale\Tests\LocaleImportFunctionalTest->testStandalonePoFile()
Unsafe strings were skipped.OtherLocaleImportFunctionalTest.php79Drupal\locale\Tests\LocaleImportFunctionalTest->testStandalonePoFile()
simplexml_import_dom(): Invalid Nodetype to importWarningWebTestBase.php1040Drupal\simpletest\WebTestBase->parse()
Parsed page successfully.BrowserLocaleImportFunctionalTest.php305Drupal\locale\Tests\LocaleImportFunctionalTest->importPoFile()
The empty translation file was successfully imported.OtherLocaleImportFunctionalTest.php87Drupal\locale\Tests\LocaleImportFunctionalTest->testStandalonePoFile()
simplexml_import_dom(): Invalid Nodetype to importWarningWebTestBase.php1040Drupal\simpletest\WebTestBase->parse()
Parsed page successfully.BrowserLocaleImportFunctionalTest.php94Drupal\locale\Tests\LocaleImportFunctionalTest->testStandalonePoFile()
File to import not found message.OtherLocaleImportFunctionalTest.php96Drupal\locale\Tests\LocaleImportFunctionalTest->testStandalonePoFile()
simplexml_import_dom(): Invalid Nodetype to importWarningWebTestBase.php1040Drupal\simpletest\WebTestBase->parse()
Parsed page successfully.BrowserLocaleImportFunctionalTest.php305Drupal\locale\Tests\LocaleImportFunctionalTest->importPoFile()
The translation file was successfully imported.OtherLocaleImportFunctionalTest.php106Drupal\locale\Tests\LocaleImportFunctionalTest->testStandalonePoFile()
simplexml_import_dom(): Invalid Nodetype to importWarningWebTestBase.php1040Drupal\simpletest\WebTestBase->parse()
Parsed page successfully.BrowserLocaleImportFunctionalTest.php113Drupal\locale\Tests\LocaleImportFunctionalTest->testStandalonePoFile()
String not overwritten by imported string.OtherLocaleImportFunctionalTest.php114Drupal\locale\Tests\LocaleImportFunctionalTest->testStandalonePoFile()
Undefined index: frNoticeLocaleImportFunctionalTest.php118Drupal\locale\Tests\LocaleImportFunctionalTest->testStandalonePoFile()
Plural numbers untouched.OtherLocaleImportFunctionalTest.php118Drupal\locale\Tests\LocaleImportFunctionalTest->testStandalonePoFile()
simplexml_import_dom(): Invalid Nodetype to importWarningWebTestBase.php1040Drupal\simpletest\WebTestBase->parse()
Parsed page successfully.BrowserLocaleImportFunctionalTest.php305Drupal\locale\Tests\LocaleImportFunctionalTest->importPoFile()
The translation file was successfully imported.OtherLocaleImportFunctionalTest.php128Drupal\locale\Tests\LocaleImportFunctionalTest->testStandalonePoFile()
simplexml_import_dom(): Invalid Nodetype to importWarningWebTestBase.php1040Drupal\simpletest\WebTestBase->parse()
Parsed page successfully.BrowserLocaleImportFunctionalTest.php135Drupal\locale\Tests\LocaleImportFunctionalTest->testStandalonePoFile()
Undefined index: frNoticeLocaleImportFunctionalTest.php139Drupal\locale\Tests\LocaleImportFunctionalTest->testStandalonePoFile()
Plural numbers changed.OtherLocaleImportFunctionalTest.php139Drupal\locale\Tests\LocaleImportFunctionalTest->testStandalonePoFile()
simplexml_import_dom(): Invalid Nodetype to importWarningWebTestBase.php1040Drupal\simpletest\WebTestBase->parse()
Parsed page successfully.BrowserLocaleImportFunctionalTest.php305Drupal\locale\Tests\LocaleImportFunctionalTest->importPoFile()
The customized translation file was successfully imported.OtherLocaleImportFunctionalTest.php148Drupal\locale\Tests\LocaleImportFunctionalTest->testStandalonePoFile()
Customized translations succesfully imported.OtherLocaleImportFunctionalTest.php153Drupal\locale\Tests\LocaleImportFunctionalTest->testStandalonePoFile()
simplexml_import_dom(): Invalid Nodetype to importWarningWebTestBase.php1040Drupal\simpletest\WebTestBase->parse()
Parsed page successfully.BrowserLocaleImportFunctionalTest.php305Drupal\locale\Tests\LocaleImportFunctionalTest->importPoFile()
The customized translation file was successfully imported.OtherLocaleImportFunctionalTest.php164Drupal\locale\Tests\LocaleImportFunctionalTest->testStandalonePoFile()
simplexml_import_dom(): Invalid Nodetype to importWarningWebTestBase.php1040Drupal\simpletest\WebTestBase->parse()
Parsed page successfully.BrowserLocaleImportFunctionalTest.php171Drupal\locale\Tests\LocaleImportFunctionalTest->testStandalonePoFile()
Customized string not overwritten by imported string.OtherLocaleImportFunctionalTest.php172Drupal\locale\Tests\LocaleImportFunctionalTest->testStandalonePoFile()
simplexml_import_dom(): Invalid Nodetype to importWarningWebTestBase.php1040Drupal\simpletest\WebTestBase->parse()
Parsed page successfully.BrowserLocaleImportFunctionalTest.php305Drupal\locale\Tests\LocaleImportFunctionalTest->importPoFile()
The customized translation file was successfully imported.OtherLocaleImportFunctionalTest.php183Drupal\locale\Tests\LocaleImportFunctionalTest->testStandalonePoFile()
simplexml_import_dom(): Invalid Nodetype to importWarningWebTestBase.php1040Drupal\simpletest\WebTestBase->parse()
Parsed page successfully.BrowserLocaleImportFunctionalTest.php190Drupal\locale\Tests\LocaleImportFunctionalTest->testStandalonePoFile()
simplexml_import_dom(): Invalid Nodetype to importWarningWebTestBase.php1040Drupal\simpletest\WebTestBase->parse()
Parsed page successfully.BrowserLocaleImportFunctionalTest.php211Drupal\locale\Tests\LocaleImportFunctionalTest->testAutomaticModuleTranslationImportLanguageEnable()
Language file automatically imported.OtherLocaleImportFunctionalTest.php215Drupal\locale\Tests\LocaleImportFunctionalTest->testAutomaticModuleTranslationImportLanguageEnable()
Language file automatically imported.OtherLocaleImportFunctionalTest.php216Drupal\locale\Tests\LocaleImportFunctionalTest->testAutomaticModuleTranslationImportLanguageEnable()
simplexml_import_dom(): Invalid Nodetype to importWarningWebTestBase.php1040Drupal\simpletest\WebTestBase->parse()
Parsed page successfully.BrowserLocaleImportFunctionalTest.php224Drupal\locale\Tests\LocaleImportFunctionalTest->testAutomaticModuleTranslationImportLanguageEnable()
simplexml_import_dom(): Invalid Nodetype to importWarningWebTestBase.php1040Drupal\simpletest\WebTestBase->parse()
Parsed page successfully.BrowserLocaleImportFunctionalTest.php233Drupal\locale\Tests\LocaleImportFunctionalTest->testAutomaticModuleTranslationImportLanguageEnable()
String successfully imported.OtherLocaleImportFunctionalTest.php234Drupal\locale\Tests\LocaleImportFunctionalTest->testAutomaticModuleTranslationImportLanguageEnable()
simplexml_import_dom(): Invalid Nodetype to importWarningWebTestBase.php1040Drupal\simpletest\WebTestBase->parse()
Parsed page successfully.BrowserLocaleImportFunctionalTest.php244Drupal\locale\Tests\LocaleImportFunctionalTest->testAutomaticModuleTranslationImportLanguageEnable()
String successfully imported.OtherLocaleImportFunctionalTest.php245Drupal\locale\Tests\LocaleImportFunctionalTest->testAutomaticModuleTranslationImportLanguageEnable()
simplexml_import_dom(): Invalid Nodetype to importWarningWebTestBase.php1040Drupal\simpletest\WebTestBase->parse()
Parsed page successfully.BrowserLocaleImportFunctionalTest.php305Drupal\locale\Tests\LocaleImportFunctionalTest->importPoFile()
Long month name context is working.OtherLocaleImportFunctionalTest.php258Drupal\locale\Tests\LocaleImportFunctionalTest->testLanguageContext()
Default context is working.OtherLocaleImportFunctionalTest.php259Drupal\locale\Tests\LocaleImportFunctionalTest->testLanguageContext()
simplexml_import_dom(): Invalid Nodetype to importWarningWebTestBase.php1040Drupal\simpletest\WebTestBase->parse()
Parsed page successfully.BrowserLocaleImportFunctionalTest.php305Drupal\locale\Tests\LocaleImportFunctionalTest->importPoFile()
The translation file was successfully imported.OtherLocaleImportFunctionalTest.php273Drupal\locale\Tests\LocaleImportFunctionalTest->testEmptyMsgstr()
String imported and translated.OtherLocaleImportFunctionalTest.php274Drupal\locale\Tests\LocaleImportFunctionalTest->testEmptyMsgstr()
simplexml_import_dom(): Invalid Nodetype to importWarningWebTestBase.php1040Drupal\simpletest\WebTestBase->parse()
Parsed page successfully.BrowserLocaleImportFunctionalTest.php305Drupal\locale\Tests\LocaleImportFunctionalTest->importPoFile()
The translation file was successfully imported.OtherLocaleImportFunctionalTest.php281Drupal\locale\Tests\LocaleImportFunctionalTest->testEmptyMsgstr()
simplexml_import_dom(): Invalid Nodetype to importWarningWebTestBase.php1040Drupal\simpletest\WebTestBase->parse()
Parsed page successfully.BrowserLocaleImportFunctionalTest.php289Drupal\locale\Tests\LocaleImportFunctionalTest->testEmptyMsgstr()
Search found the string as untranslated.OtherLocaleImportFunctionalTest.php290Drupal\locale\Tests\LocaleImportFunctionalTest->testEmptyMsgstr()
ExpandDrupal\locale\Tests\LocaleJavascriptTranslation110
MessageGroupFilenameLineFunctionStatus
The test did not complete due to a fatal error.Completion checkLocaleJavascriptTranslation.php32Drupal\locale\Tests\LocaleJavascriptTranslation->testFileParsing()
ExpandDrupal\locale\Tests\LocaleLibraryInfoAlterTest110
MessageGroupFilenameLineFunctionStatus
The test did not complete due to a fatal error.Completion checkLocaleLibraryInfoAlterTest.php38Drupal\locale\Tests\LocaleLibraryInfoAlterTest->testLibraryInfoAlter()
ExpandDrupal\locale\Tests\LocalePathTest3782
MessageGroupFilenameLineFunctionStatus
simplexml_import_dom(): Invalid Nodetype to importWarningWebTestBase.php1040Drupal\simpletest\WebTestBase->parse()
Parsed page successfully.BrowserLocalePathTest.php62Drupal\locale\Tests\LocalePathTest->testPathLanguageConfiguration()
simplexml_import_dom(): Invalid Nodetype to importWarningWebTestBase.php1040Drupal\simpletest\WebTestBase->parse()
Parsed page successfully.BrowserLocalePathTest.php66Drupal\locale\Tests\LocalePathTest->testPathLanguageConfiguration()
The "xx" front page is readibly available.OtherLocalePathTest.php71Drupal\locale\Tests\LocalePathTest->testPathLanguageConfiguration()
Failed to set field langcode to xxOtherLocalePathTest.php93Drupal\locale\Tests\LocalePathTest->testPathLanguageConfiguration()
Found the requested form fields at admin/config/search/path/addOtherLocalePathTest.php93Drupal\locale\Tests\LocalePathTest->testPathLanguageConfiguration()
Custom language alias works.OtherLocalePathTest.php101Drupal\locale\Tests\LocalePathTest->testPathLanguageConfiguration()
Custom language alias has priority.OtherLocalePathTest.php117Drupal\locale\Tests\LocalePathTest->testPathLanguageConfiguration()
Custom alias with prefix returns second node.OtherLocalePathTest.php154Drupal\locale\Tests\LocalePathTest->testPathLanguageConfiguration()
ExpandDrupal\locale\Tests\LocalePluralFormatTest725713
MessageGroupFilenameLineFunctionStatus
simplexml_import_dom(): Invalid Nodetype to importWarningWebTestBase.php1040Drupal\simpletest\WebTestBase->parse()
Parsed page successfully.BrowserLocalePluralFormatTest.php272Drupal\locale\Tests\LocalePluralFormatTest->importPoFile()
simplexml_import_dom(): Invalid Nodetype to importWarningWebTestBase.php1040Drupal\simpletest\WebTestBase->parse()
Parsed page successfully.BrowserLocalePluralFormatTest.php272Drupal\locale\Tests\LocalePluralFormatTest->importPoFile()
simplexml_import_dom(): Invalid Nodetype to importWarningWebTestBase.php1040Drupal\simpletest\WebTestBase->parse()
Parsed page successfully.BrowserLocalePluralFormatTest.php272Drupal\locale\Tests\LocalePluralFormatTest->importPoFile()
simplexml_import_dom(): Invalid Nodetype to importWarningWebTestBase.php1040Drupal\simpletest\WebTestBase->parse()
Parsed page successfully.BrowserLocalePluralFormatTest.php272Drupal\locale\Tests\LocalePluralFormatTest->importPoFile()
Computed plural index for fr for count 1 is 0OtherLocalePluralFormatTest.php124Drupal\locale\Tests\LocalePluralFormatTest->testGetPluralFormat()
Plural translation of 1 hours / @count hours for count 1 in fr is 1 heureOtherLocalePluralFormatTest.php129Drupal\locale\Tests\LocalePluralFormatTest->testGetPluralFormat()
Computed plural index for fr for count 0 is 0OtherLocalePluralFormatTest.php124Drupal\locale\Tests\LocalePluralFormatTest->testGetPluralFormat()
Plural translation of 1 hours / @count hours for count 0 in fr is 1 heureOtherLocalePluralFormatTest.php129Drupal\locale\Tests\LocalePluralFormatTest->testGetPluralFormat()
Computed plural index for fr for count 5 is 1OtherLocalePluralFormatTest.php124Drupal\locale\Tests\LocalePluralFormatTest->testGetPluralFormat()
Plural translation of 1 hours / @count hours for count 5 in fr is 5 heuresOtherLocalePluralFormatTest.php129Drupal\locale\Tests\LocalePluralFormatTest->testGetPluralFormat()
Computed plural index for hr for count 1 is 0OtherLocalePluralFormatTest.php124Drupal\locale\Tests\LocalePluralFormatTest->testGetPluralFormat()
Plural translation of 1 hours / @count hours for count 1 in hr is 1 satOtherLocalePluralFormatTest.php129Drupal\locale\Tests\LocalePluralFormatTest->testGetPluralFormat()
Computed plural index for hr for count 21 is 0OtherLocalePluralFormatTest.php124Drupal\locale\Tests\LocalePluralFormatTest->testGetPluralFormat()
Plural translation of 1 hours / @count hours for count 21 in hr is 21 satOtherLocalePluralFormatTest.php129Drupal\locale\Tests\LocalePluralFormatTest->testGetPluralFormat()
Computed plural index for hr for count 0 is 2OtherLocalePluralFormatTest.php124Drupal\locale\Tests\LocalePluralFormatTest->testGetPluralFormat()
Plural translation of 1 hours / @count hours for count 0 in hr is 0 satiOtherLocalePluralFormatTest.php129Drupal\locale\Tests\LocalePluralFormatTest->testGetPluralFormat()
Computed plural index for hr for count 2 is 1OtherLocalePluralFormatTest.php124Drupal\locale\Tests\LocalePluralFormatTest->testGetPluralFormat()
Plural translation of 1 hours / @count hours for count 2 in hr is 2 sataOtherLocalePluralFormatTest.php129Drupal\locale\Tests\LocalePluralFormatTest->testGetPluralFormat()
Computed plural index for hr for count 8 is 2OtherLocalePluralFormatTest.php124Drupal\locale\Tests\LocalePluralFormatTest->testGetPluralFormat()
Plural translation of 1 hours / @count hours for count 8 in hr is 8 satiOtherLocalePluralFormatTest.php129Drupal\locale\Tests\LocalePluralFormatTest->testGetPluralFormat()
simplexml_import_dom(): Invalid Nodetype to importWarningWebTestBase.php1040Drupal\simpletest\WebTestBase->parse()
Parsed page successfully.BrowserLocalePluralFormatTest.php272Drupal\locale\Tests\LocalePluralFormatTest->importPoFile()
simplexml_import_dom(): Invalid Nodetype to importWarningWebTestBase.php1040Drupal\simpletest\WebTestBase->parse()
Parsed page successfully.BrowserLocalePluralFormatTest.php272Drupal\locale\Tests\LocalePluralFormatTest->importPoFile()
Failed to set field langcode to frOtherLocalePluralFormatTest.php150Drupal\locale\Tests\LocalePluralFormatTest->testPluralEditExport()
Found the requested form fields at admin/config/regional/translate/exportOtherLocalePluralFormatTest.php150Drupal\locale\Tests\LocalePluralFormatTest->testPluralEditExport()
Exported French translation file.OtherLocalePluralFormatTest.php152Drupal\locale\Tests\LocalePluralFormatTest->testPluralEditExport()
French translations present in exported file.OtherLocalePluralFormatTest.php154Drupal\locale\Tests\LocalePluralFormatTest->testPluralEditExport()
Plural translations exported properly.OtherLocalePluralFormatTest.php156Drupal\locale\Tests\LocalePluralFormatTest->testPluralEditExport()
Failed to set field langcode to hrOtherLocalePluralFormatTest.php161Drupal\locale\Tests\LocalePluralFormatTest->testPluralEditExport()
Found the requested form fields at admin/config/regional/translate/exportOtherLocalePluralFormatTest.php161Drupal\locale\Tests\LocalePluralFormatTest->testPluralEditExport()
Exported Croatian translation file.OtherLocalePluralFormatTest.php163Drupal\locale\Tests\LocalePluralFormatTest->testPluralEditExport()
Croatian translations present in exported file.OtherLocalePluralFormatTest.php165Drupal\locale\Tests\LocalePluralFormatTest->testPluralEditExport()
Plural translations exported properly.OtherLocalePluralFormatTest.php167Drupal\locale\Tests\LocalePluralFormatTest->testPluralEditExport()
"1 hour" foundOtherLocalePluralFormatTest.php171Drupal\locale\Tests\LocalePluralFormatTest->testPluralEditExport()
"@count hours" foundOtherLocalePluralFormatTest.php172Drupal\locale\Tests\LocalePluralFormatTest->testPluralEditExport()
"Singular form" foundOtherLocalePluralFormatTest.php178Drupal\locale\Tests\LocalePluralFormatTest->testPluralEditExport()
"First plural form" foundOtherLocalePluralFormatTest.php179Drupal\locale\Tests\LocalePluralFormatTest->testPluralEditExport()
"2. plural form" foundOtherLocalePluralFormatTest.php180Drupal\locale\Tests\LocalePluralFormatTest->testPluralEditExport()
"@count sat" foundOtherLocalePluralFormatTest.php184Drupal\locale\Tests\LocalePluralFormatTest->testPluralEditExport()
"@count sata" foundOtherLocalePluralFormatTest.php185Drupal\locale\Tests\LocalePluralFormatTest->testPluralEditExport()
"@count sati" foundOtherLocalePluralFormatTest.php186Drupal\locale\Tests\LocalePluralFormatTest->testPluralEditExport()
simplexml_import_dom(): Invalid Nodetype to importWarningWebTestBase.php1040Drupal\simpletest\WebTestBase->parse()
Parsed page successfully.BrowserLocalePluralFormatTest.php192Drupal\locale\Tests\LocalePluralFormatTest->testPluralEditExport()
simplexml_import_dom(): Invalid Nodetype to importWarningWebTestBase.php1040Drupal\simpletest\WebTestBase->parse()
Parsed page successfully.BrowserLocalePluralFormatTest.php197Drupal\locale\Tests\LocalePluralFormatTest->testPluralEditExport()
"1 heure" foundOtherLocalePluralFormatTest.php199Drupal\locale\Tests\LocalePluralFormatTest->testPluralEditExport()
"@count heures" foundOtherLocalePluralFormatTest.php200Drupal\locale\Tests\LocalePluralFormatTest->testPluralEditExport()
simplexml_import_dom(): Invalid Nodetype to importWarningWebTestBase.php1040Drupal\simpletest\WebTestBase->parse()
Parsed page successfully.BrowserLocalePluralFormatTest.php207Drupal\locale\Tests\LocalePluralFormatTest->testPluralEditExport()
simplexml_import_dom(): Invalid Nodetype to importWarningWebTestBase.php1040Drupal\simpletest\WebTestBase->parse()
Parsed page successfully.BrowserLocalePluralFormatTest.php220Drupal\locale\Tests\LocalePluralFormatTest->testPluralEditExport()
simplexml_import_dom(): Invalid Nodetype to importWarningWebTestBase.php1040Drupal\simpletest\WebTestBase->parse()
Parsed page successfully.BrowserLocalePluralFormatTest.php227Drupal\locale\Tests\LocalePluralFormatTest->testPluralEditExport()
simplexml_import_dom(): Invalid Nodetype to importWarningWebTestBase.php1040Drupal\simpletest\WebTestBase->parse()
Parsed page successfully.BrowserLocalePluralFormatTest.php234Drupal\locale\Tests\LocalePluralFormatTest->testPluralEditExport()
simplexml_import_dom(): Invalid Nodetype to importWarningWebTestBase.php1040Drupal\simpletest\WebTestBase->parse()
Parsed page successfully.BrowserLocalePluralFormatTest.php241Drupal\locale\Tests\LocalePluralFormatTest->testPluralEditExport()
Failed to set field langcode to frOtherLocalePluralFormatTest.php246Drupal\locale\Tests\LocalePluralFormatTest->testPluralEditExport()
Found the requested form fields at admin/config/regional/translate/exportOtherLocalePluralFormatTest.php246Drupal\locale\Tests\LocalePluralFormatTest->testPluralEditExport()
Edited French plural translations for hours exported properly.OtherLocalePluralFormatTest.php248Drupal\locale\Tests\LocalePluralFormatTest->testPluralEditExport()
Added French plural translations for days exported properly.OtherLocalePluralFormatTest.php249Drupal\locale\Tests\LocalePluralFormatTest->testPluralEditExport()
Failed to set field langcode to hrOtherLocalePluralFormatTest.php254Drupal\locale\Tests\LocalePluralFormatTest->testPluralEditExport()
Found the requested form fields at admin/config/regional/translate/exportOtherLocalePluralFormatTest.php254Drupal\locale\Tests\LocalePluralFormatTest->testPluralEditExport()
Edited Croatian plural translations exported properly.OtherLocalePluralFormatTest.php256Drupal\locale\Tests\LocalePluralFormatTest->testPluralEditExport()
Added Croatian plural translations exported properly.OtherLocalePluralFormatTest.php257Drupal\locale\Tests\LocalePluralFormatTest->testPluralEditExport()
ExpandDrupal\locale\Tests\LocaleStringTest15110
MessageGroupFilenameLineFunctionStatus
Successfully loaded translation by string identifier.OtherLocaleStringTest.php84Drupal\locale\Tests\LocaleStringTest->testStringCRUDAPI()
Successfully loaded translation by source and context.OtherLocaleStringTest.php86Drupal\locale\Tests\LocaleStringTest->testStringCRUDAPI()
Successfully deleted translation string.OtherLocaleStringTest.php96Drupal\locale\Tests\LocaleStringTest->testStringCRUDAPI()
Created and retrieved all translations for our source string.OtherLocaleStringTest.php102Drupal\locale\Tests\LocaleStringTest->testStringCRUDAPI()
Translation found with only the right fields.OtherLocaleStringTest.php139Drupal\locale\Tests\LocaleStringTest->testStringSearchAPI()
Found the right translation.OtherLocaleStringTest.php140Drupal\locale\Tests\LocaleStringTest->testStringSearchAPI()
Missing translation found with only the right fields.OtherLocaleStringTest.php143Drupal\locale\Tests\LocaleStringTest->testStringSearchAPI()
Created and retrieved all translations for source strings.OtherLocaleStringTest.php149Drupal\locale\Tests\LocaleStringTest->testStringSearchAPI()
Retrieved all customized translations for source strings.OtherLocaleStringTest.php153Drupal\locale\Tests\LocaleStringTest->testStringSearchAPI()
Found only Spanish and customized translations.OtherLocaleStringTest.php157Drupal\locale\Tests\LocaleStringTest->testStringSearchAPI()
Found 1 source string without translations.OtherLocaleStringTest.php161Drupal\locale\Tests\LocaleStringTest->testStringSearchAPI()
ExpandDrupal\locale\Tests\LocaleTranslationTest2097162
MessageGroupFilenameLineFunctionStatus
simplexml_import_dom(): Invalid Nodetype to importWarningWebTestBase.php1040Drupal\simpletest\WebTestBase->parse()
Parsed page successfully.BrowserLocaleTranslationTest.php61Drupal\locale\Tests\LocaleTranslationTest->testStringTranslation()
Language code found.OtherLocaleTranslationTest.php66Drupal\locale\Tests\LocaleTranslationTest->testStringTranslation()
Test language added.OtherLocaleTranslationTest.php67Drupal\locale\Tests\LocaleTranslationTest->testStringTranslation()
simplexml_import_dom(): Invalid Nodetype to importWarningWebTestBase.php1040Drupal\simpletest\WebTestBase->parse()
Parsed page successfully.BrowserLocaleTranslationTest.php77Drupal\locale\Tests\LocaleTranslationTest->testStringTranslation()
Search found the string as untranslated.OtherLocaleTranslationTest.php78Drupal\locale\Tests\LocaleTranslationTest->testStringTranslation()
simplexml_import_dom(): Invalid Nodetype to importWarningWebTestBase.php1040Drupal\simpletest\WebTestBase->parse()
Parsed page successfully.BrowserLocaleTranslationTest.php82Drupal\locale\Tests\LocaleTranslationTest->testStringTranslation()
current() expects parameter 1 to be array, boolean givenWarningLocaleTranslationTest.php82Drupal\locale\Tests\LocaleTranslationTest->testStringTranslation()
name found on edit screen.OtherLocaleTranslationTest.php88Drupal\locale\Tests\LocaleTranslationTest->testStringTranslation()
simplexml_import_dom(): Invalid Nodetype to importWarningWebTestBase.php1040Drupal\simpletest\WebTestBase->parse()
Parsed page successfully.BrowserLocaleTranslationTest.php95Drupal\locale\Tests\LocaleTranslationTest->testStringTranslation()
Search found the string as untranslated.OtherLocaleTranslationTest.php96Drupal\locale\Tests\LocaleTranslationTest->testStringTranslation()
simplexml_import_dom(): Invalid Nodetype to importWarningWebTestBase.php1040Drupal\simpletest\WebTestBase->parse()
Parsed page successfully.BrowserLocaleTranslationTest.php99Drupal\locale\Tests\LocaleTranslationTest->testStringTranslation()
current() expects parameter 1 to be array, boolean givenWarningLocaleTranslationTest.php99Drupal\locale\Tests\LocaleTranslationTest->testStringTranslation()
simplexml_import_dom(): Invalid Nodetype to importWarningWebTestBase.php1040Drupal\simpletest\WebTestBase->parse()
Parsed page successfully.BrowserLocaleTranslationTest.php104Drupal\locale\Tests\LocaleTranslationTest->testStringTranslation()
The strings have been saved.OtherLocaleTranslationTest.php105Drupal\locale\Tests\LocaleTranslationTest->testStringTranslation()
simplexml_import_dom(): Invalid Nodetype to importWarningWebTestBase.php1040Drupal\simpletest\WebTestBase->parse()
Parsed page successfully.BrowserLocaleTranslationTest.php112Drupal\locale\Tests\LocaleTranslationTest->testStringTranslation()
Non-English translation properly saved.OtherLocaleTranslationTest.php113Drupal\locale\Tests\LocaleTranslationTest->testStringTranslation()
simplexml_import_dom(): Invalid Nodetype to importWarningWebTestBase.php1040Drupal\simpletest\WebTestBase->parse()
Parsed page successfully.BrowserLocaleTranslationTest.php121Drupal\locale\Tests\LocaleTranslationTest->testStringTranslation()
simplexml_import_dom(): Invalid Nodetype to importWarningWebTestBase.php1040Drupal\simpletest\WebTestBase->parse()
Parsed page successfully.BrowserLocaleTranslationTest.php122Drupal\locale\Tests\LocaleTranslationTest->testStringTranslation()
current() expects parameter 1 to be array, boolean givenWarningLocaleTranslationTest.php122Drupal\locale\Tests\LocaleTranslationTest->testStringTranslation()
simplexml_import_dom(): Invalid Nodetype to importWarningWebTestBase.php1040Drupal\simpletest\WebTestBase->parse()
Parsed page successfully.BrowserLocaleTranslationTest.php127Drupal\locale\Tests\LocaleTranslationTest->testStringTranslation()
simplexml_import_dom(): Invalid Nodetype to importWarningWebTestBase.php1040Drupal\simpletest\WebTestBase->parse()
Parsed page successfully.BrowserLocaleTranslationTest.php133Drupal\locale\Tests\LocaleTranslationTest->testStringTranslation()
English translation properly saved.OtherLocaleTranslationTest.php134Drupal\locale\Tests\LocaleTranslationTest->testStringTranslation()
t() works for non-English.OtherLocaleTranslationTest.php136Drupal\locale\Tests\LocaleTranslationTest->testStringTranslation()
t() works for English.OtherLocaleTranslationTest.php142Drupal\locale\Tests\LocaleTranslationTest->testStringTranslation()
simplexml_import_dom(): Invalid Nodetype to importWarningWebTestBase.php1040Drupal\simpletest\WebTestBase->parse()
Parsed page successfully.BrowserLocaleTranslationTest.php150Drupal\locale\Tests\LocaleTranslationTest->testStringTranslation()
String is translated.OtherLocaleTranslationTest.php151Drupal\locale\Tests\LocaleTranslationTest->testStringTranslation()
Found the Delete buttonOtherLocaleTranslationTest.php159Drupal\locale\Tests\LocaleTranslationTest->testStringTranslation()
Found the requested form fields at admin/config/regional/language/delete/xxOtherLocaleTranslationTest.php159Drupal\locale\Tests\LocaleTranslationTest->testStringTranslation()
The test language has been removed.OtherLocaleTranslationTest.php162Drupal\locale\Tests\LocaleTranslationTest->testStringTranslation()
simplexml_import_dom(): Invalid Nodetype to importWarningWebTestBase.php1040Drupal\simpletest\WebTestBase->parse()
Parsed page successfully.BrowserLocaleTranslationTest.php176Drupal\locale\Tests\LocaleTranslationTest->testStringTranslation()
simplexml_import_dom(): Invalid Nodetype to importWarningWebTestBase.php1040Drupal\simpletest\WebTestBase->parse()
Parsed page successfully.BrowserLocaleTranslationTest.php178Drupal\locale\Tests\LocaleTranslationTest->testStringTranslation()
current() expects parameter 1 to be array, boolean givenWarningLocaleTranslationTest.php178Drupal\locale\Tests\LocaleTranslationTest->testStringTranslation()
simplexml_import_dom(): Invalid Nodetype to importWarningWebTestBase.php1040Drupal\simpletest\WebTestBase->parse()
Parsed page successfully.BrowserLocaleTranslationTest.php183Drupal\locale\Tests\LocaleTranslationTest->testStringTranslation()
The strings have been saved.OtherLocaleTranslationTest.php184Drupal\locale\Tests\LocaleTranslationTest->testStringTranslation()
simplexml_import_dom(): Invalid Nodetype to importWarningWebTestBase.php1040Drupal\simpletest\WebTestBase->parse()
Parsed page successfully.BrowserLocaleTranslationTest.php191Drupal\locale\Tests\LocaleTranslationTest->testStringTranslation()
simplexml_import_dom(): Invalid Nodetype to importWarningWebTestBase.php1040Drupal\simpletest\WebTestBase->parse()
Parsed page successfully.BrowserLocaleTranslationTest.php214Drupal\locale\Tests\LocaleTranslationTest->testJavaScriptTranslation()
simplexml_import_dom(): Invalid Nodetype to importWarningWebTestBase.php1040Drupal\simpletest\WebTestBase->parse()
Parsed page successfully.BrowserLocaleTranslationTest.php233Drupal\locale\Tests\LocaleTranslationTest->testJavaScriptTranslation()
simplexml_import_dom(): Invalid Nodetype to importWarningWebTestBase.php1040Drupal\simpletest\WebTestBase->parse()
Parsed page successfully.BrowserLocaleTranslationTest.php235Drupal\locale\Tests\LocaleTranslationTest->testJavaScriptTranslation()
current() expects parameter 1 to be array, boolean givenWarningLocaleTranslationTest.php235Drupal\locale\Tests\LocaleTranslationTest->testJavaScriptTranslation()
simplexml_import_dom(): Invalid Nodetype to importWarningWebTestBase.php1040Drupal\simpletest\WebTestBase->parse()
Parsed page successfully.BrowserLocaleTranslationTest.php240Drupal\locale\Tests\LocaleTranslationTest->testJavaScriptTranslation()
Undefined index: xxNoticelocale.module853_locale_rebuild_js()
Trying to get property of non-objectNoticelocale.module860_locale_rebuild_js()
Trying to get property of non-objectNoticelocale.module888_locale_rebuild_js()
Trying to get property of non-objectNoticelocale.module889_locale_rebuild_js()
Trying to get property of non-objectNoticelocale.module897_locale_rebuild_js()
Undefined index: xxNoticeLocaleTranslationTest.php246Drupal\locale\Tests\LocaleTranslationTest->testJavaScriptTranslation()
JavaScript file created: not foundOtherLocaleTranslationTest.php247Drupal\locale\Tests\LocaleTranslationTest->testJavaScriptTranslation()
Undefined index: xxNoticelocale.module853_locale_rebuild_js()
Trying to get property of non-objectNoticelocale.module860_locale_rebuild_js()
Trying to get property of non-objectNoticelocale.module888_locale_rebuild_js()
Trying to get property of non-objectNoticelocale.module889_locale_rebuild_js()
Trying to get property of non-objectNoticelocale.module897_locale_rebuild_js()
JavaScript file rebuilt: not foundOtherLocaleTranslationTest.php254Drupal\locale\Tests\LocaleTranslationTest->testJavaScriptTranslation()
simplexml_import_dom(): Invalid Nodetype to importWarningWebTestBase.php1040Drupal\simpletest\WebTestBase->parse()
Parsed page successfully.BrowserLocaleTranslationTest.php287Drupal\locale\Tests\LocaleTranslationTest->testStringValidation()
simplexml_import_dom(): Invalid Nodetype to importWarningWebTestBase.php1040Drupal\simpletest\WebTestBase->parse()
Parsed page successfully.BrowserLocaleTranslationTest.php296Drupal\locale\Tests\LocaleTranslationTest->testStringValidation()
simplexml_import_dom(): Invalid Nodetype to importWarningWebTestBase.php1040Drupal\simpletest\WebTestBase->parse()
Parsed page successfully.BrowserLocaleTranslationTest.php299Drupal\locale\Tests\LocaleTranslationTest->testStringValidation()
current() expects parameter 1 to be array, boolean givenWarningLocaleTranslationTest.php299Drupal\locale\Tests\LocaleTranslationTest->testStringValidation()
simplexml_import_dom(): Invalid Nodetype to importWarningWebTestBase.php1040Drupal\simpletest\WebTestBase->parse()
Parsed page successfully.BrowserLocaleTranslationTest.php305Drupal\locale\Tests\LocaleTranslationTest->testStringValidation()
simplexml_import_dom(): Invalid Nodetype to importWarningWebTestBase.php1040Drupal\simpletest\WebTestBase->parse()
Parsed page successfully.BrowserLocaleTranslationTest.php307Drupal\locale\Tests\LocaleTranslationTest->testStringValidation()
The string was rejected as unsafe.OtherLocaleTranslationTest.php308Drupal\locale\Tests\LocaleTranslationTest->testStringValidation()
simplexml_import_dom(): Invalid Nodetype to importWarningWebTestBase.php1040Drupal\simpletest\WebTestBase->parse()
Parsed page successfully.BrowserLocaleTranslationTest.php305Drupal\locale\Tests\LocaleTranslationTest->testStringValidation()
simplexml_import_dom(): Invalid Nodetype to importWarningWebTestBase.php1040Drupal\simpletest\WebTestBase->parse()
Parsed page successfully.BrowserLocaleTranslationTest.php307Drupal\locale\Tests\LocaleTranslationTest->testStringValidation()
The string was rejected as unsafe.OtherLocaleTranslationTest.php308Drupal\locale\Tests\LocaleTranslationTest->testStringValidation()
simplexml_import_dom(): Invalid Nodetype to importWarningWebTestBase.php1040Drupal\simpletest\WebTestBase->parse()
Parsed page successfully.BrowserLocaleTranslationTest.php305Drupal\locale\Tests\LocaleTranslationTest->testStringValidation()
simplexml_import_dom(): Invalid Nodetype to importWarningWebTestBase.php1040Drupal\simpletest\WebTestBase->parse()
Parsed page successfully.BrowserLocaleTranslationTest.php307Drupal\locale\Tests\LocaleTranslationTest->testStringValidation()
The string was rejected as unsafe.OtherLocaleTranslationTest.php308Drupal\locale\Tests\LocaleTranslationTest->testStringValidation()
simplexml_import_dom(): Invalid Nodetype to importWarningWebTestBase.php1040Drupal\simpletest\WebTestBase->parse()
Parsed page successfully.BrowserLocaleTranslationTest.php305Drupal\locale\Tests\LocaleTranslationTest->testStringValidation()
simplexml_import_dom(): Invalid Nodetype to importWarningWebTestBase.php1040Drupal\simpletest\WebTestBase->parse()
Parsed page successfully.BrowserLocaleTranslationTest.php307Drupal\locale\Tests\LocaleTranslationTest->testStringValidation()
The string was rejected as unsafe.OtherLocaleTranslationTest.php308Drupal\locale\Tests\LocaleTranslationTest->testStringValidation()
simplexml_import_dom(): Invalid Nodetype to importWarningWebTestBase.php1040Drupal\simpletest\WebTestBase->parse()
Parsed page successfully.BrowserLocaleTranslationTest.php342Drupal\locale\Tests\LocaleTranslationTest->testStringSearch()
simplexml_import_dom(): Invalid Nodetype to importWarningWebTestBase.php1040Drupal\simpletest\WebTestBase->parse()
Parsed page successfully.BrowserLocaleTranslationTest.php350Drupal\locale\Tests\LocaleTranslationTest->testStringSearch()
simplexml_import_dom(): Invalid Nodetype to importWarningWebTestBase.php1040Drupal\simpletest\WebTestBase->parse()
Parsed page successfully.BrowserLocaleTranslationTest.php365Drupal\locale\Tests\LocaleTranslationTest->testStringSearch()
Search found the string.OtherLocaleTranslationTest.php369Drupal\locale\Tests\LocaleTranslationTest->testStringSearch()
simplexml_import_dom(): Invalid Nodetype to importWarningWebTestBase.php1040Drupal\simpletest\WebTestBase->parse()
Parsed page successfully.BrowserLocaleTranslationTest.php378Drupal\locale\Tests\LocaleTranslationTest->testStringSearch()
Search didn't find the string.OtherLocaleTranslationTest.php379Drupal\locale\Tests\LocaleTranslationTest->testStringSearch()
simplexml_import_dom(): Invalid Nodetype to importWarningWebTestBase.php1040Drupal\simpletest\WebTestBase->parse()
Parsed page successfully.BrowserLocaleTranslationTest.php388Drupal\locale\Tests\LocaleTranslationTest->testStringSearch()
simplexml_import_dom(): Invalid Nodetype to importWarningWebTestBase.php1040Drupal\simpletest\WebTestBase->parse()
Parsed page successfully.BrowserLocaleTranslationTest.php394Drupal\locale\Tests\LocaleTranslationTest->testStringSearch()
current() expects parameter 1 to be array, boolean givenWarningLocaleTranslationTest.php394Drupal\locale\Tests\LocaleTranslationTest->testStringSearch()
simplexml_import_dom(): Invalid Nodetype to importWarningWebTestBase.php1040Drupal\simpletest\WebTestBase->parse()
Parsed page successfully.BrowserLocaleTranslationTest.php399Drupal\locale\Tests\LocaleTranslationTest->testStringSearch()
simplexml_import_dom(): Invalid Nodetype to importWarningWebTestBase.php1040Drupal\simpletest\WebTestBase->parse()
Parsed page successfully.BrowserLocaleTranslationTest.php408Drupal\locale\Tests\LocaleTranslationTest->testStringSearch()
simplexml_import_dom(): Invalid Nodetype to importWarningWebTestBase.php1040Drupal\simpletest\WebTestBase->parse()
Parsed page successfully.BrowserLocaleTranslationTest.php418Drupal\locale\Tests\LocaleTranslationTest->testStringSearch()
Search didn't find the source string.OtherLocaleTranslationTest.php419Drupal\locale\Tests\LocaleTranslationTest->testStringSearch()
simplexml_import_dom(): Invalid Nodetype to importWarningWebTestBase.php1040Drupal\simpletest\WebTestBase->parse()
Parsed page successfully.BrowserLocaleTranslationTest.php428Drupal\locale\Tests\LocaleTranslationTest->testStringSearch()
Search didn't find the translation.OtherLocaleTranslationTest.php429Drupal\locale\Tests\LocaleTranslationTest->testStringSearch()
simplexml_import_dom(): Invalid Nodetype to importWarningWebTestBase.php1040Drupal\simpletest\WebTestBase->parse()
Parsed page successfully.BrowserLocaleTranslationTest.php437Drupal\locale\Tests\LocaleTranslationTest->testStringSearch()
simplexml_import_dom(): Invalid Nodetype to importWarningWebTestBase.php1040Drupal\simpletest\WebTestBase->parse()
Parsed page successfully.BrowserLocaleTranslationTest.php446Drupal\locale\Tests\LocaleTranslationTest->testStringSearch()
Search didn't find the translation.OtherLocaleTranslationTest.php447Drupal\locale\Tests\LocaleTranslationTest->testStringSearch()
simplexml_import_dom(): Invalid Nodetype to importWarningWebTestBase.php1040Drupal\simpletest\WebTestBase->parse()
Parsed page successfully.BrowserLocaleTranslationTest.php456Drupal\locale\Tests\LocaleTranslationTest->testStringSearch()
Search didn't find the invalid string.OtherLocaleTranslationTest.php457Drupal\locale\Tests\LocaleTranslationTest->testStringSearch()
ExpandDrupal\locale\Tests\LocaleUninstallFrenchTest3033
MessageGroupFilenameLineFunctionStatus
simplexml_import_dom(): Invalid Nodetype to importWarningWebTestBase.php1040Drupal\simpletest\WebTestBase->parse()
Parsed page successfully.BrowserLocaleUninstallTest.php77Drupal\locale\Tests\LocaleUninstallTest->testUninstallProcess()
simplexml_import_dom(): Invalid Nodetype to importWarningWebTestBase.php1040Drupal\simpletest\WebTestBase->parse()
Parsed page successfully.BrowserLocaleUninstallTest.php79Drupal\locale\Tests\LocaleUninstallTest->testUninstallProcess()
Undefined index: frNoticeLocaleUninstallTest.php82Drupal\locale\Tests\LocaleUninstallTest->testUninstallProcess()
JavaScript file created: noneOtherLocaleUninstallTest.php83Drupal\locale\Tests\LocaleUninstallTest->testUninstallProcess()
ExpandDrupal\locale\Tests\LocaleUninstallTest3033
MessageGroupFilenameLineFunctionStatus
simplexml_import_dom(): Invalid Nodetype to importWarningWebTestBase.php1040Drupal\simpletest\WebTestBase->parse()
Parsed page successfully.BrowserLocaleUninstallTest.php77Drupal\locale\Tests\LocaleUninstallTest->testUninstallProcess()
simplexml_import_dom(): Invalid Nodetype to importWarningWebTestBase.php1040Drupal\simpletest\WebTestBase->parse()
Parsed page successfully.BrowserLocaleUninstallTest.php79Drupal\locale\Tests\LocaleUninstallTest->testUninstallProcess()
Undefined index: frNoticeLocaleUninstallTest.php82Drupal\locale\Tests\LocaleUninstallTest->testUninstallProcess()
JavaScript file created: noneOtherLocaleUninstallTest.php83Drupal\locale\Tests\LocaleUninstallTest->testUninstallProcess()
LeafDrupal\path\Tests\PathLanguageTest23124
ExpandDrupal\path\Tests\PathLanguageUiTest78168
MessageGroupFilenameLineFunctionStatus
simplexml_import_dom(): Invalid Nodetype to importWarningWebTestBase.php1040Drupal\simpletest\WebTestBase->parse()
Parsed page successfully.BrowserPathLanguageUiTest.php41Drupal\path\Tests\PathLanguageUiTest->setUp()
simplexml_import_dom(): Invalid Nodetype to importWarningWebTestBase.php1040Drupal\simpletest\WebTestBase->parse()
Parsed page successfully.BrowserPathLanguageUiTest.php45Drupal\path\Tests\PathLanguageUiTest->setUp()
Failed to set field langcode to frOtherPathLanguageUiTest.php86Drupal\path\Tests\PathLanguageUiTest->testNonDefaultUrl()
Found the requested form fields at admin/config/search/path/addOtherPathLanguageUiTest.php86Drupal\path\Tests\PathLanguageUiTest->testNonDefaultUrl()
Foreign URL alias worksOtherPathLanguageUiTest.php89Drupal\path\Tests\PathLanguageUiTest->testNonDefaultUrl()
ExpandDrupal\system\Tests\Entity\EntityTranslationFormTest1446
MessageGroupFilenameLineFunctionStatus
The test did not complete due to a fatal error.Completion checkEntityTranslationFormTest.php57Drupal\system\Tests\Entity\EntityTranslationFormTest->testEntityFormLanguage()
simplexml_import_dom(): Invalid Nodetype to importWarningWebTestBase.php1040Drupal\simpletest\WebTestBase->parse()
Parsed page successfully.BrowserEntityTranslationFormTest.php71Drupal\system\Tests\Entity\EntityTranslationFormTest->testEntityFormLanguage()
Trying to get property of non-objectNoticeEntityTranslationFormTest.php74Drupal\system\Tests\Entity\EntityTranslationFormTest->testEntityFormLanguage()
Form language is the same as the entity language.OtherEntityTranslationFormTest.php74Drupal\system\Tests\Entity\EntityTranslationFormTest->testEntityFormLanguage()
Trying to get property of non-objectNoticeEntityTranslationFormTest.php77Drupal\system\Tests\Entity\EntityTranslationFormTest->testEntityFormLanguage()
Trying to get property of non-objectNoticeEntityTranslationFormTest.php79Drupal\system\Tests\Entity\EntityTranslationFormTest->testEntityFormLanguage()
Form language is the same as the entity language.OtherEntityTranslationFormTest.php79Drupal\system\Tests\Entity\EntityTranslationFormTest->testEntityFormLanguage()
Argument 1 passed to entity_get_form() must implement interface Drupal\Core\Entity\EntityInterface, boolean given, called in /var/lib/drupaltestbot/sites/default/files/checkout/core/modules/system/lib/Drupal/system/Tests/Entity/EntityTranslationFormTest.php on line 83 and definedRecoverable errorentity.inc484entity_get_form()
Argument 1 passed to entity_form_state_defaults() must implement interface Drupal\Core\Entity\EntityInterface, boolean given, called in /var/lib/drupaltestbot/sites/default/files/checkout/core/includes/entity.inc on line 485 and definedRecoverable errorentity.inc444entity_form_state_defaults()
ExpandDrupal\system\Tests\Module\EnableDisableTest1027427103
MessageGroupFilenameLineFunctionStatus
Modules status has been updated.OtherEnableDisableTest.php98Drupal\system\Tests\Module\EnableDisableTest->testEnableDisable()
"hook_modules_installed fired for locale" foundOtherEnableDisableTest.php105Drupal\system\Tests\Module\EnableDisableTest->testEnableDisable()
"hook_modules_enabled fired for locale" foundOtherEnableDisableTest.php106Drupal\system\Tests\Module\EnableDisableTest->testEnableDisable()
"hook_modules_installed fired for language" foundOtherEnableDisableTest.php105Drupal\system\Tests\Module\EnableDisableTest->testEnableDisable()
"hook_modules_enabled fired for language" foundOtherEnableDisableTest.php106Drupal\system\Tests\Module\EnableDisableTest->testEnableDisable()
simplexml_import_dom(): Invalid Nodetype to importWarningWebTestBase.php1040Drupal\simpletest\WebTestBase->parse()
Parsed page successfully.BrowserEnableDisableTest.php120Drupal\system\Tests\Module\EnableDisableTest->testEnableDisable()
Modules status has been updated.OtherEnableDisableTest.php120Drupal\system\Tests\Module\EnableDisableTest->testEnableDisable()
Module "locale" is not enabled.OtherEnableDisableTest.php120Drupal\system\Tests\Module\EnableDisableTest->testEnableDisable()
"hook_modules_disabled fired for locale" foundOtherEnableDisableTest.php120Drupal\system\Tests\Module\EnableDisableTest->testEnableDisable()
watchdog table contains 0 rows for %module module disabled.OtherEnableDisableTest.php120Drupal\system\Tests\Module\EnableDisableTest->testEnableDisable()
simplexml_import_dom(): Invalid Nodetype to importWarningWebTestBase.php1040Drupal\simpletest\WebTestBase->parse()
Parsed page successfully.BrowserEnableDisableTest.php120Drupal\system\Tests\Module\EnableDisableTest->testEnableDisable()
simplexml_import_dom(): Invalid Nodetype to importWarningWebTestBase.php1040Drupal\simpletest\WebTestBase->parse()
Parsed page successfully.BrowserEnableDisableTest.php120Drupal\system\Tests\Module\EnableDisableTest->testEnableDisable()
Modules status has been updated.OtherEnableDisableTest.php120Drupal\system\Tests\Module\EnableDisableTest->testEnableDisable()
Module "locale" is not enabled.OtherEnableDisableTest.php120Drupal\system\Tests\Module\EnableDisableTest->testEnableDisable()
"hook_modules_uninstalled fired for locale" foundOtherEnableDisableTest.php120Drupal\system\Tests\Module\EnableDisableTest->testEnableDisable()
watchdog table contains 0 rows for %module module uninstalled.OtherEnableDisableTest.php120Drupal\system\Tests\Module\EnableDisableTest->testEnableDisable()
None of the database tables defined by the locale module exist.OtherEnableDisableTest.php120Drupal\system\Tests\Module\EnableDisableTest->testEnableDisable()
No configuration found for locale module.OtherEnableDisableTest.php120Drupal\system\Tests\Module\EnableDisableTest->testEnableDisable()
simplexml_import_dom(): Invalid Nodetype to importWarningWebTestBase.php1040Drupal\simpletest\WebTestBase->parse()
Parsed page successfully.BrowserEnableDisableTest.php92Drupal\system\Tests\Module\EnableDisableTest->testEnableDisable()
Modules status has been updated.OtherEnableDisableTest.php98Drupal\system\Tests\Module\EnableDisableTest->testEnableDisable()
"hook_modules_installed fired for menu" foundOtherEnableDisableTest.php105Drupal\system\Tests\Module\EnableDisableTest->testEnableDisable()
"hook_modules_enabled fired for menu" foundOtherEnableDisableTest.php106Drupal\system\Tests\Module\EnableDisableTest->testEnableDisable()
Module "menu" is enabled.OtherEnableDisableTest.php107Drupal\system\Tests\Module\EnableDisableTest->testEnableDisable()
All database tables defined by the menu module exist.OtherEnableDisableTest.php108Drupal\system\Tests\Module\EnableDisableTest->testEnableDisable()
All default configuration of menu module found.OtherEnableDisableTest.php109Drupal\system\Tests\Module\EnableDisableTest->testEnableDisable()
watchdog table contains 0 rows for %module module installed.OtherEnableDisableTest.php110Drupal\system\Tests\Module\EnableDisableTest->testEnableDisable()
watchdog table contains 0 rows for %module module enabled.OtherEnableDisableTest.php111Drupal\system\Tests\Module\EnableDisableTest->testEnableDisable()
simplexml_import_dom(): Invalid Nodetype to importWarningWebTestBase.php1040Drupal\simpletest\WebTestBase->parse()
Parsed page successfully.BrowserEnableDisableTest.php120Drupal\system\Tests\Module\EnableDisableTest->testEnableDisable()
Modules status has been updated.OtherEnableDisableTest.php120Drupal\system\Tests\Module\EnableDisableTest->testEnableDisable()
"hook_modules_disabled fired for menu" foundOtherEnableDisableTest.php120Drupal\system\Tests\Module\EnableDisableTest->testEnableDisable()
watchdog table contains 0 rows for %module module disabled.OtherEnableDisableTest.php120Drupal\system\Tests\Module\EnableDisableTest->testEnableDisable()
All database tables defined by the menu module exist.OtherEnableDisableTest.php120Drupal\system\Tests\Module\EnableDisableTest->testEnableDisable()
All default configuration of menu module found.OtherEnableDisableTest.php120Drupal\system\Tests\Module\EnableDisableTest->testEnableDisable()
simplexml_import_dom(): Invalid Nodetype to importWarningWebTestBase.php1040Drupal\simpletest\WebTestBase->parse()
Parsed page successfully.BrowserEnableDisableTest.php120Drupal\system\Tests\Module\EnableDisableTest->testEnableDisable()
simplexml_import_dom(): Invalid Nodetype to importWarningWebTestBase.php1040Drupal\simpletest\WebTestBase->parse()
Parsed page successfully.BrowserEnableDisableTest.php120Drupal\system\Tests\Module\EnableDisableTest->testEnableDisable()
Modules status has been updated.OtherEnableDisableTest.php120Drupal\system\Tests\Module\EnableDisableTest->testEnableDisable()
"hook_modules_uninstalled fired for menu" foundOtherEnableDisableTest.php120Drupal\system\Tests\Module\EnableDisableTest->testEnableDisable()
watchdog table contains 0 rows for %module module uninstalled.OtherEnableDisableTest.php120Drupal\system\Tests\Module\EnableDisableTest->testEnableDisable()
simplexml_import_dom(): Invalid Nodetype to importWarningWebTestBase.php1040Drupal\simpletest\WebTestBase->parse()
Parsed page successfully.BrowserEnableDisableTest.php92Drupal\system\Tests\Module\EnableDisableTest->testEnableDisable()
Modules status has been updated.OtherEnableDisableTest.php98Drupal\system\Tests\Module\EnableDisableTest->testEnableDisable()
"hook_modules_installed fired for number" foundOtherEnableDisableTest.php105Drupal\system\Tests\Module\EnableDisableTest->testEnableDisable()
"hook_modules_enabled fired for number" foundOtherEnableDisableTest.php106Drupal\system\Tests\Module\EnableDisableTest->testEnableDisable()
Module "number" is enabled.OtherEnableDisableTest.php107Drupal\system\Tests\Module\EnableDisableTest->testEnableDisable()
watchdog table contains 0 rows for %module module installed.OtherEnableDisableTest.php110Drupal\system\Tests\Module\EnableDisableTest->testEnableDisable()
watchdog table contains 0 rows for %module module enabled.OtherEnableDisableTest.php111Drupal\system\Tests\Module\EnableDisableTest->testEnableDisable()
simplexml_import_dom(): Invalid Nodetype to importWarningWebTestBase.php1040Drupal\simpletest\WebTestBase->parse()
Parsed page successfully.BrowserEnableDisableTest.php120Drupal\system\Tests\Module\EnableDisableTest->testEnableDisable()
Modules status has been updated.OtherEnableDisableTest.php120Drupal\system\Tests\Module\EnableDisableTest->testEnableDisable()
"hook_modules_disabled fired for number" foundOtherEnableDisableTest.php120Drupal\system\Tests\Module\EnableDisableTest->testEnableDisable()
watchdog table contains 0 rows for %module module disabled.OtherEnableDisableTest.php120Drupal\system\Tests\Module\EnableDisableTest->testEnableDisable()
simplexml_import_dom(): Invalid Nodetype to importWarningWebTestBase.php1040Drupal\simpletest\WebTestBase->parse()
Parsed page successfully.BrowserEnableDisableTest.php120Drupal\system\Tests\Module\EnableDisableTest->testEnableDisable()
simplexml_import_dom(): Invalid Nodetype to importWarningWebTestBase.php1040Drupal\simpletest\WebTestBase->parse()
Parsed page successfully.BrowserEnableDisableTest.php120Drupal\system\Tests\Module\EnableDisableTest->testEnableDisable()
Modules status has been updated.OtherEnableDisableTest.php120Drupal\system\Tests\Module\EnableDisableTest->testEnableDisable()
"hook_modules_uninstalled fired for number" foundOtherEnableDisableTest.php120Drupal\system\Tests\Module\EnableDisableTest->testEnableDisable()
watchdog table contains 0 rows for %module module uninstalled.OtherEnableDisableTest.php120Drupal\system\Tests\Module\EnableDisableTest->testEnableDisable()
simplexml_import_dom(): Invalid Nodetype to importWarningWebTestBase.php1040Drupal\simpletest\WebTestBase->parse()
Parsed page successfully.BrowserEnableDisableTest.php92Drupal\system\Tests\Module\EnableDisableTest->testEnableDisable()
Modules status has been updated.OtherEnableDisableTest.php98Drupal\system\Tests\Module\EnableDisableTest->testEnableDisable()
ExpandDrupal\system\Tests\Upgrade\BareStandardUpgradePathTest1131
MessageGroupFilenameLineFunctionStatus
Found the Apply pending updates buttonOtherUpgradePathTestBase.php213Drupal\system\Tests\Upgrade\UpgradePathTestBase->performUpgrade()
Found the requested form fields at OtherUpgradePathTestBase.php213Drupal\system\Tests\Upgrade\UpgradePathTestBase->performUpgrade()
No pending updates at the end of the update process.OtherUpgradePathTestBase.php235Drupal\system\Tests\Upgrade\UpgradePathTestBase->performUpgrade()
Exception: update.php still shows pending updates after execution. in Drupal\system\Tests\Upgrade\UpgradePathTestBase->performUpgrade() (line 236 of /var/lib/drupaltestbot/sites/default/files/checkout/core/modules/system/lib/Drupal/system/Tests/Upgrade/UpgradePathTestBase.php).Uncaught exceptionUpgradePathTestBase.php236Drupal\system\Tests\Upgrade\UpgradePathTestBase->performUpgrade()
ExpandDrupal\system\Tests\Upgrade\FilledStandardUpgradePathTest1131
MessageGroupFilenameLineFunctionStatus
Found the Apply pending updates buttonOtherUpgradePathTestBase.php213Drupal\system\Tests\Upgrade\UpgradePathTestBase->performUpgrade()
Found the requested form fields at OtherUpgradePathTestBase.php213Drupal\system\Tests\Upgrade\UpgradePathTestBase->performUpgrade()
No pending updates at the end of the update process.OtherUpgradePathTestBase.php235Drupal\system\Tests\Upgrade\UpgradePathTestBase->performUpgrade()
Exception: update.php still shows pending updates after execution. in Drupal\system\Tests\Upgrade\UpgradePathTestBase->performUpgrade() (line 236 of /var/lib/drupaltestbot/sites/default/files/checkout/core/modules/system/lib/Drupal/system/Tests/Upgrade/UpgradePathTestBase.php).Uncaught exceptionUpgradePathTestBase.php236Drupal\system\Tests\Upgrade\UpgradePathTestBase->performUpgrade()
ExpandDrupal\system\Tests\Upgrade\LanguageUpgradePathTest60186
MessageGroupFilenameLineFunctionStatus
Found the Apply pending updates buttonOtherUpgradePathTestBase.php213Drupal\system\Tests\Upgrade\UpgradePathTestBase->performUpgrade()
Found the requested form fields at OtherUpgradePathTestBase.php213Drupal\system\Tests\Upgrade\UpgradePathTestBase->performUpgrade()
No pending updates at the end of the update process.OtherUpgradePathTestBase.php235Drupal\system\Tests\Upgrade\UpgradePathTestBase->performUpgrade()
Exception: update.php still shows pending updates after execution. in Drupal\system\Tests\Upgrade\UpgradePathTestBase->performUpgrade() (line 236 of /var/lib/drupaltestbot/sites/default/files/checkout/core/modules/system/lib/Drupal/system/Tests/Upgrade/UpgradePathTestBase.php).Uncaught exceptionUpgradePathTestBase.php236Drupal\system\Tests\Upgrade\UpgradePathTestBase->performUpgrade()
Found the Apply pending updates buttonOtherUpgradePathTestBase.php213Drupal\system\Tests\Upgrade\UpgradePathTestBase->performUpgrade()
Found the requested form fields at OtherUpgradePathTestBase.php213Drupal\system\Tests\Upgrade\UpgradePathTestBase->performUpgrade()
No pending updates at the end of the update process.OtherUpgradePathTestBase.php235Drupal\system\Tests\Upgrade\UpgradePathTestBase->performUpgrade()
Exception: update.php still shows pending updates after execution. in Drupal\system\Tests\Upgrade\UpgradePathTestBase->performUpgrade() (line 236 of /var/lib/drupaltestbot/sites/default/files/checkout/core/modules/system/lib/Drupal/system/Tests/Upgrade/UpgradePathTestBase.php).Uncaught exceptionUpgradePathTestBase.php236Drupal\system\Tests\Upgrade\UpgradePathTestBase->performUpgrade()
Found the Apply pending updates buttonOtherUpgradePathTestBase.php213Drupal\system\Tests\Upgrade\UpgradePathTestBase->performUpgrade()
Found the requested form fields at OtherUpgradePathTestBase.php213Drupal\system\Tests\Upgrade\UpgradePathTestBase->performUpgrade()
No pending updates at the end of the update process.OtherUpgradePathTestBase.php235Drupal\system\Tests\Upgrade\UpgradePathTestBase->performUpgrade()
Exception: update.php still shows pending updates after execution. in Drupal\system\Tests\Upgrade\UpgradePathTestBase->performUpgrade() (line 236 of /var/lib/drupaltestbot/sites/default/files/checkout/core/modules/system/lib/Drupal/system/Tests/Upgrade/UpgradePathTestBase.php).Uncaught exceptionUpgradePathTestBase.php236Drupal\system\Tests\Upgrade\UpgradePathTestBase->performUpgrade()
Found the Apply pending updates buttonOtherUpgradePathTestBase.php213Drupal\system\Tests\Upgrade\UpgradePathTestBase->performUpgrade()
Found the requested form fields at OtherUpgradePathTestBase.php213Drupal\system\Tests\Upgrade\UpgradePathTestBase->performUpgrade()
No pending updates at the end of the update process.OtherUpgradePathTestBase.php235Drupal\system\Tests\Upgrade\UpgradePathTestBase->performUpgrade()
Exception: update.php still shows pending updates after execution. in Drupal\system\Tests\Upgrade\UpgradePathTestBase->performUpgrade() (line 236 of /var/lib/drupaltestbot/sites/default/files/checkout/core/modules/system/lib/Drupal/system/Tests/Upgrade/UpgradePathTestBase.php).Uncaught exceptionUpgradePathTestBase.php236Drupal\system\Tests\Upgrade\UpgradePathTestBase->performUpgrade()
Found the Apply pending updates buttonOtherUpgradePathTestBase.php213Drupal\system\Tests\Upgrade\UpgradePathTestBase->performUpgrade()
Found the requested form fields at OtherUpgradePathTestBase.php213Drupal\system\Tests\Upgrade\UpgradePathTestBase->performUpgrade()
No pending updates at the end of the update process.OtherUpgradePathTestBase.php235Drupal\system\Tests\Upgrade\UpgradePathTestBase->performUpgrade()
Exception: update.php still shows pending updates after execution. in Drupal\system\Tests\Upgrade\UpgradePathTestBase->performUpgrade() (line 236 of /var/lib/drupaltestbot/sites/default/files/checkout/core/modules/system/lib/Drupal/system/Tests/Upgrade/UpgradePathTestBase.php).Uncaught exceptionUpgradePathTestBase.php236Drupal\system\Tests\Upgrade\UpgradePathTestBase->performUpgrade()
Found the Apply pending updates buttonOtherUpgradePathTestBase.php213Drupal\system\Tests\Upgrade\UpgradePathTestBase->performUpgrade()
Found the requested form fields at OtherUpgradePathTestBase.php213Drupal\system\Tests\Upgrade\UpgradePathTestBase->performUpgrade()
No pending updates at the end of the update process.OtherUpgradePathTestBase.php235Drupal\system\Tests\Upgrade\UpgradePathTestBase->performUpgrade()
Exception: update.php still shows pending updates after execution. in Drupal\system\Tests\Upgrade\UpgradePathTestBase->performUpgrade() (line 236 of /var/lib/drupaltestbot/sites/default/files/checkout/core/modules/system/lib/Drupal/system/Tests/Upgrade/UpgradePathTestBase.php).Uncaught exceptionUpgradePathTestBase.php236Drupal\system\Tests\Upgrade\UpgradePathTestBase->performUpgrade()
ExpandDrupal\system\Tests\Upgrade\SystemUpgradePathTest1131
MessageGroupFilenameLineFunctionStatus
Found the Apply pending updates buttonOtherUpgradePathTestBase.php213Drupal\system\Tests\Upgrade\UpgradePathTestBase->performUpgrade()
Found the requested form fields at OtherUpgradePathTestBase.php213Drupal\system\Tests\Upgrade\UpgradePathTestBase->performUpgrade()
No pending updates at the end of the update process.OtherUpgradePathTestBase.php235Drupal\system\Tests\Upgrade\UpgradePathTestBase->performUpgrade()
Exception: update.php still shows pending updates after execution. in Drupal\system\Tests\Upgrade\UpgradePathTestBase->performUpgrade() (line 236 of /var/lib/drupaltestbot/sites/default/files/checkout/core/modules/system/lib/Drupal/system/Tests/Upgrade/UpgradePathTestBase.php).Uncaught exceptionUpgradePathTestBase.php236Drupal\system\Tests\Upgrade\UpgradePathTestBase->performUpgrade()
ExpandDrupal\system\Tests\Upgrade\UserRoleUpgradePathTest1131
MessageGroupFilenameLineFunctionStatus
Found the Apply pending updates buttonOtherUpgradePathTestBase.php213Drupal\system\Tests\Upgrade\UpgradePathTestBase->performUpgrade()
Found the requested form fields at OtherUpgradePathTestBase.php213Drupal\system\Tests\Upgrade\UpgradePathTestBase->performUpgrade()
No pending updates at the end of the update process.OtherUpgradePathTestBase.php235Drupal\system\Tests\Upgrade\UpgradePathTestBase->performUpgrade()
Exception: update.php still shows pending updates after execution. in Drupal\system\Tests\Upgrade\UpgradePathTestBase->performUpgrade() (line 236 of /var/lib/drupaltestbot/sites/default/files/checkout/core/modules/system/lib/Drupal/system/Tests/Upgrade/UpgradePathTestBase.php).Uncaught exceptionUpgradePathTestBase.php236Drupal\system\Tests\Upgrade\UpgradePathTestBase->performUpgrade()

All

Test namePassFailException
LeafDrupal\action\Tests\ConfigurationTest3900
LeafDrupal\action\Tests\LoopTest2100
LeafDrupal\aggregator\Tests\AddFeedTest7100
LeafDrupal\aggregator\Tests\AggregatorConfigurationTest2000
LeafDrupal\aggregator\Tests\AggregatorCronTest5500
LeafDrupal\aggregator\Tests\AggregatorRenderingTest22800
LeafDrupal\aggregator\Tests\CategorizeFeedItemTest6100
LeafDrupal\aggregator\Tests\CategorizeFeedTest2100
LeafDrupal\aggregator\Tests\FeedParserTest6500
LeafDrupal\aggregator\Tests\ImportOpmlTest5500
LeafDrupal\aggregator\Tests\RemoveFeedItemTest27000
LeafDrupal\aggregator\Tests\RemoveFeedTest2500
LeafDrupal\aggregator\Tests\UpdateFeedItemTest6500
LeafDrupal\aggregator\Tests\UpdateFeedTest7600
LeafDrupal\ban\Tests\IpAddressBlockingTest4300
LeafDrupal\block\Tests\BlockAdminThemeTest1900
LeafDrupal\block\Tests\BlockCacheTest20500
LeafDrupal\block\Tests\BlockHiddenRegionTest1800
LeafDrupal\block\Tests\BlockHtmlIdTest1600
LeafDrupal\block\Tests\BlockInvalidRegionTest2400
LeafDrupal\block\Tests\BlockLanguageTest9100
LeafDrupal\block\Tests\BlockTemplateSuggestionsUnitTest300
LeafDrupal\block\Tests\BlockTest35800
LeafDrupal\block\Tests\BlockUserAccountSettingsTest1200
LeafDrupal\block\Tests\NewDefaultThemeBlocksTest2200
LeafDrupal\block\Tests\NonDefaultBlockAdminTest1100
LeafDrupal\book\Tests\BookTest51700
LeafDrupal\color\Tests\ColorTest8700
LeafDrupal\comment\Tests\CommentActionsTest2900
LeafDrupal\comment\Tests\CommentAnonymousTest16200
LeafDrupal\comment\Tests\CommentApprovalTest15000
LeafDrupal\comment\Tests\CommentBlockTest11400
LeafDrupal\comment\Tests\CommentContentRebuildTest3200
LeafDrupal\comment\Tests\CommentFieldsTest10500
ExpandDrupal\comment\Tests\CommentInterfaceTest200400
MessageGroupFilenameLineFunctionStatus
Changed environment:array ( 'authenticated' => false, 'comment count' => false, 'form' => 'below', 'user_register' => 'visitors', 'contact' => 'optional', 'comments' => 'open', 'access comments' => 0, 'post comments' => 0, 'skip comment approval' => 1, 'edit own comments' => 0, )DebugCommentInterfaceTest.php589Drupal\comment\Tests\CommentInterfaceTest->setEnvironment()
Changed environment:array ( 'authenticated' => true, 'comment count' => false, 'form' => 'below', 'user_register' => 'visitors', 'contact' => 'optional', 'comments' => 'open', 'access comments' => 0, 'post comments' => 0, 'skip comment approval' => 1, 'edit own comments' => 0, )DebugCommentInterfaceTest.php589Drupal\comment\Tests\CommentInterfaceTest->setEnvironment()
Changed environment:array ( 'authenticated' => false, 'comment count' => true, 'form' => 'below', 'user_register' => 'visitors', 'contact' => 'optional', 'comments' => 'open', 'access comments' => 0, 'post comments' => 0, 'skip comment approval' => 1, 'edit own comments' => 0, )DebugCommentInterfaceTest.php589Drupal\comment\Tests\CommentInterfaceTest->setEnvironment()
Changed environment:array ( 'authenticated' => true, 'comment count' => true, 'form' => 'below', 'user_register' => 'visitors', 'contact' => 'optional', 'comments' => 'open', 'access comments' => 0, 'post comments' => 0, 'skip comment approval' => 1, 'edit own comments' => 0, )DebugCommentInterfaceTest.php589Drupal\comment\Tests\CommentInterfaceTest->setEnvironment()
Changed environment:array ( 'authenticated' => false, 'comment count' => false, 'form' => 'below', 'user_register' => 'visitors', 'contact' => 'optional', 'comments' => 'open', 'access comments' => 1, 'post comments' => 0, 'skip comment approval' => 1, 'edit own comments' => 0, )DebugCommentInterfaceTest.php589Drupal\comment\Tests\CommentInterfaceTest->setEnvironment()
Changed environment:array ( 'authenticated' => true, 'comment count' => false, 'form' => 'below', 'user_register' => 'visitors', 'contact' => 'optional', 'comments' => 'open', 'access comments' => 1, 'post comments' => 0, 'skip comment approval' => 1, 'edit own comments' => 0, )DebugCommentInterfaceTest.php589Drupal\comment\Tests\CommentInterfaceTest->setEnvironment()
Changed environment:array ( 'authenticated' => false, 'comment count' => true, 'form' => 'below', 'user_register' => 'visitors', 'contact' => 'optional', 'comments' => 'open', 'access comments' => 1, 'post comments' => 0, 'skip comment approval' => 1, 'edit own comments' => 0, )DebugCommentInterfaceTest.php589Drupal\comment\Tests\CommentInterfaceTest->setEnvironment()
Changed environment:array ( 'authenticated' => true, 'comment count' => true, 'form' => 'below', 'user_register' => 'visitors', 'contact' => 'optional', 'comments' => 'open', 'access comments' => 1, 'post comments' => 0, 'skip comment approval' => 1, 'edit own comments' => 0, )DebugCommentInterfaceTest.php589Drupal\comment\Tests\CommentInterfaceTest->setEnvironment()
Changed environment:array ( 'authenticated' => false, 'comment count' => false, 'form' => 'below', 'user_register' => 'visitors', 'contact' => 'optional', 'comments' => 'open', 'access comments' => 0, 'post comments' => 1, 'skip comment approval' => 1, 'edit own comments' => 0, )DebugCommentInterfaceTest.php589Drupal\comment\Tests\CommentInterfaceTest->setEnvironment()
Changed environment:array ( 'authenticated' => true, 'comment count' => false, 'form' => 'below', 'user_register' => 'visitors', 'contact' => 'optional', 'comments' => 'open', 'access comments' => 0, 'post comments' => 1, 'skip comment approval' => 1, 'edit own comments' => 0, )DebugCommentInterfaceTest.php589Drupal\comment\Tests\CommentInterfaceTest->setEnvironment()
Changed environment:array ( 'authenticated' => false, 'comment count' => true, 'form' => 'below', 'user_register' => 'visitors', 'contact' => 'optional', 'comments' => 'open', 'access comments' => 0, 'post comments' => 1, 'skip comment approval' => 1, 'edit own comments' => 0, )DebugCommentInterfaceTest.php589Drupal\comment\Tests\CommentInterfaceTest->setEnvironment()
Changed environment:array ( 'authenticated' => true, 'comment count' => true, 'form' => 'below', 'user_register' => 'visitors', 'contact' => 'optional', 'comments' => 'open', 'access comments' => 0, 'post comments' => 1, 'skip comment approval' => 1, 'edit own comments' => 0, )DebugCommentInterfaceTest.php589Drupal\comment\Tests\CommentInterfaceTest->setEnvironment()
Changed environment:array ( 'authenticated' => false, 'comment count' => false, 'form' => 'below', 'user_register' => 'visitors', 'contact' => 'optional', 'comments' => 'open', 'access comments' => 1, 'post comments' => 1, 'skip comment approval' => 1, 'edit own comments' => 0, )DebugCommentInterfaceTest.php589Drupal\comment\Tests\CommentInterfaceTest->setEnvironment()
Changed environment:array ( 'authenticated' => true, 'comment count' => false, 'form' => 'below', 'user_register' => 'visitors', 'contact' => 'optional', 'comments' => 'open', 'access comments' => 1, 'post comments' => 1, 'skip comment approval' => 1, 'edit own comments' => 0, )DebugCommentInterfaceTest.php589Drupal\comment\Tests\CommentInterfaceTest->setEnvironment()
Changed environment:array ( 'authenticated' => false, 'comment count' => true, 'form' => 'below', 'user_register' => 'visitors', 'contact' => 'optional', 'comments' => 'open', 'access comments' => 1, 'post comments' => 1, 'skip comment approval' => 1, 'edit own comments' => 0, )DebugCommentInterfaceTest.php589Drupal\comment\Tests\CommentInterfaceTest->setEnvironment()
Changed environment:array ( 'authenticated' => true, 'comment count' => true, 'form' => 'below', 'user_register' => 'visitors', 'contact' => 'optional', 'comments' => 'open', 'access comments' => 1, 'post comments' => 1, 'skip comment approval' => 1, 'edit own comments' => 0, )DebugCommentInterfaceTest.php589Drupal\comment\Tests\CommentInterfaceTest->setEnvironment()
Changed environment:array ( 'authenticated' => false, 'comment count' => false, 'form' => 'separate page', 'user_register' => 'visitors', 'contact' => 'optional', 'comments' => 'open', 'access comments' => 0, 'post comments' => 0, 'skip comment approval' => 1, 'edit own comments' => 0, )DebugCommentInterfaceTest.php589Drupal\comment\Tests\CommentInterfaceTest->setEnvironment()
Changed environment:array ( 'authenticated' => true, 'comment count' => false, 'form' => 'separate page', 'user_register' => 'visitors', 'contact' => 'optional', 'comments' => 'open', 'access comments' => 0, 'post comments' => 0, 'skip comment approval' => 1, 'edit own comments' => 0, )DebugCommentInterfaceTest.php589Drupal\comment\Tests\CommentInterfaceTest->setEnvironment()
Changed environment:array ( 'authenticated' => false, 'comment count' => true, 'form' => 'separate page', 'user_register' => 'visitors', 'contact' => 'optional', 'comments' => 'open', 'access comments' => 0, 'post comments' => 0, 'skip comment approval' => 1, 'edit own comments' => 0, )DebugCommentInterfaceTest.php589Drupal\comment\Tests\CommentInterfaceTest->setEnvironment()
Changed environment:array ( 'authenticated' => true, 'comment count' => true, 'form' => 'separate page', 'user_register' => 'visitors', 'contact' => 'optional', 'comments' => 'open', 'access comments' => 0, 'post comments' => 0, 'skip comment approval' => 1, 'edit own comments' => 0, )DebugCommentInterfaceTest.php589Drupal\comment\Tests\CommentInterfaceTest->setEnvironment()
Changed environment:array ( 'authenticated' => false, 'comment count' => false, 'form' => 'separate page', 'user_register' => 'visitors', 'contact' => 'optional', 'comments' => 'open', 'access comments' => 1, 'post comments' => 0, 'skip comment approval' => 1, 'edit own comments' => 0, )DebugCommentInterfaceTest.php589Drupal\comment\Tests\CommentInterfaceTest->setEnvironment()
Changed environment:array ( 'authenticated' => true, 'comment count' => false, 'form' => 'separate page', 'user_register' => 'visitors', 'contact' => 'optional', 'comments' => 'open', 'access comments' => 1, 'post comments' => 0, 'skip comment approval' => 1, 'edit own comments' => 0, )DebugCommentInterfaceTest.php589Drupal\comment\Tests\CommentInterfaceTest->setEnvironment()
Changed environment:array ( 'authenticated' => false, 'comment count' => true, 'form' => 'separate page', 'user_register' => 'visitors', 'contact' => 'optional', 'comments' => 'open', 'access comments' => 1, 'post comments' => 0, 'skip comment approval' => 1, 'edit own comments' => 0, )DebugCommentInterfaceTest.php589Drupal\comment\Tests\CommentInterfaceTest->setEnvironment()
Changed environment:array ( 'authenticated' => true, 'comment count' => true, 'form' => 'separate page', 'user_register' => 'visitors', 'contact' => 'optional', 'comments' => 'open', 'access comments' => 1, 'post comments' => 0, 'skip comment approval' => 1, 'edit own comments' => 0, )DebugCommentInterfaceTest.php589Drupal\comment\Tests\CommentInterfaceTest->setEnvironment()
Changed environment:array ( 'authenticated' => false, 'comment count' => false, 'form' => 'separate page', 'user_register' => 'visitors', 'contact' => 'optional', 'comments' => 'open', 'access comments' => 0, 'post comments' => 1, 'skip comment approval' => 1, 'edit own comments' => 0, )DebugCommentInterfaceTest.php589Drupal\comment\Tests\CommentInterfaceTest->setEnvironment()
Changed environment:array ( 'authenticated' => true, 'comment count' => false, 'form' => 'separate page', 'user_register' => 'visitors', 'contact' => 'optional', 'comments' => 'open', 'access comments' => 0, 'post comments' => 1, 'skip comment approval' => 1, 'edit own comments' => 0, )DebugCommentInterfaceTest.php589Drupal\comment\Tests\CommentInterfaceTest->setEnvironment()
Changed environment:array ( 'authenticated' => false, 'comment count' => true, 'form' => 'separate page', 'user_register' => 'visitors', 'contact' => 'optional', 'comments' => 'open', 'access comments' => 0, 'post comments' => 1, 'skip comment approval' => 1, 'edit own comments' => 0, )DebugCommentInterfaceTest.php589Drupal\comment\Tests\CommentInterfaceTest->setEnvironment()
Changed environment:array ( 'authenticated' => true, 'comment count' => true, 'form' => 'separate page', 'user_register' => 'visitors', 'contact' => 'optional', 'comments' => 'open', 'access comments' => 0, 'post comments' => 1, 'skip comment approval' => 1, 'edit own comments' => 0, )DebugCommentInterfaceTest.php589Drupal\comment\Tests\CommentInterfaceTest->setEnvironment()
Changed environment:array ( 'authenticated' => false, 'comment count' => false, 'form' => 'separate page', 'user_register' => 'visitors', 'contact' => 'optional', 'comments' => 'open', 'access comments' => 1, 'post comments' => 1, 'skip comment approval' => 1, 'edit own comments' => 0, )DebugCommentInterfaceTest.php589Drupal\comment\Tests\CommentInterfaceTest->setEnvironment()
Changed environment:array ( 'authenticated' => true, 'comment count' => false, 'form' => 'separate page', 'user_register' => 'visitors', 'contact' => 'optional', 'comments' => 'open', 'access comments' => 1, 'post comments' => 1, 'skip comment approval' => 1, 'edit own comments' => 0, )DebugCommentInterfaceTest.php589Drupal\comment\Tests\CommentInterfaceTest->setEnvironment()
Changed environment:array ( 'authenticated' => false, 'comment count' => true, 'form' => 'separate page', 'user_register' => 'visitors', 'contact' => 'optional', 'comments' => 'open', 'access comments' => 1, 'post comments' => 1, 'skip comment approval' => 1, 'edit own comments' => 0, )DebugCommentInterfaceTest.php589Drupal\comment\Tests\CommentInterfaceTest->setEnvironment()
Changed environment:array ( 'authenticated' => true, 'comment count' => true, 'form' => 'separate page', 'user_register' => 'visitors', 'contact' => 'optional', 'comments' => 'open', 'access comments' => 1, 'post comments' => 1, 'skip comment approval' => 1, 'edit own comments' => 0, )DebugCommentInterfaceTest.php589Drupal\comment\Tests\CommentInterfaceTest->setEnvironment()
Changed environment:array ( 'authenticated' => false, 'comment count' => false, 'form' => 'below', 'user_register' => 'admin_only', 'contact' => 'optional', 'comments' => 'open', 'access comments' => 0, 'post comments' => 0, 'skip comment approval' => 1, 'edit own comments' => 0, )DebugCommentInterfaceTest.php589Drupal\comment\Tests\CommentInterfaceTest->setEnvironment()
Changed environment:array ( 'authenticated' => true, 'comment count' => false, 'form' => 'below', 'user_register' => 'admin_only', 'contact' => 'optional', 'comments' => 'open', 'access comments' => 0, 'post comments' => 0, 'skip comment approval' => 1, 'edit own comments' => 0, )DebugCommentInterfaceTest.php589Drupal\comment\Tests\CommentInterfaceTest->setEnvironment()
Changed environment:array ( 'authenticated' => false, 'comment count' => true, 'form' => 'below', 'user_register' => 'admin_only', 'contact' => 'optional', 'comments' => 'open', 'access comments' => 0, 'post comments' => 0, 'skip comment approval' => 1, 'edit own comments' => 0, )DebugCommentInterfaceTest.php589Drupal\comment\Tests\CommentInterfaceTest->setEnvironment()
Changed environment:array ( 'authenticated' => true, 'comment count' => true, 'form' => 'below', 'user_register' => 'admin_only', 'contact' => 'optional', 'comments' => 'open', 'access comments' => 0, 'post comments' => 0, 'skip comment approval' => 1, 'edit own comments' => 0, )DebugCommentInterfaceTest.php589Drupal\comment\Tests\CommentInterfaceTest->setEnvironment()
Changed environment:array ( 'authenticated' => false, 'comment count' => false, 'form' => 'below', 'user_register' => 'admin_only', 'contact' => 'optional', 'comments' => 'open', 'access comments' => 1, 'post comments' => 0, 'skip comment approval' => 1, 'edit own comments' => 0, )DebugCommentInterfaceTest.php589Drupal\comment\Tests\CommentInterfaceTest->setEnvironment()
Changed environment:array ( 'authenticated' => true, 'comment count' => false, 'form' => 'below', 'user_register' => 'admin_only', 'contact' => 'optional', 'comments' => 'open', 'access comments' => 1, 'post comments' => 0, 'skip comment approval' => 1, 'edit own comments' => 0, )DebugCommentInterfaceTest.php589Drupal\comment\Tests\CommentInterfaceTest->setEnvironment()
Changed environment:array ( 'authenticated' => false, 'comment count' => true, 'form' => 'below', 'user_register' => 'admin_only', 'contact' => 'optional', 'comments' => 'open', 'access comments' => 1, 'post comments' => 0, 'skip comment approval' => 1, 'edit own comments' => 0, )DebugCommentInterfaceTest.php589Drupal\comment\Tests\CommentInterfaceTest->setEnvironment()
Changed environment:array ( 'authenticated' => true, 'comment count' => true, 'form' => 'below', 'user_register' => 'admin_only', 'contact' => 'optional', 'comments' => 'open', 'access comments' => 1, 'post comments' => 0, 'skip comment approval' => 1, 'edit own comments' => 0, )DebugCommentInterfaceTest.php589Drupal\comment\Tests\CommentInterfaceTest->setEnvironment()
Changed environment:array ( 'authenticated' => false, 'comment count' => false, 'form' => 'below', 'user_register' => 'admin_only', 'contact' => 'optional', 'comments' => 'open', 'access comments' => 0, 'post comments' => 1, 'skip comment approval' => 1, 'edit own comments' => 0, )DebugCommentInterfaceTest.php589Drupal\comment\Tests\CommentInterfaceTest->setEnvironment()
Changed environment:array ( 'authenticated' => true, 'comment count' => false, 'form' => 'below', 'user_register' => 'admin_only', 'contact' => 'optional', 'comments' => 'open', 'access comments' => 0, 'post comments' => 1, 'skip comment approval' => 1, 'edit own comments' => 0, )DebugCommentInterfaceTest.php589Drupal\comment\Tests\CommentInterfaceTest->setEnvironment()
Changed environment:array ( 'authenticated' => false, 'comment count' => true, 'form' => 'below', 'user_register' => 'admin_only', 'contact' => 'optional', 'comments' => 'open', 'access comments' => 0, 'post comments' => 1, 'skip comment approval' => 1, 'edit own comments' => 0, )DebugCommentInterfaceTest.php589Drupal\comment\Tests\CommentInterfaceTest->setEnvironment()
Changed environment:array ( 'authenticated' => true, 'comment count' => true, 'form' => 'below', 'user_register' => 'admin_only', 'contact' => 'optional', 'comments' => 'open', 'access comments' => 0, 'post comments' => 1, 'skip comment approval' => 1, 'edit own comments' => 0, )DebugCommentInterfaceTest.php589Drupal\comment\Tests\CommentInterfaceTest->setEnvironment()
Changed environment:array ( 'authenticated' => false, 'comment count' => false, 'form' => 'below', 'user_register' => 'admin_only', 'contact' => 'optional', 'comments' => 'open', 'access comments' => 1, 'post comments' => 1, 'skip comment approval' => 1, 'edit own comments' => 0, )DebugCommentInterfaceTest.php589Drupal\comment\Tests\CommentInterfaceTest->setEnvironment()
Changed environment:array ( 'authenticated' => true, 'comment count' => false, 'form' => 'below', 'user_register' => 'admin_only', 'contact' => 'optional', 'comments' => 'open', 'access comments' => 1, 'post comments' => 1, 'skip comment approval' => 1, 'edit own comments' => 0, )DebugCommentInterfaceTest.php589Drupal\comment\Tests\CommentInterfaceTest->setEnvironment()
Changed environment:array ( 'authenticated' => false, 'comment count' => true, 'form' => 'below', 'user_register' => 'admin_only', 'contact' => 'optional', 'comments' => 'open', 'access comments' => 1, 'post comments' => 1, 'skip comment approval' => 1, 'edit own comments' => 0, )DebugCommentInterfaceTest.php589Drupal\comment\Tests\CommentInterfaceTest->setEnvironment()
Changed environment:array ( 'authenticated' => true, 'comment count' => true, 'form' => 'below', 'user_register' => 'admin_only', 'contact' => 'optional', 'comments' => 'open', 'access comments' => 1, 'post comments' => 1, 'skip comment approval' => 1, 'edit own comments' => 0, )DebugCommentInterfaceTest.php589Drupal\comment\Tests\CommentInterfaceTest->setEnvironment()
Changed environment:array ( 'authenticated' => false, 'comment count' => false, 'form' => 'separate page', 'user_register' => 'admin_only', 'contact' => 'optional', 'comments' => 'open', 'access comments' => 0, 'post comments' => 0, 'skip comment approval' => 1, 'edit own comments' => 0, )DebugCommentInterfaceTest.php589Drupal\comment\Tests\CommentInterfaceTest->setEnvironment()
Changed environment:array ( 'authenticated' => true, 'comment count' => false, 'form' => 'separate page', 'user_register' => 'admin_only', 'contact' => 'optional', 'comments' => 'open', 'access comments' => 0, 'post comments' => 0, 'skip comment approval' => 1, 'edit own comments' => 0, )DebugCommentInterfaceTest.php589Drupal\comment\Tests\CommentInterfaceTest->setEnvironment()
Changed environment:array ( 'authenticated' => false, 'comment count' => true, 'form' => 'separate page', 'user_register' => 'admin_only', 'contact' => 'optional', 'comments' => 'open', 'access comments' => 0, 'post comments' => 0, 'skip comment approval' => 1, 'edit own comments' => 0, )DebugCommentInterfaceTest.php589Drupal\comment\Tests\CommentInterfaceTest->setEnvironment()
Changed environment:array ( 'authenticated' => true, 'comment count' => true, 'form' => 'separate page', 'user_register' => 'admin_only', 'contact' => 'optional', 'comments' => 'open', 'access comments' => 0, 'post comments' => 0, 'skip comment approval' => 1, 'edit own comments' => 0, )DebugCommentInterfaceTest.php589Drupal\comment\Tests\CommentInterfaceTest->setEnvironment()
Changed environment:array ( 'authenticated' => false, 'comment count' => false, 'form' => 'separate page', 'user_register' => 'admin_only', 'contact' => 'optional', 'comments' => 'open', 'access comments' => 1, 'post comments' => 0, 'skip comment approval' => 1, 'edit own comments' => 0, )DebugCommentInterfaceTest.php589Drupal\comment\Tests\CommentInterfaceTest->setEnvironment()
Changed environment:array ( 'authenticated' => true, 'comment count' => false, 'form' => 'separate page', 'user_register' => 'admin_only', 'contact' => 'optional', 'comments' => 'open', 'access comments' => 1, 'post comments' => 0, 'skip comment approval' => 1, 'edit own comments' => 0, )DebugCommentInterfaceTest.php589Drupal\comment\Tests\CommentInterfaceTest->setEnvironment()
Changed environment:array ( 'authenticated' => false, 'comment count' => true, 'form' => 'separate page', 'user_register' => 'admin_only', 'contact' => 'optional', 'comments' => 'open', 'access comments' => 1, 'post comments' => 0, 'skip comment approval' => 1, 'edit own comments' => 0, )DebugCommentInterfaceTest.php589Drupal\comment\Tests\CommentInterfaceTest->setEnvironment()
Changed environment:array ( 'authenticated' => true, 'comment count' => true, 'form' => 'separate page', 'user_register' => 'admin_only', 'contact' => 'optional', 'comments' => 'open', 'access comments' => 1, 'post comments' => 0, 'skip comment approval' => 1, 'edit own comments' => 0, )DebugCommentInterfaceTest.php589Drupal\comment\Tests\CommentInterfaceTest->setEnvironment()
Changed environment:array ( 'authenticated' => false, 'comment count' => false, 'form' => 'separate page', 'user_register' => 'admin_only', 'contact' => 'optional', 'comments' => 'open', 'access comments' => 0, 'post comments' => 1, 'skip comment approval' => 1, 'edit own comments' => 0, )DebugCommentInterfaceTest.php589Drupal\comment\Tests\CommentInterfaceTest->setEnvironment()
Changed environment:array ( 'authenticated' => true, 'comment count' => false, 'form' => 'separate page', 'user_register' => 'admin_only', 'contact' => 'optional', 'comments' => 'open', 'access comments' => 0, 'post comments' => 1, 'skip comment approval' => 1, 'edit own comments' => 0, )DebugCommentInterfaceTest.php589Drupal\comment\Tests\CommentInterfaceTest->setEnvironment()
Changed environment:array ( 'authenticated' => false, 'comment count' => true, 'form' => 'separate page', 'user_register' => 'admin_only', 'contact' => 'optional', 'comments' => 'open', 'access comments' => 0, 'post comments' => 1, 'skip comment approval' => 1, 'edit own comments' => 0, )DebugCommentInterfaceTest.php589Drupal\comment\Tests\CommentInterfaceTest->setEnvironment()
Changed environment:array ( 'authenticated' => true, 'comment count' => true, 'form' => 'separate page', 'user_register' => 'admin_only', 'contact' => 'optional', 'comments' => 'open', 'access comments' => 0, 'post comments' => 1, 'skip comment approval' => 1, 'edit own comments' => 0, )DebugCommentInterfaceTest.php589Drupal\comment\Tests\CommentInterfaceTest->setEnvironment()
Changed environment:array ( 'authenticated' => false, 'comment count' => false, 'form' => 'separate page', 'user_register' => 'admin_only', 'contact' => 'optional', 'comments' => 'open', 'access comments' => 1, 'post comments' => 1, 'skip comment approval' => 1, 'edit own comments' => 0, )DebugCommentInterfaceTest.php589Drupal\comment\Tests\CommentInterfaceTest->setEnvironment()
Changed environment:array ( 'authenticated' => true, 'comment count' => false, 'form' => 'separate page', 'user_register' => 'admin_only', 'contact' => 'optional', 'comments' => 'open', 'access comments' => 1, 'post comments' => 1, 'skip comment approval' => 1, 'edit own comments' => 0, )DebugCommentInterfaceTest.php589Drupal\comment\Tests\CommentInterfaceTest->setEnvironment()
Changed environment:array ( 'authenticated' => false, 'comment count' => true, 'form' => 'separate page', 'user_register' => 'admin_only', 'contact' => 'optional', 'comments' => 'open', 'access comments' => 1, 'post comments' => 1, 'skip comment approval' => 1, 'edit own comments' => 0, )DebugCommentInterfaceTest.php589Drupal\comment\Tests\CommentInterfaceTest->setEnvironment()
Changed environment:array ( 'authenticated' => true, 'comment count' => true, 'form' => 'separate page', 'user_register' => 'admin_only', 'contact' => 'optional', 'comments' => 'open', 'access comments' => 1, 'post comments' => 1, 'skip comment approval' => 1, 'edit own comments' => 0, )DebugCommentInterfaceTest.php589Drupal\comment\Tests\CommentInterfaceTest->setEnvironment()
LeafDrupal\comment\Tests\CommentLanguageTest7200
LeafDrupal\comment\Tests\CommentNodeAccessTest5600
LeafDrupal\comment\Tests\CommentNodeChangesTest2300
LeafDrupal\comment\Tests\CommentPagerTest21000
LeafDrupal\comment\Tests\CommentPreviewTest9800
LeafDrupal\comment\Tests\CommentRssTest2500
LeafDrupal\comment\Tests\CommentThreadingTest15000
LeafDrupal\comment\Tests\CommentTokenReplaceTest6500
LeafDrupal\config\Tests\ConfigCRUDTest1900
LeafDrupal\config\Tests\ConfigEntityListTest6800
LeafDrupal\config\Tests\ConfigEntityTest3700
LeafDrupal\config\Tests\ConfigFileContentTest3000
LeafDrupal\config\Tests\ConfigImportTest5200
LeafDrupal\config\Tests\ConfigInstallTest1100
LeafDrupal\config\Tests\ConfigOverrideTest1300
LeafDrupal\config\Tests\ConfigUpgradeTest1100
LeafDrupal\config\Tests\LocaleConfigOverride300
LeafDrupal\config\Tests\Storage\DatabaseStorageTest1900
LeafDrupal\config\Tests\Storage\FileStorageTest2000
LeafDrupal\contact\Tests\ContactAuthenticatedUserTest1300
LeafDrupal\contact\Tests\ContactPersonalTest16300
LeafDrupal\contact\Tests\ContactSitewideTest24100
LeafDrupal\contextual\Tests\ContextualDynamicContextTest1600
LeafDrupal\dblog\Tests\DBLogTest51400
LeafDrupal\email\Tests\EmailFieldTest1800
LeafDrupal\field\Tests\BulkDeleteTest7500
LeafDrupal\field\Tests\CrudTest6900
LeafDrupal\field\Tests\DisplayApiTest4600
LeafDrupal\field\Tests\EntityPropertiesTest400
LeafDrupal\field\Tests\FieldAttachOtherTest5400
LeafDrupal\field\Tests\FieldAttachStorageTest9200
LeafDrupal\field\Tests\FieldInfoTest8300
LeafDrupal\field\Tests\FieldInstanceCrudTest3800
LeafDrupal\field\Tests\FormTest26400
LeafDrupal\field\Tests\TranslationTest10200
LeafDrupal\field_sql_storage\Tests\FieldSqlStorageTest9200
LeafDrupal\field_ui\Tests\AlterTest2100
LeafDrupal\field_ui\Tests\ManageDisplayTest10900
LeafDrupal\field_ui\Tests\ManageFieldsTest19800
LeafDrupal\file\Tests\CopyTest11000
LeafDrupal\file\Tests\DeleteTest2400
LeafDrupal\file\Tests\DownloadTest4500
LeafDrupal\file\Tests\FileFieldDisplayTest5000
LeafDrupal\file\Tests\FileFieldPathTest2700
LeafDrupal\file\Tests\FileFieldRevisionTest6700
LeafDrupal\file\Tests\FileFieldValidateTest11800
LeafDrupal\file\Tests\FileFieldWidgetTest29900
LeafDrupal\file\Tests\FileManagedFileElementTest26800
LeafDrupal\file\Tests\FilePrivateTest3700
LeafDrupal\file\Tests\FileTokenReplaceTest3500
LeafDrupal\file\Tests\LoadTest3400
LeafDrupal\file\Tests\MoveTest11000
LeafDrupal\file\Tests\RemoteFileSaveUploadTest27000
LeafDrupal\file\Tests\SaveDataTest9300
LeafDrupal\file\Tests\SaveTest1600
LeafDrupal\file\Tests\SaveUploadTest27000
LeafDrupal\file\Tests\SpaceUsedTest1200
LeafDrupal\file\Tests\UsageTest3400
LeafDrupal\file\Tests\ValidateTest1200
LeafDrupal\file\Tests\ValidatorTest2900
LeafDrupal\filter\Tests\FilterAdminTest17800
LeafDrupal\filter\Tests\FilterCrudTest21500
LeafDrupal\filter\Tests\FilterDefaultFormatTest3300
LeafDrupal\filter\Tests\FilterFormatAccessTest27200
LeafDrupal\filter\Tests\FilterHooksTest3300
LeafDrupal\filter\Tests\FilterNoFormatTest100
LeafDrupal\filter\Tests\FilterSecurityTest2800
LeafDrupal\filter\Tests\FilterSettingsTest1000
LeafDrupal\filter\Tests\FilterUnitTest21500
LeafDrupal\forum\Tests\ForumIndexTest2700
LeafDrupal\forum\Tests\ForumNodeAccessTest6300
LeafDrupal\forum\Tests\ForumTest75900
LeafDrupal\help\Tests\HelpTest27800
LeafDrupal\help\Tests\NoHelpTest1200
LeafDrupal\image\Tests\ImageAdminStylesTest19600
LeafDrupal\image\Tests\ImageDimensionsScaleUnitTest1500
LeafDrupal\image\Tests\ImageDimensionsTest5600
LeafDrupal\image\Tests\ImageEffectsTest4400
LeafDrupal\image\Tests\ImageFieldDefaultImagesTest3600
LeafDrupal\image\Tests\ImageFieldDisplayTest16300
LeafDrupal\image\Tests\ImageFieldValidateTest2100
LeafDrupal\image\Tests\ImageStylesPathAndUrlTest6700
LeafDrupal\image\Tests\ImageThemeFunctionTest500
LeafDrupal\language\Tests\LanguageBrowserDetectionUnitTest10700
LeafDrupal\language\Tests\LanguageConfigurationTest4600
LeafDrupal\language\Tests\LanguageCustomLanguageConfigurationTest3600
LeafDrupal\language\Tests\LanguageDependencyInjectionTest1700
LeafDrupal\language\Tests\LanguageListTest10000
LeafDrupal\language\Tests\LanguageNegotiationInfoTest4900
LeafDrupal\language\Tests\LanguagePathMonolingualTest3500
LeafDrupal\language\Tests\LanguageSwitchingTest2600
ExpandDrupal\language\Tests\LanguageUILanguageNegotiationTest862416
MessageGroupFilenameLineFunctionStatus
simplexml_import_dom(): Invalid Nodetype to importWarningWebTestBase.php1040Drupal\simpletest\WebTestBase->parse()
Parsed page successfully.BrowserLanguageUILanguageNegotiationTest.php120Drupal\language\Tests\LanguageUILanguageNegotiationTest->testUILanguageNegotiation()
simplexml_import_dom(): Invalid Nodetype to importWarningWebTestBase.php1040Drupal\simpletest\WebTestBase->parse()
Parsed page successfully.BrowserLanguageUILanguageNegotiationTest.php121Drupal\language\Tests\LanguageUILanguageNegotiationTest->testUILanguageNegotiation()
current() expects parameter 1 to be array, boolean givenWarningLanguageUILanguageNegotiationTest.php121Drupal\language\Tests\LanguageUILanguageNegotiationTest->testUILanguageNegotiation()
simplexml_import_dom(): Invalid Nodetype to importWarningWebTestBase.php1040Drupal\simpletest\WebTestBase->parse()
Parsed page successfully.BrowserLanguageUILanguageNegotiationTest.php126Drupal\language\Tests\LanguageUILanguageNegotiationTest->testUILanguageNegotiation()
simplexml_import_dom(): Invalid Nodetype to importWarningWebTestBase.php1040Drupal\simpletest\WebTestBase->parse()
Parsed page successfully.BrowserLanguageUILanguageNegotiationTest.php132Drupal\language\Tests\LanguageUILanguageNegotiationTest->testUILanguageNegotiation()
simplexml_import_dom(): Invalid Nodetype to importWarningWebTestBase.php1040Drupal\simpletest\WebTestBase->parse()
Parsed page successfully.BrowserLanguageUILanguageNegotiationTest.php133Drupal\language\Tests\LanguageUILanguageNegotiationTest->testUILanguageNegotiation()
current() expects parameter 1 to be array, boolean givenWarningLanguageUILanguageNegotiationTest.php133Drupal\language\Tests\LanguageUILanguageNegotiationTest->testUILanguageNegotiation()
simplexml_import_dom(): Invalid Nodetype to importWarningWebTestBase.php1040Drupal\simpletest\WebTestBase->parse()
Parsed page successfully.BrowserLanguageUILanguageNegotiationTest.php138Drupal\language\Tests\LanguageUILanguageNegotiationTest->testUILanguageNegotiation()
URL (PATH) > DEFAULT: with language prefix, UI language is switched based on path prefixOtherLanguageUILanguageNegotiationTest.php349Drupal\language\Tests\LanguageUILanguageNegotiationTest->runTest()
URL (PATH) > BROWSER: no language prefix, UI language is determined by browser language preferenceOtherLanguageUILanguageNegotiationTest.php349Drupal\language\Tests\LanguageUILanguageNegotiationTest->runTest()
URL (PATH) > BROWSER: with langage prefix, UI language is based on path prefixOtherLanguageUILanguageNegotiationTest.php349Drupal\language\Tests\LanguageUILanguageNegotiationTest->runTest()
USER > DEFAULT: defined prefereed user language setting, the UI language is based on user settingOtherLanguageUILanguageNegotiationTest.php349Drupal\language\Tests\LanguageUILanguageNegotiationTest->runTest()
USER ADMIN > DEFAULT: defined prefereed user admin language setting, the UI language is based on user settingOtherLanguageUILanguageNegotiationTest.php349Drupal\language\Tests\LanguageUILanguageNegotiationTest->runTest()
simplexml_import_dom(): Invalid Nodetype to importWarningWebTestBase.php1040Drupal\simpletest\WebTestBase->parse()
Parsed page successfully.BrowserLanguageUILanguageNegotiationTest.php304Drupal\language\Tests\LanguageUILanguageNegotiationTest->testUILanguageNegotiation()
URL (DOMAIN) > DEFAULT: domain example.cn should switch to ChineseOtherLanguageUILanguageNegotiationTest.php349Drupal\language\Tests\LanguageUILanguageNegotiationTest->runTest()
"Language negotiation method: language-url" foundOtherLanguageUILanguageNegotiationTest.php350Drupal\language\Tests\LanguageUILanguageNegotiationTest->runTest()
simplexml_import_dom(): Invalid Nodetype to importWarningWebTestBase.php1040Drupal\simpletest\WebTestBase->parse()
Parsed page successfully.BrowserLanguageUILanguageNegotiationTest.php368Drupal\language\Tests\LanguageUILanguageNegotiationTest->testUrlLanguageFallback()
simplexml_import_dom(): Invalid Nodetype to importWarningWebTestBase.php1040Drupal\simpletest\WebTestBase->parse()
Parsed page successfully.BrowserLanguageUILanguageNegotiationTest.php377Drupal\language\Tests\LanguageUILanguageNegotiationTest->testUrlLanguageFallback()
simplexml_import_dom(): Invalid Nodetype to importWarningWebTestBase.php1040Drupal\simpletest\WebTestBase->parse()
Parsed page successfully.BrowserLanguageUILanguageNegotiationTest.php382Drupal\language\Tests\LanguageUILanguageNegotiationTest->testUrlLanguageFallback()
Undefined offset: 0NoticeLanguageUILanguageNegotiationTest.php394Drupal\language\Tests\LanguageUILanguageNegotiationTest->testUrlLanguageFallback()
The browser language is the URL active languageOtherLanguageUILanguageNegotiationTest.php394Drupal\language\Tests\LanguageUILanguageNegotiationTest->testUrlLanguageFallback()
Undefined offset: 0NoticeLanguageUILanguageNegotiationTest.php398Drupal\language\Tests\LanguageUILanguageNegotiationTest->testUrlLanguageFallback()
URLs are rewritten using the browser language.OtherLanguageUILanguageNegotiationTest.php398Drupal\language\Tests\LanguageUILanguageNegotiationTest->testUrlLanguageFallback()
simplexml_import_dom(): Invalid Nodetype to importWarningWebTestBase.php1040Drupal\simpletest\WebTestBase->parse()
Parsed page successfully.BrowserLanguageUILanguageNegotiationTest.php418Drupal\language\Tests\LanguageUILanguageNegotiationTest->testLanguageDomain()
simplexml_import_dom(): Invalid Nodetype to importWarningWebTestBase.php1040Drupal\simpletest\WebTestBase->parse()
Parsed page successfully.BrowserLanguageUILanguageNegotiationTest.php425Drupal\language\Tests\LanguageUILanguageNegotiationTest->testLanguageDomain()
The url() function returns the right URL (/checkout/it/admin) in accordance with the chosen languageOtherLanguageUILanguageNegotiationTest.php437Drupal\language\Tests\LanguageUILanguageNegotiationTest->testLanguageDomain()
The url() function returns the right HTTPS URL (via options) (https://drupaltestbot813.2-mysql.osuosl.test/checkout/it/admin) in accordance with the chosen languageOtherLanguageUILanguageNegotiationTest.php443Drupal\language\Tests\LanguageUILanguageNegotiationTest->testLanguageDomain()
The url() function returns the right URL (via current URL scheme) (/checkout/it/admin) in accordance with the chosen languageOtherLanguageUILanguageNegotiationTest.php451Drupal\language\Tests\LanguageUILanguageNegotiationTest->testLanguageDomain()
LeafDrupal\language\Tests\LanguageUrlRewritingTest4400
LeafDrupal\link\Tests\LinkFieldTest13300
LeafDrupal\link\Tests\LinkFieldUITest2100
LeafDrupal\locale\Tests\LocaleCompareTest1600
ExpandDrupal\locale\Tests\LocaleContentTest992218
MessageGroupFilenameLineFunctionStatus
simplexml_import_dom(): Invalid Nodetype to importWarningWebTestBase.php1040Drupal\simpletest\WebTestBase->parse()
Parsed page successfully.BrowserLocaleContentTest.php46Drupal\locale\Tests\LocaleContentTest->testMachineNameLTR()
The machine name field is LTR when no additional language is configured.OtherLocaleContentTest.php46Drupal\locale\Tests\LocaleContentTest->testMachineNameLTR()
simplexml_import_dom(): Invalid Nodetype to importWarningWebTestBase.php1040Drupal\simpletest\WebTestBase->parse()
Parsed page successfully.BrowserLocaleContentTest.php51Drupal\locale\Tests\LocaleContentTest->testMachineNameLTR()
simplexml_import_dom(): Invalid Nodetype to importWarningWebTestBase.php1040Drupal\simpletest\WebTestBase->parse()
Parsed page successfully.BrowserLocaleContentTest.php55Drupal\locale\Tests\LocaleContentTest->testMachineNameLTR()
simplexml_import_dom(): Invalid Nodetype to importWarningWebTestBase.php1040Drupal\simpletest\WebTestBase->parse()
Parsed page successfully.BrowserLocaleContentTest.php59Drupal\locale\Tests\LocaleContentTest->testMachineNameLTR()
The machine name field is LTR when the default language is RTL.OtherLocaleContentTest.php59Drupal\locale\Tests\LocaleContentTest->testMachineNameLTR()
simplexml_import_dom(): Invalid Nodetype to importWarningWebTestBase.php1040Drupal\simpletest\WebTestBase->parse()
Parsed page successfully.BrowserLocaleContentTest.php85Drupal\locale\Tests\LocaleContentTest->testContentTypeLanguageConfiguration()
Multilingual support fieldset present on content type configuration form.OtherLocaleContentTest.php89Drupal\locale\Tests\LocaleContentTest->testContentTypeLanguageConfiguration()
simplexml_import_dom(): Invalid Nodetype to importWarningWebTestBase.php1040Drupal\simpletest\WebTestBase->parse()
Parsed page successfully.BrowserLocaleContentTest.php93Drupal\locale\Tests\LocaleContentTest->testContentTypeLanguageConfiguration()
Basic page content type has been updated.OtherLocaleContentTest.php94Drupal\locale\Tests\LocaleContentTest->testContentTypeLanguageConfiguration()
simplexml_import_dom(): Invalid Nodetype to importWarningWebTestBase.php1040Drupal\simpletest\WebTestBase->parse()
Parsed page successfully.BrowserLocaleContentTest.php101Drupal\locale\Tests\LocaleContentTest->testContentTypeLanguageConfiguration()
simplexml_import_dom(): Invalid Nodetype to importWarningWebTestBase.php1040Drupal\simpletest\WebTestBase->parse()
Parsed page successfully.BrowserLocaleContentTest.php106Drupal\locale\Tests\LocaleContentTest->testContentTypeLanguageConfiguration()
Language select present on add Basic page form.BrowserLocaleContentTest.php106Drupal\locale\Tests\LocaleContentTest->testContentTypeLanguageConfiguration()
Language present.OtherLocaleContentTest.php108Drupal\locale\Tests\LocaleContentTest->testContentTypeLanguageConfiguration()
Trying to get property of non-objectNoticeEntityFormController.php230Drupal\Core\Entity\EntityFormController->getFormLangcode()
Correct language selected.OtherLocaleContentTest.php123Drupal\locale\Tests\LocaleContentTest->testContentTypeLanguageConfiguration()
Trying to get property of non-objectNoticeEntityFormController.php230Drupal\Core\Entity\EntityFormController->getFormLangcode()
simplexml_import_dom(): Invalid Nodetype to importWarningWebTestBase.php1040Drupal\simpletest\WebTestBase->parse()
Parsed page successfully.BrowserLocaleContentTest.php128Drupal\locale\Tests\LocaleContentTest->testContentTypeLanguageConfiguration()
Basic page content updated.OtherLocaleContentTest.php129Drupal\locale\Tests\LocaleContentTest->testContentTypeLanguageConfiguration()
simplexml_import_dom(): Invalid Nodetype to importWarningWebTestBase.php1040Drupal\simpletest\WebTestBase->parse()
Parsed page successfully.BrowserLocaleContentTest.php149Drupal\locale\Tests\LocaleContentTest->testContentTypeDirLang()
simplexml_import_dom(): Invalid Nodetype to importWarningWebTestBase.php1040Drupal\simpletest\WebTestBase->parse()
Parsed page successfully.BrowserLocaleContentTest.php154Drupal\locale\Tests\LocaleContentTest->testContentTypeDirLang()
simplexml_import_dom(): Invalid Nodetype to importWarningWebTestBase.php1040Drupal\simpletest\WebTestBase->parse()
Parsed page successfully.BrowserLocaleContentTest.php161Drupal\locale\Tests\LocaleContentTest->testContentTypeDirLang()
Article content type has been updated.OtherLocaleContentTest.php162Drupal\locale\Tests\LocaleContentTest->testContentTypeDirLang()
Trying to get property of non-objectNoticelocale.module658locale_preprocess_node()
Trying to get property of non-objectNoticelocale.module663locale_preprocess_node()
Trying to get property of non-objectNoticelocale.module658locale_preprocess_node()
Trying to get property of non-objectNoticelocale.module663locale_preprocess_node()
The lang and dir tags have been assigned correctly to the Arabic node.OtherLocaleContentTest.php185Drupal\locale\Tests\LocaleContentTest->testContentTypeDirLang()
ExpandDrupal\locale\Tests\LocaleExportTest38212
MessageGroupFilenameLineFunctionStatus
simplexml_import_dom(): Invalid Nodetype to importWarningWebTestBase.php1040Drupal\simpletest\WebTestBase->parse()
Parsed page successfully.BrowserLocaleExportTest.php59Drupal\locale\Tests\LocaleExportTest->testExportTranslation()
Failed to set field langcode to frOtherLocaleExportTest.php65Drupal\locale\Tests\LocaleExportTest->testExportTranslation()
Found the requested form fields at admin/config/regional/translate/exportOtherLocaleExportTest.php65Drupal\locale\Tests\LocaleExportTest->testExportTranslation()
Exported French translation file.OtherLocaleExportTest.php68Drupal\locale\Tests\LocaleExportTest->testExportTranslation()
French translations present in exported file.OtherLocaleExportTest.php70Drupal\locale\Tests\LocaleExportTest->testExportTranslation()
simplexml_import_dom(): Invalid Nodetype to importWarningWebTestBase.php1040Drupal\simpletest\WebTestBase->parse()
Parsed page successfully.BrowserLocaleExportTest.php79Drupal\locale\Tests\LocaleExportTest->testExportTranslation()
Failed to set field langcode to frOtherLocaleExportTest.php92Drupal\locale\Tests\LocaleExportTest->testExportTranslation()
Failed to set field content_options[not_customized] to OtherLocaleExportTest.php92Drupal\locale\Tests\LocaleExportTest->testExportTranslation()
Failed to set field content_options[customized] to 1OtherLocaleExportTest.php92Drupal\locale\Tests\LocaleExportTest->testExportTranslation()
Failed to set field content_options[not_translated] to OtherLocaleExportTest.php92Drupal\locale\Tests\LocaleExportTest->testExportTranslation()
Found the requested form fields at admin/config/regional/translate/exportOtherLocaleExportTest.php92Drupal\locale\Tests\LocaleExportTest->testExportTranslation()
Exported French translation file with only customized strings.OtherLocaleExportTest.php95Drupal\locale\Tests\LocaleExportTest->testExportTranslation()
French custom translation present in exported file.OtherLocaleExportTest.php97Drupal\locale\Tests\LocaleExportTest->testExportTranslation()
Failed to set field langcode to frOtherLocaleExportTest.php107Drupal\locale\Tests\LocaleExportTest->testExportTranslation()
Failed to set field content_options[not_customized] to OtherLocaleExportTest.php107Drupal\locale\Tests\LocaleExportTest->testExportTranslation()
Failed to set field content_options[customized] to OtherLocaleExportTest.php107Drupal\locale\Tests\LocaleExportTest->testExportTranslation()
Failed to set field content_options[not_translated] to 1OtherLocaleExportTest.php107Drupal\locale\Tests\LocaleExportTest->testExportTranslation()
Found the requested form fields at admin/config/regional/translate/exportOtherLocaleExportTest.php107Drupal\locale\Tests\LocaleExportTest->testExportTranslation()
Exported French translation file with only untranslated strings.OtherLocaleExportTest.php110Drupal\locale\Tests\LocaleExportTest->testExportTranslation()
Untranslated string present in exported file.OtherLocaleExportTest.php114Drupal\locale\Tests\LocaleExportTest->testExportTranslation()
Exported translation template file.OtherLocaleExportTest.php128Drupal\locale\Tests\LocaleExportTest->testExportTranslationTemplateFile()
ExpandDrupal\locale\Tests\LocaleFileImportStatus61144
MessageGroupFilenameLineFunctionStatus
simplexml_import_dom(): Invalid Nodetype to importWarningWebTestBase.php1040Drupal\simpletest\WebTestBase->parse()
Parsed page successfully.BrowserLocaleFileImportStatus.php51Drupal\locale\Tests\LocaleFileImportStatus->addLanguage()
Language de added.OtherLocaleFileImportStatus.php53Drupal\locale\Tests\LocaleFileImportStatus->addLanguage()
Value 'Montag' is equal to value ''.OtherLocaleFileImportStatus.php67Drupal\locale\Tests\LocaleFileImportStatus->checkTranslations()
Value 'Dienstag' is equal to value ''.OtherLocaleFileImportStatus.php67Drupal\locale\Tests\LocaleFileImportStatus->checkTranslations()
simplexml_import_dom(): Invalid Nodetype to importWarningWebTestBase.php1040Drupal\simpletest\WebTestBase->parse()
Parsed page successfully.BrowserLocaleFileImportStatus.php51Drupal\locale\Tests\LocaleFileImportStatus->addLanguage()
Language de added.OtherLocaleFileImportStatus.php53Drupal\locale\Tests\LocaleFileImportStatus->addLanguage()
Value 'Montag' is equal to value ''.OtherLocaleFileImportStatus.php67Drupal\locale\Tests\LocaleFileImportStatus->checkTranslations()
Value 'Dienstag' is equal to value ''.OtherLocaleFileImportStatus.php67Drupal\locale\Tests\LocaleFileImportStatus->checkTranslations()
Timestamp on locale_file updated.OtherLocaleFileImportStatus.php156Drupal\locale\Tests\LocaleFileImportStatus->testBulkImportUpdateExisting()
simplexml_import_dom(): Invalid Nodetype to importWarningWebTestBase.php1040Drupal\simpletest\WebTestBase->parse()
Parsed page successfully.BrowserLocaleFileImportStatus.php51Drupal\locale\Tests\LocaleFileImportStatus->addLanguage()
Language de added.OtherLocaleFileImportStatus.php53Drupal\locale\Tests\LocaleFileImportStatus->addLanguage()
simplexml_import_dom(): Invalid Nodetype to importWarningWebTestBase.php1040Drupal\simpletest\WebTestBase->parse()
Parsed page successfully.BrowserLocaleFileImportStatus.php51Drupal\locale\Tests\LocaleFileImportStatus->addLanguage()
Language de added.OtherLocaleFileImportStatus.php53Drupal\locale\Tests\LocaleFileImportStatus->addLanguage()
Translation file deleted after deleting languageOtherLocaleFileImportStatus.php200Drupal\locale\Tests\LocaleFileImportStatus->testDeleteLanguage()
ExpandDrupal\locale\Tests\LocaleImportFunctionalTest834924
MessageGroupFilenameLineFunctionStatus
simplexml_import_dom(): Invalid Nodetype to importWarningWebTestBase.php1040Drupal\simpletest\WebTestBase->parse()
Parsed page successfully.BrowserLocaleImportFunctionalTest.php305Drupal\locale\Tests\LocaleImportFunctionalTest->importPoFile()
The language has been automatically created.OtherLocaleImportFunctionalTest.php58Drupal\locale\Tests\LocaleImportFunctionalTest->testStandalonePoFile()
The translation file was successfully imported.OtherLocaleImportFunctionalTest.php61Drupal\locale\Tests\LocaleImportFunctionalTest->testStandalonePoFile()
Undefined index: frNoticeLocaleImportFunctionalTest.php65Drupal\locale\Tests\LocaleImportFunctionalTest->testStandalonePoFile()
Plural number initialized.OtherLocaleImportFunctionalTest.php65Drupal\locale\Tests\LocaleImportFunctionalTest->testStandalonePoFile()
Correct page redirection.OtherLocaleImportFunctionalTest.php68Drupal\locale\Tests\LocaleImportFunctionalTest->testStandalonePoFile()
simplexml_import_dom(): Invalid Nodetype to importWarningWebTestBase.php1040Drupal\simpletest\WebTestBase->parse()
Parsed page successfully.BrowserLocaleImportFunctionalTest.php305Drupal\locale\Tests\LocaleImportFunctionalTest->importPoFile()
The translation file was successfully imported.OtherLocaleImportFunctionalTest.php77Drupal\locale\Tests\LocaleImportFunctionalTest->testStandalonePoFile()
Unsafe strings were skipped.OtherLocaleImportFunctionalTest.php79Drupal\locale\Tests\LocaleImportFunctionalTest->testStandalonePoFile()
simplexml_import_dom(): Invalid Nodetype to importWarningWebTestBase.php1040Drupal\simpletest\WebTestBase->parse()
Parsed page successfully.BrowserLocaleImportFunctionalTest.php305Drupal\locale\Tests\LocaleImportFunctionalTest->importPoFile()
The empty translation file was successfully imported.OtherLocaleImportFunctionalTest.php87Drupal\locale\Tests\LocaleImportFunctionalTest->testStandalonePoFile()
simplexml_import_dom(): Invalid Nodetype to importWarningWebTestBase.php1040Drupal\simpletest\WebTestBase->parse()
Parsed page successfully.BrowserLocaleImportFunctionalTest.php94Drupal\locale\Tests\LocaleImportFunctionalTest->testStandalonePoFile()
File to import not found message.OtherLocaleImportFunctionalTest.php96Drupal\locale\Tests\LocaleImportFunctionalTest->testStandalonePoFile()
simplexml_import_dom(): Invalid Nodetype to importWarningWebTestBase.php1040Drupal\simpletest\WebTestBase->parse()
Parsed page successfully.BrowserLocaleImportFunctionalTest.php305Drupal\locale\Tests\LocaleImportFunctionalTest->importPoFile()
The translation file was successfully imported.OtherLocaleImportFunctionalTest.php106Drupal\locale\Tests\LocaleImportFunctionalTest->testStandalonePoFile()
simplexml_import_dom(): Invalid Nodetype to importWarningWebTestBase.php1040Drupal\simpletest\WebTestBase->parse()
Parsed page successfully.BrowserLocaleImportFunctionalTest.php113Drupal\locale\Tests\LocaleImportFunctionalTest->testStandalonePoFile()
String not overwritten by imported string.OtherLocaleImportFunctionalTest.php114Drupal\locale\Tests\LocaleImportFunctionalTest->testStandalonePoFile()
Undefined index: frNoticeLocaleImportFunctionalTest.php118Drupal\locale\Tests\LocaleImportFunctionalTest->testStandalonePoFile()
Plural numbers untouched.OtherLocaleImportFunctionalTest.php118Drupal\locale\Tests\LocaleImportFunctionalTest->testStandalonePoFile()
simplexml_import_dom(): Invalid Nodetype to importWarningWebTestBase.php1040Drupal\simpletest\WebTestBase->parse()
Parsed page successfully.BrowserLocaleImportFunctionalTest.php305Drupal\locale\Tests\LocaleImportFunctionalTest->importPoFile()
The translation file was successfully imported.OtherLocaleImportFunctionalTest.php128Drupal\locale\Tests\LocaleImportFunctionalTest->testStandalonePoFile()
simplexml_import_dom(): Invalid Nodetype to importWarningWebTestBase.php1040Drupal\simpletest\WebTestBase->parse()
Parsed page successfully.BrowserLocaleImportFunctionalTest.php135Drupal\locale\Tests\LocaleImportFunctionalTest->testStandalonePoFile()
Undefined index: frNoticeLocaleImportFunctionalTest.php139Drupal\locale\Tests\LocaleImportFunctionalTest->testStandalonePoFile()
Plural numbers changed.OtherLocaleImportFunctionalTest.php139Drupal\locale\Tests\LocaleImportFunctionalTest->testStandalonePoFile()
simplexml_import_dom(): Invalid Nodetype to importWarningWebTestBase.php1040Drupal\simpletest\WebTestBase->parse()
Parsed page successfully.BrowserLocaleImportFunctionalTest.php305Drupal\locale\Tests\LocaleImportFunctionalTest->importPoFile()
The customized translation file was successfully imported.OtherLocaleImportFunctionalTest.php148Drupal\locale\Tests\LocaleImportFunctionalTest->testStandalonePoFile()
Customized translations succesfully imported.OtherLocaleImportFunctionalTest.php153Drupal\locale\Tests\LocaleImportFunctionalTest->testStandalonePoFile()
simplexml_import_dom(): Invalid Nodetype to importWarningWebTestBase.php1040Drupal\simpletest\WebTestBase->parse()
Parsed page successfully.BrowserLocaleImportFunctionalTest.php305Drupal\locale\Tests\LocaleImportFunctionalTest->importPoFile()
The customized translation file was successfully imported.OtherLocaleImportFunctionalTest.php164Drupal\locale\Tests\LocaleImportFunctionalTest->testStandalonePoFile()
simplexml_import_dom(): Invalid Nodetype to importWarningWebTestBase.php1040Drupal\simpletest\WebTestBase->parse()
Parsed page successfully.BrowserLocaleImportFunctionalTest.php171Drupal\locale\Tests\LocaleImportFunctionalTest->testStandalonePoFile()
Customized string not overwritten by imported string.OtherLocaleImportFunctionalTest.php172Drupal\locale\Tests\LocaleImportFunctionalTest->testStandalonePoFile()
simplexml_import_dom(): Invalid Nodetype to importWarningWebTestBase.php1040Drupal\simpletest\WebTestBase->parse()
Parsed page successfully.BrowserLocaleImportFunctionalTest.php305Drupal\locale\Tests\LocaleImportFunctionalTest->importPoFile()
The customized translation file was successfully imported.OtherLocaleImportFunctionalTest.php183Drupal\locale\Tests\LocaleImportFunctionalTest->testStandalonePoFile()
simplexml_import_dom(): Invalid Nodetype to importWarningWebTestBase.php1040Drupal\simpletest\WebTestBase->parse()
Parsed page successfully.BrowserLocaleImportFunctionalTest.php190Drupal\locale\Tests\LocaleImportFunctionalTest->testStandalonePoFile()
simplexml_import_dom(): Invalid Nodetype to importWarningWebTestBase.php1040Drupal\simpletest\WebTestBase->parse()
Parsed page successfully.BrowserLocaleImportFunctionalTest.php211Drupal\locale\Tests\LocaleImportFunctionalTest->testAutomaticModuleTranslationImportLanguageEnable()
Language file automatically imported.OtherLocaleImportFunctionalTest.php215Drupal\locale\Tests\LocaleImportFunctionalTest->testAutomaticModuleTranslationImportLanguageEnable()
Language file automatically imported.OtherLocaleImportFunctionalTest.php216Drupal\locale\Tests\LocaleImportFunctionalTest->testAutomaticModuleTranslationImportLanguageEnable()
simplexml_import_dom(): Invalid Nodetype to importWarningWebTestBase.php1040Drupal\simpletest\WebTestBase->parse()
Parsed page successfully.BrowserLocaleImportFunctionalTest.php224Drupal\locale\Tests\LocaleImportFunctionalTest->testAutomaticModuleTranslationImportLanguageEnable()
simplexml_import_dom(): Invalid Nodetype to importWarningWebTestBase.php1040Drupal\simpletest\WebTestBase->parse()
Parsed page successfully.BrowserLocaleImportFunctionalTest.php233Drupal\locale\Tests\LocaleImportFunctionalTest->testAutomaticModuleTranslationImportLanguageEnable()
String successfully imported.OtherLocaleImportFunctionalTest.php234Drupal\locale\Tests\LocaleImportFunctionalTest->testAutomaticModuleTranslationImportLanguageEnable()
simplexml_import_dom(): Invalid Nodetype to importWarningWebTestBase.php1040Drupal\simpletest\WebTestBase->parse()
Parsed page successfully.BrowserLocaleImportFunctionalTest.php244Drupal\locale\Tests\LocaleImportFunctionalTest->testAutomaticModuleTranslationImportLanguageEnable()
String successfully imported.OtherLocaleImportFunctionalTest.php245Drupal\locale\Tests\LocaleImportFunctionalTest->testAutomaticModuleTranslationImportLanguageEnable()
simplexml_import_dom(): Invalid Nodetype to importWarningWebTestBase.php1040Drupal\simpletest\WebTestBase->parse()
Parsed page successfully.BrowserLocaleImportFunctionalTest.php305Drupal\locale\Tests\LocaleImportFunctionalTest->importPoFile()
Long month name context is working.OtherLocaleImportFunctionalTest.php258Drupal\locale\Tests\LocaleImportFunctionalTest->testLanguageContext()
Default context is working.OtherLocaleImportFunctionalTest.php259Drupal\locale\Tests\LocaleImportFunctionalTest->testLanguageContext()
simplexml_import_dom(): Invalid Nodetype to importWarningWebTestBase.php1040Drupal\simpletest\WebTestBase->parse()
Parsed page successfully.BrowserLocaleImportFunctionalTest.php305Drupal\locale\Tests\LocaleImportFunctionalTest->importPoFile()
The translation file was successfully imported.OtherLocaleImportFunctionalTest.php273Drupal\locale\Tests\LocaleImportFunctionalTest->testEmptyMsgstr()
String imported and translated.OtherLocaleImportFunctionalTest.php274Drupal\locale\Tests\LocaleImportFunctionalTest->testEmptyMsgstr()
simplexml_import_dom(): Invalid Nodetype to importWarningWebTestBase.php1040Drupal\simpletest\WebTestBase->parse()
Parsed page successfully.BrowserLocaleImportFunctionalTest.php305Drupal\locale\Tests\LocaleImportFunctionalTest->importPoFile()
The translation file was successfully imported.OtherLocaleImportFunctionalTest.php281Drupal\locale\Tests\LocaleImportFunctionalTest->testEmptyMsgstr()
simplexml_import_dom(): Invalid Nodetype to importWarningWebTestBase.php1040Drupal\simpletest\WebTestBase->parse()
Parsed page successfully.BrowserLocaleImportFunctionalTest.php289Drupal\locale\Tests\LocaleImportFunctionalTest->testEmptyMsgstr()
Search found the string as untranslated.OtherLocaleImportFunctionalTest.php290Drupal\locale\Tests\LocaleImportFunctionalTest->testEmptyMsgstr()
LeafDrupal\locale\Tests\LocaleInstallTest200
ExpandDrupal\locale\Tests\LocaleJavascriptTranslation110
MessageGroupFilenameLineFunctionStatus
The test did not complete due to a fatal error.Completion checkLocaleJavascriptTranslation.php32Drupal\locale\Tests\LocaleJavascriptTranslation->testFileParsing()
ExpandDrupal\locale\Tests\LocaleLibraryInfoAlterTest110
MessageGroupFilenameLineFunctionStatus
The test did not complete due to a fatal error.Completion checkLocaleLibraryInfoAlterTest.php38Drupal\locale\Tests\LocaleLibraryInfoAlterTest->testLibraryInfoAlter()
ExpandDrupal\locale\Tests\LocalePathTest3782
MessageGroupFilenameLineFunctionStatus
simplexml_import_dom(): Invalid Nodetype to importWarningWebTestBase.php1040Drupal\simpletest\WebTestBase->parse()
Parsed page successfully.BrowserLocalePathTest.php62Drupal\locale\Tests\LocalePathTest->testPathLanguageConfiguration()
simplexml_import_dom(): Invalid Nodetype to importWarningWebTestBase.php1040Drupal\simpletest\WebTestBase->parse()
Parsed page successfully.BrowserLocalePathTest.php66Drupal\locale\Tests\LocalePathTest->testPathLanguageConfiguration()
The "xx" front page is readibly available.OtherLocalePathTest.php71Drupal\locale\Tests\LocalePathTest->testPathLanguageConfiguration()
Failed to set field langcode to xxOtherLocalePathTest.php93Drupal\locale\Tests\LocalePathTest->testPathLanguageConfiguration()
Found the requested form fields at admin/config/search/path/addOtherLocalePathTest.php93Drupal\locale\Tests\LocalePathTest->testPathLanguageConfiguration()
Custom language alias works.OtherLocalePathTest.php101Drupal\locale\Tests\LocalePathTest->testPathLanguageConfiguration()
Custom language alias has priority.OtherLocalePathTest.php117Drupal\locale\Tests\LocalePathTest->testPathLanguageConfiguration()
Custom alias with prefix returns second node.OtherLocalePathTest.php154Drupal\locale\Tests\LocalePathTest->testPathLanguageConfiguration()
ExpandDrupal\locale\Tests\LocalePluralFormatTest725713
MessageGroupFilenameLineFunctionStatus
simplexml_import_dom(): Invalid Nodetype to importWarningWebTestBase.php1040Drupal\simpletest\WebTestBase->parse()
Parsed page successfully.BrowserLocalePluralFormatTest.php272Drupal\locale\Tests\LocalePluralFormatTest->importPoFile()
simplexml_import_dom(): Invalid Nodetype to importWarningWebTestBase.php1040Drupal\simpletest\WebTestBase->parse()
Parsed page successfully.BrowserLocalePluralFormatTest.php272Drupal\locale\Tests\LocalePluralFormatTest->importPoFile()
simplexml_import_dom(): Invalid Nodetype to importWarningWebTestBase.php1040Drupal\simpletest\WebTestBase->parse()
Parsed page successfully.BrowserLocalePluralFormatTest.php272Drupal\locale\Tests\LocalePluralFormatTest->importPoFile()
simplexml_import_dom(): Invalid Nodetype to importWarningWebTestBase.php1040Drupal\simpletest\WebTestBase->parse()
Parsed page successfully.BrowserLocalePluralFormatTest.php272Drupal\locale\Tests\LocalePluralFormatTest->importPoFile()
Computed plural index for fr for count 1 is 0OtherLocalePluralFormatTest.php124Drupal\locale\Tests\LocalePluralFormatTest->testGetPluralFormat()
Plural translation of 1 hours / @count hours for count 1 in fr is 1 heureOtherLocalePluralFormatTest.php129Drupal\locale\Tests\LocalePluralFormatTest->testGetPluralFormat()
Computed plural index for fr for count 0 is 0OtherLocalePluralFormatTest.php124Drupal\locale\Tests\LocalePluralFormatTest->testGetPluralFormat()
Plural translation of 1 hours / @count hours for count 0 in fr is 1 heureOtherLocalePluralFormatTest.php129Drupal\locale\Tests\LocalePluralFormatTest->testGetPluralFormat()
Computed plural index for fr for count 5 is 1OtherLocalePluralFormatTest.php124Drupal\locale\Tests\LocalePluralFormatTest->testGetPluralFormat()
Plural translation of 1 hours / @count hours for count 5 in fr is 5 heuresOtherLocalePluralFormatTest.php129Drupal\locale\Tests\LocalePluralFormatTest->testGetPluralFormat()
Computed plural index for hr for count 1 is 0OtherLocalePluralFormatTest.php124Drupal\locale\Tests\LocalePluralFormatTest->testGetPluralFormat()
Plural translation of 1 hours / @count hours for count 1 in hr is 1 satOtherLocalePluralFormatTest.php129Drupal\locale\Tests\LocalePluralFormatTest->testGetPluralFormat()
Computed plural index for hr for count 21 is 0OtherLocalePluralFormatTest.php124Drupal\locale\Tests\LocalePluralFormatTest->testGetPluralFormat()
Plural translation of 1 hours / @count hours for count 21 in hr is 21 satOtherLocalePluralFormatTest.php129Drupal\locale\Tests\LocalePluralFormatTest->testGetPluralFormat()
Computed plural index for hr for count 0 is 2OtherLocalePluralFormatTest.php124Drupal\locale\Tests\LocalePluralFormatTest->testGetPluralFormat()
Plural translation of 1 hours / @count hours for count 0 in hr is 0 satiOtherLocalePluralFormatTest.php129Drupal\locale\Tests\LocalePluralFormatTest->testGetPluralFormat()
Computed plural index for hr for count 2 is 1OtherLocalePluralFormatTest.php124Drupal\locale\Tests\LocalePluralFormatTest->testGetPluralFormat()
Plural translation of 1 hours / @count hours for count 2 in hr is 2 sataOtherLocalePluralFormatTest.php129Drupal\locale\Tests\LocalePluralFormatTest->testGetPluralFormat()
Computed plural index for hr for count 8 is 2OtherLocalePluralFormatTest.php124Drupal\locale\Tests\LocalePluralFormatTest->testGetPluralFormat()
Plural translation of 1 hours / @count hours for count 8 in hr is 8 satiOtherLocalePluralFormatTest.php129Drupal\locale\Tests\LocalePluralFormatTest->testGetPluralFormat()
simplexml_import_dom(): Invalid Nodetype to importWarningWebTestBase.php1040Drupal\simpletest\WebTestBase->parse()
Parsed page successfully.BrowserLocalePluralFormatTest.php272Drupal\locale\Tests\LocalePluralFormatTest->importPoFile()
simplexml_import_dom(): Invalid Nodetype to importWarningWebTestBase.php1040Drupal\simpletest\WebTestBase->parse()
Parsed page successfully.BrowserLocalePluralFormatTest.php272Drupal\locale\Tests\LocalePluralFormatTest->importPoFile()
Failed to set field langcode to frOtherLocalePluralFormatTest.php150Drupal\locale\Tests\LocalePluralFormatTest->testPluralEditExport()
Found the requested form fields at admin/config/regional/translate/exportOtherLocalePluralFormatTest.php150Drupal\locale\Tests\LocalePluralFormatTest->testPluralEditExport()
Exported French translation file.OtherLocalePluralFormatTest.php152Drupal\locale\Tests\LocalePluralFormatTest->testPluralEditExport()
French translations present in exported file.OtherLocalePluralFormatTest.php154Drupal\locale\Tests\LocalePluralFormatTest->testPluralEditExport()
Plural translations exported properly.OtherLocalePluralFormatTest.php156Drupal\locale\Tests\LocalePluralFormatTest->testPluralEditExport()
Failed to set field langcode to hrOtherLocalePluralFormatTest.php161Drupal\locale\Tests\LocalePluralFormatTest->testPluralEditExport()
Found the requested form fields at admin/config/regional/translate/exportOtherLocalePluralFormatTest.php161Drupal\locale\Tests\LocalePluralFormatTest->testPluralEditExport()
Exported Croatian translation file.OtherLocalePluralFormatTest.php163Drupal\locale\Tests\LocalePluralFormatTest->testPluralEditExport()
Croatian translations present in exported file.OtherLocalePluralFormatTest.php165Drupal\locale\Tests\LocalePluralFormatTest->testPluralEditExport()
Plural translations exported properly.OtherLocalePluralFormatTest.php167Drupal\locale\Tests\LocalePluralFormatTest->testPluralEditExport()
"1 hour" foundOtherLocalePluralFormatTest.php171Drupal\locale\Tests\LocalePluralFormatTest->testPluralEditExport()
"@count hours" foundOtherLocalePluralFormatTest.php172Drupal\locale\Tests\LocalePluralFormatTest->testPluralEditExport()
"Singular form" foundOtherLocalePluralFormatTest.php178Drupal\locale\Tests\LocalePluralFormatTest->testPluralEditExport()
"First plural form" foundOtherLocalePluralFormatTest.php179Drupal\locale\Tests\LocalePluralFormatTest->testPluralEditExport()
"2. plural form" foundOtherLocalePluralFormatTest.php180Drupal\locale\Tests\LocalePluralFormatTest->testPluralEditExport()
"@count sat" foundOtherLocalePluralFormatTest.php184Drupal\locale\Tests\LocalePluralFormatTest->testPluralEditExport()
"@count sata" foundOtherLocalePluralFormatTest.php185Drupal\locale\Tests\LocalePluralFormatTest->testPluralEditExport()
"@count sati" foundOtherLocalePluralFormatTest.php186Drupal\locale\Tests\LocalePluralFormatTest->testPluralEditExport()
simplexml_import_dom(): Invalid Nodetype to importWarningWebTestBase.php1040Drupal\simpletest\WebTestBase->parse()
Parsed page successfully.BrowserLocalePluralFormatTest.php192Drupal\locale\Tests\LocalePluralFormatTest->testPluralEditExport()
simplexml_import_dom(): Invalid Nodetype to importWarningWebTestBase.php1040Drupal\simpletest\WebTestBase->parse()
Parsed page successfully.BrowserLocalePluralFormatTest.php197Drupal\locale\Tests\LocalePluralFormatTest->testPluralEditExport()
"1 heure" foundOtherLocalePluralFormatTest.php199Drupal\locale\Tests\LocalePluralFormatTest->testPluralEditExport()
"@count heures" foundOtherLocalePluralFormatTest.php200Drupal\locale\Tests\LocalePluralFormatTest->testPluralEditExport()
simplexml_import_dom(): Invalid Nodetype to importWarningWebTestBase.php1040Drupal\simpletest\WebTestBase->parse()
Parsed page successfully.BrowserLocalePluralFormatTest.php207Drupal\locale\Tests\LocalePluralFormatTest->testPluralEditExport()
simplexml_import_dom(): Invalid Nodetype to importWarningWebTestBase.php1040Drupal\simpletest\WebTestBase->parse()
Parsed page successfully.BrowserLocalePluralFormatTest.php220Drupal\locale\Tests\LocalePluralFormatTest->testPluralEditExport()
simplexml_import_dom(): Invalid Nodetype to importWarningWebTestBase.php1040Drupal\simpletest\WebTestBase->parse()
Parsed page successfully.BrowserLocalePluralFormatTest.php227Drupal\locale\Tests\LocalePluralFormatTest->testPluralEditExport()
simplexml_import_dom(): Invalid Nodetype to importWarningWebTestBase.php1040Drupal\simpletest\WebTestBase->parse()
Parsed page successfully.BrowserLocalePluralFormatTest.php234Drupal\locale\Tests\LocalePluralFormatTest->testPluralEditExport()
simplexml_import_dom(): Invalid Nodetype to importWarningWebTestBase.php1040Drupal\simpletest\WebTestBase->parse()
Parsed page successfully.BrowserLocalePluralFormatTest.php241Drupal\locale\Tests\LocalePluralFormatTest->testPluralEditExport()
Failed to set field langcode to frOtherLocalePluralFormatTest.php246Drupal\locale\Tests\LocalePluralFormatTest->testPluralEditExport()
Found the requested form fields at admin/config/regional/translate/exportOtherLocalePluralFormatTest.php246Drupal\locale\Tests\LocalePluralFormatTest->testPluralEditExport()
Edited French plural translations for hours exported properly.OtherLocalePluralFormatTest.php248Drupal\locale\Tests\LocalePluralFormatTest->testPluralEditExport()
Added French plural translations for days exported properly.OtherLocalePluralFormatTest.php249Drupal\locale\Tests\LocalePluralFormatTest->testPluralEditExport()
Failed to set field langcode to hrOtherLocalePluralFormatTest.php254Drupal\locale\Tests\LocalePluralFormatTest->testPluralEditExport()
Found the requested form fields at admin/config/regional/translate/exportOtherLocalePluralFormatTest.php254Drupal\locale\Tests\LocalePluralFormatTest->testPluralEditExport()
Edited Croatian plural translations exported properly.OtherLocalePluralFormatTest.php256Drupal\locale\Tests\LocalePluralFormatTest->testPluralEditExport()
Added Croatian plural translations exported properly.OtherLocalePluralFormatTest.php257Drupal\locale\Tests\LocalePluralFormatTest->testPluralEditExport()
ExpandDrupal\locale\Tests\LocaleStringTest15110
MessageGroupFilenameLineFunctionStatus
Successfully loaded translation by string identifier.OtherLocaleStringTest.php84Drupal\locale\Tests\LocaleStringTest->testStringCRUDAPI()
Successfully loaded translation by source and context.OtherLocaleStringTest.php86Drupal\locale\Tests\LocaleStringTest->testStringCRUDAPI()
Successfully deleted translation string.OtherLocaleStringTest.php96Drupal\locale\Tests\LocaleStringTest->testStringCRUDAPI()
Created and retrieved all translations for our source string.OtherLocaleStringTest.php102Drupal\locale\Tests\LocaleStringTest->testStringCRUDAPI()
Translation found with only the right fields.OtherLocaleStringTest.php139Drupal\locale\Tests\LocaleStringTest->testStringSearchAPI()
Found the right translation.OtherLocaleStringTest.php140Drupal\locale\Tests\LocaleStringTest->testStringSearchAPI()
Missing translation found with only the right fields.OtherLocaleStringTest.php143Drupal\locale\Tests\LocaleStringTest->testStringSearchAPI()
Created and retrieved all translations for source strings.OtherLocaleStringTest.php149Drupal\locale\Tests\LocaleStringTest->testStringSearchAPI()
Retrieved all customized translations for source strings.OtherLocaleStringTest.php153Drupal\locale\Tests\LocaleStringTest->testStringSearchAPI()
Found only Spanish and customized translations.OtherLocaleStringTest.php157Drupal\locale\Tests\LocaleStringTest->testStringSearchAPI()
Found 1 source string without translations.OtherLocaleStringTest.php161Drupal\locale\Tests\LocaleStringTest->testStringSearchAPI()
ExpandDrupal\locale\Tests\LocaleTranslationTest2097162
MessageGroupFilenameLineFunctionStatus
simplexml_import_dom(): Invalid Nodetype to importWarningWebTestBase.php1040Drupal\simpletest\WebTestBase->parse()
Parsed page successfully.BrowserLocaleTranslationTest.php61Drupal\locale\Tests\LocaleTranslationTest->testStringTranslation()
Language code found.OtherLocaleTranslationTest.php66Drupal\locale\Tests\LocaleTranslationTest->testStringTranslation()
Test language added.OtherLocaleTranslationTest.php67Drupal\locale\Tests\LocaleTranslationTest->testStringTranslation()
simplexml_import_dom(): Invalid Nodetype to importWarningWebTestBase.php1040Drupal\simpletest\WebTestBase->parse()
Parsed page successfully.BrowserLocaleTranslationTest.php77Drupal\locale\Tests\LocaleTranslationTest->testStringTranslation()
Search found the string as untranslated.OtherLocaleTranslationTest.php78Drupal\locale\Tests\LocaleTranslationTest->testStringTranslation()
simplexml_import_dom(): Invalid Nodetype to importWarningWebTestBase.php1040Drupal\simpletest\WebTestBase->parse()
Parsed page successfully.BrowserLocaleTranslationTest.php82Drupal\locale\Tests\LocaleTranslationTest->testStringTranslation()
current() expects parameter 1 to be array, boolean givenWarningLocaleTranslationTest.php82Drupal\locale\Tests\LocaleTranslationTest->testStringTranslation()
name found on edit screen.OtherLocaleTranslationTest.php88Drupal\locale\Tests\LocaleTranslationTest->testStringTranslation()
simplexml_import_dom(): Invalid Nodetype to importWarningWebTestBase.php1040Drupal\simpletest\WebTestBase->parse()
Parsed page successfully.BrowserLocaleTranslationTest.php95Drupal\locale\Tests\LocaleTranslationTest->testStringTranslation()
Search found the string as untranslated.OtherLocaleTranslationTest.php96Drupal\locale\Tests\LocaleTranslationTest->testStringTranslation()
simplexml_import_dom(): Invalid Nodetype to importWarningWebTestBase.php1040Drupal\simpletest\WebTestBase->parse()
Parsed page successfully.BrowserLocaleTranslationTest.php99Drupal\locale\Tests\LocaleTranslationTest->testStringTranslation()
current() expects parameter 1 to be array, boolean givenWarningLocaleTranslationTest.php99Drupal\locale\Tests\LocaleTranslationTest->testStringTranslation()
simplexml_import_dom(): Invalid Nodetype to importWarningWebTestBase.php1040Drupal\simpletest\WebTestBase->parse()
Parsed page successfully.BrowserLocaleTranslationTest.php104Drupal\locale\Tests\LocaleTranslationTest->testStringTranslation()
The strings have been saved.OtherLocaleTranslationTest.php105Drupal\locale\Tests\LocaleTranslationTest->testStringTranslation()
simplexml_import_dom(): Invalid Nodetype to importWarningWebTestBase.php1040Drupal\simpletest\WebTestBase->parse()
Parsed page successfully.BrowserLocaleTranslationTest.php112Drupal\locale\Tests\LocaleTranslationTest->testStringTranslation()
Non-English translation properly saved.OtherLocaleTranslationTest.php113Drupal\locale\Tests\LocaleTranslationTest->testStringTranslation()
simplexml_import_dom(): Invalid Nodetype to importWarningWebTestBase.php1040Drupal\simpletest\WebTestBase->parse()
Parsed page successfully.BrowserLocaleTranslationTest.php121Drupal\locale\Tests\LocaleTranslationTest->testStringTranslation()
simplexml_import_dom(): Invalid Nodetype to importWarningWebTestBase.php1040Drupal\simpletest\WebTestBase->parse()
Parsed page successfully.BrowserLocaleTranslationTest.php122Drupal\locale\Tests\LocaleTranslationTest->testStringTranslation()
current() expects parameter 1 to be array, boolean givenWarningLocaleTranslationTest.php122Drupal\locale\Tests\LocaleTranslationTest->testStringTranslation()
simplexml_import_dom(): Invalid Nodetype to importWarningWebTestBase.php1040Drupal\simpletest\WebTestBase->parse()
Parsed page successfully.BrowserLocaleTranslationTest.php127Drupal\locale\Tests\LocaleTranslationTest->testStringTranslation()
simplexml_import_dom(): Invalid Nodetype to importWarningWebTestBase.php1040Drupal\simpletest\WebTestBase->parse()
Parsed page successfully.BrowserLocaleTranslationTest.php133Drupal\locale\Tests\LocaleTranslationTest->testStringTranslation()
English translation properly saved.OtherLocaleTranslationTest.php134Drupal\locale\Tests\LocaleTranslationTest->testStringTranslation()
t() works for non-English.OtherLocaleTranslationTest.php136Drupal\locale\Tests\LocaleTranslationTest->testStringTranslation()
t() works for English.OtherLocaleTranslationTest.php142Drupal\locale\Tests\LocaleTranslationTest->testStringTranslation()
simplexml_import_dom(): Invalid Nodetype to importWarningWebTestBase.php1040Drupal\simpletest\WebTestBase->parse()
Parsed page successfully.BrowserLocaleTranslationTest.php150Drupal\locale\Tests\LocaleTranslationTest->testStringTranslation()
String is translated.OtherLocaleTranslationTest.php151Drupal\locale\Tests\LocaleTranslationTest->testStringTranslation()
Found the Delete buttonOtherLocaleTranslationTest.php159Drupal\locale\Tests\LocaleTranslationTest->testStringTranslation()
Found the requested form fields at admin/config/regional/language/delete/xxOtherLocaleTranslationTest.php159Drupal\locale\Tests\LocaleTranslationTest->testStringTranslation()
The test language has been removed.OtherLocaleTranslationTest.php162Drupal\locale\Tests\LocaleTranslationTest->testStringTranslation()
simplexml_import_dom(): Invalid Nodetype to importWarningWebTestBase.php1040Drupal\simpletest\WebTestBase->parse()
Parsed page successfully.BrowserLocaleTranslationTest.php176Drupal\locale\Tests\LocaleTranslationTest->testStringTranslation()
simplexml_import_dom(): Invalid Nodetype to importWarningWebTestBase.php1040Drupal\simpletest\WebTestBase->parse()
Parsed page successfully.BrowserLocaleTranslationTest.php178Drupal\locale\Tests\LocaleTranslationTest->testStringTranslation()
current() expects parameter 1 to be array, boolean givenWarningLocaleTranslationTest.php178Drupal\locale\Tests\LocaleTranslationTest->testStringTranslation()
simplexml_import_dom(): Invalid Nodetype to importWarningWebTestBase.php1040Drupal\simpletest\WebTestBase->parse()
Parsed page successfully.BrowserLocaleTranslationTest.php183Drupal\locale\Tests\LocaleTranslationTest->testStringTranslation()
The strings have been saved.OtherLocaleTranslationTest.php184Drupal\locale\Tests\LocaleTranslationTest->testStringTranslation()
simplexml_import_dom(): Invalid Nodetype to importWarningWebTestBase.php1040Drupal\simpletest\WebTestBase->parse()
Parsed page successfully.BrowserLocaleTranslationTest.php191Drupal\locale\Tests\LocaleTranslationTest->testStringTranslation()
simplexml_import_dom(): Invalid Nodetype to importWarningWebTestBase.php1040Drupal\simpletest\WebTestBase->parse()
Parsed page successfully.BrowserLocaleTranslationTest.php214Drupal\locale\Tests\LocaleTranslationTest->testJavaScriptTranslation()
simplexml_import_dom(): Invalid Nodetype to importWarningWebTestBase.php1040Drupal\simpletest\WebTestBase->parse()
Parsed page successfully.BrowserLocaleTranslationTest.php233Drupal\locale\Tests\LocaleTranslationTest->testJavaScriptTranslation()
simplexml_import_dom(): Invalid Nodetype to importWarningWebTestBase.php1040Drupal\simpletest\WebTestBase->parse()
Parsed page successfully.BrowserLocaleTranslationTest.php235Drupal\locale\Tests\LocaleTranslationTest->testJavaScriptTranslation()
current() expects parameter 1 to be array, boolean givenWarningLocaleTranslationTest.php235Drupal\locale\Tests\LocaleTranslationTest->testJavaScriptTranslation()
simplexml_import_dom(): Invalid Nodetype to importWarningWebTestBase.php1040Drupal\simpletest\WebTestBase->parse()
Parsed page successfully.BrowserLocaleTranslationTest.php240Drupal\locale\Tests\LocaleTranslationTest->testJavaScriptTranslation()
Undefined index: xxNoticelocale.module853_locale_rebuild_js()
Trying to get property of non-objectNoticelocale.module860_locale_rebuild_js()
Trying to get property of non-objectNoticelocale.module888_locale_rebuild_js()
Trying to get property of non-objectNoticelocale.module889_locale_rebuild_js()
Trying to get property of non-objectNoticelocale.module897_locale_rebuild_js()
Undefined index: xxNoticeLocaleTranslationTest.php246Drupal\locale\Tests\LocaleTranslationTest->testJavaScriptTranslation()
JavaScript file created: not foundOtherLocaleTranslationTest.php247Drupal\locale\Tests\LocaleTranslationTest->testJavaScriptTranslation()
Undefined index: xxNoticelocale.module853_locale_rebuild_js()
Trying to get property of non-objectNoticelocale.module860_locale_rebuild_js()
Trying to get property of non-objectNoticelocale.module888_locale_rebuild_js()
Trying to get property of non-objectNoticelocale.module889_locale_rebuild_js()
Trying to get property of non-objectNoticelocale.module897_locale_rebuild_js()
JavaScript file rebuilt: not foundOtherLocaleTranslationTest.php254Drupal\locale\Tests\LocaleTranslationTest->testJavaScriptTranslation()
simplexml_import_dom(): Invalid Nodetype to importWarningWebTestBase.php1040Drupal\simpletest\WebTestBase->parse()
Parsed page successfully.BrowserLocaleTranslationTest.php287Drupal\locale\Tests\LocaleTranslationTest->testStringValidation()
simplexml_import_dom(): Invalid Nodetype to importWarningWebTestBase.php1040Drupal\simpletest\WebTestBase->parse()
Parsed page successfully.BrowserLocaleTranslationTest.php296Drupal\locale\Tests\LocaleTranslationTest->testStringValidation()
simplexml_import_dom(): Invalid Nodetype to importWarningWebTestBase.php1040Drupal\simpletest\WebTestBase->parse()
Parsed page successfully.BrowserLocaleTranslationTest.php299Drupal\locale\Tests\LocaleTranslationTest->testStringValidation()
current() expects parameter 1 to be array, boolean givenWarningLocaleTranslationTest.php299Drupal\locale\Tests\LocaleTranslationTest->testStringValidation()
simplexml_import_dom(): Invalid Nodetype to importWarningWebTestBase.php1040Drupal\simpletest\WebTestBase->parse()
Parsed page successfully.BrowserLocaleTranslationTest.php305Drupal\locale\Tests\LocaleTranslationTest->testStringValidation()
simplexml_import_dom(): Invalid Nodetype to importWarningWebTestBase.php1040Drupal\simpletest\WebTestBase->parse()
Parsed page successfully.BrowserLocaleTranslationTest.php307Drupal\locale\Tests\LocaleTranslationTest->testStringValidation()
The string was rejected as unsafe.OtherLocaleTranslationTest.php308Drupal\locale\Tests\LocaleTranslationTest->testStringValidation()
simplexml_import_dom(): Invalid Nodetype to importWarningWebTestBase.php1040Drupal\simpletest\WebTestBase->parse()
Parsed page successfully.BrowserLocaleTranslationTest.php305Drupal\locale\Tests\LocaleTranslationTest->testStringValidation()
simplexml_import_dom(): Invalid Nodetype to importWarningWebTestBase.php1040Drupal\simpletest\WebTestBase->parse()
Parsed page successfully.BrowserLocaleTranslationTest.php307Drupal\locale\Tests\LocaleTranslationTest->testStringValidation()
The string was rejected as unsafe.OtherLocaleTranslationTest.php308Drupal\locale\Tests\LocaleTranslationTest->testStringValidation()
simplexml_import_dom(): Invalid Nodetype to importWarningWebTestBase.php1040Drupal\simpletest\WebTestBase->parse()
Parsed page successfully.BrowserLocaleTranslationTest.php305Drupal\locale\Tests\LocaleTranslationTest->testStringValidation()
simplexml_import_dom(): Invalid Nodetype to importWarningWebTestBase.php1040Drupal\simpletest\WebTestBase->parse()
Parsed page successfully.BrowserLocaleTranslationTest.php307Drupal\locale\Tests\LocaleTranslationTest->testStringValidation()
The string was rejected as unsafe.OtherLocaleTranslationTest.php308Drupal\locale\Tests\LocaleTranslationTest->testStringValidation()
simplexml_import_dom(): Invalid Nodetype to importWarningWebTestBase.php1040Drupal\simpletest\WebTestBase->parse()
Parsed page successfully.BrowserLocaleTranslationTest.php305Drupal\locale\Tests\LocaleTranslationTest->testStringValidation()
simplexml_import_dom(): Invalid Nodetype to importWarningWebTestBase.php1040Drupal\simpletest\WebTestBase->parse()
Parsed page successfully.BrowserLocaleTranslationTest.php307Drupal\locale\Tests\LocaleTranslationTest->testStringValidation()
The string was rejected as unsafe.OtherLocaleTranslationTest.php308Drupal\locale\Tests\LocaleTranslationTest->testStringValidation()
simplexml_import_dom(): Invalid Nodetype to importWarningWebTestBase.php1040Drupal\simpletest\WebTestBase->parse()
Parsed page successfully.BrowserLocaleTranslationTest.php342Drupal\locale\Tests\LocaleTranslationTest->testStringSearch()
simplexml_import_dom(): Invalid Nodetype to importWarningWebTestBase.php1040Drupal\simpletest\WebTestBase->parse()
Parsed page successfully.BrowserLocaleTranslationTest.php350Drupal\locale\Tests\LocaleTranslationTest->testStringSearch()
simplexml_import_dom(): Invalid Nodetype to importWarningWebTestBase.php1040Drupal\simpletest\WebTestBase->parse()
Parsed page successfully.BrowserLocaleTranslationTest.php365Drupal\locale\Tests\LocaleTranslationTest->testStringSearch()
Search found the string.OtherLocaleTranslationTest.php369Drupal\locale\Tests\LocaleTranslationTest->testStringSearch()
simplexml_import_dom(): Invalid Nodetype to importWarningWebTestBase.php1040Drupal\simpletest\WebTestBase->parse()
Parsed page successfully.BrowserLocaleTranslationTest.php378Drupal\locale\Tests\LocaleTranslationTest->testStringSearch()
Search didn't find the string.OtherLocaleTranslationTest.php379Drupal\locale\Tests\LocaleTranslationTest->testStringSearch()
simplexml_import_dom(): Invalid Nodetype to importWarningWebTestBase.php1040Drupal\simpletest\WebTestBase->parse()
Parsed page successfully.BrowserLocaleTranslationTest.php388Drupal\locale\Tests\LocaleTranslationTest->testStringSearch()
simplexml_import_dom(): Invalid Nodetype to importWarningWebTestBase.php1040Drupal\simpletest\WebTestBase->parse()
Parsed page successfully.BrowserLocaleTranslationTest.php394Drupal\locale\Tests\LocaleTranslationTest->testStringSearch()
current() expects parameter 1 to be array, boolean givenWarningLocaleTranslationTest.php394Drupal\locale\Tests\LocaleTranslationTest->testStringSearch()
simplexml_import_dom(): Invalid Nodetype to importWarningWebTestBase.php1040Drupal\simpletest\WebTestBase->parse()
Parsed page successfully.BrowserLocaleTranslationTest.php399Drupal\locale\Tests\LocaleTranslationTest->testStringSearch()
simplexml_import_dom(): Invalid Nodetype to importWarningWebTestBase.php1040Drupal\simpletest\WebTestBase->parse()
Parsed page successfully.BrowserLocaleTranslationTest.php408Drupal\locale\Tests\LocaleTranslationTest->testStringSearch()
simplexml_import_dom(): Invalid Nodetype to importWarningWebTestBase.php1040Drupal\simpletest\WebTestBase->parse()
Parsed page successfully.BrowserLocaleTranslationTest.php418Drupal\locale\Tests\LocaleTranslationTest->testStringSearch()
Search didn't find the source string.OtherLocaleTranslationTest.php419Drupal\locale\Tests\LocaleTranslationTest->testStringSearch()
simplexml_import_dom(): Invalid Nodetype to importWarningWebTestBase.php1040Drupal\simpletest\WebTestBase->parse()
Parsed page successfully.BrowserLocaleTranslationTest.php428Drupal\locale\Tests\LocaleTranslationTest->testStringSearch()
Search didn't find the translation.OtherLocaleTranslationTest.php429Drupal\locale\Tests\LocaleTranslationTest->testStringSearch()
simplexml_import_dom(): Invalid Nodetype to importWarningWebTestBase.php1040Drupal\simpletest\WebTestBase->parse()
Parsed page successfully.BrowserLocaleTranslationTest.php437Drupal\locale\Tests\LocaleTranslationTest->testStringSearch()
simplexml_import_dom(): Invalid Nodetype to importWarningWebTestBase.php1040Drupal\simpletest\WebTestBase->parse()
Parsed page successfully.BrowserLocaleTranslationTest.php446Drupal\locale\Tests\LocaleTranslationTest->testStringSearch()
Search didn't find the translation.OtherLocaleTranslationTest.php447Drupal\locale\Tests\LocaleTranslationTest->testStringSearch()
simplexml_import_dom(): Invalid Nodetype to importWarningWebTestBase.php1040Drupal\simpletest\WebTestBase->parse()
Parsed page successfully.BrowserLocaleTranslationTest.php456Drupal\locale\Tests\LocaleTranslationTest->testStringSearch()
Search didn't find the invalid string.OtherLocaleTranslationTest.php457Drupal\locale\Tests\LocaleTranslationTest->testStringSearch()
ExpandDrupal\locale\Tests\LocaleUninstallFrenchTest3033
MessageGroupFilenameLineFunctionStatus
simplexml_import_dom(): Invalid Nodetype to importWarningWebTestBase.php1040Drupal\simpletest\WebTestBase->parse()
Parsed page successfully.BrowserLocaleUninstallTest.php77Drupal\locale\Tests\LocaleUninstallTest->testUninstallProcess()
simplexml_import_dom(): Invalid Nodetype to importWarningWebTestBase.php1040Drupal\simpletest\WebTestBase->parse()
Parsed page successfully.BrowserLocaleUninstallTest.php79Drupal\locale\Tests\LocaleUninstallTest->testUninstallProcess()
Undefined index: frNoticeLocaleUninstallTest.php82Drupal\locale\Tests\LocaleUninstallTest->testUninstallProcess()
JavaScript file created: noneOtherLocaleUninstallTest.php83Drupal\locale\Tests\LocaleUninstallTest->testUninstallProcess()
ExpandDrupal\locale\Tests\LocaleUninstallTest3033
MessageGroupFilenameLineFunctionStatus
simplexml_import_dom(): Invalid Nodetype to importWarningWebTestBase.php1040Drupal\simpletest\WebTestBase->parse()
Parsed page successfully.BrowserLocaleUninstallTest.php77Drupal\locale\Tests\LocaleUninstallTest->testUninstallProcess()
simplexml_import_dom(): Invalid Nodetype to importWarningWebTestBase.php1040Drupal\simpletest\WebTestBase->parse()
Parsed page successfully.BrowserLocaleUninstallTest.php79Drupal\locale\Tests\LocaleUninstallTest->testUninstallProcess()
Undefined index: frNoticeLocaleUninstallTest.php82Drupal\locale\Tests\LocaleUninstallTest->testUninstallProcess()
JavaScript file created: noneOtherLocaleUninstallTest.php83Drupal\locale\Tests\LocaleUninstallTest->testUninstallProcess()
LeafDrupal\menu\Tests\MenuNodeTest6100
LeafDrupal\menu\Tests\MenuTest316200
LeafDrupal\node\Tests\MultiStepNodeFormBasicOptionsTest1600
LeafDrupal\node\Tests\NodeAccessBaseTableTest15900
LeafDrupal\node\Tests\NodeAccessFieldTest5000
LeafDrupal\node\Tests\NodeAccessLanguageTest2500
LeafDrupal\node\Tests\NodeAccessPagerTest3000
LeafDrupal\node\Tests\NodeAccessRebuildTest1900
LeafDrupal\node\Tests\NodeAccessRecordsTest2600
LeafDrupal\node\Tests\NodeAccessTest3400
LeafDrupal\node\Tests\NodeAdminTest14500
LeafDrupal\node\Tests\NodeBlockFunctionalTest8400
LeafDrupal\node\Tests\NodeBlockTest2100
LeafDrupal\node\Tests\NodeBuildContentTest400
LeafDrupal\node\Tests\NodeCreationTest4700
LeafDrupal\node\Tests\NodeEntityFieldQueryAlterTest3200
LeafDrupal\node\Tests\NodeFeedTest100
LeafDrupal\node\Tests\NodeFieldMultilingualTestCase6400
LeafDrupal\node\Tests\NodeLoadHooksTest700
LeafDrupal\node\Tests\NodeLoadMultipleTest2700
LeafDrupal\node\Tests\NodePostSettingsTest4000
LeafDrupal\node\Tests\NodeQueryAlterTest9900
LeafDrupal\node\Tests\NodeRevisionPermissionsTest3300
LeafDrupal\node\Tests\NodeRevisionsTest6400
LeafDrupal\node\Tests\NodeRSSContentTest2100
LeafDrupal\node\Tests\NodeSaveTest4800
LeafDrupal\node\Tests\NodeTitleTest2300
LeafDrupal\node\Tests\NodeTitleXSSTest2300
LeafDrupal\node\Tests\NodeTokenReplaceTest3700
LeafDrupal\node\Tests\NodeTypeInitialLanguageTest8000
LeafDrupal\node\Tests\NodeTypePersistenceTest6500
LeafDrupal\node\Tests\NodeTypeTest13600
LeafDrupal\node\Tests\PageEditTest9700
LeafDrupal\node\Tests\PagePreviewTest4100
LeafDrupal\node\Tests\PageViewTest3400
LeafDrupal\node\Tests\SummaryLengthTest1800
LeafDrupal\number\Tests\NumberFieldTest8700
LeafDrupal\openid\Tests\OpenIDFunctionalTest32200
LeafDrupal\openid\Tests\OpenIDRegistrationTest15300
LeafDrupal\openid\Tests\OpenIDTest4500
LeafDrupal\options\Tests\OptionsDynamicValuesValidationTest900
LeafDrupal\options\Tests\OptionsFieldTest1600
LeafDrupal\options\Tests\OptionsFieldUITest20700
LeafDrupal\options\Tests\OptionsSelectDynamicValuesTest1600
LeafDrupal\options\Tests\OptionsWidgetsTest26100
LeafDrupal\path\Tests\PathAliasTest15900
LeafDrupal\path\Tests\PathLanguageTest23124
ExpandDrupal\path\Tests\PathLanguageUiTest78168
MessageGroupFilenameLineFunctionStatus
simplexml_import_dom(): Invalid Nodetype to importWarningWebTestBase.php1040Drupal\simpletest\WebTestBase->parse()
Parsed page successfully.BrowserPathLanguageUiTest.php41Drupal\path\Tests\PathLanguageUiTest->setUp()
simplexml_import_dom(): Invalid Nodetype to importWarningWebTestBase.php1040Drupal\simpletest\WebTestBase->parse()
Parsed page successfully.BrowserPathLanguageUiTest.php45Drupal\path\Tests\PathLanguageUiTest->setUp()
Failed to set field langcode to frOtherPathLanguageUiTest.php86Drupal\path\Tests\PathLanguageUiTest->testNonDefaultUrl()
Found the requested form fields at admin/config/search/path/addOtherPathLanguageUiTest.php86Drupal\path\Tests\PathLanguageUiTest->testNonDefaultUrl()
Foreign URL alias worksOtherPathLanguageUiTest.php89Drupal\path\Tests\PathLanguageUiTest->testNonDefaultUrl()
LeafDrupal\path\Tests\PathTaxonomyTermTest3700
LeafDrupal\php\Tests\PhpAccessTest4300
LeafDrupal\php\Tests\PhpFilterTest4200
LeafDrupal\poll\Tests\PollBlockTest17200
LeafDrupal\poll\Tests\PollCreateTest26900
LeafDrupal\poll\Tests\PollDeleteChoiceTest5400
LeafDrupal\poll\Tests\PollExpirationTest5200
LeafDrupal\poll\Tests\PollJsAddChoiceTest1600
LeafDrupal\poll\Tests\PollTokenReplaceTest12500
LeafDrupal\poll\Tests\PollTranslateTest7300
LeafDrupal\poll\Tests\PollVoteCheckHostnameTest14000
LeafDrupal\poll\Tests\PollVoteTest14600
LeafDrupal\rdf\Tests\CommentAttributesTest20300
LeafDrupal\rdf\Tests\CrudTest1000
LeafDrupal\rdf\Tests\GetNamespacesTest700
LeafDrupal\rdf\Tests\GetRdfNamespacesTest500
LeafDrupal\rdf\Tests\MappingDefinitionTest5900
LeafDrupal\rdf\Tests\MappingHookTest600
LeafDrupal\rdf\Tests\RdfaMarkupTest2900
LeafDrupal\rdf\Tests\TrackerAttributesTest3300
LeafDrupal\search\Tests\SearchAdvancedSearchFormTest3400
LeafDrupal\search\Tests\SearchBlockTest6400
LeafDrupal\search\Tests\SearchCommentCountToggleTest3100
LeafDrupal\search\Tests\SearchCommentTest19300
LeafDrupal\search\Tests\SearchConfigSettingsFormTest13200
LeafDrupal\search\Tests\SearchEmbedFormTest3200
LeafDrupal\search\Tests\SearchExactTest2500
LeafDrupal\search\Tests\SearchExcerptTest1800
LeafDrupal\search\Tests\SearchExpressionInsertExtractTest2400
LeafDrupal\search\Tests\SearchKeywordsConditionsTest2800
LeafDrupal\search\Tests\SearchLanguageTest4100
LeafDrupal\search\Tests\SearchMatchTest14700
LeafDrupal\search\Tests\SearchMultilingualEntityTest1000
LeafDrupal\search\Tests\SearchNodeAccessTest1600
LeafDrupal\search\Tests\SearchNumberMatchingTest29500
LeafDrupal\search\Tests\SearchNumbersTest17500
LeafDrupal\search\Tests\SearchPageOverrideTest1500
LeafDrupal\search\Tests\SearchPageTextTest3700
LeafDrupal\search\Tests\SearchPreprocessLangcodeTest3900
LeafDrupal\search\Tests\SearchRankingTest5900
LeafDrupal\search\Tests\SearchSimplifyTest65700
LeafDrupal\search\Tests\SearchTokenizerTest800
LeafDrupal\shortcut\Tests\ShortcutLinksTest14800
LeafDrupal\shortcut\Tests\ShortcutSetsTest21600
LeafDrupal\simpletest\Tests\BrokenSetUpTest2100
LeafDrupal\simpletest\Tests\BrowserTest1600
LeafDrupal\simpletest\Tests\FolderTest200
LeafDrupal\simpletest\Tests\InstallationProfileModuleTestsTest1900
LeafDrupal\simpletest\Tests\MailCaptureTest1300
LeafDrupal\simpletest\Tests\MissingCheckedRequirementsTest1900
LeafDrupal\simpletest\Tests\OtherInstallationProfileModuleTestsTest1200
LeafDrupal\simpletest\Tests\SimpleTestTest11400
LeafDrupal\statistics\Tests\StatisticsAdminTest11100
LeafDrupal\statistics\Tests\StatisticsBlockVisitorsTest4600
LeafDrupal\statistics\Tests\StatisticsLoggingTest3500
LeafDrupal\statistics\Tests\StatisticsReportsTest9200
LeafDrupal\statistics\Tests\StatisticsTokenReplaceTest3000
LeafDrupal\syslog\Tests\SyslogTest1700
LeafDrupal\system\Tests\Ajax\CommandsTest7300
LeafDrupal\system\Tests\Ajax\ElementValidationTest700
LeafDrupal\system\Tests\Ajax\FormValuesTest2900
LeafDrupal\system\Tests\Ajax\FrameworkTest3400
LeafDrupal\system\Tests\Ajax\MultiFormTest3600
LeafDrupal\system\Tests\Batch\PageTest1600
LeafDrupal\system\Tests\Batch\PercentagesUnitTest1800
LeafDrupal\system\Tests\Batch\ProcessingTest16100
LeafDrupal\system\Tests\Bootstrap\GetFilenameUnitTest500
LeafDrupal\system\Tests\Bootstrap\HookBootExitTest1900
LeafDrupal\system\Tests\Bootstrap\IpAddressTest1100
LeafDrupal\system\Tests\Bootstrap\MiscUnitTest500
LeafDrupal\system\Tests\Bootstrap\OverrideServerVariablesUnitTest600
LeafDrupal\system\Tests\Bootstrap\PageCacheTest7900
LeafDrupal\system\Tests\Bootstrap\ResettableStaticUnitTest500
LeafDrupal\system\Tests\Bootstrap\TimerUnitTest500
LeafDrupal\system\Tests\Bootstrap\VariableTest900
LeafDrupal\system\Tests\Bundle\BundleTest500
LeafDrupal\system\Tests\Cache\ClearTest900
LeafDrupal\system\Tests\Cache\DatabaseBackendUnitTest9700
LeafDrupal\system\Tests\Cache\InstallTest1900
LeafDrupal\system\Tests\Cache\MemoryBackendUnitTest9700
LeafDrupal\system\Tests\Cache\NullBackendTest200
LeafDrupal\system\Tests\Common\AddFeedTest700
LeafDrupal\system\Tests\Common\AlterTest700
LeafDrupal\system\Tests\Common\ArrayUnitTest1300
LeafDrupal\system\Tests\Common\AttributesUnitTest600
LeafDrupal\system\Tests\Common\AutocompleteTagsUnitTest800
LeafDrupal\system\Tests\Common\CascadingStylesheetsTest4100
LeafDrupal\system\Tests\Common\CascadingStylesheetsUnitTest1200
LeafDrupal\system\Tests\Common\ColorTest8500
LeafDrupal\system\Tests\Common\FormatDateTest7100
LeafDrupal\system\Tests\Common\GotoTest2100
LeafDrupal\system\Tests\Common\HtmlIdentifierUnitTest1000
LeafDrupal\system\Tests\Common\HttpRequestTest3500
LeafDrupal\system\Tests\Common\InstallerLanguageTest800
LeafDrupal\system\Tests\Common\JavaScriptTest9500
LeafDrupal\system\Tests\Common\JsonUnitTest2100
LeafDrupal\system\Tests\Common\ParseInfoFileUnitTest300
LeafDrupal\system\Tests\Common\RegionContentTest1800
LeafDrupal\system\Tests\Common\RenderTest5400
LeafDrupal\system\Tests\Common\SchemaTest58800
LeafDrupal\system\Tests\Common\SimpleTestErrorCollectorTest1600
LeafDrupal\system\Tests\Common\SizeUnitTest3500
LeafDrupal\system\Tests\Common\SystemListingTest600
LeafDrupal\system\Tests\Common\TableSortExtenderUnitTest600
LeafDrupal\system\Tests\Common\UrlTest5600
LeafDrupal\system\Tests\Common\ValidNumberStepUnitTest2400
LeafDrupal\system\Tests\Common\ValidUrlUnitTest7900
LeafDrupal\system\Tests\Common\WriteRecordTest3400
LeafDrupal\system\Tests\Common\XssUnitTest1700
LeafDrupal\system\Tests\Database\AlterTest6200
LeafDrupal\system\Tests\Database\BasicSyntaxTest3000
LeafDrupal\system\Tests\Database\CaseSensitivityTest800
LeafDrupal\system\Tests\Database\ConnectionTest3800
LeafDrupal\system\Tests\Database\DeleteTruncateTest2300
LeafDrupal\system\Tests\Database\EmptyStatementTest400
LeafDrupal\system\Tests\Database\FetchTest6600
LeafDrupal\system\Tests\Database\InsertDefaultsTest2200
LeafDrupal\system\Tests\Database\InsertLobTest1500
LeafDrupal\system\Tests\Database\InsertTest5100
LeafDrupal\system\Tests\Database\InvalidDataTest800
LeafDrupal\system\Tests\Database\LoggingTest4400
LeafDrupal\system\Tests\Database\MergeTest8300
LeafDrupal\system\Tests\Database\NextIdTest200
LeafDrupal\system\Tests\Database\QueryTest700
LeafDrupal\system\Tests\Database\RangeQueryTest300
LeafDrupal\system\Tests\Database\RegressionTest3100
LeafDrupal\system\Tests\Database\SelectComplexTest17800
LeafDrupal\system\Tests\Database\SelectOrderedTest2900
LeafDrupal\system\Tests\Database\SelectPagerDefaultTest4700
LeafDrupal\system\Tests\Database\SelectSubqueryTest4300
LeafDrupal\system\Tests\Database\SelectTableSortDefaultTest4500
LeafDrupal\system\Tests\Database\SelectTest18900
LeafDrupal\system\Tests\Database\SerializeQueryTest700
LeafDrupal\system\Tests\Database\TaggingTest3200
LeafDrupal\system\Tests\Database\TemporaryQueryTest600
LeafDrupal\system\Tests\Database\TransactionTest10500
LeafDrupal\system\Tests\Database\UpdateComplexTest8100
LeafDrupal\system\Tests\Database\UpdateLobTest1500
LeafDrupal\system\Tests\Database\UpdateTest7300
LeafDrupal\system\Tests\Entity\EntityApiInfoTest1000
LeafDrupal\system\Tests\Entity\EntityApiTest1600
LeafDrupal\system\Tests\Entity\EntityCrudHookTest13300
LeafDrupal\system\Tests\Entity\EntityFieldQueryTest20800
LeafDrupal\system\Tests\Entity\EntityFieldTest13800
LeafDrupal\system\Tests\Entity\EntityFormTest2600
ExpandDrupal\system\Tests\Entity\EntityTranslationFormTest1446
MessageGroupFilenameLineFunctionStatus
The test did not complete due to a fatal error.Completion checkEntityTranslationFormTest.php57Drupal\system\Tests\Entity\EntityTranslationFormTest->testEntityFormLanguage()
simplexml_import_dom(): Invalid Nodetype to importWarningWebTestBase.php1040Drupal\simpletest\WebTestBase->parse()
Parsed page successfully.BrowserEntityTranslationFormTest.php71Drupal\system\Tests\Entity\EntityTranslationFormTest->testEntityFormLanguage()
Trying to get property of non-objectNoticeEntityTranslationFormTest.php74Drupal\system\Tests\Entity\EntityTranslationFormTest->testEntityFormLanguage()
Form language is the same as the entity language.OtherEntityTranslationFormTest.php74Drupal\system\Tests\Entity\EntityTranslationFormTest->testEntityFormLanguage()
Trying to get property of non-objectNoticeEntityTranslationFormTest.php77Drupal\system\Tests\Entity\EntityTranslationFormTest->testEntityFormLanguage()
Trying to get property of non-objectNoticeEntityTranslationFormTest.php79Drupal\system\Tests\Entity\EntityTranslationFormTest->testEntityFormLanguage()
Form language is the same as the entity language.OtherEntityTranslationFormTest.php79Drupal\system\Tests\Entity\EntityTranslationFormTest->testEntityFormLanguage()
Argument 1 passed to entity_get_form() must implement interface Drupal\Core\Entity\EntityInterface, boolean given, called in /var/lib/drupaltestbot/sites/default/files/checkout/core/modules/system/lib/Drupal/system/Tests/Entity/EntityTranslationFormTest.php on line 83 and definedRecoverable errorentity.inc484entity_get_form()
Argument 1 passed to entity_form_state_defaults() must implement interface Drupal\Core\Entity\EntityInterface, boolean given, called in /var/lib/drupaltestbot/sites/default/files/checkout/core/includes/entity.inc on line 485 and definedRecoverable errorentity.inc444entity_form_state_defaults()
LeafDrupal\system\Tests\Entity\EntityTranslationTest5100
LeafDrupal\system\Tests\Entity\EntityUUIDTest1100
LeafDrupal\system\Tests\FileTransfer\FileTransferTest200
LeafDrupal\system\Tests\File\DirectoryTest2000
LeafDrupal\system\Tests\File\MimeTypeTest4200
LeafDrupal\system\Tests\File\NameMungingTest500
LeafDrupal\system\Tests\File\RemoteFileDirectoryTest2400
LeafDrupal\system\Tests\File\RemoteFileScanDirectoryTest2900
LeafDrupal\system\Tests\File\RemoteFileUnmanagedCopyTest3200
LeafDrupal\system\Tests\File\RemoteFileUnmanagedDeleteRecursiveTest2100
LeafDrupal\system\Tests\File\RemoteFileUnmanagedDeleteTest1000
LeafDrupal\system\Tests\File\RemoteFileUnmanagedMoveTest2300
LeafDrupal\system\Tests\File\RemoteFileUnmanagedSaveDataTest800
LeafDrupal\system\Tests\File\ScanDirectoryTest2900
LeafDrupal\system\Tests\File\StreamWrapperTest1900
LeafDrupal\system\Tests\File\UnmanagedCopyTest2900
LeafDrupal\system\Tests\File\UnmanagedDeleteRecursiveTest1700
LeafDrupal\system\Tests\File\UnmanagedDeleteTest700
LeafDrupal\system\Tests\File\UnmanagedMoveTest2000
LeafDrupal\system\Tests\File\UnmanagedSaveDataTest700
LeafDrupal\system\Tests\File\UrlRewritingTest1400
LeafDrupal\system\Tests\Form\AlterTest400
LeafDrupal\system\Tests\Form\ArbitraryRebuildTest1600
LeafDrupal\system\Tests\Form\CheckboxTest9700
LeafDrupal\system\Tests\Form\ElementsLabelsTest2000
LeafDrupal\system\Tests\Form\ElementsTableSelectTest6900
LeafDrupal\system\Tests\Form\ElementsVerticalTabsTest400
LeafDrupal\system\Tests\Form\ElementTest3700
LeafDrupal\system\Tests\Form\EmailTest1700
LeafDrupal\system\Tests\Form\FileInclusionTest1100
LeafDrupal\system\Tests\Form\FormTest63800
LeafDrupal\system\Tests\Form\HTMLIdTest700
LeafDrupal\system\Tests\Form\LanguageSelectElementTest4700
LeafDrupal\system\Tests\Form\ProgrammaticTest2400
LeafDrupal\system\Tests\Form\RebuildTest5300
LeafDrupal\system\Tests\Form\RedirectTest3100
LeafDrupal\system\Tests\Form\StateValuesCleanAdvancedTest700
LeafDrupal\system\Tests\Form\StateValuesCleanTest1400
LeafDrupal\system\Tests\Form\StorageTest12000
LeafDrupal\system\Tests\Form\TriggeringElementTest5000
LeafDrupal\system\Tests\Form\UrlTest1700
LeafDrupal\system\Tests\Form\ValidationTest8900
LeafDrupal\system\Tests\Form\WrapperTest500
LeafDrupal\system\Tests\Graph\GraphUnitTest2800
LeafDrupal\system\Tests\Image\FileMoveTest400
LeafDrupal\system\Tests\Image\ToolkitGdTest40800
LeafDrupal\system\Tests\Image\ToolkitTest5800
LeafDrupal\system\Tests\KeyValueStore\DatabaseStorageTest5400
LeafDrupal\system\Tests\KeyValueStore\MemoryStorageTest5400
LeafDrupal\system\Tests\Lock\LockFunctionalTest2900
LeafDrupal\system\Tests\Mail\HtmlToTextTest8300
LeafDrupal\system\Tests\Mail\MailTest400
LeafDrupal\system\Tests\Menu\BreadcrumbTest40900
LeafDrupal\system\Tests\Menu\LinksTest5000
LeafDrupal\system\Tests\Menu\RebuildTest500
LeafDrupal\system\Tests\Menu\RouterTest24900
LeafDrupal\system\Tests\Menu\TrailTest6800
LeafDrupal\system\Tests\Menu\TreeDataUnitTest400
LeafDrupal\system\Tests\Menu\TreeOutputTest700
LeafDrupal\system\Tests\Module\ClassLoaderTest1000
LeafDrupal\system\Tests\Module\DependencyTest16000
ExpandDrupal\system\Tests\Module\EnableDisableTest1027427103
MessageGroupFilenameLineFunctionStatus
Modules status has been updated.OtherEnableDisableTest.php98Drupal\system\Tests\Module\EnableDisableTest->testEnableDisable()
"hook_modules_installed fired for locale" foundOtherEnableDisableTest.php105Drupal\system\Tests\Module\EnableDisableTest->testEnableDisable()
"hook_modules_enabled fired for locale" foundOtherEnableDisableTest.php106Drupal\system\Tests\Module\EnableDisableTest->testEnableDisable()
"hook_modules_installed fired for language" foundOtherEnableDisableTest.php105Drupal\system\Tests\Module\EnableDisableTest->testEnableDisable()
"hook_modules_enabled fired for language" foundOtherEnableDisableTest.php106Drupal\system\Tests\Module\EnableDisableTest->testEnableDisable()
simplexml_import_dom(): Invalid Nodetype to importWarningWebTestBase.php1040Drupal\simpletest\WebTestBase->parse()
Parsed page successfully.BrowserEnableDisableTest.php120Drupal\system\Tests\Module\EnableDisableTest->testEnableDisable()
Modules status has been updated.OtherEnableDisableTest.php120Drupal\system\Tests\Module\EnableDisableTest->testEnableDisable()
Module "locale" is not enabled.OtherEnableDisableTest.php120Drupal\system\Tests\Module\EnableDisableTest->testEnableDisable()
"hook_modules_disabled fired for locale" foundOtherEnableDisableTest.php120Drupal\system\Tests\Module\EnableDisableTest->testEnableDisable()
watchdog table contains 0 rows for %module module disabled.OtherEnableDisableTest.php120Drupal\system\Tests\Module\EnableDisableTest->testEnableDisable()
simplexml_import_dom(): Invalid Nodetype to importWarningWebTestBase.php1040Drupal\simpletest\WebTestBase->parse()
Parsed page successfully.BrowserEnableDisableTest.php120Drupal\system\Tests\Module\EnableDisableTest->testEnableDisable()
simplexml_import_dom(): Invalid Nodetype to importWarningWebTestBase.php1040Drupal\simpletest\WebTestBase->parse()
Parsed page successfully.BrowserEnableDisableTest.php120Drupal\system\Tests\Module\EnableDisableTest->testEnableDisable()
Modules status has been updated.OtherEnableDisableTest.php120Drupal\system\Tests\Module\EnableDisableTest->testEnableDisable()
Module "locale" is not enabled.OtherEnableDisableTest.php120Drupal\system\Tests\Module\EnableDisableTest->testEnableDisable()
"hook_modules_uninstalled fired for locale" foundOtherEnableDisableTest.php120Drupal\system\Tests\Module\EnableDisableTest->testEnableDisable()
watchdog table contains 0 rows for %module module uninstalled.OtherEnableDisableTest.php120Drupal\system\Tests\Module\EnableDisableTest->testEnableDisable()
None of the database tables defined by the locale module exist.OtherEnableDisableTest.php120Drupal\system\Tests\Module\EnableDisableTest->testEnableDisable()
No configuration found for locale module.OtherEnableDisableTest.php120Drupal\system\Tests\Module\EnableDisableTest->testEnableDisable()
simplexml_import_dom(): Invalid Nodetype to importWarningWebTestBase.php1040Drupal\simpletest\WebTestBase->parse()
Parsed page successfully.BrowserEnableDisableTest.php92Drupal\system\Tests\Module\EnableDisableTest->testEnableDisable()
Modules status has been updated.OtherEnableDisableTest.php98Drupal\system\Tests\Module\EnableDisableTest->testEnableDisable()
"hook_modules_installed fired for menu" foundOtherEnableDisableTest.php105Drupal\system\Tests\Module\EnableDisableTest->testEnableDisable()
"hook_modules_enabled fired for menu" foundOtherEnableDisableTest.php106Drupal\system\Tests\Module\EnableDisableTest->testEnableDisable()
Module "menu" is enabled.OtherEnableDisableTest.php107Drupal\system\Tests\Module\EnableDisableTest->testEnableDisable()
All database tables defined by the menu module exist.OtherEnableDisableTest.php108Drupal\system\Tests\Module\EnableDisableTest->testEnableDisable()
All default configuration of menu module found.OtherEnableDisableTest.php109Drupal\system\Tests\Module\EnableDisableTest->testEnableDisable()
watchdog table contains 0 rows for %module module installed.OtherEnableDisableTest.php110Drupal\system\Tests\Module\EnableDisableTest->testEnableDisable()
watchdog table contains 0 rows for %module module enabled.OtherEnableDisableTest.php111Drupal\system\Tests\Module\EnableDisableTest->testEnableDisable()
simplexml_import_dom(): Invalid Nodetype to importWarningWebTestBase.php1040Drupal\simpletest\WebTestBase->parse()
Parsed page successfully.BrowserEnableDisableTest.php120Drupal\system\Tests\Module\EnableDisableTest->testEnableDisable()
Modules status has been updated.OtherEnableDisableTest.php120Drupal\system\Tests\Module\EnableDisableTest->testEnableDisable()
"hook_modules_disabled fired for menu" foundOtherEnableDisableTest.php120Drupal\system\Tests\Module\EnableDisableTest->testEnableDisable()
watchdog table contains 0 rows for %module module disabled.OtherEnableDisableTest.php120Drupal\system\Tests\Module\EnableDisableTest->testEnableDisable()
All database tables defined by the menu module exist.OtherEnableDisableTest.php120Drupal\system\Tests\Module\EnableDisableTest->testEnableDisable()
All default configuration of menu module found.OtherEnableDisableTest.php120Drupal\system\Tests\Module\EnableDisableTest->testEnableDisable()
simplexml_import_dom(): Invalid Nodetype to importWarningWebTestBase.php1040Drupal\simpletest\WebTestBase->parse()
Parsed page successfully.BrowserEnableDisableTest.php120Drupal\system\Tests\Module\EnableDisableTest->testEnableDisable()
simplexml_import_dom(): Invalid Nodetype to importWarningWebTestBase.php1040Drupal\simpletest\WebTestBase->parse()
Parsed page successfully.BrowserEnableDisableTest.php120Drupal\system\Tests\Module\EnableDisableTest->testEnableDisable()
Modules status has been updated.OtherEnableDisableTest.php120Drupal\system\Tests\Module\EnableDisableTest->testEnableDisable()
"hook_modules_uninstalled fired for menu" foundOtherEnableDisableTest.php120Drupal\system\Tests\Module\EnableDisableTest->testEnableDisable()
watchdog table contains 0 rows for %module module uninstalled.OtherEnableDisableTest.php120Drupal\system\Tests\Module\EnableDisableTest->testEnableDisable()
simplexml_import_dom(): Invalid Nodetype to importWarningWebTestBase.php1040Drupal\simpletest\WebTestBase->parse()
Parsed page successfully.BrowserEnableDisableTest.php92Drupal\system\Tests\Module\EnableDisableTest->testEnableDisable()
Modules status has been updated.OtherEnableDisableTest.php98Drupal\system\Tests\Module\EnableDisableTest->testEnableDisable()
"hook_modules_installed fired for number" foundOtherEnableDisableTest.php105Drupal\system\Tests\Module\EnableDisableTest->testEnableDisable()
"hook_modules_enabled fired for number" foundOtherEnableDisableTest.php106Drupal\system\Tests\Module\EnableDisableTest->testEnableDisable()
Module "number" is enabled.OtherEnableDisableTest.php107Drupal\system\Tests\Module\EnableDisableTest->testEnableDisable()
watchdog table contains 0 rows for %module module installed.OtherEnableDisableTest.php110Drupal\system\Tests\Module\EnableDisableTest->testEnableDisable()
watchdog table contains 0 rows for %module module enabled.OtherEnableDisableTest.php111Drupal\system\Tests\Module\EnableDisableTest->testEnableDisable()
simplexml_import_dom(): Invalid Nodetype to importWarningWebTestBase.php1040Drupal\simpletest\WebTestBase->parse()
Parsed page successfully.BrowserEnableDisableTest.php120Drupal\system\Tests\Module\EnableDisableTest->testEnableDisable()
Modules status has been updated.OtherEnableDisableTest.php120Drupal\system\Tests\Module\EnableDisableTest->testEnableDisable()
"hook_modules_disabled fired for number" foundOtherEnableDisableTest.php120Drupal\system\Tests\Module\EnableDisableTest->testEnableDisable()
watchdog table contains 0 rows for %module module disabled.OtherEnableDisableTest.php120Drupal\system\Tests\Module\EnableDisableTest->testEnableDisable()
simplexml_import_dom(): Invalid Nodetype to importWarningWebTestBase.php1040Drupal\simpletest\WebTestBase->parse()
Parsed page successfully.BrowserEnableDisableTest.php120Drupal\system\Tests\Module\EnableDisableTest->testEnableDisable()
simplexml_import_dom(): Invalid Nodetype to importWarningWebTestBase.php1040Drupal\simpletest\WebTestBase->parse()
Parsed page successfully.BrowserEnableDisableTest.php120Drupal\system\Tests\Module\EnableDisableTest->testEnableDisable()
Modules status has been updated.OtherEnableDisableTest.php120Drupal\system\Tests\Module\EnableDisableTest->testEnableDisable()
"hook_modules_uninstalled fired for number" foundOtherEnableDisableTest.php120Drupal\system\Tests\Module\EnableDisableTest->testEnableDisable()
watchdog table contains 0 rows for %module module uninstalled.OtherEnableDisableTest.php120Drupal\system\Tests\Module\EnableDisableTest->testEnableDisable()
simplexml_import_dom(): Invalid Nodetype to importWarningWebTestBase.php1040Drupal\simpletest\WebTestBase->parse()
Parsed page successfully.BrowserEnableDisableTest.php92Drupal\system\Tests\Module\EnableDisableTest->testEnableDisable()
Modules status has been updated.OtherEnableDisableTest.php98Drupal\system\Tests\Module\EnableDisableTest->testEnableDisable()
LeafDrupal\system\Tests\Module\HookRequirementsTest1600
LeafDrupal\system\Tests\Module\InstallTest300
LeafDrupal\system\Tests\Module\ModuleApiTest6800
LeafDrupal\system\Tests\Module\RequiredTest1800
LeafDrupal\system\Tests\Module\UninstallTest200
LeafDrupal\system\Tests\Module\VersionTest5100
LeafDrupal\system\Tests\Pager\PagerTest12300
LeafDrupal\system\Tests\Path\LookupTest1300
LeafDrupal\system\Tests\Path\MatchPathTest6300
LeafDrupal\system\Tests\Path\SaveTest800
LeafDrupal\system\Tests\Path\UrlAlterFunctionalTest4700
LeafDrupal\system\Tests\PhpStorage\FileStorageTest2400
LeafDrupal\system\Tests\PhpStorage\MTimeProtectedFastFileStorageTest1900
LeafDrupal\system\Tests\PhpStorage\MTimeProtectedFileStorageTest1900
LeafDrupal\system\Tests\Plugin\DerivativeTest900
LeafDrupal\system\Tests\Plugin\DiscoveryTest300
LeafDrupal\system\Tests\Plugin\FactoryTest900
LeafDrupal\system\Tests\Plugin\InspectionTest600
LeafDrupal\system\Tests\Queue\QueueTest1400
LeafDrupal\system\Tests\Routing\ChainMatcherTest300
LeafDrupal\system\Tests\Routing\ControllerResolverTest100
LeafDrupal\system\Tests\Routing\FirstEntryFinalMatcherTest800
LeafDrupal\system\Tests\Routing\HttpMethodMatcherTest800
LeafDrupal\system\Tests\Routing\MatcherDumperTest800
LeafDrupal\system\Tests\Routing\NestedMatcherTest100
LeafDrupal\system\Tests\Routing\PathMatcherTest2700
LeafDrupal\system\Tests\Routing\RouterTest2100
LeafDrupal\system\Tests\Routing\RouteTest600
LeafDrupal\system\Tests\Session\SessionHttpsTest8300
LeafDrupal\system\Tests\Session\SessionTest19000
LeafDrupal\system\Tests\System\AccessDeniedTest6800
LeafDrupal\system\Tests\System\AdminMetaTagTest300
LeafDrupal\system\Tests\System\AdminTest18100
LeafDrupal\system\Tests\System\CronRunTest4000
LeafDrupal\system\Tests\System\DateFormatsLanguageTest3700
LeafDrupal\system\Tests\System\DateTimeTest11300
LeafDrupal\system\Tests\System\DefaultMobileMetaTagsTest1200
LeafDrupal\system\Tests\System\ErrorHandlerTest4000
LeafDrupal\system\Tests\System\FloodTest600
LeafDrupal\system\Tests\System\FrontPageTest3700
LeafDrupal\system\Tests\System\IndexPhpTest600
LeafDrupal\system\Tests\System\InfoAlterTest1000
LeafDrupal\system\Tests\System\InfoFileParserUnitTest900
LeafDrupal\system\Tests\System\MainContentFallbackTest6000
LeafDrupal\system\Tests\System\PageNotFoundTest1800
LeafDrupal\system\Tests\System\PageTitleFilteringTest4400
LeafDrupal\system\Tests\System\PasswordHashingTest1000
LeafDrupal\system\Tests\System\RetrieveFileTest700
LeafDrupal\system\Tests\System\ShutdownFunctionsTest500
LeafDrupal\system\Tests\System\SiteMaintenanceTest7800
LeafDrupal\system\Tests\System\SystemAuthorizeTest1600
LeafDrupal\system\Tests\System\ThemeTest20500
LeafDrupal\system\Tests\System\TokenReplaceTest3600
LeafDrupal\system\Tests\System\UnicodeUnitTest18200
LeafDrupal\system\Tests\Theme\FastTest1200
LeafDrupal\system\Tests\Theme\FunctionsTest2500
LeafDrupal\system\Tests\Theme\HookInitTest500
LeafDrupal\system\Tests\Theme\HtmlTagUnitTest200
LeafDrupal\system\Tests\Theme\HtmlTplPhpAttributesTest500
LeafDrupal\system\Tests\Theme\RegistryTest600
LeafDrupal\system\Tests\Theme\TableTest600
LeafDrupal\system\Tests\Theme\ThemeTest4600
LeafDrupal\system\Tests\TypedData\TypedDataTest6100
LeafDrupal\system\Tests\Update\DependencyHookInvocationTest400
LeafDrupal\system\Tests\Update\DependencyMissingTest400
LeafDrupal\system\Tests\Update\DependencyOrderingTest500
LeafDrupal\system\Tests\Update\UpdateScriptTest20100
LeafDrupal\system\Tests\Upgrade\BareMinimalUpgradePathTest6000
ExpandDrupal\system\Tests\Upgrade\BareStandardUpgradePathTest1131
MessageGroupFilenameLineFunctionStatus
Found the Apply pending updates buttonOtherUpgradePathTestBase.php213Drupal\system\Tests\Upgrade\UpgradePathTestBase->performUpgrade()
Found the requested form fields at OtherUpgradePathTestBase.php213Drupal\system\Tests\Upgrade\UpgradePathTestBase->performUpgrade()
No pending updates at the end of the update process.OtherUpgradePathTestBase.php235Drupal\system\Tests\Upgrade\UpgradePathTestBase->performUpgrade()
Exception: update.php still shows pending updates after execution. in Drupal\system\Tests\Upgrade\UpgradePathTestBase->performUpgrade() (line 236 of /var/lib/drupaltestbot/sites/default/files/checkout/core/modules/system/lib/Drupal/system/Tests/Upgrade/UpgradePathTestBase.php).Uncaught exceptionUpgradePathTestBase.php236Drupal\system\Tests\Upgrade\UpgradePathTestBase->performUpgrade()
LeafDrupal\system\Tests\Upgrade\FilledMinimalUpgradePathTest6000
ExpandDrupal\system\Tests\Upgrade\FilledStandardUpgradePathTest1131
MessageGroupFilenameLineFunctionStatus
Found the Apply pending updates buttonOtherUpgradePathTestBase.php213Drupal\system\Tests\Upgrade\UpgradePathTestBase->performUpgrade()
Found the requested form fields at OtherUpgradePathTestBase.php213Drupal\system\Tests\Upgrade\UpgradePathTestBase->performUpgrade()
No pending updates at the end of the update process.OtherUpgradePathTestBase.php235Drupal\system\Tests\Upgrade\UpgradePathTestBase->performUpgrade()
Exception: update.php still shows pending updates after execution. in Drupal\system\Tests\Upgrade\UpgradePathTestBase->performUpgrade() (line 236 of /var/lib/drupaltestbot/sites/default/files/checkout/core/modules/system/lib/Drupal/system/Tests/Upgrade/UpgradePathTestBase.php).Uncaught exceptionUpgradePathTestBase.php236Drupal\system\Tests\Upgrade\UpgradePathTestBase->performUpgrade()
ExpandDrupal\system\Tests\Upgrade\LanguageUpgradePathTest60186
MessageGroupFilenameLineFunctionStatus
Found the Apply pending updates buttonOtherUpgradePathTestBase.php213Drupal\system\Tests\Upgrade\UpgradePathTestBase->performUpgrade()
Found the requested form fields at OtherUpgradePathTestBase.php213Drupal\system\Tests\Upgrade\UpgradePathTestBase->performUpgrade()
No pending updates at the end of the update process.OtherUpgradePathTestBase.php235Drupal\system\Tests\Upgrade\UpgradePathTestBase->performUpgrade()
Exception: update.php still shows pending updates after execution. in Drupal\system\Tests\Upgrade\UpgradePathTestBase->performUpgrade() (line 236 of /var/lib/drupaltestbot/sites/default/files/checkout/core/modules/system/lib/Drupal/system/Tests/Upgrade/UpgradePathTestBase.php).Uncaught exceptionUpgradePathTestBase.php236Drupal\system\Tests\Upgrade\UpgradePathTestBase->performUpgrade()
Found the Apply pending updates buttonOtherUpgradePathTestBase.php213Drupal\system\Tests\Upgrade\UpgradePathTestBase->performUpgrade()
Found the requested form fields at OtherUpgradePathTestBase.php213Drupal\system\Tests\Upgrade\UpgradePathTestBase->performUpgrade()
No pending updates at the end of the update process.OtherUpgradePathTestBase.php235Drupal\system\Tests\Upgrade\UpgradePathTestBase->performUpgrade()
Exception: update.php still shows pending updates after execution. in Drupal\system\Tests\Upgrade\UpgradePathTestBase->performUpgrade() (line 236 of /var/lib/drupaltestbot/sites/default/files/checkout/core/modules/system/lib/Drupal/system/Tests/Upgrade/UpgradePathTestBase.php).Uncaught exceptionUpgradePathTestBase.php236Drupal\system\Tests\Upgrade\UpgradePathTestBase->performUpgrade()
Found the Apply pending updates buttonOtherUpgradePathTestBase.php213Drupal\system\Tests\Upgrade\UpgradePathTestBase->performUpgrade()
Found the requested form fields at OtherUpgradePathTestBase.php213Drupal\system\Tests\Upgrade\UpgradePathTestBase->performUpgrade()
No pending updates at the end of the update process.OtherUpgradePathTestBase.php235Drupal\system\Tests\Upgrade\UpgradePathTestBase->performUpgrade()
Exception: update.php still shows pending updates after execution. in Drupal\system\Tests\Upgrade\UpgradePathTestBase->performUpgrade() (line 236 of /var/lib/drupaltestbot/sites/default/files/checkout/core/modules/system/lib/Drupal/system/Tests/Upgrade/UpgradePathTestBase.php).Uncaught exceptionUpgradePathTestBase.php236Drupal\system\Tests\Upgrade\UpgradePathTestBase->performUpgrade()
Found the Apply pending updates buttonOtherUpgradePathTestBase.php213Drupal\system\Tests\Upgrade\UpgradePathTestBase->performUpgrade()
Found the requested form fields at OtherUpgradePathTestBase.php213Drupal\system\Tests\Upgrade\UpgradePathTestBase->performUpgrade()
No pending updates at the end of the update process.OtherUpgradePathTestBase.php235Drupal\system\Tests\Upgrade\UpgradePathTestBase->performUpgrade()
Exception: update.php still shows pending updates after execution. in Drupal\system\Tests\Upgrade\UpgradePathTestBase->performUpgrade() (line 236 of /var/lib/drupaltestbot/sites/default/files/checkout/core/modules/system/lib/Drupal/system/Tests/Upgrade/UpgradePathTestBase.php).Uncaught exceptionUpgradePathTestBase.php236Drupal\system\Tests\Upgrade\UpgradePathTestBase->performUpgrade()
Found the Apply pending updates buttonOtherUpgradePathTestBase.php213Drupal\system\Tests\Upgrade\UpgradePathTestBase->performUpgrade()
Found the requested form fields at OtherUpgradePathTestBase.php213Drupal\system\Tests\Upgrade\UpgradePathTestBase->performUpgrade()
No pending updates at the end of the update process.OtherUpgradePathTestBase.php235Drupal\system\Tests\Upgrade\UpgradePathTestBase->performUpgrade()
Exception: update.php still shows pending updates after execution. in Drupal\system\Tests\Upgrade\UpgradePathTestBase->performUpgrade() (line 236 of /var/lib/drupaltestbot/sites/default/files/checkout/core/modules/system/lib/Drupal/system/Tests/Upgrade/UpgradePathTestBase.php).Uncaught exceptionUpgradePathTestBase.php236Drupal\system\Tests\Upgrade\UpgradePathTestBase->performUpgrade()
Found the Apply pending updates buttonOtherUpgradePathTestBase.php213Drupal\system\Tests\Upgrade\UpgradePathTestBase->performUpgrade()
Found the requested form fields at OtherUpgradePathTestBase.php213Drupal\system\Tests\Upgrade\UpgradePathTestBase->performUpgrade()
No pending updates at the end of the update process.OtherUpgradePathTestBase.php235Drupal\system\Tests\Upgrade\UpgradePathTestBase->performUpgrade()
Exception: update.php still shows pending updates after execution. in Drupal\system\Tests\Upgrade\UpgradePathTestBase->performUpgrade() (line 236 of /var/lib/drupaltestbot/sites/default/files/checkout/core/modules/system/lib/Drupal/system/Tests/Upgrade/UpgradePathTestBase.php).Uncaught exceptionUpgradePathTestBase.php236Drupal\system\Tests\Upgrade\UpgradePathTestBase->performUpgrade()
LeafDrupal\system\Tests\Upgrade\ModulesDisabledUpgradePathTest3400
ExpandDrupal\system\Tests\Upgrade\SystemUpgradePathTest1131
MessageGroupFilenameLineFunctionStatus
Found the Apply pending updates buttonOtherUpgradePathTestBase.php213Drupal\system\Tests\Upgrade\UpgradePathTestBase->performUpgrade()
Found the requested form fields at OtherUpgradePathTestBase.php213Drupal\system\Tests\Upgrade\UpgradePathTestBase->performUpgrade()
No pending updates at the end of the update process.OtherUpgradePathTestBase.php235Drupal\system\Tests\Upgrade\UpgradePathTestBase->performUpgrade()
Exception: update.php still shows pending updates after execution. in Drupal\system\Tests\Upgrade\UpgradePathTestBase->performUpgrade() (line 236 of /var/lib/drupaltestbot/sites/default/files/checkout/core/modules/system/lib/Drupal/system/Tests/Upgrade/UpgradePathTestBase.php).Uncaught exceptionUpgradePathTestBase.php236Drupal\system\Tests\Upgrade\UpgradePathTestBase->performUpgrade()
ExpandDrupal\system\Tests\Upgrade\UserRoleUpgradePathTest1131
MessageGroupFilenameLineFunctionStatus
Found the Apply pending updates buttonOtherUpgradePathTestBase.php213Drupal\system\Tests\Upgrade\UpgradePathTestBase->performUpgrade()
Found the requested form fields at OtherUpgradePathTestBase.php213Drupal\system\Tests\Upgrade\UpgradePathTestBase->performUpgrade()
No pending updates at the end of the update process.OtherUpgradePathTestBase.php235Drupal\system\Tests\Upgrade\UpgradePathTestBase->performUpgrade()
Exception: update.php still shows pending updates after execution. in Drupal\system\Tests\Upgrade\UpgradePathTestBase->performUpgrade() (line 236 of /var/lib/drupaltestbot/sites/default/files/checkout/core/modules/system/lib/Drupal/system/Tests/Upgrade/UpgradePathTestBase.php).Uncaught exceptionUpgradePathTestBase.php236Drupal\system\Tests\Upgrade\UpgradePathTestBase->performUpgrade()
LeafDrupal\system\Tests\Uuid\UuidUnitTest700
LeafDrupal\taxonomy\Tests\EfqTest1300
LeafDrupal\taxonomy\Tests\HooksTest2300
LeafDrupal\taxonomy\Tests\LegacyTest1400
LeafDrupal\taxonomy\Tests\LoadMultipleTest1800
LeafDrupal\taxonomy\Tests\RssTest2400
LeafDrupal\taxonomy\Tests\TermFieldMultipleVocabularyTest2600
LeafDrupal\taxonomy\Tests\TermFieldTest4500
LeafDrupal\taxonomy\Tests\TermIndexTest4600
LeafDrupal\taxonomy\Tests\TermLanguageTest2600
LeafDrupal\taxonomy\Tests\TermTest26300
LeafDrupal\taxonomy\Tests\TermUnitTest1100
LeafDrupal\taxonomy\Tests\ThemeTest1900
LeafDrupal\taxonomy\Tests\TokenReplaceTest5500
LeafDrupal\taxonomy\Tests\VocabularyLanguageTest2300
LeafDrupal\taxonomy\Tests\VocabularyTest11000
LeafDrupal\taxonomy\Tests\VocabularyUnitTest8300
LeafDrupal\text\Tests\TextFieldTest18400
LeafDrupal\text\Tests\TextSummaryTest13800
LeafDrupal\text\Tests\TextTranslationTest10400
LeafDrupal\tracker\Tests\TrackerNodeAccessTest2800
LeafDrupal\tracker\Tests\TrackerTest22800
LeafDrupal\translation\Tests\TranslationTest70600
LeafDrupal\update\Tests\UpdateContribTest18700
LeafDrupal\update\Tests\UpdateCoreTest25000
LeafDrupal\update\Tests\UpdateCoreUnitTest400
LeafDrupal\update\Tests\UpdateUploadTest6400
LeafDrupal\user\Tests\UserAccountLinksTests8000
LeafDrupal\user\Tests\UserAdminSettingsFormTest400
LeafDrupal\user\Tests\UserAdminTest12200
LeafDrupal\user\Tests\UserAuthmapAssignmentTest1200
LeafDrupal\user\Tests\UserAutocompleteTest5000
LeafDrupal\user\Tests\UserBlocksTests7300
LeafDrupal\user\Tests\UserCancelTest26000
LeafDrupal\user\Tests\UserCreateTest3400
LeafDrupal\user\Tests\UserDeleteTest1500
LeafDrupal\user\Tests\UserEditedOwnAccountTest2200
LeafDrupal\user\Tests\UserEditTest7800
LeafDrupal\user\Tests\UserEntityCallbacksTest700
LeafDrupal\user\Tests\UserLanguageCreationTest6900
LeafDrupal\user\Tests\UserLanguageTest3900
LeafDrupal\user\Tests\UserLoginTest15900
LeafDrupal\user\Tests\UserPasswordResetTest3100
LeafDrupal\user\Tests\UserPermissionsTest5000
LeafDrupal\user\Tests\UserPictureTest12600
LeafDrupal\user\Tests\UserRegistrationTest13400
LeafDrupal\user\Tests\UserRoleAdminTest5400
LeafDrupal\user\Tests\UserRolesAssignmentTest5100
LeafDrupal\user\Tests\UserSaveTest200
LeafDrupal\user\Tests\UserSearchTest3700
LeafDrupal\user\Tests\UserSignatureTest4600
LeafDrupal\user\Tests\UserTimeZoneTest2900
LeafDrupal\user\Tests\UserTokenReplaceTest4700
LeafDrupal\user\Tests\UserValidateCurrentPassCustomFormTest1700
LeafDrupal\user\Tests\UserValidationTest1600
LeafDrupal\xmlrpc\Tests\XmlRpcBasicTest900
LeafDrupal\xmlrpc\Tests\XmlRpcMessagesTest700
LeafDrupal\xmlrpc\Tests\XmlRpcValidatorTest1000