fivestar-migrate_integration-1635608-2.patch

Test status
StatusResult
Last receivedWed, 08/22/2012 - 21:41:28
Last requestedWed, 08/22/2012 - 21:42:01
Last testedWed, 08/22/2012 - 21:45:11
Test count1
Environment status
MySQLfail
File information
Filefivestar-migrate_integration-1635608-2.patch
BranchFivestar - 7.x-2.0-alpha2
LinkIssue Link
SummaryFAILED: [[SimpleTest]]: [MySQL] 8 pass(es), 19 fail(s), and 9 exception(s).
Details

MySQL

  1. Setup environment
  2. Detect an invalid patch URL
  3. Detect invalid repository information
  4. Detect invalid patch format
  5. Detect a non-applicable patch
  6. Detect invalid PHP syntax
  7. Detect a Drupal installation failure
  8. Detect a test run failure
  9. Detect a failing test
    Review the test failures below then if necessary run them locally until the problem has been fixed.
  10. Complete test suite with all tests passing
8 pass(es), 19 fail(s), and 9 exception(s)

Non-pass

Test namePassFailException
ExpandFivestar widgets (FivestarTestCase) [Fivestar]8199
MessageGroupFilenameLineFunctionStatus
Enabled modules: ajax_test, ajax_forms_test, fivestar, dblogOtherajax.test9AJAXTestCase->setUp()
Invalid permission rate content.Rolefivestar.base.test20FivestarBaseTestCase->setUp()
Invalid permission rate content.Rolefivestar.base.test21FivestarBaseTestCase->setUp()
Argument 1 passed to DrupalWebTestCase::drupalLogin() must be an instance of stdClass, boolean given, called in /var/lib/drupaltestbot/sites/default/files/checkout/sites/default/modules/fivestar/test/fivestar.field.test on line 21 and definedRecoverable errordrupal_web_test_case.php1225DrupalWebTestCase->drupalLogin()
Trying to get property of non-objectNoticedrupal_web_test_case.php1231DrupalWebTestCase->drupalLogin()
Trying to get property of non-objectNoticedrupal_web_test_case.php1232DrupalWebTestCase->drupalLogin()
Failed to set field name to Otherfivestar.field.test21FivestarTestCase->testAuthorRating()
Failed to set field pass to Otherfivestar.field.test21FivestarTestCase->testAuthorRating()
Found the requested form fields at userOtherfivestar.field.test21FivestarTestCase->testAuthorRating()
Trying to get property of non-objectNoticedrupal_web_test_case.php1238DrupalWebTestCase->drupalLogin()
User successfully logged in.User loginfivestar.field.test21FivestarTestCase->testAuthorRating()
FieldException: Attempt to create a field of unknown type <em class="placeholder">fivestar</em>. in field_create_field() (line 110 of /var/lib/drupaltestbot/sites/default/files/checkout/modules/field/field.crud.inc).Uncaught exceptionfield.crud.inc110field_create_field()
Enabled modules: ajax_test, ajax_forms_test, fivestar, dblogOtherajax.test9AJAXTestCase->setUp()
Invalid permission rate content.Rolefivestar.base.test20FivestarBaseTestCase->setUp()
Invalid permission rate content.Rolefivestar.base.test21FivestarBaseTestCase->setUp()
FieldException: Attempt to create a field of unknown type <em class="placeholder">fivestar</em>. in field_create_field() (line 110 of /var/lib/drupaltestbot/sites/default/files/checkout/modules/field/field.crud.inc).Uncaught exceptionfield.crud.inc110field_create_field()
Enabled modules: ajax_test, ajax_forms_test, fivestar, dblogOtherajax.test9AJAXTestCase->setUp()
Invalid permission rate content.Rolefivestar.base.test20FivestarBaseTestCase->setUp()
Invalid permission rate content.Rolefivestar.base.test21FivestarBaseTestCase->setUp()
FieldException: Attempt to create a field of unknown type <em class="placeholder">fivestar</em>. in field_create_field() (line 110 of /var/lib/drupaltestbot/sites/default/files/checkout/modules/field/field.crud.inc).Uncaught exceptionfield.crud.inc110field_create_field()
Enabled modules: ajax_test, ajax_forms_test, fivestar, dblogOtherajax.test9AJAXTestCase->setUp()
Invalid permission rate content.Rolefivestar.base.test20FivestarBaseTestCase->setUp()
Invalid permission rate content.Rolefivestar.base.test21FivestarBaseTestCase->setUp()
FieldException: Attempt to create a field of unknown type <em class="placeholder">fivestar</em>. in field_create_field() (line 110 of /var/lib/drupaltestbot/sites/default/files/checkout/modules/field/field.crud.inc).Uncaught exceptionfield.crud.inc110field_create_field()
Enabled modules: ajax_test, ajax_forms_test, fivestar, dblogOtherajax.test9AJAXTestCase->setUp()
Invalid permission rate content.Rolefivestar.base.test20FivestarBaseTestCase->setUp()
Invalid permission rate content.Rolefivestar.base.test21FivestarBaseTestCase->setUp()
FieldException: Attempt to create a field of unknown type <em class="placeholder">fivestar</em>. in field_create_field() (line 110 of /var/lib/drupaltestbot/sites/default/files/checkout/modules/field/field.crud.inc).Uncaught exceptionfield.crud.inc110field_create_field()

All

Test namePassFailException
ExpandFivestar widgets (FivestarTestCase) [Fivestar]8199
MessageGroupFilenameLineFunctionStatus
Enabled modules: ajax_test, ajax_forms_test, fivestar, dblogOtherajax.test9AJAXTestCase->setUp()
Invalid permission rate content.Rolefivestar.base.test20FivestarBaseTestCase->setUp()
Invalid permission rate content.Rolefivestar.base.test21FivestarBaseTestCase->setUp()
Argument 1 passed to DrupalWebTestCase::drupalLogin() must be an instance of stdClass, boolean given, called in /var/lib/drupaltestbot/sites/default/files/checkout/sites/default/modules/fivestar/test/fivestar.field.test on line 21 and definedRecoverable errordrupal_web_test_case.php1225DrupalWebTestCase->drupalLogin()
Trying to get property of non-objectNoticedrupal_web_test_case.php1231DrupalWebTestCase->drupalLogin()
Trying to get property of non-objectNoticedrupal_web_test_case.php1232DrupalWebTestCase->drupalLogin()
Failed to set field name to Otherfivestar.field.test21FivestarTestCase->testAuthorRating()
Failed to set field pass to Otherfivestar.field.test21FivestarTestCase->testAuthorRating()
Found the requested form fields at userOtherfivestar.field.test21FivestarTestCase->testAuthorRating()
Trying to get property of non-objectNoticedrupal_web_test_case.php1238DrupalWebTestCase->drupalLogin()
User successfully logged in.User loginfivestar.field.test21FivestarTestCase->testAuthorRating()
FieldException: Attempt to create a field of unknown type <em class="placeholder">fivestar</em>. in field_create_field() (line 110 of /var/lib/drupaltestbot/sites/default/files/checkout/modules/field/field.crud.inc).Uncaught exceptionfield.crud.inc110field_create_field()
Enabled modules: ajax_test, ajax_forms_test, fivestar, dblogOtherajax.test9AJAXTestCase->setUp()
Invalid permission rate content.Rolefivestar.base.test20FivestarBaseTestCase->setUp()
Invalid permission rate content.Rolefivestar.base.test21FivestarBaseTestCase->setUp()
FieldException: Attempt to create a field of unknown type <em class="placeholder">fivestar</em>. in field_create_field() (line 110 of /var/lib/drupaltestbot/sites/default/files/checkout/modules/field/field.crud.inc).Uncaught exceptionfield.crud.inc110field_create_field()
Enabled modules: ajax_test, ajax_forms_test, fivestar, dblogOtherajax.test9AJAXTestCase->setUp()
Invalid permission rate content.Rolefivestar.base.test20FivestarBaseTestCase->setUp()
Invalid permission rate content.Rolefivestar.base.test21FivestarBaseTestCase->setUp()
FieldException: Attempt to create a field of unknown type <em class="placeholder">fivestar</em>. in field_create_field() (line 110 of /var/lib/drupaltestbot/sites/default/files/checkout/modules/field/field.crud.inc).Uncaught exceptionfield.crud.inc110field_create_field()
Enabled modules: ajax_test, ajax_forms_test, fivestar, dblogOtherajax.test9AJAXTestCase->setUp()
Invalid permission rate content.Rolefivestar.base.test20FivestarBaseTestCase->setUp()
Invalid permission rate content.Rolefivestar.base.test21FivestarBaseTestCase->setUp()
FieldException: Attempt to create a field of unknown type <em class="placeholder">fivestar</em>. in field_create_field() (line 110 of /var/lib/drupaltestbot/sites/default/files/checkout/modules/field/field.crud.inc).Uncaught exceptionfield.crud.inc110field_create_field()
Enabled modules: ajax_test, ajax_forms_test, fivestar, dblogOtherajax.test9AJAXTestCase->setUp()
Invalid permission rate content.Rolefivestar.base.test20FivestarBaseTestCase->setUp()
Invalid permission rate content.Rolefivestar.base.test21FivestarBaseTestCase->setUp()
FieldException: Attempt to create a field of unknown type <em class="placeholder">fivestar</em>. in field_create_field() (line 110 of /var/lib/drupaltestbot/sites/default/files/checkout/modules/field/field.crud.inc).Uncaught exceptionfield.crud.inc110field_create_field()