platform.testing.84.patch

Test status
StatusResult
Last receivedSat, 04/07/2012 - 03:03:37
Last requestedSat, 04/07/2012 - 03:04:03
Last testedSat, 04/07/2012 - 03:25:22
Test count1
Environment status
MySQLfail
File information
Fileplatform.testing.84.patch
BranchDrupal core - 7.x
LinkIssue Link
SummaryFAILED: [[SimpleTest]]: [MySQL] 38,222 pass(es), 678 fail(s), and 145 exception(s).
Details

MySQL

  1. Setup environment
  2. Detect an invalid patch URL
  3. Detect invalid repository information
  4. Detect invalid patch format
  5. Detect a non-applicable patch
  6. Detect invalid PHP syntax
  7. Detect a Drupal installation failure
  8. Detect a test run failure
  9. Detect a failing test
    Review the test failures below then if necessary run them locally until the problem has been fixed.
  10. Complete test suite with all tests passing
38,222 pass(es), 678 fail(s), and 145 exception(s)

Non-pass

Test namePassFailException
ExpandAutocompletion (ProfileTestAutocomplete) [Profile]34276
MessageGroupFilenameLineFunctionStatus
Invalid permission administer blocks.Roleprofile.test19ProfileTestCase->setUp()
Argument 1 passed to DrupalWebTestCase::drupalLogin() must be an instance of stdClass, boolean given, called in /var/lib/drupaltestbot/sites/default/files/checkout/modules/profile/profile.test on line 331 and definedRecoverable errordrupal_web_test_case.php1226DrupalWebTestCase->drupalLogin()
Trying to get property of non-objectNoticedrupal_web_test_case.php1232DrupalWebTestCase->drupalLogin()
Trying to get property of non-objectNoticedrupal_web_test_case.php1233DrupalWebTestCase->drupalLogin()
Failed to set field name to Otherprofile.test331ProfileTestAutocomplete->testAutocomplete()
Failed to set field pass to Otherprofile.test331ProfileTestAutocomplete->testAutocomplete()
Found the requested form fields at userOtherprofile.test331ProfileTestAutocomplete->testAutocomplete()
Trying to get property of non-objectNoticedrupal_web_test_case.php1239DrupalWebTestCase->drupalLogin()
User successfully logged in.User loginprofile.test331ProfileTestAutocomplete->testAutocomplete()
Failed to set field weight to 1Otherprofile.test43ProfileTestCase->createProfileField()
Failed to set field autocomplete to 1Otherprofile.test43ProfileTestCase->createProfileField()
Failed to set field title to h8W3DTe9Otherprofile.test43ProfileTestCase->createProfileField()
Failed to set field name to profile_h8W3DTe9Otherprofile.test43ProfileTestCase->createProfileField()
Failed to set field category to kO93kxsDOtherprofile.test43ProfileTestCase->createProfileField()
Failed to set field explanation to qI4hCbIUNJ4HH0cRMNvwYmzhjcnNiSRBLZRMgajxmHaB1PQAwMOtherprofile.test43ProfileTestCase->createProfileField()
Found the Save field buttonOtherprofile.test43ProfileTestCase->createProfileField()
Found the requested form fields at admin/config/people/profile/add/textfieldOtherprofile.test43ProfileTestCase->createProfileField()
New Profile field has been entered in the databaseOtherprofile.test45ProfileTestCase->createProfileField()
Trying to get property of non-objectNoticeprofile.test48ProfileTestCase->createProfileField()
Found form named profile_h8W3DTe9Otherprofile.test57ProfileTestCase->createProfileField()
Checking title for field h8W3DTe9Otherprofile.test61ProfileTestCase->createProfileField()
Checking explanation for field h8W3DTe9Otherprofile.test63ProfileTestCase->createProfileField()
Failed to set field profile_h8W3DTe9 to diFKSQC6Otherprofile.test140ProfileTestCase->setProfileField()
Found the Save buttonOtherprofile.test140ProfileTestCase->setProfileField()
Found the requested form fields at user/2/edit/kO93kxsDOtherprofile.test140ProfileTestCase->setProfileField()
Found profile field with title h8W3DTe9Otherprofile.test144ProfileTestCase->setProfileField()
Found profile field with value diFKSQC6Otherprofile.test148ProfileTestCase->setProfileField()
Trying to get property of non-objectNoticeprofile.test346ProfileTestAutocomplete->testAutocomplete()
Autocomplete found.Otherprofile.test347ProfileTestAutocomplete->testAutocomplete()
Autocomplete JavaScript found.Otherprofile.test348ProfileTestAutocomplete->testAutocomplete()
Autocomplete form element class found.Otherprofile.test349ProfileTestAutocomplete->testAutocomplete()
Autocomplete path allowed to user with permission.Browserprofile.test354ProfileTestAutocomplete->testAutocomplete()
Autocomplete value found.Otherprofile.test355ProfileTestAutocomplete->testAutocomplete()
ExpandBlock availability (ProfileBlockTestCase) [Profile]41657
MessageGroupFilenameLineFunctionStatus
Invalid permission administer blocks.Roleprofile.test19ProfileTestCase->setUp()
Argument 1 passed to DrupalWebTestCase::drupalLogin() must be an instance of stdClass, boolean given, called in /var/lib/drupaltestbot/sites/default/files/checkout/modules/profile/profile.test on line 384 and definedRecoverable errordrupal_web_test_case.php1226DrupalWebTestCase->drupalLogin()
Trying to get property of non-objectNoticedrupal_web_test_case.php1232DrupalWebTestCase->drupalLogin()
Trying to get property of non-objectNoticedrupal_web_test_case.php1233DrupalWebTestCase->drupalLogin()
Failed to set field name to Otherprofile.test384ProfileBlockTestCase->setUp()
Failed to set field pass to Otherprofile.test384ProfileBlockTestCase->setUp()
Found the requested form fields at userOtherprofile.test384ProfileBlockTestCase->setUp()
Trying to get property of non-objectNoticedrupal_web_test_case.php1239DrupalWebTestCase->drupalLogin()
User successfully logged in.User loginprofile.test384ProfileBlockTestCase->setUp()
Failed to set field weight to 0Otherprofile.test43ProfileTestCase->createProfileField()
Failed to set field title to bNu9SdhjOtherprofile.test43ProfileTestCase->createProfileField()
Failed to set field name to profile_bNu9SdhjOtherprofile.test43ProfileTestCase->createProfileField()
Failed to set field category to sRX15OpHOtherprofile.test43ProfileTestCase->createProfileField()
Failed to set field explanation to bsiRifEFsuwIBKClQRBLDXoGikXO8DoWf63vQ2jQoSiAcVI3D9Otherprofile.test43ProfileTestCase->createProfileField()
Found the Save field buttonOtherprofile.test43ProfileTestCase->createProfileField()
Found the requested form fields at admin/config/people/profile/add/textfieldOtherprofile.test43ProfileTestCase->createProfileField()
New Profile field has been entered in the databaseOtherprofile.test45ProfileTestCase->createProfileField()
Trying to get property of non-objectNoticeprofile.test48ProfileTestCase->createProfileField()
Found form named profile_bNu9SdhjOtherprofile.test57ProfileTestCase->createProfileField()
Checking title for field bNu9SdhjOtherprofile.test61ProfileTestCase->createProfileField()
Checking explanation for field bNu9SdhjOtherprofile.test63ProfileTestCase->createProfileField()
Failed to set field weight to 1Otherprofile.test43ProfileTestCase->createProfileField()
Failed to set field title to s9TTK7iwOtherprofile.test43ProfileTestCase->createProfileField()
Failed to set field name to profile_s9TTK7iwOtherprofile.test43ProfileTestCase->createProfileField()
Failed to set field category to sRX15OpHOtherprofile.test43ProfileTestCase->createProfileField()
Failed to set field explanation to zpCzVjJBQD2EiXHodkUt85l1gp1Cl9l78TQiMx6DBbFcIQQBdBOtherprofile.test43ProfileTestCase->createProfileField()
Found the Save field buttonOtherprofile.test43ProfileTestCase->createProfileField()
Found the requested form fields at admin/config/people/profile/add/textfieldOtherprofile.test43ProfileTestCase->createProfileField()
New Profile field has been entered in the databaseOtherprofile.test45ProfileTestCase->createProfileField()
Trying to get property of non-objectNoticeprofile.test48ProfileTestCase->createProfileField()
Found form named profile_s9TTK7iwOtherprofile.test57ProfileTestCase->createProfileField()
Checking title for field s9TTK7iwOtherprofile.test61ProfileTestCase->createProfileField()
Checking explanation for field s9TTK7iwOtherprofile.test63ProfileTestCase->createProfileField()
Failed to set field profile_bNu9Sdhj to tSKHmeTfOtherprofile.test140ProfileTestCase->setProfileField()
Found the Save buttonOtherprofile.test140ProfileTestCase->setProfileField()
Found the requested form fields at user/2/edit/sRX15OpHOtherprofile.test140ProfileTestCase->setProfileField()
Found profile field with title bNu9SdhjOtherprofile.test144ProfileTestCase->setProfileField()
Found profile field with value tSKHmeTfOtherprofile.test148ProfileTestCase->setProfileField()
Failed to set field profile_s9TTK7iw to mCeLyM4ZOtherprofile.test140ProfileTestCase->setProfileField()
Found the Save buttonOtherprofile.test140ProfileTestCase->setProfileField()
Found the requested form fields at user/2/edit/sRX15OpHOtherprofile.test140ProfileTestCase->setProfileField()
Found profile field with title s9TTK7iwOtherprofile.test144ProfileTestCase->setProfileField()
Found profile field with value mCeLyM4ZOtherprofile.test148ProfileTestCase->setProfileField()
Failed to set field blocks[profile_author-information][region] to footerOtherprofile.test405ProfileBlockTestCase->testAuthorInformationBlock()
Found the Save blocks buttonOtherprofile.test405ProfileBlockTestCase->testAuthorInformationBlock()
Found the requested form fields at admin/structure/blockOtherprofile.test405ProfileBlockTestCase->testAuthorInformationBlock()
Block successfully move to footer region.Otherprofile.test406ProfileBlockTestCase->testAuthorInformationBlock()
Failed to set field profile_block_author_fields[profile_bNu9Sdhj] to 1Otherprofile.test411ProfileBlockTestCase->testAuthorInformationBlock()
Found the Save block buttonOtherprofile.test411ProfileBlockTestCase->testAuthorInformationBlock()
Found the requested form fields at admin/structure/block/manage/profile/author-information/configureOtherprofile.test411ProfileBlockTestCase->testAuthorInformationBlock()
Block configuration set.Otherprofile.test412ProfileBlockTestCase->testAuthorInformationBlock()
Field 1 is displayedOtherprofile.test416ProfileBlockTestCase->testAuthorInformationBlock()
Failed to set field profile_block_author_fields[profile_bNu9Sdhj] to Otherprofile.test423ProfileBlockTestCase->testAuthorInformationBlock()
Failed to set field profile_block_author_fields[profile_s9TTK7iw] to 1Otherprofile.test423ProfileBlockTestCase->testAuthorInformationBlock()
Found the Save block buttonOtherprofile.test423ProfileBlockTestCase->testAuthorInformationBlock()
Found the requested form fields at admin/structure/block/manage/profile/author-information/configureOtherprofile.test423ProfileBlockTestCase->testAuthorInformationBlock()
Block configuration set.Otherprofile.test424ProfileBlockTestCase->testAuthorInformationBlock()
Field 2 is displayedOtherprofile.test429ProfileBlockTestCase->testAuthorInformationBlock()
Failed to set field profile_block_author_fields[profile_bNu9Sdhj] to 1Otherprofile.test435ProfileBlockTestCase->testAuthorInformationBlock()
Failed to set field profile_block_author_fields[profile_s9TTK7iw] to 1Otherprofile.test435ProfileBlockTestCase->testAuthorInformationBlock()
Found the Save block buttonOtherprofile.test435ProfileBlockTestCase->testAuthorInformationBlock()
Found the requested form fields at admin/structure/block/manage/profile/author-information/configureOtherprofile.test435ProfileBlockTestCase->testAuthorInformationBlock()
Block configuration set.Otherprofile.test436ProfileBlockTestCase->testAuthorInformationBlock()
Field 1 is displayedOtherprofile.test440ProfileBlockTestCase->testAuthorInformationBlock()
Field 2 is displayedOtherprofile.test441ProfileBlockTestCase->testAuthorInformationBlock()
Failed to set field profile_block_author_fields[user_profile] to 1Otherprofile.test446ProfileBlockTestCase->testAuthorInformationBlock()
Found the Save block buttonOtherprofile.test446ProfileBlockTestCase->testAuthorInformationBlock()
Found the requested form fields at admin/structure/block/manage/profile/author-information/configureOtherprofile.test446ProfileBlockTestCase->testAuthorInformationBlock()
Block configuration set.Otherprofile.test447ProfileBlockTestCase->testAuthorInformationBlock()
Undefined variable: url_targetNoticedrupal_web_test_case.php2546DrupalWebTestCase->clickLink()
Clicked link View full user profile () from http://drupaltestbot654-mysql/checkout/?q=node/1Browserprofile.test451ProfileBlockTestCase->testAuthorInformationBlock()
Value 'http://drupaltestbot654-mysql/checkout/?q=node/1' is equal to value 'http://drupaltestbot654-mysql/checkout/?q=user/2'.Otherprofile.test452ProfileBlockTestCase->testAuthorInformationBlock()
ExpandBlog functionality (BlogTestCase) [Blog]2073314
MessageGroupFilenameLineFunctionStatus
Invalid permission administer blocks.Roleblog.test27BlogTestCase->setUp()
Trying to get property of non-objectNoticeblog.test39BlogTestCase->testUnprivilegedUser()
Argument 1 passed to DrupalWebTestCase::drupalLogin() must be an instance of stdClass, boolean given, called in /var/lib/drupaltestbot/sites/default/files/checkout/modules/blog/blog.test on line 41 and definedRecoverable errordrupal_web_test_case.php1226DrupalWebTestCase->drupalLogin()
Trying to get property of non-objectNoticedrupal_web_test_case.php1232DrupalWebTestCase->drupalLogin()
Trying to get property of non-objectNoticedrupal_web_test_case.php1233DrupalWebTestCase->drupalLogin()
Failed to set field name to Otherblog.test41BlogTestCase->testUnprivilegedUser()
Failed to set field pass to Otherblog.test41BlogTestCase->testUnprivilegedUser()
Found the requested form fields at userOtherblog.test41BlogTestCase->testUnprivilegedUser()
Trying to get property of non-objectNoticedrupal_web_test_case.php1239DrupalWebTestCase->drupalLogin()
User successfully logged in.User loginblog.test41BlogTestCase->testUnprivilegedUser()
Trying to get property of non-objectNoticeblog.test43BlogTestCase->testUnprivilegedUser()
Blog title was displayedOtherblog.test45BlogTestCase->testUnprivilegedUser()
No new entries can be posted without the right permissionOtherblog.test46BlogTestCase->testUnprivilegedUser()
Invalid permission administer blocks.Roleblog.test27BlogTestCase->setUp()
Argument 1 passed to DrupalWebTestCase::drupalLogin() must be an instance of stdClass, boolean given, called in /var/lib/drupaltestbot/sites/default/files/checkout/modules/blog/blog.test on line 53 and definedRecoverable errordrupal_web_test_case.php1226DrupalWebTestCase->drupalLogin()
Trying to get property of non-objectNoticedrupal_web_test_case.php1232DrupalWebTestCase->drupalLogin()
Trying to get property of non-objectNoticedrupal_web_test_case.php1233DrupalWebTestCase->drupalLogin()
Failed to set field name to Otherblog.test53BlogTestCase->testBlogPageNoEntries()
Failed to set field pass to Otherblog.test53BlogTestCase->testBlogPageNoEntries()
Found the requested form fields at userOtherblog.test53BlogTestCase->testBlogPageNoEntries()
Trying to get property of non-objectNoticedrupal_web_test_case.php1239DrupalWebTestCase->drupalLogin()
User successfully logged in.User loginblog.test53BlogTestCase->testBlogPageNoEntries()
Invalid permission administer blocks.Roleblog.test27BlogTestCase->setUp()
Argument 1 passed to DrupalWebTestCase::drupalLogin() must be an instance of stdClass, boolean given, called in /var/lib/drupaltestbot/sites/default/files/checkout/modules/blog/blog.test on line 66 and definedRecoverable errordrupal_web_test_case.php1226DrupalWebTestCase->drupalLogin()
Trying to get property of non-objectNoticedrupal_web_test_case.php1232DrupalWebTestCase->drupalLogin()
Trying to get property of non-objectNoticedrupal_web_test_case.php1233DrupalWebTestCase->drupalLogin()
Failed to set field name to Otherblog.test66BlogTestCase->testBlog()
Failed to set field pass to Otherblog.test66BlogTestCase->testBlog()
Found the requested form fields at userOtherblog.test66BlogTestCase->testBlog()
Trying to get property of non-objectNoticedrupal_web_test_case.php1239DrupalWebTestCase->drupalLogin()
User successfully logged in.User loginblog.test66BlogTestCase->testBlog()
Failed to set field blocks[blog_recent][region] to sidebar_secondOtherblog.test70BlogTestCase->testBlog()
Found the Save blocks buttonOtherblog.test70BlogTestCase->testBlog()
Found the requested form fields at admin/structure/blockOtherblog.test70BlogTestCase->testBlog()
HTTP response expected 200, actual 403Browserblog.test71BlogTestCase->testBlog()
Failed to set field blog_block_count to 5Otherblog.test75BlogTestCase->testBlog()
Found the Save block buttonOtherblog.test75BlogTestCase->testBlog()
Found the requested form fields at admin/structure/block/manage/blog/recent/configureOtherblog.test75BlogTestCase->testBlog()
Number of recent blog posts changed.Otherblog.test76BlogTestCase->testBlog()
Blog help node was displayedOtherblog.test135BlogTestCase->verifyBlogs()
Blog help node was displayedOtherblog.test136BlogTestCase->verifyBlogs()
Blog block was displayedOtherblog.test142BlogTestCase->verifyBlogs()
Blog block was displayedOtherblog.test142BlogTestCase->verifyBlogs()
Blog block was displayedOtherblog.test142BlogTestCase->verifyBlogs()
Blog help node was displayedOtherblog.test135BlogTestCase->verifyBlogs()
Blog help node was displayedOtherblog.test136BlogTestCase->verifyBlogs()
Blog block was displayedOtherblog.test142BlogTestCase->verifyBlogs()
ExpandManage display (FieldUIManageDisplayTestCase) [Field UI]306810
MessageGroupFilenameLineFunctionStatus
Invalid permission administer taxonomy.Rolefield_ui.test25FieldUITestCase->setUp()
Argument 1 passed to DrupalWebTestCase::drupalLogin() must be an instance of stdClass, boolean given, called in /var/lib/drupaltestbot/sites/default/files/checkout/modules/field_ui/field_ui.test on line 26 and definedRecoverable errordrupal_web_test_case.php1226DrupalWebTestCase->drupalLogin()
Trying to get property of non-objectNoticedrupal_web_test_case.php1232DrupalWebTestCase->drupalLogin()
Trying to get property of non-objectNoticedrupal_web_test_case.php1233DrupalWebTestCase->drupalLogin()
Failed to set field name to Otherfield_ui.test26FieldUITestCase->setUp()
Failed to set field pass to Otherfield_ui.test26FieldUITestCase->setUp()
Found the requested form fields at userOtherfield_ui.test26FieldUITestCase->setUp()
Trying to get property of non-objectNoticedrupal_web_test_case.php1239DrupalWebTestCase->drupalLogin()
User successfully logged in.User loginfield_ui.test26FieldUITestCase->setUp()
Failed to set field fields[_add_new_field][label] to Test fieldOtherfield_ui.test61FieldUITestCase->fieldUIAddNewField()
Failed to set field fields[_add_new_field][field_name] to testOtherfield_ui.test61FieldUITestCase->fieldUIAddNewField()
Failed to set field fields[_add_new_field][type] to test_fieldOtherfield_ui.test61FieldUITestCase->fieldUIAddNewField()
Failed to set field fields[_add_new_field][widget_type] to test_field_widgetOtherfield_ui.test61FieldUITestCase->fieldUIAddNewField()
Found the Save buttonOtherfield_ui.test61FieldUITestCase->fieldUIAddNewField()
Found the requested form fields at admin/structure/types/manage/e0kl9miw-test/fieldsOtherfield_ui.test61FieldUITestCase->fieldUIAddNewField()
Field settings page was displayed.Otherfield_ui.test62FieldUITestCase->fieldUIAddNewField()
Found the Save field settings buttonOtherfield_ui.test65FieldUITestCase->fieldUIAddNewField()
Found the requested form fields at Otherfield_ui.test65FieldUITestCase->fieldUIAddNewField()
Redirected to instance and widget settings page.Otherfield_ui.test66FieldUITestCase->fieldUIAddNewField()
Found the Save settings buttonOtherfield_ui.test69FieldUITestCase->fieldUIAddNewField()
Found the requested form fields at Otherfield_ui.test69FieldUITestCase->fieldUIAddNewField()
Redirected to "Manage fields" page.Otherfield_ui.test70FieldUITestCase->fieldUIAddNewField()
Field was created and appears in the overview page.Otherfield_ui.test73FieldUITestCase->fieldUIAddNewField()
The expected formatter is selected.Browserfield_ui.test491FieldUIManageDisplayTestCase->testFormatterUI()
The expected summary is displayed.Otherfield_ui.test492FieldUIManageDisplayTestCase->testFormatterUI()
Undefined offset: 0Noticedrupal_web_test_case.php2030DrupalWebTestCase->drupalPostAJAX()
Undefined index: ajaxNoticedrupal_web_test_case.php2031DrupalWebTestCase->drupalPostAJAX()
Failed to set field fields[field_test][type] to field_test_multipleOtherfield_ui.test496FieldUIManageDisplayTestCase->testFormatterUI()
Failed to set field refresh_rows to field_testOtherfield_ui.test496FieldUIManageDisplayTestCase->testFormatterUI()
Found the requested form fields at Otherfield_ui.test496FieldUIManageDisplayTestCase->testFormatterUI()
The expected formatter is selected.Browserfield_ui.test501FieldUIManageDisplayTestCase->testFormatterUI()
The expected summary is displayed.Otherfield_ui.test502FieldUIManageDisplayTestCase->testFormatterUI()
Found the Save buttonOtherfield_ui.test505FieldUIManageDisplayTestCase->testFormatterUI()
Found the requested form fields at Otherfield_ui.test505FieldUIManageDisplayTestCase->testFormatterUI()
The formatter was updated.Otherfield_ui.test510FieldUIManageDisplayTestCase->testFormatterUI()
The setting was updated.Otherfield_ui.test511FieldUIManageDisplayTestCase->testFormatterUI()
Invalid permission administer taxonomy.Rolefield_ui.test25FieldUITestCase->setUp()
Argument 1 passed to DrupalWebTestCase::drupalLogin() must be an instance of stdClass, boolean given, called in /var/lib/drupaltestbot/sites/default/files/checkout/modules/field_ui/field_ui.test on line 26 and definedRecoverable errordrupal_web_test_case.php1226DrupalWebTestCase->drupalLogin()
Trying to get property of non-objectNoticedrupal_web_test_case.php1232DrupalWebTestCase->drupalLogin()
Trying to get property of non-objectNoticedrupal_web_test_case.php1233DrupalWebTestCase->drupalLogin()
Failed to set field name to Otherfield_ui.test26FieldUITestCase->setUp()
Failed to set field pass to Otherfield_ui.test26FieldUITestCase->setUp()
Found the requested form fields at userOtherfield_ui.test26FieldUITestCase->setUp()
Trying to get property of non-objectNoticedrupal_web_test_case.php1239DrupalWebTestCase->drupalLogin()
User successfully logged in.User loginfield_ui.test26FieldUITestCase->setUp()
Failed to set field fields[_add_new_field][label] to Test fieldOtherfield_ui.test61FieldUITestCase->fieldUIAddNewField()
Failed to set field fields[_add_new_field][field_name] to testOtherfield_ui.test61FieldUITestCase->fieldUIAddNewField()
Failed to set field fields[_add_new_field][type] to test_fieldOtherfield_ui.test61FieldUITestCase->fieldUIAddNewField()
Failed to set field fields[_add_new_field][widget_type] to test_field_widgetOtherfield_ui.test61FieldUITestCase->fieldUIAddNewField()
Found the Save buttonOtherfield_ui.test61FieldUITestCase->fieldUIAddNewField()
Found the requested form fields at admin/structure/types/manage/sflzgzuc-test/fieldsOtherfield_ui.test61FieldUITestCase->fieldUIAddNewField()
Field settings page was displayed.Otherfield_ui.test62FieldUITestCase->fieldUIAddNewField()
Found the Save field settings buttonOtherfield_ui.test65FieldUITestCase->fieldUIAddNewField()
Found the requested form fields at Otherfield_ui.test65FieldUITestCase->fieldUIAddNewField()
Redirected to instance and widget settings page.Otherfield_ui.test66FieldUITestCase->fieldUIAddNewField()
Found the Save settings buttonOtherfield_ui.test69FieldUITestCase->fieldUIAddNewField()
Found the requested form fields at Otherfield_ui.test69FieldUITestCase->fieldUIAddNewField()
Redirected to "Manage fields" page.Otherfield_ui.test70FieldUITestCase->fieldUIAddNewField()
Field was created and appears in the overview page.Otherfield_ui.test73FieldUITestCase->fieldUIAddNewField()
The field is displayed as expected in view modes that use 'default' settings.Otherfield_ui.test543FieldUIManageDisplayTestCase->testViewModeCustom()
Failed to set field fields[field_test][type] to field_test_with_prepare_viewOtherfield_ui.test551FieldUIManageDisplayTestCase->testViewModeCustom()
Found the Save buttonOtherfield_ui.test551FieldUIManageDisplayTestCase->testViewModeCustom()
Found the requested form fields at admin/structure/types/manage/sflzgzuc-test/displayOtherfield_ui.test551FieldUIManageDisplayTestCase->testViewModeCustom()
The field is displayed as expected in view modes that use 'default' settings.Otherfield_ui.test552FieldUIManageDisplayTestCase->testViewModeCustom()
Failed to set field view_modes_custom[rss] to 1Otherfield_ui.test558FieldUIManageDisplayTestCase->testViewModeCustom()
Found the Save buttonOtherfield_ui.test558FieldUIManageDisplayTestCase->testViewModeCustom()
Found the requested form fields at admin/structure/types/manage/sflzgzuc-test/displayOtherfield_ui.test558FieldUIManageDisplayTestCase->testViewModeCustom()
The field is displayed as expected in newly specialized 'rss' mode.Otherfield_ui.test559FieldUIManageDisplayTestCase->testViewModeCustom()
Failed to set field fields[field_test][type] to hiddenOtherfield_ui.test566FieldUIManageDisplayTestCase->testViewModeCustom()
Found the Save buttonOtherfield_ui.test566FieldUIManageDisplayTestCase->testViewModeCustom()
Found the requested form fields at admin/structure/types/manage/sflzgzuc-test/display/rssOtherfield_ui.test566FieldUIManageDisplayTestCase->testViewModeCustom()
Failed to set field view_modes_custom[rss] to Otherfield_ui.test574FieldUIManageDisplayTestCase->testViewModeCustom()
Found the Save buttonOtherfield_ui.test574FieldUIManageDisplayTestCase->testViewModeCustom()
Found the requested form fields at admin/structure/types/manage/sflzgzuc-test/displayOtherfield_ui.test574FieldUIManageDisplayTestCase->testViewModeCustom()
The field is displayed as expected when 'rss' mode is set back to 'default' settings.Otherfield_ui.test575FieldUIManageDisplayTestCase->testViewModeCustom()
Failed to set field view_modes_custom[rss] to 1Otherfield_ui.test581FieldUIManageDisplayTestCase->testViewModeCustom()
Found the Save buttonOtherfield_ui.test581FieldUIManageDisplayTestCase->testViewModeCustom()
Found the requested form fields at admin/structure/types/manage/sflzgzuc-test/displayOtherfield_ui.test581FieldUIManageDisplayTestCase->testViewModeCustom()
ExpandManage fields (FieldUIManageFieldsTestCase) [Field UI]9274
MessageGroupFilenameLineFunctionStatus
The test did not complete due to a fatal error.Completion checkfield_ui.test160FieldUIManageFieldsTestCase->testCRUDFields()
Invalid permission administer taxonomy.Rolefield_ui.test25FieldUITestCase->setUp()
Argument 1 passed to DrupalWebTestCase::drupalLogin() must be an instance of stdClass, boolean given, called in /var/lib/drupaltestbot/sites/default/files/checkout/modules/field_ui/field_ui.test on line 26 and definedRecoverable errordrupal_web_test_case.php1226DrupalWebTestCase->drupalLogin()
Trying to get property of non-objectNoticedrupal_web_test_case.php1232DrupalWebTestCase->drupalLogin()
Trying to get property of non-objectNoticedrupal_web_test_case.php1233DrupalWebTestCase->drupalLogin()
Failed to set field name to Otherfield_ui.test26FieldUITestCase->setUp()
Failed to set field pass to Otherfield_ui.test26FieldUITestCase->setUp()
Found the requested form fields at userOtherfield_ui.test26FieldUITestCase->setUp()
Trying to get property of non-objectNoticedrupal_web_test_case.php1239DrupalWebTestCase->drupalLogin()
User successfully logged in.User loginfield_ui.test26FieldUITestCase->setUp()
Label table header was found.Otherfield_ui.test182FieldUIManageFieldsTestCase->manageFieldsPage()
Machine name table header was found.Otherfield_ui.test182FieldUIManageFieldsTestCase->manageFieldsPage()
Field table header was found.Otherfield_ui.test182FieldUIManageFieldsTestCase->manageFieldsPage()
Widget table header was found.Otherfield_ui.test182FieldUIManageFieldsTestCase->manageFieldsPage()
Operations table header was found.Otherfield_ui.test182FieldUIManageFieldsTestCase->manageFieldsPage()
"Add new field" was found.Otherfield_ui.test188FieldUIManageFieldsTestCase->manageFieldsPage()
"Add existing field" was found.Otherfield_ui.test188FieldUIManageFieldsTestCase->manageFieldsPage()
Failed to set field fields[_add_new_field][label] to dxNPixfQOtherfield_ui.test61FieldUITestCase->fieldUIAddNewField()
Failed to set field fields[_add_new_field][field_name] to umxvrondOtherfield_ui.test61FieldUITestCase->fieldUIAddNewField()
Failed to set field fields[_add_new_field][type] to test_fieldOtherfield_ui.test61FieldUITestCase->fieldUIAddNewField()
Failed to set field fields[_add_new_field][widget_type] to test_field_widgetOtherfield_ui.test61FieldUITestCase->fieldUIAddNewField()
Found the Save buttonOtherfield_ui.test61FieldUITestCase->fieldUIAddNewField()
Found the requested form fields at admin/structure/types/manage/d4s9ym0e-test/fieldsOtherfield_ui.test61FieldUITestCase->fieldUIAddNewField()
Field settings page was displayed.Otherfield_ui.test62FieldUITestCase->fieldUIAddNewField()
Found the Save field settings buttonOtherfield_ui.test65FieldUITestCase->fieldUIAddNewField()
Found the requested form fields at Otherfield_ui.test65FieldUITestCase->fieldUIAddNewField()
Redirected to instance and widget settings page.Otherfield_ui.test66FieldUITestCase->fieldUIAddNewField()
Found the Save settings buttonOtherfield_ui.test69FieldUITestCase->fieldUIAddNewField()
Found the requested form fields at Otherfield_ui.test69FieldUITestCase->fieldUIAddNewField()
Redirected to "Manage fields" page.Otherfield_ui.test70FieldUITestCase->fieldUIAddNewField()
Field was created and appears in the overview page.Otherfield_ui.test73FieldUITestCase->fieldUIAddNewField()
ExpandModule dependencies (ModuleDependencyTestCase) [Module]17310
MessageGroupFilenameLineFunctionStatus
"You must enable the Taxonomy, Options, Comment, Poll, PHP Filter modules to install Forum." foundOthersystem.test533ModuleDependencyTestCase->testModuleEnableOrder()
ExpandProfile browsing (ProfileTestBrowsing) [Profile]15225
MessageGroupFilenameLineFunctionStatus
Invalid permission administer blocks.Roleprofile.test19ProfileTestCase->setUp()
Argument 1 passed to DrupalWebTestCase::drupalLogin() must be an instance of stdClass, boolean given, called in /var/lib/drupaltestbot/sites/default/files/checkout/modules/profile/profile.test on line 472 and definedRecoverable errordrupal_web_test_case.php1226DrupalWebTestCase->drupalLogin()
Trying to get property of non-objectNoticedrupal_web_test_case.php1232DrupalWebTestCase->drupalLogin()
Trying to get property of non-objectNoticedrupal_web_test_case.php1233DrupalWebTestCase->drupalLogin()
Failed to set field name to Otherprofile.test472ProfileTestBrowsing->testProfileBrowsing()
Failed to set field pass to Otherprofile.test472ProfileTestBrowsing->testProfileBrowsing()
Found the requested form fields at userOtherprofile.test472ProfileTestBrowsing->testProfileBrowsing()
Trying to get property of non-objectNoticedrupal_web_test_case.php1239DrupalWebTestCase->drupalLogin()
User successfully logged in.User loginprofile.test472ProfileTestBrowsing->testProfileBrowsing()
Failed to set field page to %valueOtherprofile.test43ProfileTestCase->createProfileField()
Failed to set field title to n6KN3Y8MOtherprofile.test43ProfileTestCase->createProfileField()
Failed to set field name to profile_n6KN3Y8MOtherprofile.test43ProfileTestCase->createProfileField()
Failed to set field category to simpletestOtherprofile.test43ProfileTestCase->createProfileField()
Failed to set field explanation to cSdXmqO7EP9NY6VVvJy7HmBLj8pk4tLNAIkqcwIDOhTtB5Znb7Otherprofile.test43ProfileTestCase->createProfileField()
Found the Save field buttonOtherprofile.test43ProfileTestCase->createProfileField()
Found the requested form fields at admin/config/people/profile/add/listOtherprofile.test43ProfileTestCase->createProfileField()
New Profile field has been entered in the databaseOtherprofile.test45ProfileTestCase->createProfileField()
Trying to get property of non-objectNoticeprofile.test48ProfileTestCase->createProfileField()
Found form named profile_n6KN3Y8MOtherprofile.test57ProfileTestCase->createProfileField()
Checking title for field n6KN3Y8MOtherprofile.test61ProfileTestCase->createProfileField()
Checking explanation for field n6KN3Y8MOtherprofile.test63ProfileTestCase->createProfileField()
Failed to set field profile_n6KN3Y8M to jS7hsGsGOtherprofile.test140ProfileTestCase->setProfileField()
Found the Save buttonOtherprofile.test140ProfileTestCase->setProfileField()
Found the requested form fields at user/2/edit/simpletestOtherprofile.test140ProfileTestCase->setProfileField()
Found profile field with title n6KN3Y8MOtherprofile.test144ProfileTestCase->setProfileField()
Found profile field with value jS7hsGsGOtherprofile.test148ProfileTestCase->setProfileField()
"uzd6k6FP" foundOtherprofile.test480ProfileTestBrowsing->testProfileBrowsing()
ExpandProfile CRUD tests (ProfileCrudTestCase) [Profile]210
MessageGroupFilenameLineFunctionStatus
Invalid permission administer blocks.Roleprofile.test19ProfileTestCase->setUp()
ExpandRDF mapping CRUD functions (RdfCrudTestCase) [RDF]010
MessageGroupFilenameLineFunctionStatus
The test did not complete due to a fatal error.Completion checkrdf.test229RdfCrudTestCase->testCRUD()
ExpandRDF mapping hook (RdfMappingHookTestCase) [RDF]010
MessageGroupFilenameLineFunctionStatus
The test did not complete due to a fatal error.Completion checkrdf.test24RdfMappingHookTestCase->testMapping()
ExpandRDF namespaces (RdfGetRdfNamespacesTestCase) [RDF]010
MessageGroupFilenameLineFunctionStatus
The test did not complete due to a fatal error.Completion checkrdf.test712RdfGetRdfNamespacesTestCase->testGetRdfNamespaces()
ExpandRDF namespaces XML serialization tests (DrupalGetRdfNamespacesTestCase) [System]010
MessageGroupFilenameLineFunctionStatus
The test did not complete due to a fatal error.Completion checkcommon.test2454DrupalGetRdfNamespacesTestCase->testGetRdfNamespaces()
ExpandTest date field (ProfileTestDate) [Profile]22376
MessageGroupFilenameLineFunctionStatus
Invalid permission administer blocks.Roleprofile.test19ProfileTestCase->setUp()
Argument 1 passed to DrupalWebTestCase::drupalLogin() must be an instance of stdClass, boolean given, called in /var/lib/drupaltestbot/sites/default/files/checkout/modules/profile/profile.test on line 257 and definedRecoverable errordrupal_web_test_case.php1226DrupalWebTestCase->drupalLogin()
Trying to get property of non-objectNoticedrupal_web_test_case.php1232DrupalWebTestCase->drupalLogin()
Trying to get property of non-objectNoticedrupal_web_test_case.php1233DrupalWebTestCase->drupalLogin()
Failed to set field name to Otherprofile.test257ProfileTestDate->testProfileDateField()
Failed to set field pass to Otherprofile.test257ProfileTestDate->testProfileDateField()
Found the requested form fields at userOtherprofile.test257ProfileTestDate->testProfileDateField()
Trying to get property of non-objectNoticedrupal_web_test_case.php1239DrupalWebTestCase->drupalLogin()
User successfully logged in.User loginprofile.test257ProfileTestDate->testProfileDateField()
Failed to set field title to xwROlfmSOtherprofile.test43ProfileTestCase->createProfileField()
Failed to set field name to profile_xwROlfmSOtherprofile.test43ProfileTestCase->createProfileField()
Failed to set field category to simpletestOtherprofile.test43ProfileTestCase->createProfileField()
Failed to set field explanation to qsBv7Kg3AgeA5MsE94FyswCuHivWtoV2Zu7wJ1ZBbseoRhEt1QOtherprofile.test43ProfileTestCase->createProfileField()
Found the Save field buttonOtherprofile.test43ProfileTestCase->createProfileField()
Found the requested form fields at admin/config/people/profile/add/dateOtherprofile.test43ProfileTestCase->createProfileField()
New Profile field has been entered in the databaseOtherprofile.test45ProfileTestCase->createProfileField()
Trying to get property of non-objectNoticeprofile.test48ProfileTestCase->createProfileField()
Found month selection fieldOtherprofile.test52ProfileTestCase->createProfileField()
Found day selection fieldOtherprofile.test53ProfileTestCase->createProfileField()
Found day selection fieldOtherprofile.test54ProfileTestCase->createProfileField()
Checking title for field xwROlfmSOtherprofile.test61ProfileTestCase->createProfileField()
Checking explanation for field xwROlfmSOtherprofile.test63ProfileTestCase->createProfileField()
Failed to set field profile_xwROlfmS[month] to 1Otherprofile.test269ProfileTestDate->testProfileDateField()
Failed to set field profile_xwROlfmS[day] to 9Otherprofile.test269ProfileTestDate->testProfileDateField()
Failed to set field profile_xwROlfmS[year] to 1983Otherprofile.test269ProfileTestDate->testProfileDateField()
Found the Save buttonOtherprofile.test269ProfileTestDate->testProfileDateField()
Found the requested form fields at user/2/edit/simpletestOtherprofile.test269ProfileTestDate->testProfileDateField()
Found profile field with title xwROlfmSOtherprofile.test273ProfileTestDate->testProfileDateField()
Found date profile field.Otherprofile.test275ProfileTestDate->testProfileDateField()
Failed to set field name to profile_xwROlfmSOtherprofile.test92ProfileTestCase->updateProfileField()
Failed to set field title to dh3MzzVtOtherprofile.test92ProfileTestCase->updateProfileField()
Failed to set field category to simpletestOtherprofile.test92ProfileTestCase->updateProfileField()
Failed to set field explanation to koYBvYcOOtherprofile.test92ProfileTestCase->updateProfileField()
Found the Save field buttonOtherprofile.test92ProfileTestCase->updateProfileField()
Found the requested form fields at admin/config/people/profile/edit/Otherprofile.test92ProfileTestCase->updateProfileField()
Trying to get property of non-objectNoticeprofile.test95ProfileTestCase->updateProfileField()
Found month selection fieldOtherprofile.test99ProfileTestCase->updateProfileField()
Found day selection fieldOtherprofile.test100ProfileTestCase->updateProfileField()
Found day selection fieldOtherprofile.test101ProfileTestCase->updateProfileField()
Checking title for field dh3MzzVtOtherprofile.test108ProfileTestCase->updateProfileField()
Checking explanation for field dh3MzzVtOtherprofile.test110ProfileTestCase->updateProfileField()
Found the Delete buttonOtherprofile.test161ProfileTestCase->deleteProfileField()
Found the requested form fields at admin/config/people/profile/delete/Otherprofile.test161ProfileTestCase->deleteProfileField()
ExpandTest field weights (ProfileTestWeights) [Profile]25396
MessageGroupFilenameLineFunctionStatus
Invalid permission administer blocks.Roleprofile.test19ProfileTestCase->setUp()
Argument 1 passed to DrupalWebTestCase::drupalLogin() must be an instance of stdClass, boolean given, called in /var/lib/drupaltestbot/sites/default/files/checkout/modules/profile/profile.test on line 298 and definedRecoverable errordrupal_web_test_case.php1226DrupalWebTestCase->drupalLogin()
Trying to get property of non-objectNoticedrupal_web_test_case.php1232DrupalWebTestCase->drupalLogin()
Trying to get property of non-objectNoticedrupal_web_test_case.php1233DrupalWebTestCase->drupalLogin()
Failed to set field name to Otherprofile.test298ProfileTestWeights->testProfileFieldWeights()
Failed to set field pass to Otherprofile.test298ProfileTestWeights->testProfileFieldWeights()
Found the requested form fields at userOtherprofile.test298ProfileTestWeights->testProfileFieldWeights()
Trying to get property of non-objectNoticedrupal_web_test_case.php1239DrupalWebTestCase->drupalLogin()
User successfully logged in.User loginprofile.test298ProfileTestWeights->testProfileFieldWeights()
Failed to set field weight to 1Otherprofile.test43ProfileTestCase->createProfileField()
Failed to set field title to nyYUzRyDOtherprofile.test43ProfileTestCase->createProfileField()
Failed to set field name to profile_nyYUzRyDOtherprofile.test43ProfileTestCase->createProfileField()
Failed to set field category to nAZ99PzuOtherprofile.test43ProfileTestCase->createProfileField()
Failed to set field explanation to vLdIZkkpANVAu3o35MOr2unzFVSMBhyVhwOnzm7tGdacxNKILvOtherprofile.test43ProfileTestCase->createProfileField()
Found the Save field buttonOtherprofile.test43ProfileTestCase->createProfileField()
Found the requested form fields at admin/config/people/profile/add/textfieldOtherprofile.test43ProfileTestCase->createProfileField()
New Profile field has been entered in the databaseOtherprofile.test45ProfileTestCase->createProfileField()
Trying to get property of non-objectNoticeprofile.test48ProfileTestCase->createProfileField()
Found form named profile_nyYUzRyDOtherprofile.test57ProfileTestCase->createProfileField()
Checking title for field nyYUzRyDOtherprofile.test61ProfileTestCase->createProfileField()
Checking explanation for field nyYUzRyDOtherprofile.test63ProfileTestCase->createProfileField()
Failed to set field weight to -1Otherprofile.test43ProfileTestCase->createProfileField()
Failed to set field title to hIYnfcVvOtherprofile.test43ProfileTestCase->createProfileField()
Failed to set field name to profile_hIYnfcVvOtherprofile.test43ProfileTestCase->createProfileField()
Failed to set field category to nAZ99PzuOtherprofile.test43ProfileTestCase->createProfileField()
Failed to set field explanation to zzV5abcgnRXrI5cRVi6hUSwDx2anglWIhojlqaJNeyk1bwtBTnOtherprofile.test43ProfileTestCase->createProfileField()
Found the Save field buttonOtherprofile.test43ProfileTestCase->createProfileField()
Found the requested form fields at admin/config/people/profile/add/textfieldOtherprofile.test43ProfileTestCase->createProfileField()
New Profile field has been entered in the databaseOtherprofile.test45ProfileTestCase->createProfileField()
Trying to get property of non-objectNoticeprofile.test48ProfileTestCase->createProfileField()
Found form named profile_hIYnfcVvOtherprofile.test57ProfileTestCase->createProfileField()
Checking title for field hIYnfcVvOtherprofile.test61ProfileTestCase->createProfileField()
Checking explanation for field hIYnfcVvOtherprofile.test63ProfileTestCase->createProfileField()
Failed to set field profile_nyYUzRyD to bincXVnUOtherprofile.test140ProfileTestCase->setProfileField()
Found the Save buttonOtherprofile.test140ProfileTestCase->setProfileField()
Found the requested form fields at user/2/edit/nAZ99PzuOtherprofile.test140ProfileTestCase->setProfileField()
Found profile field with title nyYUzRyDOtherprofile.test144ProfileTestCase->setProfileField()
Found profile field with value bincXVnUOtherprofile.test148ProfileTestCase->setProfileField()
Failed to set field profile_hIYnfcVv to dn6affFROtherprofile.test140ProfileTestCase->setProfileField()
Found the Save buttonOtherprofile.test140ProfileTestCase->setProfileField()
Found the requested form fields at user/2/edit/nAZ99PzuOtherprofile.test140ProfileTestCase->setProfileField()
Found profile field with title hIYnfcVvOtherprofile.test144ProfileTestCase->setProfileField()
Found profile field with value dn6affFROtherprofile.test148ProfileTestCase->setProfileField()
Profile field weights are respected on the user edit form.Otherprofile.test308ProfileTestWeights->testProfileFieldWeights()
Profile field weights are respected on the user profile page.Otherprofile.test311ProfileTestWeights->testProfileFieldWeights()
ExpandTest select field (ProfileTestSelect) [Profile]23316
MessageGroupFilenameLineFunctionStatus
Invalid permission administer blocks.Roleprofile.test19ProfileTestCase->setUp()
Argument 1 passed to DrupalWebTestCase::drupalLogin() must be an instance of stdClass, boolean given, called in /var/lib/drupaltestbot/sites/default/files/checkout/modules/profile/profile.test on line 224 and definedRecoverable errordrupal_web_test_case.php1226DrupalWebTestCase->drupalLogin()
Trying to get property of non-objectNoticedrupal_web_test_case.php1232DrupalWebTestCase->drupalLogin()
Trying to get property of non-objectNoticedrupal_web_test_case.php1233DrupalWebTestCase->drupalLogin()
Failed to set field name to Otherprofile.test224ProfileTestSelect->testProfileSelectionField()
Failed to set field pass to Otherprofile.test224ProfileTestSelect->testProfileSelectionField()
Found the requested form fields at userOtherprofile.test224ProfileTestSelect->testProfileSelectionField()
Trying to get property of non-objectNoticedrupal_web_test_case.php1239DrupalWebTestCase->drupalLogin()
User successfully logged in.User loginprofile.test224ProfileTestSelect->testProfileSelectionField()
Failed to set field options to 1 2 3 4 5 6 7 8 9 10Otherprofile.test43ProfileTestCase->createProfileField()
Failed to set field title to hR4YCCAEOtherprofile.test43ProfileTestCase->createProfileField()
Failed to set field name to profile_hR4YCCAEOtherprofile.test43ProfileTestCase->createProfileField()
Failed to set field category to simpletestOtherprofile.test43ProfileTestCase->createProfileField()
Failed to set field explanation to bO6DSP2EaAPD2vVitMO4xU5sF9zvxE52NPe7vLQYLwUnz2Vw0LOtherprofile.test43ProfileTestCase->createProfileField()
Found the Save field buttonOtherprofile.test43ProfileTestCase->createProfileField()
Found the requested form fields at admin/config/people/profile/add/selectionOtherprofile.test43ProfileTestCase->createProfileField()
New Profile field has been entered in the databaseOtherprofile.test45ProfileTestCase->createProfileField()
Trying to get property of non-objectNoticeprofile.test48ProfileTestCase->createProfileField()
Found form named profile_hR4YCCAEOtherprofile.test57ProfileTestCase->createProfileField()
Checking title for field hR4YCCAEOtherprofile.test61ProfileTestCase->createProfileField()
Checking explanation for field hR4YCCAEOtherprofile.test63ProfileTestCase->createProfileField()
Failed to set field profile_hR4YCCAE to 6Otherprofile.test140ProfileTestCase->setProfileField()
Found the Save buttonOtherprofile.test140ProfileTestCase->setProfileField()
Found the requested form fields at user/2/edit/simpletestOtherprofile.test140ProfileTestCase->setProfileField()
Found profile field with title hR4YCCAEOtherprofile.test144ProfileTestCase->setProfileField()
Failed to set field name to profile_hR4YCCAEOtherprofile.test92ProfileTestCase->updateProfileField()
Failed to set field title to bKUmmsMKOtherprofile.test92ProfileTestCase->updateProfileField()
Failed to set field category to simpletestOtherprofile.test92ProfileTestCase->updateProfileField()
Failed to set field explanation to zmVfOQ9IOtherprofile.test92ProfileTestCase->updateProfileField()
Found the Save field buttonOtherprofile.test92ProfileTestCase->updateProfileField()
Found the requested form fields at admin/config/people/profile/edit/Otherprofile.test92ProfileTestCase->updateProfileField()
Trying to get property of non-objectNoticeprofile.test95ProfileTestCase->updateProfileField()
Found form named profile_hR4YCCAEOtherprofile.test104ProfileTestCase->updateProfileField()
Checking title for field bKUmmsMKOtherprofile.test108ProfileTestCase->updateProfileField()
Checking explanation for field bKUmmsMKOtherprofile.test110ProfileTestCase->updateProfileField()
Found the Delete buttonOtherprofile.test161ProfileTestCase->deleteProfileField()
Found the requested form fields at admin/config/people/profile/delete/Otherprofile.test161ProfileTestCase->deleteProfileField()
ExpandTest single fields (ProfileTestFields) [Profile]9013414
MessageGroupFilenameLineFunctionStatus
Invalid permission administer blocks.Roleprofile.test19ProfileTestCase->setUp()
Argument 1 passed to DrupalWebTestCase::drupalLogin() must be an instance of stdClass, boolean given, called in /var/lib/drupaltestbot/sites/default/files/checkout/modules/profile/profile.test on line 181 and definedRecoverable errordrupal_web_test_case.php1226DrupalWebTestCase->drupalLogin()
Trying to get property of non-objectNoticedrupal_web_test_case.php1232DrupalWebTestCase->drupalLogin()
Trying to get property of non-objectNoticedrupal_web_test_case.php1233DrupalWebTestCase->drupalLogin()
Failed to set field name to Otherprofile.test181ProfileTestFields->testProfileFields()
Failed to set field pass to Otherprofile.test181ProfileTestFields->testProfileFields()
Found the requested form fields at userOtherprofile.test181ProfileTestFields->testProfileFields()
Trying to get property of non-objectNoticedrupal_web_test_case.php1239DrupalWebTestCase->drupalLogin()
User successfully logged in.User loginprofile.test181ProfileTestFields->testProfileFields()
Failed to set field title to bK6WaiYuOtherprofile.test43ProfileTestCase->createProfileField()
Failed to set field name to profile_bK6WaiYuOtherprofile.test43ProfileTestCase->createProfileField()
Failed to set field category to simpletestOtherprofile.test43ProfileTestCase->createProfileField()
Failed to set field explanation to v8bSgnemD6S7Y0uGx7Il8gY5MibFincyh6kyEfCdB8fvOo0iWdOtherprofile.test43ProfileTestCase->createProfileField()
Found the Save field buttonOtherprofile.test43ProfileTestCase->createProfileField()
Found the requested form fields at admin/config/people/profile/add/textfieldOtherprofile.test43ProfileTestCase->createProfileField()
New Profile field has been entered in the databaseOtherprofile.test45ProfileTestCase->createProfileField()
Trying to get property of non-objectNoticeprofile.test48ProfileTestCase->createProfileField()
Found form named profile_bK6WaiYuOtherprofile.test57ProfileTestCase->createProfileField()
Checking title for field bK6WaiYuOtherprofile.test61ProfileTestCase->createProfileField()
Checking explanation for field bK6WaiYuOtherprofile.test63ProfileTestCase->createProfileField()
Failed to set field profile_bK6WaiYu to cFj7QS01Otherprofile.test140ProfileTestCase->setProfileField()
Found the Save buttonOtherprofile.test140ProfileTestCase->setProfileField()
Found the requested form fields at user/2/edit/simpletestOtherprofile.test140ProfileTestCase->setProfileField()
Found profile field with title bK6WaiYuOtherprofile.test144ProfileTestCase->setProfileField()
Found profile field with value cFj7QS01Otherprofile.test148ProfileTestCase->setProfileField()
Failed to set field name to profile_bK6WaiYuOtherprofile.test92ProfileTestCase->updateProfileField()
Failed to set field title to cWRlWi1OOtherprofile.test92ProfileTestCase->updateProfileField()
Failed to set field category to simpletestOtherprofile.test92ProfileTestCase->updateProfileField()
Failed to set field explanation to dqTtsh8kOtherprofile.test92ProfileTestCase->updateProfileField()
Found the Save field buttonOtherprofile.test92ProfileTestCase->updateProfileField()
Found the requested form fields at admin/config/people/profile/edit/Otherprofile.test92ProfileTestCase->updateProfileField()
Trying to get property of non-objectNoticeprofile.test95ProfileTestCase->updateProfileField()
Found form named profile_bK6WaiYuOtherprofile.test104ProfileTestCase->updateProfileField()
Checking title for field cWRlWi1OOtherprofile.test108ProfileTestCase->updateProfileField()
Checking explanation for field cWRlWi1OOtherprofile.test110ProfileTestCase->updateProfileField()
Found the Delete buttonOtherprofile.test161ProfileTestCase->deleteProfileField()
Found the requested form fields at admin/config/people/profile/delete/Otherprofile.test161ProfileTestCase->deleteProfileField()
Failed to set field title to s891qU42Otherprofile.test43ProfileTestCase->createProfileField()
Failed to set field name to profile_s891qU42Otherprofile.test43ProfileTestCase->createProfileField()
Failed to set field category to simpletestOtherprofile.test43ProfileTestCase->createProfileField()
Failed to set field explanation to fN75xHXE0AzteCzMXfABVtcyjIPtot7Bm7chfrDrStqpU1W0s9Otherprofile.test43ProfileTestCase->createProfileField()
Found the Save field buttonOtherprofile.test43ProfileTestCase->createProfileField()
Found the requested form fields at admin/config/people/profile/add/textareaOtherprofile.test43ProfileTestCase->createProfileField()
New Profile field has been entered in the databaseOtherprofile.test45ProfileTestCase->createProfileField()
Trying to get property of non-objectNoticeprofile.test48ProfileTestCase->createProfileField()
Found form named profile_s891qU42Otherprofile.test57ProfileTestCase->createProfileField()
Checking title for field s891qU42Otherprofile.test61ProfileTestCase->createProfileField()
Checking explanation for field s891qU42Otherprofile.test63ProfileTestCase->createProfileField()
Failed to set field profile_s891qU42 to ujXWcBxJOtherprofile.test140ProfileTestCase->setProfileField()
Found the Save buttonOtherprofile.test140ProfileTestCase->setProfileField()
Found the requested form fields at user/2/edit/simpletestOtherprofile.test140ProfileTestCase->setProfileField()
Found profile field with title s891qU42Otherprofile.test144ProfileTestCase->setProfileField()
Found profile field with value ujXWcBxJOtherprofile.test148ProfileTestCase->setProfileField()
Failed to set field name to profile_s891qU42Otherprofile.test92ProfileTestCase->updateProfileField()
Failed to set field title to jM9GBk7jOtherprofile.test92ProfileTestCase->updateProfileField()
Failed to set field category to simpletestOtherprofile.test92ProfileTestCase->updateProfileField()
Failed to set field explanation to pCxw3UHtOtherprofile.test92ProfileTestCase->updateProfileField()
Found the Save field buttonOtherprofile.test92ProfileTestCase->updateProfileField()
Found the requested form fields at admin/config/people/profile/edit/Otherprofile.test92ProfileTestCase->updateProfileField()
Trying to get property of non-objectNoticeprofile.test95ProfileTestCase->updateProfileField()
Found form named profile_s891qU42Otherprofile.test104ProfileTestCase->updateProfileField()
Checking title for field jM9GBk7jOtherprofile.test108ProfileTestCase->updateProfileField()
Checking explanation for field jM9GBk7jOtherprofile.test110ProfileTestCase->updateProfileField()
Found the Delete buttonOtherprofile.test161ProfileTestCase->deleteProfileField()
Found the requested form fields at admin/config/people/profile/delete/Otherprofile.test161ProfileTestCase->deleteProfileField()
Failed to set field title to r3YZrY50Otherprofile.test43ProfileTestCase->createProfileField()
Failed to set field name to profile_r3YZrY50Otherprofile.test43ProfileTestCase->createProfileField()
Failed to set field category to simpletestOtherprofile.test43ProfileTestCase->createProfileField()
Failed to set field explanation to haUuIW6gbZeLMeWdlDgI4TuSL3KOT8tRUNiYNWSnlgZTuaazgTOtherprofile.test43ProfileTestCase->createProfileField()
Found the Save field buttonOtherprofile.test43ProfileTestCase->createProfileField()
Found the requested form fields at admin/config/people/profile/add/listOtherprofile.test43ProfileTestCase->createProfileField()
New Profile field has been entered in the databaseOtherprofile.test45ProfileTestCase->createProfileField()
Trying to get property of non-objectNoticeprofile.test48ProfileTestCase->createProfileField()
Found form named profile_r3YZrY50Otherprofile.test57ProfileTestCase->createProfileField()
Checking title for field r3YZrY50Otherprofile.test61ProfileTestCase->createProfileField()
Checking explanation for field r3YZrY50Otherprofile.test63ProfileTestCase->createProfileField()
Failed to set field profile_r3YZrY50 to zXmrp27xOtherprofile.test140ProfileTestCase->setProfileField()
Found the Save buttonOtherprofile.test140ProfileTestCase->setProfileField()
Found the requested form fields at user/2/edit/simpletestOtherprofile.test140ProfileTestCase->setProfileField()
Found profile field with title r3YZrY50Otherprofile.test144ProfileTestCase->setProfileField()
Found profile field with value zXmrp27xOtherprofile.test148ProfileTestCase->setProfileField()
Failed to set field name to profile_r3YZrY50Otherprofile.test92ProfileTestCase->updateProfileField()
Failed to set field title to fJmAJtutOtherprofile.test92ProfileTestCase->updateProfileField()
Failed to set field category to simpletestOtherprofile.test92ProfileTestCase->updateProfileField()
Failed to set field explanation to tCf5gYjQOtherprofile.test92ProfileTestCase->updateProfileField()
Found the Save field buttonOtherprofile.test92ProfileTestCase->updateProfileField()
Found the requested form fields at admin/config/people/profile/edit/Otherprofile.test92ProfileTestCase->updateProfileField()
Trying to get property of non-objectNoticeprofile.test95ProfileTestCase->updateProfileField()
Found form named profile_r3YZrY50Otherprofile.test104ProfileTestCase->updateProfileField()
Checking title for field fJmAJtutOtherprofile.test108ProfileTestCase->updateProfileField()
Checking explanation for field fJmAJtutOtherprofile.test110ProfileTestCase->updateProfileField()
Found the Delete buttonOtherprofile.test161ProfileTestCase->deleteProfileField()
Found the requested form fields at admin/config/people/profile/delete/Otherprofile.test161ProfileTestCase->deleteProfileField()
Failed to set field title to oF0jePKPOtherprofile.test43ProfileTestCase->createProfileField()
Failed to set field name to profile_oF0jePKPOtherprofile.test43ProfileTestCase->createProfileField()
Failed to set field category to simpletestOtherprofile.test43ProfileTestCase->createProfileField()
Failed to set field explanation to r4FWIiM0xCwDXtWzZMLnw06s0etZ1uugfygQOtjcSb1agX32jbOtherprofile.test43ProfileTestCase->createProfileField()
Found the Save field buttonOtherprofile.test43ProfileTestCase->createProfileField()
Found the requested form fields at admin/config/people/profile/add/checkboxOtherprofile.test43ProfileTestCase->createProfileField()
New Profile field has been entered in the databaseOtherprofile.test45ProfileTestCase->createProfileField()
Trying to get property of non-objectNoticeprofile.test48ProfileTestCase->createProfileField()
Found form named profile_oF0jePKPOtherprofile.test57ProfileTestCase->createProfileField()
Checking title for field oF0jePKPOtherprofile.test61ProfileTestCase->createProfileField()
Checking explanation for field oF0jePKPOtherprofile.test63ProfileTestCase->createProfileField()
Failed to set field profile_oF0jePKP to 1Otherprofile.test140ProfileTestCase->setProfileField()
Found the Save buttonOtherprofile.test140ProfileTestCase->setProfileField()
Found the requested form fields at user/2/edit/simpletestOtherprofile.test140ProfileTestCase->setProfileField()
Found profile field with title oF0jePKPOtherprofile.test144ProfileTestCase->setProfileField()
Failed to set field name to profile_oF0jePKPOtherprofile.test92ProfileTestCase->updateProfileField()
Failed to set field title to ih9MBl8mOtherprofile.test92ProfileTestCase->updateProfileField()
Failed to set field category to simpletestOtherprofile.test92ProfileTestCase->updateProfileField()
Failed to set field explanation to gQEKJ8QNOtherprofile.test92ProfileTestCase->updateProfileField()
Found the Save field buttonOtherprofile.test92ProfileTestCase->updateProfileField()
Found the requested form fields at admin/config/people/profile/edit/Otherprofile.test92ProfileTestCase->updateProfileField()
Trying to get property of non-objectNoticeprofile.test95ProfileTestCase->updateProfileField()
Found form named profile_oF0jePKPOtherprofile.test104ProfileTestCase->updateProfileField()
Checking title for field ih9MBl8mOtherprofile.test108ProfileTestCase->updateProfileField()
Checking explanation for field ih9MBl8mOtherprofile.test110ProfileTestCase->updateProfileField()
Found the Delete buttonOtherprofile.test161ProfileTestCase->deleteProfileField()
Found the requested form fields at admin/config/people/profile/delete/Otherprofile.test161ProfileTestCase->deleteProfileField()
Failed to set field title to wEiePK9LOtherprofile.test43ProfileTestCase->createProfileField()
Failed to set field name to profile_wEiePK9LOtherprofile.test43ProfileTestCase->createProfileField()
Failed to set field category to simpletestOtherprofile.test43ProfileTestCase->createProfileField()
Failed to set field explanation to k4IRRLsSvEBIPtlesMi0Rsx9VhiaiffSEOKjkzhaiCUzUHjUDxOtherprofile.test43ProfileTestCase->createProfileField()
Found the Save field buttonOtherprofile.test43ProfileTestCase->createProfileField()
Found the requested form fields at admin/config/people/profile/add/urlOtherprofile.test43ProfileTestCase->createProfileField()
New Profile field has been entered in the databaseOtherprofile.test45ProfileTestCase->createProfileField()
Trying to get property of non-objectNoticeprofile.test48ProfileTestCase->createProfileField()
Found form named profile_wEiePK9LOtherprofile.test57ProfileTestCase->createProfileField()
Checking title for field wEiePK9LOtherprofile.test61ProfileTestCase->createProfileField()
Checking explanation for field wEiePK9LOtherprofile.test63ProfileTestCase->createProfileField()
Failed to set field profile_wEiePK9L to http://www.frR5i3N1Wg.orgOtherprofile.test140ProfileTestCase->setProfileField()
Found the Save buttonOtherprofile.test140ProfileTestCase->setProfileField()
Found the requested form fields at user/2/edit/simpletestOtherprofile.test140ProfileTestCase->setProfileField()
Found profile field with title wEiePK9LOtherprofile.test144ProfileTestCase->setProfileField()
Found profile field with value http://www.frR5i3N1Wg.orgOtherprofile.test148ProfileTestCase->setProfileField()
Failed to set field name to profile_wEiePK9LOtherprofile.test92ProfileTestCase->updateProfileField()
Failed to set field title to n2XvjjH2Otherprofile.test92ProfileTestCase->updateProfileField()
Failed to set field category to simpletestOtherprofile.test92ProfileTestCase->updateProfileField()
Failed to set field explanation to sASir1knOtherprofile.test92ProfileTestCase->updateProfileField()
Found the Save field buttonOtherprofile.test92ProfileTestCase->updateProfileField()
Found the requested form fields at admin/config/people/profile/edit/Otherprofile.test92ProfileTestCase->updateProfileField()
Trying to get property of non-objectNoticeprofile.test95ProfileTestCase->updateProfileField()
Found form named profile_wEiePK9LOtherprofile.test104ProfileTestCase->updateProfileField()
Checking title for field n2XvjjH2Otherprofile.test108ProfileTestCase->updateProfileField()
Checking explanation for field n2XvjjH2Otherprofile.test110ProfileTestCase->updateProfileField()
Found the Delete buttonOtherprofile.test161ProfileTestCase->deleteProfileField()
Found the requested form fields at admin/config/people/profile/delete/Otherprofile.test161ProfileTestCase->deleteProfileField()
ExpandTest user actions (TriggerUserActionTestCase) [Trigger]13259
MessageGroupFilenameLineFunctionStatus
Invalid permission create article content.Roletrigger.test504TriggerUserActionTestCase->testUserActionAssignmentExecution()
Invalid permission access comments.Roletrigger.test504TriggerUserActionTestCase->testUserActionAssignmentExecution()
Invalid permission administer comments.Roletrigger.test504TriggerUserActionTestCase->testUserActionAssignmentExecution()
Invalid permission skip comment approval.Roletrigger.test504TriggerUserActionTestCase->testUserActionAssignmentExecution()
Invalid permission edit own comments.Roletrigger.test504TriggerUserActionTestCase->testUserActionAssignmentExecution()
Argument 1 passed to DrupalWebTestCase::drupalLogin() must be an instance of stdClass, boolean given, called in /var/lib/drupaltestbot/sites/default/files/checkout/modules/trigger/trigger.test on line 505 and definedRecoverable errordrupal_web_test_case.php1226DrupalWebTestCase->drupalLogin()
Trying to get property of non-objectNoticedrupal_web_test_case.php1232DrupalWebTestCase->drupalLogin()
Trying to get property of non-objectNoticedrupal_web_test_case.php1233DrupalWebTestCase->drupalLogin()
Failed to set field name to Othertrigger.test505TriggerUserActionTestCase->testUserActionAssignmentExecution()
Failed to set field pass to Othertrigger.test505TriggerUserActionTestCase->testUserActionAssignmentExecution()
Found the requested form fields at userOthertrigger.test505TriggerUserActionTestCase->testUserActionAssignmentExecution()
Trying to get property of non-objectNoticedrupal_web_test_case.php1239DrupalWebTestCase->drupalLogin()
User successfully logged in.User logintrigger.test505TriggerUserActionTestCase->testUserActionAssignmentExecution()
Failed to set field aid to yaTqy7bmnYJ6r1fXPw4VFTrvUwdnohYrF5kvg9scbRIOthertrigger.test322TriggerActionTestCase->assignSimpleAction()
Found the Assign buttonOthertrigger.test322TriggerActionTestCase->assignSimpleAction()
Found the requested form fields at admin/structure/trigger/commentOthertrigger.test322TriggerActionTestCase->assignSimpleAction()
Simple action user_block_user_action assigned to trigger comment_presaveOthertrigger.test324TriggerActionTestCase->assignSimpleAction()
Failed to set field aid to yaTqy7bmnYJ6r1fXPw4VFTrvUwdnohYrF5kvg9scbRIOthertrigger.test322TriggerActionTestCase->assignSimpleAction()
Found the Assign buttonOthertrigger.test322TriggerActionTestCase->assignSimpleAction()
Found the requested form fields at admin/structure/trigger/commentOthertrigger.test322TriggerActionTestCase->assignSimpleAction()
Simple action user_block_user_action assigned to trigger comment_insertOthertrigger.test324TriggerActionTestCase->assignSimpleAction()
Failed to set field aid to yaTqy7bmnYJ6r1fXPw4VFTrvUwdnohYrF5kvg9scbRIOthertrigger.test322TriggerActionTestCase->assignSimpleAction()
Found the Assign buttonOthertrigger.test322TriggerActionTestCase->assignSimpleAction()
Found the requested form fields at admin/structure/trigger/commentOthertrigger.test322TriggerActionTestCase->assignSimpleAction()
Simple action user_block_user_action assigned to trigger comment_updateOthertrigger.test324TriggerActionTestCase->assignSimpleAction()
Failed to set field comment_body[und][0][value] to my commentOthertrigger.test517TriggerUserActionTestCase->testUserActionAssignmentExecution()
Failed to set field subject to my comment subjectOthertrigger.test517TriggerUserActionTestCase->testUserActionAssignmentExecution()
Found the Save buttonOthertrigger.test517TriggerUserActionTestCase->testUserActionAssignmentExecution()
Found the requested form fields at node/1Othertrigger.test517TriggerUserActionTestCase->testUserActionAssignmentExecution()
Trying to get property of non-objectNoticetrigger.test519TriggerUserActionTestCase->testUserActionAssignmentExecution()
array_flip(): Can only flip STRING and INTEGER values!Warningentity.inc178DrupalDefaultEntityController->load()
Trying to get property of non-objectNoticetrigger.test520TriggerUserActionTestCase->testUserActionAssignmentExecution()
Trying to get property of non-objectNoticetrigger.test521TriggerUserActionTestCase->testUserActionAssignmentExecution()
PDOException: SQLSTATE[23000]: Integrity constraint violation: 1062 Duplicate entry '' for key 'name': INSERT INTO {users} (uid, created, status) VALUES (:db_insert_placeholder_0, :db_insert_placeholder_1, :db_insert_placeholder_2); Array ( [:db_insert_placeholder_0] => 2 [:db_insert_placeholder_1] => 1333768890 [:db_insert_placeholder_2] => 1 ) in drupal_write_record() (line 7001 of /var/lib/drupaltestbot/sites/default/files/checkout/includes/common.inc).Uncaught exceptiondatabase.inc2136PDOStatement->execute()
ExpandTheme interface functionality (SystemThemeFunctionalTest) [System]524514
MessageGroupFilenameLineFunctionStatus
Invalid permission administer blocks.Rolesystem.test1647SystemThemeFunctionalTest->setUp()
Argument 1 passed to DrupalWebTestCase::drupalLogin() must be an instance of stdClass, boolean given, called in /var/lib/drupaltestbot/sites/default/files/checkout/modules/system/system.test on line 1648 and definedRecoverable errordrupal_web_test_case.php1226DrupalWebTestCase->drupalLogin()
Trying to get property of non-objectNoticedrupal_web_test_case.php1232DrupalWebTestCase->drupalLogin()
Trying to get property of non-objectNoticedrupal_web_test_case.php1233DrupalWebTestCase->drupalLogin()
Failed to set field name to Othersystem.test1648SystemThemeFunctionalTest->setUp()
Failed to set field pass to Othersystem.test1648SystemThemeFunctionalTest->setUp()
Found the requested form fields at userOthersystem.test1648SystemThemeFunctionalTest->setUp()
Trying to get property of non-objectNoticedrupal_web_test_case.php1239DrupalWebTestCase->drupalLogin()
User successfully logged in.User loginsystem.test1648SystemThemeFunctionalTest->setUp()
Failed to set field default_logo to Othersystem.test1663SystemThemeFunctionalTest->testThemeSettings()
Failed to set field logo_path to /var/lib/drupaltestbot/sites/default/files/checkout/sites/default/files/simpletest/998001/image-test.pngOthersystem.test1663SystemThemeFunctionalTest->testThemeSettings()
Found the Save configuration buttonOthersystem.test1663SystemThemeFunctionalTest->testThemeSettings()
Found the requested form fields at admin/appearance/settingsOthersystem.test1663SystemThemeFunctionalTest->testThemeSettings()
Logo path successfully changed.Othersystem.test1665SystemThemeFunctionalTest->testThemeSettings()
Failed to set field default_logo to Othersystem.test1675SystemThemeFunctionalTest->testThemeSettings()
Failed to set field logo_path to Othersystem.test1675SystemThemeFunctionalTest->testThemeSettings()
Failed to set field files[logo_upload] to /var/lib/drupaltestbot/sites/default/files/checkout/sites/default/files/simpletest/998001/image-test.pngOthersystem.test1675SystemThemeFunctionalTest->testThemeSettings()
Found the Save configuration buttonOthersystem.test1675SystemThemeFunctionalTest->testThemeSettings()
Found the requested form fields at admin/appearance/settingsOthersystem.test1675SystemThemeFunctionalTest->testThemeSettings()
Logo file successfully uploaded.Othersystem.test1677SystemThemeFunctionalTest->testThemeSettings()
Invalid permission administer blocks.Rolesystem.test1647SystemThemeFunctionalTest->setUp()
Argument 1 passed to DrupalWebTestCase::drupalLogin() must be an instance of stdClass, boolean given, called in /var/lib/drupaltestbot/sites/default/files/checkout/modules/system/system.test on line 1648 and definedRecoverable errordrupal_web_test_case.php1226DrupalWebTestCase->drupalLogin()
Trying to get property of non-objectNoticedrupal_web_test_case.php1232DrupalWebTestCase->drupalLogin()
Trying to get property of non-objectNoticedrupal_web_test_case.php1233DrupalWebTestCase->drupalLogin()
Failed to set field name to Othersystem.test1648SystemThemeFunctionalTest->setUp()
Failed to set field pass to Othersystem.test1648SystemThemeFunctionalTest->setUp()
Found the requested form fields at userOthersystem.test1648SystemThemeFunctionalTest->setUp()
Trying to get property of non-objectNoticedrupal_web_test_case.php1239DrupalWebTestCase->drupalLogin()
User successfully logged in.User loginsystem.test1648SystemThemeFunctionalTest->setUp()
Failed to set field admin_theme to sevenOthersystem.test1691SystemThemeFunctionalTest->testAdministrationTheme()
Failed to set field node_admin_theme to 1Othersystem.test1691SystemThemeFunctionalTest->testAdministrationTheme()
Found the Save configuration buttonOthersystem.test1691SystemThemeFunctionalTest->testAdministrationTheme()
Found the requested form fields at admin/appearanceOthersystem.test1691SystemThemeFunctionalTest->testAdministrationTheme()
Administration theme used on an administration page.Othersystem.test1694SystemThemeFunctionalTest->testAdministrationTheme()
Administration theme used on the add content page.Othersystem.test1700SystemThemeFunctionalTest->testAdministrationTheme()
Administration theme used on the edit content page.Othersystem.test1703SystemThemeFunctionalTest->testAdministrationTheme()
Failed to set field node_admin_theme to Othersystem.test1709SystemThemeFunctionalTest->testAdministrationTheme()
Found the Save configuration buttonOthersystem.test1709SystemThemeFunctionalTest->testAdministrationTheme()
Found the requested form fields at admin/appearanceOthersystem.test1709SystemThemeFunctionalTest->testAdministrationTheme()
Administration theme used on an administration page.Othersystem.test1712SystemThemeFunctionalTest->testAdministrationTheme()
Failed to set field admin_theme to 0Othersystem.test1723SystemThemeFunctionalTest->testAdministrationTheme()
Failed to set field node_admin_theme to Othersystem.test1723SystemThemeFunctionalTest->testAdministrationTheme()
Found the Save configuration buttonOthersystem.test1723SystemThemeFunctionalTest->testAdministrationTheme()
Found the requested form fields at admin/appearanceOthersystem.test1723SystemThemeFunctionalTest->testAdministrationTheme()
Invalid permission administer blocks.Rolesystem.test1647SystemThemeFunctionalTest->setUp()
Argument 1 passed to DrupalWebTestCase::drupalLogin() must be an instance of stdClass, boolean given, called in /var/lib/drupaltestbot/sites/default/files/checkout/modules/system/system.test on line 1648 and definedRecoverable errordrupal_web_test_case.php1226DrupalWebTestCase->drupalLogin()
Trying to get property of non-objectNoticedrupal_web_test_case.php1232DrupalWebTestCase->drupalLogin()
Trying to get property of non-objectNoticedrupal_web_test_case.php1233DrupalWebTestCase->drupalLogin()
Failed to set field name to Othersystem.test1648SystemThemeFunctionalTest->setUp()
Failed to set field pass to Othersystem.test1648SystemThemeFunctionalTest->setUp()
Found the requested form fields at userOthersystem.test1648SystemThemeFunctionalTest->setUp()
Trying to get property of non-objectNoticedrupal_web_test_case.php1239DrupalWebTestCase->drupalLogin()
User successfully logged in.User loginsystem.test1648SystemThemeFunctionalTest->setUp()
Undefined variable: url_targetNoticedrupal_web_test_case.php2546DrupalWebTestCase->clickLink()
Clicked link Set default () from http://drupaltestbot654-mysql/checkout/?q=admin/appearanceBrowsersystem.test1739SystemThemeFunctionalTest->testSwitchDefaultTheme()
Default local task on blocks admin page is the default theme.Othersystem.test1744SystemThemeFunctionalTest->testSwitchDefaultTheme()
Undefined variable: url_targetNoticedrupal_web_test_case.php2546DrupalWebTestCase->clickLink()
Clicked link Set default () from http://drupaltestbot654-mysql/checkout/?q=admin/appearanceBrowsersystem.test1747SystemThemeFunctionalTest->testSwitchDefaultTheme()
Default local task on blocks admin page has changed.Othersystem.test1749SystemThemeFunctionalTest->testSwitchDefaultTheme()
ExpandTrigger content (node) actions (TriggerContentTestCase) [Trigger]2678734
MessageGroupFilenameLineFunctionStatus
Invalid permission create page content.Roletrigger.test66TriggerContentTestCase->testActionsContent()
Argument 1 passed to DrupalWebTestCase::drupalLogin() must be an instance of stdClass, boolean given, called in /var/lib/drupaltestbot/sites/default/files/checkout/modules/trigger/trigger.test on line 77 and definedRecoverable errordrupal_web_test_case.php1226DrupalWebTestCase->drupalLogin()
Trying to get property of non-objectNoticedrupal_web_test_case.php1232DrupalWebTestCase->drupalLogin()
Trying to get property of non-objectNoticedrupal_web_test_case.php1233DrupalWebTestCase->drupalLogin()
Failed to set field name to Othertrigger.test77TriggerContentTestCase->testActionsContent()
Failed to set field pass to Othertrigger.test77TriggerContentTestCase->testActionsContent()
Found the requested form fields at userOthertrigger.test77TriggerContentTestCase->testActionsContent()
Trying to get property of non-objectNoticedrupal_web_test_case.php1239DrupalWebTestCase->drupalLogin()
User successfully logged in.User logintrigger.test77TriggerContentTestCase->testActionsContent()
Failed to set field title to !SimpleTest test node! qNfvzQzZJ7Othertrigger.test83TriggerContentTestCase->testActionsContent()
Failed to set field body[und][0][value] to !SimpleTest test body! uGE3R4VgkQxjJKJApVOLNlvotn9wvhum wSDbUjNcLgKffGbC3LOxZ7HQ9BNRgIxZOthertrigger.test83TriggerContentTestCase->testActionsContent()
Failed to set field status to Othertrigger.test83TriggerContentTestCase->testActionsContent()
Found the Save buttonOthertrigger.test83TriggerContentTestCase->testActionsContent()
Found the requested form fields at node/add/pageOthertrigger.test83TriggerContentTestCase->testActionsContent()
Make sure the Basic page has actually been createdOthertrigger.test85TriggerContentTestCase->testActionsContent()
Trying to get property of non-objectNoticetrigger.test88TriggerContentTestCase->testActionsContent()
Make sure the publish content action fired.Othertrigger.test88TriggerContentTestCase->testActionsContent()
Argument 1 passed to DrupalWebTestCase::drupalLogin() must be an instance of stdClass, boolean given, called in /var/lib/drupaltestbot/sites/default/files/checkout/modules/trigger/trigger.test on line 77 and definedRecoverable errordrupal_web_test_case.php1226DrupalWebTestCase->drupalLogin()
Trying to get property of non-objectNoticedrupal_web_test_case.php1232DrupalWebTestCase->drupalLogin()
Trying to get property of non-objectNoticedrupal_web_test_case.php1233DrupalWebTestCase->drupalLogin()
Failed to set field name to Othertrigger.test77TriggerContentTestCase->testActionsContent()
Failed to set field pass to Othertrigger.test77TriggerContentTestCase->testActionsContent()
Found the requested form fields at userOthertrigger.test77TriggerContentTestCase->testActionsContent()
Trying to get property of non-objectNoticedrupal_web_test_case.php1239DrupalWebTestCase->drupalLogin()
User successfully logged in.User logintrigger.test77TriggerContentTestCase->testActionsContent()
Failed to set field title to !SimpleTest test node! isdAQ3LLn0Othertrigger.test83TriggerContentTestCase->testActionsContent()
Failed to set field body[und][0][value] to !SimpleTest test body! sSEIfzw39ZA6PXZ2r6bu98CaDXLMu3rk bcpD2no0wsDLiHBRYKoQgnS1f0lstlgpOthertrigger.test83TriggerContentTestCase->testActionsContent()
Failed to set field status to 1Othertrigger.test83TriggerContentTestCase->testActionsContent()
Found the Save buttonOthertrigger.test83TriggerContentTestCase->testActionsContent()
Found the requested form fields at node/add/pageOthertrigger.test83TriggerContentTestCase->testActionsContent()
Make sure the Basic page has actually been createdOthertrigger.test85TriggerContentTestCase->testActionsContent()
Trying to get property of non-objectNoticetrigger.test88TriggerContentTestCase->testActionsContent()
Argument 1 passed to DrupalWebTestCase::drupalLogin() must be an instance of stdClass, boolean given, called in /var/lib/drupaltestbot/sites/default/files/checkout/modules/trigger/trigger.test on line 77 and definedRecoverable errordrupal_web_test_case.php1226DrupalWebTestCase->drupalLogin()
Trying to get property of non-objectNoticedrupal_web_test_case.php1232DrupalWebTestCase->drupalLogin()
Trying to get property of non-objectNoticedrupal_web_test_case.php1233DrupalWebTestCase->drupalLogin()
Failed to set field name to Othertrigger.test77TriggerContentTestCase->testActionsContent()
Failed to set field pass to Othertrigger.test77TriggerContentTestCase->testActionsContent()
Found the requested form fields at userOthertrigger.test77TriggerContentTestCase->testActionsContent()
Trying to get property of non-objectNoticedrupal_web_test_case.php1239DrupalWebTestCase->drupalLogin()
User successfully logged in.User logintrigger.test77TriggerContentTestCase->testActionsContent()
Failed to set field title to !SimpleTest test node! puIZqIuWgbOthertrigger.test83TriggerContentTestCase->testActionsContent()
Failed to set field body[und][0][value] to !SimpleTest test body! rmdD3ejtxW5etpg3kpQBKAuAib6vW9qY vnuFqtqcoqcU88aZ7T9nwhJo5vnG881jOthertrigger.test83TriggerContentTestCase->testActionsContent()
Failed to set field sticky to Othertrigger.test83TriggerContentTestCase->testActionsContent()
Found the Save buttonOthertrigger.test83TriggerContentTestCase->testActionsContent()
Found the requested form fields at node/add/pageOthertrigger.test83TriggerContentTestCase->testActionsContent()
Make sure the Basic page has actually been createdOthertrigger.test85TriggerContentTestCase->testActionsContent()
Trying to get property of non-objectNoticetrigger.test88TriggerContentTestCase->testActionsContent()
Make sure the make content sticky action fired.Othertrigger.test88TriggerContentTestCase->testActionsContent()
Argument 1 passed to DrupalWebTestCase::drupalLogin() must be an instance of stdClass, boolean given, called in /var/lib/drupaltestbot/sites/default/files/checkout/modules/trigger/trigger.test on line 77 and definedRecoverable errordrupal_web_test_case.php1226DrupalWebTestCase->drupalLogin()
Trying to get property of non-objectNoticedrupal_web_test_case.php1232DrupalWebTestCase->drupalLogin()
Trying to get property of non-objectNoticedrupal_web_test_case.php1233DrupalWebTestCase->drupalLogin()
Failed to set field name to Othertrigger.test77TriggerContentTestCase->testActionsContent()
Failed to set field pass to Othertrigger.test77TriggerContentTestCase->testActionsContent()
Found the requested form fields at userOthertrigger.test77TriggerContentTestCase->testActionsContent()
Trying to get property of non-objectNoticedrupal_web_test_case.php1239DrupalWebTestCase->drupalLogin()
User successfully logged in.User logintrigger.test77TriggerContentTestCase->testActionsContent()
Failed to set field title to !SimpleTest test node! zLj5g1i7IzOthertrigger.test83TriggerContentTestCase->testActionsContent()
Failed to set field body[und][0][value] to !SimpleTest test body! lHI3HAMlnSphVd0fFx2DrRajNYgpjV4q m99XosElF8gmONUumPPemzlnverLU0bGOthertrigger.test83TriggerContentTestCase->testActionsContent()
Failed to set field sticky to 1Othertrigger.test83TriggerContentTestCase->testActionsContent()
Found the Save buttonOthertrigger.test83TriggerContentTestCase->testActionsContent()
Found the requested form fields at node/add/pageOthertrigger.test83TriggerContentTestCase->testActionsContent()
Make sure the Basic page has actually been createdOthertrigger.test85TriggerContentTestCase->testActionsContent()
Trying to get property of non-objectNoticetrigger.test88TriggerContentTestCase->testActionsContent()
Argument 1 passed to DrupalWebTestCase::drupalLogin() must be an instance of stdClass, boolean given, called in /var/lib/drupaltestbot/sites/default/files/checkout/modules/trigger/trigger.test on line 77 and definedRecoverable errordrupal_web_test_case.php1226DrupalWebTestCase->drupalLogin()
Trying to get property of non-objectNoticedrupal_web_test_case.php1232DrupalWebTestCase->drupalLogin()
Trying to get property of non-objectNoticedrupal_web_test_case.php1233DrupalWebTestCase->drupalLogin()
Failed to set field name to Othertrigger.test77TriggerContentTestCase->testActionsContent()
Failed to set field pass to Othertrigger.test77TriggerContentTestCase->testActionsContent()
Found the requested form fields at userOthertrigger.test77TriggerContentTestCase->testActionsContent()
Trying to get property of non-objectNoticedrupal_web_test_case.php1239DrupalWebTestCase->drupalLogin()
User successfully logged in.User logintrigger.test77TriggerContentTestCase->testActionsContent()
Failed to set field title to !SimpleTest test node! n60nEV1wSqOthertrigger.test83TriggerContentTestCase->testActionsContent()
Failed to set field body[und][0][value] to !SimpleTest test body! bsNOb9RGEOhLbFTGPpzdTFF6XgS4xTGJ o2ag3rLsn3C5a5bFqfeDZbvAosBAz29yOthertrigger.test83TriggerContentTestCase->testActionsContent()
Failed to set field promote to Othertrigger.test83TriggerContentTestCase->testActionsContent()
Found the Save buttonOthertrigger.test83TriggerContentTestCase->testActionsContent()
Found the requested form fields at node/add/pageOthertrigger.test83TriggerContentTestCase->testActionsContent()
Make sure the Basic page has actually been createdOthertrigger.test85TriggerContentTestCase->testActionsContent()
Trying to get property of non-objectNoticetrigger.test88TriggerContentTestCase->testActionsContent()
Make sure the promote content to front page action fired.Othertrigger.test88TriggerContentTestCase->testActionsContent()
Argument 1 passed to DrupalWebTestCase::drupalLogin() must be an instance of stdClass, boolean given, called in /var/lib/drupaltestbot/sites/default/files/checkout/modules/trigger/trigger.test on line 77 and definedRecoverable errordrupal_web_test_case.php1226DrupalWebTestCase->drupalLogin()
Trying to get property of non-objectNoticedrupal_web_test_case.php1232DrupalWebTestCase->drupalLogin()
Trying to get property of non-objectNoticedrupal_web_test_case.php1233DrupalWebTestCase->drupalLogin()
Failed to set field name to Othertrigger.test77TriggerContentTestCase->testActionsContent()
Failed to set field pass to Othertrigger.test77TriggerContentTestCase->testActionsContent()
Found the requested form fields at userOthertrigger.test77TriggerContentTestCase->testActionsContent()
Trying to get property of non-objectNoticedrupal_web_test_case.php1239DrupalWebTestCase->drupalLogin()
User successfully logged in.User logintrigger.test77TriggerContentTestCase->testActionsContent()
Failed to set field title to !SimpleTest test node! jv5RoiQY6xOthertrigger.test83TriggerContentTestCase->testActionsContent()
Failed to set field body[und][0][value] to !SimpleTest test body! cEl9yA5IvokQ3UE0Dt64KDTNsdYRNh3r zubfTRkU5M3HcR67dxddPvDqTeBfWbitOthertrigger.test83TriggerContentTestCase->testActionsContent()
Failed to set field promote to 1Othertrigger.test83TriggerContentTestCase->testActionsContent()
Found the Save buttonOthertrigger.test83TriggerContentTestCase->testActionsContent()
Found the requested form fields at node/add/pageOthertrigger.test83TriggerContentTestCase->testActionsContent()
Make sure the Basic page has actually been createdOthertrigger.test85TriggerContentTestCase->testActionsContent()
Trying to get property of non-objectNoticetrigger.test88TriggerContentTestCase->testActionsContent()
Invalid permission create page content.Roletrigger.test115TriggerContentTestCase->testActionContentMultiple()
Argument 1 passed to DrupalWebTestCase::drupalLogin() must be an instance of stdClass, boolean given, called in /var/lib/drupaltestbot/sites/default/files/checkout/modules/trigger/trigger.test on line 116 and definedRecoverable errordrupal_web_test_case.php1226DrupalWebTestCase->drupalLogin()
Trying to get property of non-objectNoticedrupal_web_test_case.php1232DrupalWebTestCase->drupalLogin()
Trying to get property of non-objectNoticedrupal_web_test_case.php1233DrupalWebTestCase->drupalLogin()
Failed to set field name to Othertrigger.test116TriggerContentTestCase->testActionContentMultiple()
Failed to set field pass to Othertrigger.test116TriggerContentTestCase->testActionContentMultiple()
Found the requested form fields at userOthertrigger.test116TriggerContentTestCase->testActionContentMultiple()
Trying to get property of non-objectNoticedrupal_web_test_case.php1239DrupalWebTestCase->drupalLogin()
User successfully logged in.User logintrigger.test116TriggerContentTestCase->testActionContentMultiple()
Failed to set field title to gmZ71zxBOthertrigger.test120TriggerContentTestCase->testActionContentMultiple()
Found the Save buttonOthertrigger.test120TriggerContentTestCase->testActionContentMultiple()
Found the requested form fields at node/add/pageOthertrigger.test120TriggerContentTestCase->testActionContentMultiple()
Failed to set field title to nkoYhECfOthertrigger.test120TriggerContentTestCase->testActionContentMultiple()
Found the Save buttonOthertrigger.test120TriggerContentTestCase->testActionContentMultiple()
Found the requested form fields at node/add/pageOthertrigger.test120TriggerContentTestCase->testActionContentMultiple()
Failed to set field title to wTVtAJyVOthertrigger.test120TriggerContentTestCase->testActionContentMultiple()
Found the Save buttonOthertrigger.test120TriggerContentTestCase->testActionContentMultiple()
Found the requested form fields at node/add/pageOthertrigger.test120TriggerContentTestCase->testActionContentMultiple()
Failed to set field aid to -NDFpvNNrSPLf6XQK2zJKAgAiqq7X3jTPpDqSItKCGkOthertrigger.test126TriggerContentTestCase->testActionContentMultiple()
Found the Assign buttonOthertrigger.test126TriggerContentTestCase->testActionContentMultiple()
Found the requested form fields at admin/structure/trigger/nodeOthertrigger.test126TriggerContentTestCase->testActionContentMultiple()
Failed to set field operation to unpublishOthertrigger.test133TriggerContentTestCase->testActionContentMultiple()
Failed to set field nodes[1] to 1Othertrigger.test133TriggerContentTestCase->testActionContentMultiple()
Failed to set field nodes[2] to 1Othertrigger.test133TriggerContentTestCase->testActionContentMultiple()
Found the Update buttonOthertrigger.test133TriggerContentTestCase->testActionContentMultiple()
Found the requested form fields at admin/contentOthertrigger.test133TriggerContentTestCase->testActionContentMultiple()
Action was triggered 2 times. Actual: 0Othertrigger.test135TriggerContentTestCase->testActionContentMultiple()
ExpandTrigger orphaned actions (TriggerOrphanedActionsTestCase) [Trigger]26175
MessageGroupFilenameLineFunctionStatus
Invalid permission create page content.Roletrigger.test719TriggerOrphanedActionsTestCase->testActionsOrphaned()
Invalid permission edit own page content.Roletrigger.test719TriggerOrphanedActionsTestCase->testActionsOrphaned()
Argument 1 passed to DrupalWebTestCase::drupalLogin() must be an instance of stdClass, boolean given, called in /var/lib/drupaltestbot/sites/default/files/checkout/modules/trigger/trigger.test on line 720 and definedRecoverable errordrupal_web_test_case.php1226DrupalWebTestCase->drupalLogin()
Trying to get property of non-objectNoticedrupal_web_test_case.php1232DrupalWebTestCase->drupalLogin()
Trying to get property of non-objectNoticedrupal_web_test_case.php1233DrupalWebTestCase->drupalLogin()
Failed to set field name to Othertrigger.test720TriggerOrphanedActionsTestCase->testActionsOrphaned()
Failed to set field pass to Othertrigger.test720TriggerOrphanedActionsTestCase->testActionsOrphaned()
Found the requested form fields at userOthertrigger.test720TriggerOrphanedActionsTestCase->testActionsOrphaned()
Trying to get property of non-objectNoticedrupal_web_test_case.php1239DrupalWebTestCase->drupalLogin()
User successfully logged in.User logintrigger.test720TriggerOrphanedActionsTestCase->testActionsOrphaned()
Failed to set field title to !SimpleTest test node! cBCVI62CqgOthertrigger.test725TriggerOrphanedActionsTestCase->testActionsOrphaned()
Failed to set field body[und][0][value] to !SimpleTest test body! erBwejnjAec0FqB32OEt6fhSpVq6Uo11 tUB0HrlUUvyxx5JSNAPwdtizldqMSKaZOthertrigger.test725TriggerOrphanedActionsTestCase->testActionsOrphaned()
Found the Save buttonOthertrigger.test725TriggerOrphanedActionsTestCase->testActionsOrphaned()
Found the requested form fields at node/add/pageOthertrigger.test725TriggerOrphanedActionsTestCase->testActionsOrphaned()
Make sure the Basic page has actually been createdOthertrigger.test726TriggerOrphanedActionsTestCase->testActionsOrphaned()
Trigger test action successfully fired.Othertrigger.test729TriggerOrphanedActionsTestCase->testActionsOrphaned()
Trying to get property of non-objectNoticetrigger.test736TriggerOrphanedActionsTestCase->testActionsOrphaned()
Failed to set field title to !SimpleTest test node! cBCVI62CqgOthertrigger.test736TriggerOrphanedActionsTestCase->testActionsOrphaned()
Failed to set field body[und][0][value] to !SimpleTest test body! r293HZ8TbAqWHgfvMg5xUijkBC0g9BaD xcx8I5NzQj5DeXoyydwsTEz7KeoL0GogOthertrigger.test736TriggerOrphanedActionsTestCase->testActionsOrphaned()
Found the Save buttonOthertrigger.test736TriggerOrphanedActionsTestCase->testActionsOrphaned()
Found the requested form fields at node//editOthertrigger.test736TriggerOrphanedActionsTestCase->testActionsOrphaned()
Make sure the Basic page can be updated with the missing trigger function.Othertrigger.test740TriggerOrphanedActionsTestCase->testActionsOrphaned()
ExpandTrigger other actions (TriggerOtherTestCase) [Trigger]106134
MessageGroupFilenameLineFunctionStatus
Invalid permission create article content.Roletrigger.test636TriggerOtherTestCase->testActionsComment()
Invalid permission skip comment approval.Roletrigger.test636TriggerOtherTestCase->testActionsComment()
Invalid permission post comments.Roletrigger.test636TriggerOtherTestCase->testActionsComment()
Argument 1 passed to DrupalWebTestCase::drupalLogin() must be an instance of stdClass, boolean given, called in /var/lib/drupaltestbot/sites/default/files/checkout/modules/trigger/trigger.test on line 637 and definedRecoverable errordrupal_web_test_case.php1226DrupalWebTestCase->drupalLogin()
Trying to get property of non-objectNoticedrupal_web_test_case.php1232DrupalWebTestCase->drupalLogin()
Trying to get property of non-objectNoticedrupal_web_test_case.php1233DrupalWebTestCase->drupalLogin()
Failed to set field name to Othertrigger.test637TriggerOtherTestCase->testActionsComment()
Failed to set field pass to Othertrigger.test637TriggerOtherTestCase->testActionsComment()
Found the requested form fields at userOthertrigger.test637TriggerOtherTestCase->testActionsComment()
Trying to get property of non-objectNoticedrupal_web_test_case.php1239DrupalWebTestCase->drupalLogin()
User successfully logged in.User logintrigger.test637TriggerOtherTestCase->testActionsComment()
Failed to set field subject to bCDOuQjcqnOthertrigger.test643TriggerOtherTestCase->testActionsComment()
Failed to set field comment_body[und][0][value] to nxExVvdQ6M qTrWUbayb4Othertrigger.test643TriggerOtherTestCase->testActionsComment()
Found the Save buttonOthertrigger.test643TriggerOtherTestCase->testActionsComment()
Found the requested form fields at Othertrigger.test643TriggerOtherTestCase->testActionsComment()
Check that creating a comment triggered the action.Othertrigger.test646TriggerOtherTestCase->testActionsComment()
The test did not complete due to a fatal error.Completion checktrigger.test652TriggerOtherTestCase->testActionsTaxonomy()
ExpandUI language negotiation (LocaleUILanguageNegotiationTest) [Locale]9611
MessageGroupFilenameLineFunctionStatus
Undefined offset: 0Noticelocale.test2454LocaleUILanguageNegotiationTest->testUrlLanguageFallback()
The browser language is the URL active languageOtherlocale.test2454LocaleUILanguageNegotiationTest->testUrlLanguageFallback()
ExpandUpdate functionality (UpdateScriptFunctionalTest) [System]20410
MessageGroupFilenameLineFunctionStatus
Link with label logged found.Othersystem.test2305UpdateScriptFunctionalTest->testSuccessfulUpdateFunctionality()

All

Test namePassFailException
Leaf403 functionality (AccessDeniedTestCase) [System]12400
Leaf404 functionality (PageNotFoundTestCase) [System]1800
LeafActionLoopTestCase2800
LeafActionsConfigurationTestCase3800
LeafActive trail (MenuTrailTestCase) [Menu]3300
LeafAddFeedTestCase3000
LeafAdmin theme block admin accessibility (BlockAdminThemeTestCase) [Block]1900
LeafAdministrative pages (SystemAdminTestCase) [System]18700
LeafAdvanced search form (SearchAdvancedSearchForm) [Search]3400
LeafAggregator configuration (AggregatorConfigurationTestCase) [Unknown]2000
LeafAJAX command form values (AJAXFormValuesTestCase) [AJAX]2900
LeafAJAX commands (AJAXCommandsTestCase) [AJAX]6900
LeafAJAX framework (AJAXFrameworkTestCase) [AJAX]3400
LeafAJAX multi form (AJAXMultiFormTestCase) [AJAX]3600
LeafAnonymous comments (CommentAnonymous) [Comment]16600
LeafAuthmap assignment (UserAuthmapAssignmentTestCase) [User]600
LeafAuthorize API (SystemAuthorizeCase) [System]1600
ExpandAutocompletion (ProfileTestAutocomplete) [Profile]34276
MessageGroupFilenameLineFunctionStatus
Invalid permission administer blocks.Roleprofile.test19ProfileTestCase->setUp()
Argument 1 passed to DrupalWebTestCase::drupalLogin() must be an instance of stdClass, boolean given, called in /var/lib/drupaltestbot/sites/default/files/checkout/modules/profile/profile.test on line 331 and definedRecoverable errordrupal_web_test_case.php1226DrupalWebTestCase->drupalLogin()
Trying to get property of non-objectNoticedrupal_web_test_case.php1232DrupalWebTestCase->drupalLogin()
Trying to get property of non-objectNoticedrupal_web_test_case.php1233DrupalWebTestCase->drupalLogin()
Failed to set field name to Otherprofile.test331ProfileTestAutocomplete->testAutocomplete()
Failed to set field pass to Otherprofile.test331ProfileTestAutocomplete->testAutocomplete()
Found the requested form fields at userOtherprofile.test331ProfileTestAutocomplete->testAutocomplete()
Trying to get property of non-objectNoticedrupal_web_test_case.php1239DrupalWebTestCase->drupalLogin()
User successfully logged in.User loginprofile.test331ProfileTestAutocomplete->testAutocomplete()
Failed to set field weight to 1Otherprofile.test43ProfileTestCase->createProfileField()
Failed to set field autocomplete to 1Otherprofile.test43ProfileTestCase->createProfileField()
Failed to set field title to h8W3DTe9Otherprofile.test43ProfileTestCase->createProfileField()
Failed to set field name to profile_h8W3DTe9Otherprofile.test43ProfileTestCase->createProfileField()
Failed to set field category to kO93kxsDOtherprofile.test43ProfileTestCase->createProfileField()
Failed to set field explanation to qI4hCbIUNJ4HH0cRMNvwYmzhjcnNiSRBLZRMgajxmHaB1PQAwMOtherprofile.test43ProfileTestCase->createProfileField()
Found the Save field buttonOtherprofile.test43ProfileTestCase->createProfileField()
Found the requested form fields at admin/config/people/profile/add/textfieldOtherprofile.test43ProfileTestCase->createProfileField()
New Profile field has been entered in the databaseOtherprofile.test45ProfileTestCase->createProfileField()
Trying to get property of non-objectNoticeprofile.test48ProfileTestCase->createProfileField()
Found form named profile_h8W3DTe9Otherprofile.test57ProfileTestCase->createProfileField()
Checking title for field h8W3DTe9Otherprofile.test61ProfileTestCase->createProfileField()
Checking explanation for field h8W3DTe9Otherprofile.test63ProfileTestCase->createProfileField()
Failed to set field profile_h8W3DTe9 to diFKSQC6Otherprofile.test140ProfileTestCase->setProfileField()
Found the Save buttonOtherprofile.test140ProfileTestCase->setProfileField()
Found the requested form fields at user/2/edit/kO93kxsDOtherprofile.test140ProfileTestCase->setProfileField()
Found profile field with title h8W3DTe9Otherprofile.test144ProfileTestCase->setProfileField()
Found profile field with value diFKSQC6Otherprofile.test148ProfileTestCase->setProfileField()
Trying to get property of non-objectNoticeprofile.test346ProfileTestAutocomplete->testAutocomplete()
Autocomplete found.Otherprofile.test347ProfileTestAutocomplete->testAutocomplete()
Autocomplete JavaScript found.Otherprofile.test348ProfileTestAutocomplete->testAutocomplete()
Autocomplete form element class found.Otherprofile.test349ProfileTestAutocomplete->testAutocomplete()
Autocomplete path allowed to user with permission.Browserprofile.test354ProfileTestAutocomplete->testAutocomplete()
Autocomplete value found.Otherprofile.test355ProfileTestAutocomplete->testAutocomplete()
LeafBasic minimal profile update path (BasicMinimalUpdatePath) [Upgrade path]6200
LeafBasic minimal profile update path, populated database (FilledMinimalUpdatePath) [Upgrade path]6200
LeafBasic SQL syntax tests (DatabaseBasicSyntaxTestCase) [Database]3000
LeafBasic standard + all profile update path (BasicStandardUpdatePath) [Upgrade path]6200
LeafBasic standard + all profile update path, populated database (FilledStandardUpdatePath) [Upgrade path]6200
LeafBasic upgrade path (BasicUpgradePath) [Upgrade path]8800
LeafBatch percentages (BatchPercentagesUnitTestCase) [Batch API]1800
LeafBatch processing (BatchProcessingTestCase) [Batch API]16100
LeafBatch progress page (BatchPageTestCase) [Batch API]1600
LeafBlock availability (DashboardBlockAvailabilityTestCase) [Dashboard]2600
LeafBlock availability (NodeBlockTestCase) [Node]2100
LeafBlock availability (PollBlockTestCase) [Poll]13900
ExpandBlock availability (ProfileBlockTestCase) [Profile]41657
MessageGroupFilenameLineFunctionStatus
Invalid permission administer blocks.Roleprofile.test19ProfileTestCase->setUp()
Argument 1 passed to DrupalWebTestCase::drupalLogin() must be an instance of stdClass, boolean given, called in /var/lib/drupaltestbot/sites/default/files/checkout/modules/profile/profile.test on line 384 and definedRecoverable errordrupal_web_test_case.php1226DrupalWebTestCase->drupalLogin()
Trying to get property of non-objectNoticedrupal_web_test_case.php1232DrupalWebTestCase->drupalLogin()
Trying to get property of non-objectNoticedrupal_web_test_case.php1233DrupalWebTestCase->drupalLogin()
Failed to set field name to Otherprofile.test384ProfileBlockTestCase->setUp()
Failed to set field pass to Otherprofile.test384ProfileBlockTestCase->setUp()
Found the requested form fields at userOtherprofile.test384ProfileBlockTestCase->setUp()
Trying to get property of non-objectNoticedrupal_web_test_case.php1239DrupalWebTestCase->drupalLogin()
User successfully logged in.User loginprofile.test384ProfileBlockTestCase->setUp()
Failed to set field weight to 0Otherprofile.test43ProfileTestCase->createProfileField()
Failed to set field title to bNu9SdhjOtherprofile.test43ProfileTestCase->createProfileField()
Failed to set field name to profile_bNu9SdhjOtherprofile.test43ProfileTestCase->createProfileField()
Failed to set field category to sRX15OpHOtherprofile.test43ProfileTestCase->createProfileField()
Failed to set field explanation to bsiRifEFsuwIBKClQRBLDXoGikXO8DoWf63vQ2jQoSiAcVI3D9Otherprofile.test43ProfileTestCase->createProfileField()
Found the Save field buttonOtherprofile.test43ProfileTestCase->createProfileField()
Found the requested form fields at admin/config/people/profile/add/textfieldOtherprofile.test43ProfileTestCase->createProfileField()
New Profile field has been entered in the databaseOtherprofile.test45ProfileTestCase->createProfileField()
Trying to get property of non-objectNoticeprofile.test48ProfileTestCase->createProfileField()
Found form named profile_bNu9SdhjOtherprofile.test57ProfileTestCase->createProfileField()
Checking title for field bNu9SdhjOtherprofile.test61ProfileTestCase->createProfileField()
Checking explanation for field bNu9SdhjOtherprofile.test63ProfileTestCase->createProfileField()
Failed to set field weight to 1Otherprofile.test43ProfileTestCase->createProfileField()
Failed to set field title to s9TTK7iwOtherprofile.test43ProfileTestCase->createProfileField()
Failed to set field name to profile_s9TTK7iwOtherprofile.test43ProfileTestCase->createProfileField()
Failed to set field category to sRX15OpHOtherprofile.test43ProfileTestCase->createProfileField()
Failed to set field explanation to zpCzVjJBQD2EiXHodkUt85l1gp1Cl9l78TQiMx6DBbFcIQQBdBOtherprofile.test43ProfileTestCase->createProfileField()
Found the Save field buttonOtherprofile.test43ProfileTestCase->createProfileField()
Found the requested form fields at admin/config/people/profile/add/textfieldOtherprofile.test43ProfileTestCase->createProfileField()
New Profile field has been entered in the databaseOtherprofile.test45ProfileTestCase->createProfileField()
Trying to get property of non-objectNoticeprofile.test48ProfileTestCase->createProfileField()
Found form named profile_s9TTK7iwOtherprofile.test57ProfileTestCase->createProfileField()
Checking title for field s9TTK7iwOtherprofile.test61ProfileTestCase->createProfileField()
Checking explanation for field s9TTK7iwOtherprofile.test63ProfileTestCase->createProfileField()
Failed to set field profile_bNu9Sdhj to tSKHmeTfOtherprofile.test140ProfileTestCase->setProfileField()
Found the Save buttonOtherprofile.test140ProfileTestCase->setProfileField()
Found the requested form fields at user/2/edit/sRX15OpHOtherprofile.test140ProfileTestCase->setProfileField()
Found profile field with title bNu9SdhjOtherprofile.test144ProfileTestCase->setProfileField()
Found profile field with value tSKHmeTfOtherprofile.test148ProfileTestCase->setProfileField()
Failed to set field profile_s9TTK7iw to mCeLyM4ZOtherprofile.test140ProfileTestCase->setProfileField()
Found the Save buttonOtherprofile.test140ProfileTestCase->setProfileField()
Found the requested form fields at user/2/edit/sRX15OpHOtherprofile.test140ProfileTestCase->setProfileField()
Found profile field with title s9TTK7iwOtherprofile.test144ProfileTestCase->setProfileField()
Found profile field with value mCeLyM4ZOtherprofile.test148ProfileTestCase->setProfileField()
Failed to set field blocks[profile_author-information][region] to footerOtherprofile.test405ProfileBlockTestCase->testAuthorInformationBlock()
Found the Save blocks buttonOtherprofile.test405ProfileBlockTestCase->testAuthorInformationBlock()
Found the requested form fields at admin/structure/blockOtherprofile.test405ProfileBlockTestCase->testAuthorInformationBlock()
Block successfully move to footer region.Otherprofile.test406ProfileBlockTestCase->testAuthorInformationBlock()
Failed to set field profile_block_author_fields[profile_bNu9Sdhj] to 1Otherprofile.test411ProfileBlockTestCase->testAuthorInformationBlock()
Found the Save block buttonOtherprofile.test411ProfileBlockTestCase->testAuthorInformationBlock()
Found the requested form fields at admin/structure/block/manage/profile/author-information/configureOtherprofile.test411ProfileBlockTestCase->testAuthorInformationBlock()
Block configuration set.Otherprofile.test412ProfileBlockTestCase->testAuthorInformationBlock()
Field 1 is displayedOtherprofile.test416ProfileBlockTestCase->testAuthorInformationBlock()
Failed to set field profile_block_author_fields[profile_bNu9Sdhj] to Otherprofile.test423ProfileBlockTestCase->testAuthorInformationBlock()
Failed to set field profile_block_author_fields[profile_s9TTK7iw] to 1Otherprofile.test423ProfileBlockTestCase->testAuthorInformationBlock()
Found the Save block buttonOtherprofile.test423ProfileBlockTestCase->testAuthorInformationBlock()
Found the requested form fields at admin/structure/block/manage/profile/author-information/configureOtherprofile.test423ProfileBlockTestCase->testAuthorInformationBlock()
Block configuration set.Otherprofile.test424ProfileBlockTestCase->testAuthorInformationBlock()
Field 2 is displayedOtherprofile.test429ProfileBlockTestCase->testAuthorInformationBlock()
Failed to set field profile_block_author_fields[profile_bNu9Sdhj] to 1Otherprofile.test435ProfileBlockTestCase->testAuthorInformationBlock()
Failed to set field profile_block_author_fields[profile_s9TTK7iw] to 1Otherprofile.test435ProfileBlockTestCase->testAuthorInformationBlock()
Found the Save block buttonOtherprofile.test435ProfileBlockTestCase->testAuthorInformationBlock()
Found the requested form fields at admin/structure/block/manage/profile/author-information/configureOtherprofile.test435ProfileBlockTestCase->testAuthorInformationBlock()
Block configuration set.Otherprofile.test436ProfileBlockTestCase->testAuthorInformationBlock()
Field 1 is displayedOtherprofile.test440ProfileBlockTestCase->testAuthorInformationBlock()
Field 2 is displayedOtherprofile.test441ProfileBlockTestCase->testAuthorInformationBlock()
Failed to set field profile_block_author_fields[user_profile] to 1Otherprofile.test446ProfileBlockTestCase->testAuthorInformationBlock()
Found the Save block buttonOtherprofile.test446ProfileBlockTestCase->testAuthorInformationBlock()
Found the requested form fields at admin/structure/block/manage/profile/author-information/configureOtherprofile.test446ProfileBlockTestCase->testAuthorInformationBlock()
Block configuration set.Otherprofile.test447ProfileBlockTestCase->testAuthorInformationBlock()
Undefined variable: url_targetNoticedrupal_web_test_case.php2546DrupalWebTestCase->clickLink()
Clicked link View full user profile () from http://drupaltestbot654-mysql/checkout/?q=node/1Browserprofile.test451ProfileBlockTestCase->testAuthorInformationBlock()
Value 'http://drupaltestbot654-mysql/checkout/?q=node/1' is equal to value 'http://drupaltestbot654-mysql/checkout/?q=user/2'.Otherprofile.test452ProfileBlockTestCase->testAuthorInformationBlock()
LeafBlock availability (SearchBlockTestCase) [Search]6400
LeafBlock caching (BlockCacheTestCase) [Block]21300
LeafBlock functionality (BlockTestCase) [Block]36000
LeafBlock functionality (SystemBlockTestCase) [System]4500
LeafBlock HTML id (BlockHTMLIdTestCase) [Block]1600
LeafBlock template suggestions (BlockTemplateSuggestionsUnitTest) [Block]200
LeafBlocks not in hidden region (BlockHiddenRegionTestCase) [Block]1800
ExpandBlog functionality (BlogTestCase) [Blog]2073314
MessageGroupFilenameLineFunctionStatus
Invalid permission administer blocks.Roleblog.test27BlogTestCase->setUp()
Trying to get property of non-objectNoticeblog.test39BlogTestCase->testUnprivilegedUser()
Argument 1 passed to DrupalWebTestCase::drupalLogin() must be an instance of stdClass, boolean given, called in /var/lib/drupaltestbot/sites/default/files/checkout/modules/blog/blog.test on line 41 and definedRecoverable errordrupal_web_test_case.php1226DrupalWebTestCase->drupalLogin()
Trying to get property of non-objectNoticedrupal_web_test_case.php1232DrupalWebTestCase->drupalLogin()
Trying to get property of non-objectNoticedrupal_web_test_case.php1233DrupalWebTestCase->drupalLogin()
Failed to set field name to Otherblog.test41BlogTestCase->testUnprivilegedUser()
Failed to set field pass to Otherblog.test41BlogTestCase->testUnprivilegedUser()
Found the requested form fields at userOtherblog.test41BlogTestCase->testUnprivilegedUser()
Trying to get property of non-objectNoticedrupal_web_test_case.php1239DrupalWebTestCase->drupalLogin()
User successfully logged in.User loginblog.test41BlogTestCase->testUnprivilegedUser()
Trying to get property of non-objectNoticeblog.test43BlogTestCase->testUnprivilegedUser()
Blog title was displayedOtherblog.test45BlogTestCase->testUnprivilegedUser()
No new entries can be posted without the right permissionOtherblog.test46BlogTestCase->testUnprivilegedUser()
Invalid permission administer blocks.Roleblog.test27BlogTestCase->setUp()
Argument 1 passed to DrupalWebTestCase::drupalLogin() must be an instance of stdClass, boolean given, called in /var/lib/drupaltestbot/sites/default/files/checkout/modules/blog/blog.test on line 53 and definedRecoverable errordrupal_web_test_case.php1226DrupalWebTestCase->drupalLogin()
Trying to get property of non-objectNoticedrupal_web_test_case.php1232DrupalWebTestCase->drupalLogin()
Trying to get property of non-objectNoticedrupal_web_test_case.php1233DrupalWebTestCase->drupalLogin()
Failed to set field name to Otherblog.test53BlogTestCase->testBlogPageNoEntries()
Failed to set field pass to Otherblog.test53BlogTestCase->testBlogPageNoEntries()
Found the requested form fields at userOtherblog.test53BlogTestCase->testBlogPageNoEntries()
Trying to get property of non-objectNoticedrupal_web_test_case.php1239DrupalWebTestCase->drupalLogin()
User successfully logged in.User loginblog.test53BlogTestCase->testBlogPageNoEntries()
Invalid permission administer blocks.Roleblog.test27BlogTestCase->setUp()
Argument 1 passed to DrupalWebTestCase::drupalLogin() must be an instance of stdClass, boolean given, called in /var/lib/drupaltestbot/sites/default/files/checkout/modules/blog/blog.test on line 66 and definedRecoverable errordrupal_web_test_case.php1226DrupalWebTestCase->drupalLogin()
Trying to get property of non-objectNoticedrupal_web_test_case.php1232DrupalWebTestCase->drupalLogin()
Trying to get property of non-objectNoticedrupal_web_test_case.php1233DrupalWebTestCase->drupalLogin()
Failed to set field name to Otherblog.test66BlogTestCase->testBlog()
Failed to set field pass to Otherblog.test66BlogTestCase->testBlog()
Found the requested form fields at userOtherblog.test66BlogTestCase->testBlog()
Trying to get property of non-objectNoticedrupal_web_test_case.php1239DrupalWebTestCase->drupalLogin()
User successfully logged in.User loginblog.test66BlogTestCase->testBlog()
Failed to set field blocks[blog_recent][region] to sidebar_secondOtherblog.test70BlogTestCase->testBlog()
Found the Save blocks buttonOtherblog.test70BlogTestCase->testBlog()
Found the requested form fields at admin/structure/blockOtherblog.test70BlogTestCase->testBlog()
HTTP response expected 200, actual 403Browserblog.test71BlogTestCase->testBlog()
Failed to set field blog_block_count to 5Otherblog.test75BlogTestCase->testBlog()
Found the Save block buttonOtherblog.test75BlogTestCase->testBlog()
Found the requested form fields at admin/structure/block/manage/blog/recent/configureOtherblog.test75BlogTestCase->testBlog()
Number of recent blog posts changed.Otherblog.test76BlogTestCase->testBlog()
Blog help node was displayedOtherblog.test135BlogTestCase->verifyBlogs()
Blog help node was displayedOtherblog.test136BlogTestCase->verifyBlogs()
Blog block was displayedOtherblog.test142BlogTestCase->verifyBlogs()
Blog block was displayedOtherblog.test142BlogTestCase->verifyBlogs()
Blog block was displayedOtherblog.test142BlogTestCase->verifyBlogs()
Blog help node was displayedOtherblog.test135BlogTestCase->verifyBlogs()
Blog help node was displayedOtherblog.test136BlogTestCase->verifyBlogs()
Blog block was displayedOtherblog.test142BlogTestCase->verifyBlogs()
LeafBook functionality (BookTestCase) [Book]45500
LeafBoot and exit hook invocation (HookBootExitTestCase) [Bootstrap]1900
LeafBreadcrumbs (MenuBreadcrumbTestCase) [Menu]45900
LeafBroken SimpleTest method (SimpleTestBrokenSetUp) [SimpleTest]2100
LeafBrowser language detection (LocaleBrowserDetectionTest) [Locale]4100
LeafCache clear test (CacheClearCase) [Cache]1900
LeafCache emptiness test (CacheIsEmptyCase) [Cache]500
LeafCache saving test (CacheSavingCase) [Cache]800
LeafCancel account (UserCancelTestCase) [User]23600
LeafCascading stylesheets (CascadingStylesheetsTestCase) [System]4100
LeafCategorize feed functionality (CategorizeFeedTestCase) [Unknown]2100
LeafCategorize feed item functionality (CategorizeFeedItemTestCase) [Unknown]6100
LeafChecks display of aggregator items (AggregatorRenderingTestCase) [Unknown]22600
LeafCJK tokenizer (SearchTokenizerTestCase) [Search]800
LeafColor functionality (ColorTestCase) [Color]12200
LeafComment actions (CommentActionsTestCase) [Comment]2900
LeafComment approval (CommentApprovalTest) [Comment]15600
LeafComment blocks (CommentBlockFunctionalTest) [Comment]11600
LeafComment count toggle (SearchCommentCountToggleTestCase) [Search]3100
LeafComment fields (CommentFieldsTest) [Comment]11600
ExpandComment interface (CommentInterfaceTest) [Comment]203700
MessageGroupFilenameLineFunctionStatus
Changed environment:array ( 'authenticated' => false, 'comment count' => false, 'form' => 'below', 'user_register' => 1, 'contact' => 'optional', 'comments' => 'open', 'access comments' => 0, 'post comments' => 0, 'skip comment approval' => 1, 'edit own comments' => 0, )Debugcomment.test831CommentInterfaceTest->setEnvironment()
Changed environment:array ( 'authenticated' => true, 'comment count' => false, 'form' => 'below', 'user_register' => 1, 'contact' => 'optional', 'comments' => 'open', 'access comments' => 0, 'post comments' => 0, 'skip comment approval' => 1, 'edit own comments' => 0, )Debugcomment.test831CommentInterfaceTest->setEnvironment()
Changed environment:array ( 'authenticated' => false, 'comment count' => true, 'form' => 'below', 'user_register' => 1, 'contact' => 'optional', 'comments' => 'open', 'access comments' => 0, 'post comments' => 0, 'skip comment approval' => 1, 'edit own comments' => 0, )Debugcomment.test831CommentInterfaceTest->setEnvironment()
Changed environment:array ( 'authenticated' => true, 'comment count' => true, 'form' => 'below', 'user_register' => 1, 'contact' => 'optional', 'comments' => 'open', 'access comments' => 0, 'post comments' => 0, 'skip comment approval' => 1, 'edit own comments' => 0, )Debugcomment.test831CommentInterfaceTest->setEnvironment()
Changed environment:array ( 'authenticated' => false, 'comment count' => false, 'form' => 'below', 'user_register' => 1, 'contact' => 'optional', 'comments' => 'open', 'access comments' => 1, 'post comments' => 0, 'skip comment approval' => 1, 'edit own comments' => 0, )Debugcomment.test831CommentInterfaceTest->setEnvironment()
Changed environment:array ( 'authenticated' => true, 'comment count' => false, 'form' => 'below', 'user_register' => 1, 'contact' => 'optional', 'comments' => 'open', 'access comments' => 1, 'post comments' => 0, 'skip comment approval' => 1, 'edit own comments' => 0, )Debugcomment.test831CommentInterfaceTest->setEnvironment()
Changed environment:array ( 'authenticated' => false, 'comment count' => true, 'form' => 'below', 'user_register' => 1, 'contact' => 'optional', 'comments' => 'open', 'access comments' => 1, 'post comments' => 0, 'skip comment approval' => 1, 'edit own comments' => 0, )Debugcomment.test831CommentInterfaceTest->setEnvironment()
Changed environment:array ( 'authenticated' => true, 'comment count' => true, 'form' => 'below', 'user_register' => 1, 'contact' => 'optional', 'comments' => 'open', 'access comments' => 1, 'post comments' => 0, 'skip comment approval' => 1, 'edit own comments' => 0, )Debugcomment.test831CommentInterfaceTest->setEnvironment()
Changed environment:array ( 'authenticated' => false, 'comment count' => false, 'form' => 'below', 'user_register' => 1, 'contact' => 'optional', 'comments' => 'open', 'access comments' => 0, 'post comments' => 1, 'skip comment approval' => 1, 'edit own comments' => 0, )Debugcomment.test831CommentInterfaceTest->setEnvironment()
Changed environment:array ( 'authenticated' => true, 'comment count' => false, 'form' => 'below', 'user_register' => 1, 'contact' => 'optional', 'comments' => 'open', 'access comments' => 0, 'post comments' => 1, 'skip comment approval' => 1, 'edit own comments' => 0, )Debugcomment.test831CommentInterfaceTest->setEnvironment()
Changed environment:array ( 'authenticated' => false, 'comment count' => true, 'form' => 'below', 'user_register' => 1, 'contact' => 'optional', 'comments' => 'open', 'access comments' => 0, 'post comments' => 1, 'skip comment approval' => 1, 'edit own comments' => 0, )Debugcomment.test831CommentInterfaceTest->setEnvironment()
Changed environment:array ( 'authenticated' => true, 'comment count' => true, 'form' => 'below', 'user_register' => 1, 'contact' => 'optional', 'comments' => 'open', 'access comments' => 0, 'post comments' => 1, 'skip comment approval' => 1, 'edit own comments' => 0, )Debugcomment.test831CommentInterfaceTest->setEnvironment()
Changed environment:array ( 'authenticated' => false, 'comment count' => false, 'form' => 'below', 'user_register' => 1, 'contact' => 'optional', 'comments' => 'open', 'access comments' => 1, 'post comments' => 1, 'skip comment approval' => 1, 'edit own comments' => 0, )Debugcomment.test831CommentInterfaceTest->setEnvironment()
Changed environment:array ( 'authenticated' => true, 'comment count' => false, 'form' => 'below', 'user_register' => 1, 'contact' => 'optional', 'comments' => 'open', 'access comments' => 1, 'post comments' => 1, 'skip comment approval' => 1, 'edit own comments' => 0, )Debugcomment.test831CommentInterfaceTest->setEnvironment()
Changed environment:array ( 'authenticated' => false, 'comment count' => true, 'form' => 'below', 'user_register' => 1, 'contact' => 'optional', 'comments' => 'open', 'access comments' => 1, 'post comments' => 1, 'skip comment approval' => 1, 'edit own comments' => 0, )Debugcomment.test831CommentInterfaceTest->setEnvironment()
Changed environment:array ( 'authenticated' => true, 'comment count' => true, 'form' => 'below', 'user_register' => 1, 'contact' => 'optional', 'comments' => 'open', 'access comments' => 1, 'post comments' => 1, 'skip comment approval' => 1, 'edit own comments' => 0, )Debugcomment.test831CommentInterfaceTest->setEnvironment()
Changed environment:array ( 'authenticated' => false, 'comment count' => false, 'form' => 'separate page', 'user_register' => 1, 'contact' => 'optional', 'comments' => 'open', 'access comments' => 0, 'post comments' => 0, 'skip comment approval' => 1, 'edit own comments' => 0, )Debugcomment.test831CommentInterfaceTest->setEnvironment()
Changed environment:array ( 'authenticated' => true, 'comment count' => false, 'form' => 'separate page', 'user_register' => 1, 'contact' => 'optional', 'comments' => 'open', 'access comments' => 0, 'post comments' => 0, 'skip comment approval' => 1, 'edit own comments' => 0, )Debugcomment.test831CommentInterfaceTest->setEnvironment()
Changed environment:array ( 'authenticated' => false, 'comment count' => true, 'form' => 'separate page', 'user_register' => 1, 'contact' => 'optional', 'comments' => 'open', 'access comments' => 0, 'post comments' => 0, 'skip comment approval' => 1, 'edit own comments' => 0, )Debugcomment.test831CommentInterfaceTest->setEnvironment()
Changed environment:array ( 'authenticated' => true, 'comment count' => true, 'form' => 'separate page', 'user_register' => 1, 'contact' => 'optional', 'comments' => 'open', 'access comments' => 0, 'post comments' => 0, 'skip comment approval' => 1, 'edit own comments' => 0, )Debugcomment.test831CommentInterfaceTest->setEnvironment()
Changed environment:array ( 'authenticated' => false, 'comment count' => false, 'form' => 'separate page', 'user_register' => 1, 'contact' => 'optional', 'comments' => 'open', 'access comments' => 1, 'post comments' => 0, 'skip comment approval' => 1, 'edit own comments' => 0, )Debugcomment.test831CommentInterfaceTest->setEnvironment()
Changed environment:array ( 'authenticated' => true, 'comment count' => false, 'form' => 'separate page', 'user_register' => 1, 'contact' => 'optional', 'comments' => 'open', 'access comments' => 1, 'post comments' => 0, 'skip comment approval' => 1, 'edit own comments' => 0, )Debugcomment.test831CommentInterfaceTest->setEnvironment()
Changed environment:array ( 'authenticated' => false, 'comment count' => true, 'form' => 'separate page', 'user_register' => 1, 'contact' => 'optional', 'comments' => 'open', 'access comments' => 1, 'post comments' => 0, 'skip comment approval' => 1, 'edit own comments' => 0, )Debugcomment.test831CommentInterfaceTest->setEnvironment()
Changed environment:array ( 'authenticated' => true, 'comment count' => true, 'form' => 'separate page', 'user_register' => 1, 'contact' => 'optional', 'comments' => 'open', 'access comments' => 1, 'post comments' => 0, 'skip comment approval' => 1, 'edit own comments' => 0, )Debugcomment.test831CommentInterfaceTest->setEnvironment()
Changed environment:array ( 'authenticated' => false, 'comment count' => false, 'form' => 'separate page', 'user_register' => 1, 'contact' => 'optional', 'comments' => 'open', 'access comments' => 0, 'post comments' => 1, 'skip comment approval' => 1, 'edit own comments' => 0, )Debugcomment.test831CommentInterfaceTest->setEnvironment()
Changed environment:array ( 'authenticated' => true, 'comment count' => false, 'form' => 'separate page', 'user_register' => 1, 'contact' => 'optional', 'comments' => 'open', 'access comments' => 0, 'post comments' => 1, 'skip comment approval' => 1, 'edit own comments' => 0, )Debugcomment.test831CommentInterfaceTest->setEnvironment()
Changed environment:array ( 'authenticated' => false, 'comment count' => true, 'form' => 'separate page', 'user_register' => 1, 'contact' => 'optional', 'comments' => 'open', 'access comments' => 0, 'post comments' => 1, 'skip comment approval' => 1, 'edit own comments' => 0, )Debugcomment.test831CommentInterfaceTest->setEnvironment()
Changed environment:array ( 'authenticated' => true, 'comment count' => true, 'form' => 'separate page', 'user_register' => 1, 'contact' => 'optional', 'comments' => 'open', 'access comments' => 0, 'post comments' => 1, 'skip comment approval' => 1, 'edit own comments' => 0, )Debugcomment.test831CommentInterfaceTest->setEnvironment()
Changed environment:array ( 'authenticated' => false, 'comment count' => false, 'form' => 'separate page', 'user_register' => 1, 'contact' => 'optional', 'comments' => 'open', 'access comments' => 1, 'post comments' => 1, 'skip comment approval' => 1, 'edit own comments' => 0, )Debugcomment.test831CommentInterfaceTest->setEnvironment()
Changed environment:array ( 'authenticated' => true, 'comment count' => false, 'form' => 'separate page', 'user_register' => 1, 'contact' => 'optional', 'comments' => 'open', 'access comments' => 1, 'post comments' => 1, 'skip comment approval' => 1, 'edit own comments' => 0, )Debugcomment.test831CommentInterfaceTest->setEnvironment()
Changed environment:array ( 'authenticated' => false, 'comment count' => true, 'form' => 'separate page', 'user_register' => 1, 'contact' => 'optional', 'comments' => 'open', 'access comments' => 1, 'post comments' => 1, 'skip comment approval' => 1, 'edit own comments' => 0, )Debugcomment.test831CommentInterfaceTest->setEnvironment()
Changed environment:array ( 'authenticated' => true, 'comment count' => true, 'form' => 'separate page', 'user_register' => 1, 'contact' => 'optional', 'comments' => 'open', 'access comments' => 1, 'post comments' => 1, 'skip comment approval' => 1, 'edit own comments' => 0, )Debugcomment.test831CommentInterfaceTest->setEnvironment()
Changed environment:array ( 'authenticated' => false, 'comment count' => false, 'form' => 'below', 'user_register' => 0, 'contact' => 'optional', 'comments' => 'open', 'access comments' => 0, 'post comments' => 0, 'skip comment approval' => 1, 'edit own comments' => 0, )Debugcomment.test831CommentInterfaceTest->setEnvironment()
Changed environment:array ( 'authenticated' => true, 'comment count' => false, 'form' => 'below', 'user_register' => 0, 'contact' => 'optional', 'comments' => 'open', 'access comments' => 0, 'post comments' => 0, 'skip comment approval' => 1, 'edit own comments' => 0, )Debugcomment.test831CommentInterfaceTest->setEnvironment()
Changed environment:array ( 'authenticated' => false, 'comment count' => true, 'form' => 'below', 'user_register' => 0, 'contact' => 'optional', 'comments' => 'open', 'access comments' => 0, 'post comments' => 0, 'skip comment approval' => 1, 'edit own comments' => 0, )Debugcomment.test831CommentInterfaceTest->setEnvironment()
Changed environment:array ( 'authenticated' => true, 'comment count' => true, 'form' => 'below', 'user_register' => 0, 'contact' => 'optional', 'comments' => 'open', 'access comments' => 0, 'post comments' => 0, 'skip comment approval' => 1, 'edit own comments' => 0, )Debugcomment.test831CommentInterfaceTest->setEnvironment()
Changed environment:array ( 'authenticated' => false, 'comment count' => false, 'form' => 'below', 'user_register' => 0, 'contact' => 'optional', 'comments' => 'open', 'access comments' => 1, 'post comments' => 0, 'skip comment approval' => 1, 'edit own comments' => 0, )Debugcomment.test831CommentInterfaceTest->setEnvironment()
Changed environment:array ( 'authenticated' => true, 'comment count' => false, 'form' => 'below', 'user_register' => 0, 'contact' => 'optional', 'comments' => 'open', 'access comments' => 1, 'post comments' => 0, 'skip comment approval' => 1, 'edit own comments' => 0, )Debugcomment.test831CommentInterfaceTest->setEnvironment()
Changed environment:array ( 'authenticated' => false, 'comment count' => true, 'form' => 'below', 'user_register' => 0, 'contact' => 'optional', 'comments' => 'open', 'access comments' => 1, 'post comments' => 0, 'skip comment approval' => 1, 'edit own comments' => 0, )Debugcomment.test831CommentInterfaceTest->setEnvironment()
Changed environment:array ( 'authenticated' => true, 'comment count' => true, 'form' => 'below', 'user_register' => 0, 'contact' => 'optional', 'comments' => 'open', 'access comments' => 1, 'post comments' => 0, 'skip comment approval' => 1, 'edit own comments' => 0, )Debugcomment.test831CommentInterfaceTest->setEnvironment()
Changed environment:array ( 'authenticated' => false, 'comment count' => false, 'form' => 'below', 'user_register' => 0, 'contact' => 'optional', 'comments' => 'open', 'access comments' => 0, 'post comments' => 1, 'skip comment approval' => 1, 'edit own comments' => 0, )Debugcomment.test831CommentInterfaceTest->setEnvironment()
Changed environment:array ( 'authenticated' => true, 'comment count' => false, 'form' => 'below', 'user_register' => 0, 'contact' => 'optional', 'comments' => 'open', 'access comments' => 0, 'post comments' => 1, 'skip comment approval' => 1, 'edit own comments' => 0, )Debugcomment.test831CommentInterfaceTest->setEnvironment()
Changed environment:array ( 'authenticated' => false, 'comment count' => true, 'form' => 'below', 'user_register' => 0, 'contact' => 'optional', 'comments' => 'open', 'access comments' => 0, 'post comments' => 1, 'skip comment approval' => 1, 'edit own comments' => 0, )Debugcomment.test831CommentInterfaceTest->setEnvironment()
Changed environment:array ( 'authenticated' => true, 'comment count' => true, 'form' => 'below', 'user_register' => 0, 'contact' => 'optional', 'comments' => 'open', 'access comments' => 0, 'post comments' => 1, 'skip comment approval' => 1, 'edit own comments' => 0, )Debugcomment.test831CommentInterfaceTest->setEnvironment()
Changed environment:array ( 'authenticated' => false, 'comment count' => false, 'form' => 'below', 'user_register' => 0, 'contact' => 'optional', 'comments' => 'open', 'access comments' => 1, 'post comments' => 1, 'skip comment approval' => 1, 'edit own comments' => 0, )Debugcomment.test831CommentInterfaceTest->setEnvironment()
Changed environment:array ( 'authenticated' => true, 'comment count' => false, 'form' => 'below', 'user_register' => 0, 'contact' => 'optional', 'comments' => 'open', 'access comments' => 1, 'post comments' => 1, 'skip comment approval' => 1, 'edit own comments' => 0, )Debugcomment.test831CommentInterfaceTest->setEnvironment()
Changed environment:array ( 'authenticated' => false, 'comment count' => true, 'form' => 'below', 'user_register' => 0, 'contact' => 'optional', 'comments' => 'open', 'access comments' => 1, 'post comments' => 1, 'skip comment approval' => 1, 'edit own comments' => 0, )Debugcomment.test831CommentInterfaceTest->setEnvironment()
Changed environment:array ( 'authenticated' => true, 'comment count' => true, 'form' => 'below', 'user_register' => 0, 'contact' => 'optional', 'comments' => 'open', 'access comments' => 1, 'post comments' => 1, 'skip comment approval' => 1, 'edit own comments' => 0, )Debugcomment.test831CommentInterfaceTest->setEnvironment()
Changed environment:array ( 'authenticated' => false, 'comment count' => false, 'form' => 'separate page', 'user_register' => 0, 'contact' => 'optional', 'comments' => 'open', 'access comments' => 0, 'post comments' => 0, 'skip comment approval' => 1, 'edit own comments' => 0, )Debugcomment.test831CommentInterfaceTest->setEnvironment()
Changed environment:array ( 'authenticated' => true, 'comment count' => false, 'form' => 'separate page', 'user_register' => 0, 'contact' => 'optional', 'comments' => 'open', 'access comments' => 0, 'post comments' => 0, 'skip comment approval' => 1, 'edit own comments' => 0, )Debugcomment.test831CommentInterfaceTest->setEnvironment()
Changed environment:array ( 'authenticated' => false, 'comment count' => true, 'form' => 'separate page', 'user_register' => 0, 'contact' => 'optional', 'comments' => 'open', 'access comments' => 0, 'post comments' => 0, 'skip comment approval' => 1, 'edit own comments' => 0, )Debugcomment.test831CommentInterfaceTest->setEnvironment()
Changed environment:array ( 'authenticated' => true, 'comment count' => true, 'form' => 'separate page', 'user_register' => 0, 'contact' => 'optional', 'comments' => 'open', 'access comments' => 0, 'post comments' => 0, 'skip comment approval' => 1, 'edit own comments' => 0, )Debugcomment.test831CommentInterfaceTest->setEnvironment()
Changed environment:array ( 'authenticated' => false, 'comment count' => false, 'form' => 'separate page', 'user_register' => 0, 'contact' => 'optional', 'comments' => 'open', 'access comments' => 1, 'post comments' => 0, 'skip comment approval' => 1, 'edit own comments' => 0, )Debugcomment.test831CommentInterfaceTest->setEnvironment()
Changed environment:array ( 'authenticated' => true, 'comment count' => false, 'form' => 'separate page', 'user_register' => 0, 'contact' => 'optional', 'comments' => 'open', 'access comments' => 1, 'post comments' => 0, 'skip comment approval' => 1, 'edit own comments' => 0, )Debugcomment.test831CommentInterfaceTest->setEnvironment()
Changed environment:array ( 'authenticated' => false, 'comment count' => true, 'form' => 'separate page', 'user_register' => 0, 'contact' => 'optional', 'comments' => 'open', 'access comments' => 1, 'post comments' => 0, 'skip comment approval' => 1, 'edit own comments' => 0, )Debugcomment.test831CommentInterfaceTest->setEnvironment()
Changed environment:array ( 'authenticated' => true, 'comment count' => true, 'form' => 'separate page', 'user_register' => 0, 'contact' => 'optional', 'comments' => 'open', 'access comments' => 1, 'post comments' => 0, 'skip comment approval' => 1, 'edit own comments' => 0, )Debugcomment.test831CommentInterfaceTest->setEnvironment()
Changed environment:array ( 'authenticated' => false, 'comment count' => false, 'form' => 'separate page', 'user_register' => 0, 'contact' => 'optional', 'comments' => 'open', 'access comments' => 0, 'post comments' => 1, 'skip comment approval' => 1, 'edit own comments' => 0, )Debugcomment.test831CommentInterfaceTest->setEnvironment()
Changed environment:array ( 'authenticated' => true, 'comment count' => false, 'form' => 'separate page', 'user_register' => 0, 'contact' => 'optional', 'comments' => 'open', 'access comments' => 0, 'post comments' => 1, 'skip comment approval' => 1, 'edit own comments' => 0, )Debugcomment.test831CommentInterfaceTest->setEnvironment()
Changed environment:array ( 'authenticated' => false, 'comment count' => true, 'form' => 'separate page', 'user_register' => 0, 'contact' => 'optional', 'comments' => 'open', 'access comments' => 0, 'post comments' => 1, 'skip comment approval' => 1, 'edit own comments' => 0, )Debugcomment.test831CommentInterfaceTest->setEnvironment()
Changed environment:array ( 'authenticated' => true, 'comment count' => true, 'form' => 'separate page', 'user_register' => 0, 'contact' => 'optional', 'comments' => 'open', 'access comments' => 0, 'post comments' => 1, 'skip comment approval' => 1, 'edit own comments' => 0, )Debugcomment.test831CommentInterfaceTest->setEnvironment()
Changed environment:array ( 'authenticated' => false, 'comment count' => false, 'form' => 'separate page', 'user_register' => 0, 'contact' => 'optional', 'comments' => 'open', 'access comments' => 1, 'post comments' => 1, 'skip comment approval' => 1, 'edit own comments' => 0, )Debugcomment.test831CommentInterfaceTest->setEnvironment()
Changed environment:array ( 'authenticated' => true, 'comment count' => false, 'form' => 'separate page', 'user_register' => 0, 'contact' => 'optional', 'comments' => 'open', 'access comments' => 1, 'post comments' => 1, 'skip comment approval' => 1, 'edit own comments' => 0, )Debugcomment.test831CommentInterfaceTest->setEnvironment()
Changed environment:array ( 'authenticated' => false, 'comment count' => true, 'form' => 'separate page', 'user_register' => 0, 'contact' => 'optional', 'comments' => 'open', 'access comments' => 1, 'post comments' => 1, 'skip comment approval' => 1, 'edit own comments' => 0, )Debugcomment.test831CommentInterfaceTest->setEnvironment()
Changed environment:array ( 'authenticated' => true, 'comment count' => true, 'form' => 'separate page', 'user_register' => 0, 'contact' => 'optional', 'comments' => 'open', 'access comments' => 1, 'post comments' => 1, 'skip comment approval' => 1, 'edit own comments' => 0, )Debugcomment.test831CommentInterfaceTest->setEnvironment()
LeafComment language (LocaleCommentLanguageFunctionalTest) [Locale]5300
LeafComment node access (CommentNodeAccessTest) [Comment]5400
LeafComment paging settings (CommentPagerTest) [Comment]21100
LeafComment preview (CommentPreviewTest) [Comment]9900
LeafComment Rebuild (CommentContentRebuild) [Comment]3300
LeafComment RSS (CommentRSSUnitTest) [Comment]2500
LeafComment Search tests (SearchCommentTestCase) [Search]19000
LeafComment Threading (CommentThreadingTestCase) [Comment]15700
LeafComment token replacement (CommentTokenReplaceTestCase) [Comment]6500
LeafComment upgrade path (CommentUpgradePathTestCase) [Upgrade path]2800
LeafConfig settings form (SearchConfigSettingsForm) [Search]12200
LeafConnection tests (DatabaseConnectionTestCase) [Database]3800
LeafContent language settings (LocaleContentFunctionalTest) [Locale]8600
LeafContextual links on node lists (ContextualDynamicContextTestCase) [Contextual]1600
LeafCron run (CronRunTestCase) [System]5100
LeafCSS Unit Tests (CascadingStylesheetsUnitTest) [System]2300
LeafCustom query syntax tests (DatabaseQueryTestCase) [Database]700
LeafDashboard blocks (DashboardBlocksTestCase) [Dashboard]8500
LeafData API functions (DrupalDataApiTest) [System]3300
LeafDate and time (DateTimeFunctionalTest) [System]11300
LeafDBLog functionality (DBLogTestCase) [DBLog]50300
LeafDefault text format functionality (FilterDefaultFormatTestCase) [Filter]3300
LeafDelete/Truncate tests (DatabaseDeleteTruncateTestCase) [Database]2300
LeafDisabled node type upgrade path (DisabledNodeTypeTestCase) [Upgrade path]3300
LeafDrupal error handlers (DrupalErrorHandlerTestCase) [System]3000
LeafDrupal goto (DrupalGotoTest) [System]2100
LeafDrupal HTTP request (DrupalHTTPRequestTestCase) [System]3500
LeafDrupal match path (DrupalMatchPathTestCase) [Path API]4100
LeafDrupal set/get regions (DrupalSetContentTestCase) [System]3400
LeafDrupal system listing (DrupalSystemListingTestCase) [System]600
LeafDrupal tags handling (DrupalTagsHandlingTestCase) [System]800
Leafdrupal_add_feed() tests (DrupalAddFeedTestCase) [System]600
Leafdrupal_alter() tests (DrupalAlterTestCase) [System]700
Leafdrupal_render() (DrupalRenderTestCase) [System]4700
LeafElement processing (FormElementTestCase) [Form API]2700
LeafEmbedded forms (SearchEmbedForm) [Search]3200
LeafEmpty statement (DatabaseEmptyStatementTestCase) [Database]400
LeafEnable/disable modules (EnableDisableTestCase) [Module]142600
LeafEntity CRUD hooks (EntityCrudHookTestCase) [Entity API]7800
LeafEntity properties (EntityPropertiesTestCase) [Entity API]400
LeafEntity query (EntityFieldQueryTestCase) [Entity API]12700
LeafFeed parser functionality (FeedParserTestCase) [Unknown]4500
LeafFetch tests (DatabaseFetchTestCase) [Database]3700
LeafFetch tests, part 2 (DatabaseFetch2TestCase) [Database]2900
LeafFetching multiple cache items (CacheGetMultipleUnitTest) [Cache]700
LeafField attach tests (other) (FieldAttachOtherTestCase) [Field API]5400
LeafField attach tests (storage-related) (FieldAttachStorageTestCase) [Field API]11300
LeafField bulk delete tests (FieldBulkDeleteTestCase) [Field API]7500
LeafField CRUD tests (FieldCrudTestCase) [Field API]9500
LeafField Display API tests (FieldDisplayAPITestCase) [Field API]4600
LeafField form tests (FieldFormTestCase) [Field API]31500
LeafField info tests (FieldInfoTestCase) [Field API]11000
LeafField instance CRUD tests (FieldInstanceCrudTestCase) [Field API]5800
LeafField SQL storage tests (FieldSqlStorageTestCase) [Field API]13100
LeafField translations tests (FieldTranslationsTestCase) [Field API]10400
LeafFile copying (FileCopyTest) [File API]11000
LeafFile delete (FileDeleteTest) [File API]2000
LeafFile download (FileDownloadTest) [File API]3900
LeafFile field display tests (FileFieldDisplayTestCase) [File]5000
LeafFile field file path tests (FileFieldPathTestCase) [File]2700
LeafFile field revision test (FileFieldRevisionTestCase) [File]6700
LeafFile field validation tests (FileFieldValidateTestCase) [File]11800
LeafFile field widget test (FileFieldWidgetTestCase) [File]30000
LeafFile loading (FileLoadTest) [File API]3400
LeafFile mimetypes (FileMimeTypeTest) [File API]4200
LeafFile moving (FileMoveTest) [File API]11000
LeafFile naming (FileNameMungingTest) [File API]500
LeafFile paths and directories (FileDirectoryTest) [File API]2000
LeafFile paths and directories (RemoteFileDirectoryTest) [File API (remote)]2400
LeafFile save data (FileSaveDataTest) [File API]9300
LeafFile saving (FileSaveTest) [File API]1500
LeafFile scan directory (FileScanDirectoryTest) [File API]2300
LeafFile scan directory (RemoteFileScanDirectoryTest) [File API (remote)]2300
LeafFile space used tests (FileSpaceUsedTest) [File API]1100
LeafFile token replacement (FileTokenReplaceTestCase) [File]3500
LeafFile uploading (FileSaveUploadTest) [File API]27100
LeafFile uploading (RemoteFileSaveUploadTest) [File API (remote)]27100
LeafFile URL rewriting (FileURLRewritingTest) [File]1700
LeafFile usage (FileUsageTest) [File]2100
LeafFile validate (FileValidateTest) [File API]1200
LeafFile validator tests (FileValidatorTest) [File API]2500
LeafFileTransfer unit tests (FileTranferTest) [System]200
LeafFilter administration functionality (FilterAdminTestCase) [Filter]16400
LeafFilter CRUD operations (FilterCRUDTestCase) [Filter]21500
LeafFilter format access (FilterFormatAccessTestCase) [Filter]24700
LeafFilter format hooks (FilterHooksTestCase) [Filter]3300
LeafFilter format upgrade path (FilterFormatUpgradePathTestCase) [Upgrade path]4000
LeafFilter module filters (FilterUnitTestCase) [Filter]21300
LeafFingerprinting meta tag (AdminMetaTagTestCase) [System]600
LeafFlood control mechanism (FloodFunctionalTest) [System]600
LeafForm alter hooks (FormAlterTestCase) [Form API]400
LeafForm API checkbox (FormCheckboxTestCase) [Form API]9700
LeafForm API file inclusion (FormsFileInclusionTestCase) [Form API]1100
LeafForm element and label output test (FormsElementsLabelsTestCase) [Form API]1800
LeafForm element validation (FormsTestCase) [Form API]29300
LeafForm rebuilding (FormsRebuildTestCase) [Form API]5400
LeafForm state values clearance (FormStateValuesCleanTestCase) [Form API]1400
LeafForm triggering element determination (FormsTriggeringElementTestCase) [Form API]5000
LeafForm validation handlers (FormValidationTestCase) [Form API]4900
LeafForm wrapper callback (FormsFormWrapperTestCase) [Form API]500
LeafFormat date (FormatDateUnitTest) [System]6100
LeafForum functionality (ForumTestCase) [Forum]63500
LeafForum upgrade path (ForumUpgradePathTestCase) [Upgrade path]5600
LeafFront page (FrontPageTestCase) [System]3700
LeafGet filename test (BootstrapGetFilenameTestCase) [Bootstrap]500
LeafGraph (GraphUnitTest) [System]2800
LeafHelp functionality (HelpTestCase) [Help]30700
LeafHTML Attributes (DrupalAttributesUnitTest) [System]600
LeafHTML identifiers (DrupalHTMLIdentifierTestCase) [System]1000
LeafHTML in page titles (PageTitleFiltering) [System]4400
LeafHTML to text conversion (DrupalHtmlToTextTestCase) [Mail]8100
LeafHTTP file retrieval (RetrieveFileTestCase) [System]700
LeafImage dimensions (ImageDimensionsTestCase) [Image]5400
LeafImage effects (ImageEffectsUnitTest) [Image]3900
LeafImage field display tests (ImageFieldDisplayTestCase) [Image]17400
LeafImage field validation tests (ImageFieldValidateTestCase) [Image]2100
LeafImage GD manipulation tests (ImageToolkitGdTestCase) [Image]100
LeafImage moving (ImageFileMoveTest) [Image]400
LeafImage styles and effects UI configuration (ImageAdminStylesUnitTest) [Image]17600
LeafImage styles path and URL functions (ImageStylesPathAndUrlTestCase) [Image]4700
LeafImage toolkit tests (ImageToolkitUnitTest) [Image]5300
Leafimage_dimensions_scale() (ImageDimensionsScaleTestCase) [Image]1500
LeafImport feeds from OPML functionality (ImportOPMLTestCase) [Unknown]5500
LeafIndex.php handling (SystemIndexPhpTest) [System]900
LeafInfo file format parser (InfoFileParserTestCase) [System]900
LeafInsert tests (DatabaseInsertTestCase) [Database]5100
LeafInsert tests, default fields (DatabaseInsertDefaultsTestCase) [Database]2200
LeafInsert tests, LOB fields (DatabaseInsertLOBTestCase) [Database]1500
LeafInstallation profile module tests (SimpleTestInstallationProfileModuleTestsTestCase) [SimpleTest]1900
LeafInvalid data (DatabaseInvalidDataTestCase) [Database]800
LeafIP address and HTTP_HOST test (BootstrapIPAddressTestCase) [Bootstrap]1100
LeafIP address blocking (IPAddressBlockingTestCase) [System]4200
LeafJavaScript (JavaScriptTestCase) [System]6600
LeafJavascript translation (LocaleJavascriptTranslationTest) [Locale]6600
LeafJSON (DrupalJSONTest) [System]2100
LeafKeywords and conditions (SearchKeywordsConditions) [Search]2800
LeafLanguage configuration (LocaleConfigurationTest) [Locale]9800
LeafLanguage negotiation info (LocaleLanguageNegotiationInfoFunctionalTest) [Locale]4900
LeafLanguage switching (LocaleLanguageSwitchingFunctionalTest) [Locale]2600
LeafLinks (ThemeLinksTest) [Theme]1700
LeafList field (ListFieldTestCase) [Field types]3200
LeafList field UI (ListFieldUITestCase) [Field types]21600
LeafLoad multiple nodes (NodeLoadMultipleTestCase) [Node]3900
LeafLocale uninstall (EN) (LocaleUninstallFunctionalTest) [Locale]3300
LeafLocale uninstall (FR) (LocaleUninstallFrenchFunctionalTest) [Locale]3300
LeafLocale upgrade path (LocaleUpgradePathTestCase) [Upgrade path]16900
LeafLocalize date formats (LocaleDateFormatsFunctionalTest) [Locale]3700
LeafLocking framework tests (LockFunctionalTest) [System]1800
LeafMail system (MailTestCase) [System]400
LeafMain content rendering fallback (SystemMainContentFallback) [System]6200
ExpandManage display (FieldUIManageDisplayTestCase) [Field UI]306810
MessageGroupFilenameLineFunctionStatus
Invalid permission administer taxonomy.Rolefield_ui.test25FieldUITestCase->setUp()
Argument 1 passed to DrupalWebTestCase::drupalLogin() must be an instance of stdClass, boolean given, called in /var/lib/drupaltestbot/sites/default/files/checkout/modules/field_ui/field_ui.test on line 26 and definedRecoverable errordrupal_web_test_case.php1226DrupalWebTestCase->drupalLogin()
Trying to get property of non-objectNoticedrupal_web_test_case.php1232DrupalWebTestCase->drupalLogin()
Trying to get property of non-objectNoticedrupal_web_test_case.php1233DrupalWebTestCase->drupalLogin()
Failed to set field name to Otherfield_ui.test26FieldUITestCase->setUp()
Failed to set field pass to Otherfield_ui.test26FieldUITestCase->setUp()
Found the requested form fields at userOtherfield_ui.test26FieldUITestCase->setUp()
Trying to get property of non-objectNoticedrupal_web_test_case.php1239DrupalWebTestCase->drupalLogin()
User successfully logged in.User loginfield_ui.test26FieldUITestCase->setUp()
Failed to set field fields[_add_new_field][label] to Test fieldOtherfield_ui.test61FieldUITestCase->fieldUIAddNewField()
Failed to set field fields[_add_new_field][field_name] to testOtherfield_ui.test61FieldUITestCase->fieldUIAddNewField()
Failed to set field fields[_add_new_field][type] to test_fieldOtherfield_ui.test61FieldUITestCase->fieldUIAddNewField()
Failed to set field fields[_add_new_field][widget_type] to test_field_widgetOtherfield_ui.test61FieldUITestCase->fieldUIAddNewField()
Found the Save buttonOtherfield_ui.test61FieldUITestCase->fieldUIAddNewField()
Found the requested form fields at admin/structure/types/manage/e0kl9miw-test/fieldsOtherfield_ui.test61FieldUITestCase->fieldUIAddNewField()
Field settings page was displayed.Otherfield_ui.test62FieldUITestCase->fieldUIAddNewField()
Found the Save field settings buttonOtherfield_ui.test65FieldUITestCase->fieldUIAddNewField()
Found the requested form fields at Otherfield_ui.test65FieldUITestCase->fieldUIAddNewField()
Redirected to instance and widget settings page.Otherfield_ui.test66FieldUITestCase->fieldUIAddNewField()
Found the Save settings buttonOtherfield_ui.test69FieldUITestCase->fieldUIAddNewField()
Found the requested form fields at Otherfield_ui.test69FieldUITestCase->fieldUIAddNewField()
Redirected to "Manage fields" page.Otherfield_ui.test70FieldUITestCase->fieldUIAddNewField()
Field was created and appears in the overview page.Otherfield_ui.test73FieldUITestCase->fieldUIAddNewField()
The expected formatter is selected.Browserfield_ui.test491FieldUIManageDisplayTestCase->testFormatterUI()
The expected summary is displayed.Otherfield_ui.test492FieldUIManageDisplayTestCase->testFormatterUI()
Undefined offset: 0Noticedrupal_web_test_case.php2030DrupalWebTestCase->drupalPostAJAX()
Undefined index: ajaxNoticedrupal_web_test_case.php2031DrupalWebTestCase->drupalPostAJAX()
Failed to set field fields[field_test][type] to field_test_multipleOtherfield_ui.test496FieldUIManageDisplayTestCase->testFormatterUI()
Failed to set field refresh_rows to field_testOtherfield_ui.test496FieldUIManageDisplayTestCase->testFormatterUI()
Found the requested form fields at Otherfield_ui.test496FieldUIManageDisplayTestCase->testFormatterUI()
The expected formatter is selected.Browserfield_ui.test501FieldUIManageDisplayTestCase->testFormatterUI()
The expected summary is displayed.Otherfield_ui.test502FieldUIManageDisplayTestCase->testFormatterUI()
Found the Save buttonOtherfield_ui.test505FieldUIManageDisplayTestCase->testFormatterUI()
Found the requested form fields at Otherfield_ui.test505FieldUIManageDisplayTestCase->testFormatterUI()
The formatter was updated.Otherfield_ui.test510FieldUIManageDisplayTestCase->testFormatterUI()
The setting was updated.Otherfield_ui.test511FieldUIManageDisplayTestCase->testFormatterUI()
Invalid permission administer taxonomy.Rolefield_ui.test25FieldUITestCase->setUp()
Argument 1 passed to DrupalWebTestCase::drupalLogin() must be an instance of stdClass, boolean given, called in /var/lib/drupaltestbot/sites/default/files/checkout/modules/field_ui/field_ui.test on line 26 and definedRecoverable errordrupal_web_test_case.php1226DrupalWebTestCase->drupalLogin()
Trying to get property of non-objectNoticedrupal_web_test_case.php1232DrupalWebTestCase->drupalLogin()
Trying to get property of non-objectNoticedrupal_web_test_case.php1233DrupalWebTestCase->drupalLogin()
Failed to set field name to Otherfield_ui.test26FieldUITestCase->setUp()
Failed to set field pass to Otherfield_ui.test26FieldUITestCase->setUp()
Found the requested form fields at userOtherfield_ui.test26FieldUITestCase->setUp()
Trying to get property of non-objectNoticedrupal_web_test_case.php1239DrupalWebTestCase->drupalLogin()
User successfully logged in.User loginfield_ui.test26FieldUITestCase->setUp()
Failed to set field fields[_add_new_field][label] to Test fieldOtherfield_ui.test61FieldUITestCase->fieldUIAddNewField()
Failed to set field fields[_add_new_field][field_name] to testOtherfield_ui.test61FieldUITestCase->fieldUIAddNewField()
Failed to set field fields[_add_new_field][type] to test_fieldOtherfield_ui.test61FieldUITestCase->fieldUIAddNewField()
Failed to set field fields[_add_new_field][widget_type] to test_field_widgetOtherfield_ui.test61FieldUITestCase->fieldUIAddNewField()
Found the Save buttonOtherfield_ui.test61FieldUITestCase->fieldUIAddNewField()
Found the requested form fields at admin/structure/types/manage/sflzgzuc-test/fieldsOtherfield_ui.test61FieldUITestCase->fieldUIAddNewField()
Field settings page was displayed.Otherfield_ui.test62FieldUITestCase->fieldUIAddNewField()
Found the Save field settings buttonOtherfield_ui.test65FieldUITestCase->fieldUIAddNewField()
Found the requested form fields at Otherfield_ui.test65FieldUITestCase->fieldUIAddNewField()
Redirected to instance and widget settings page.Otherfield_ui.test66FieldUITestCase->fieldUIAddNewField()
Found the Save settings buttonOtherfield_ui.test69FieldUITestCase->fieldUIAddNewField()
Found the requested form fields at Otherfield_ui.test69FieldUITestCase->fieldUIAddNewField()
Redirected to "Manage fields" page.Otherfield_ui.test70FieldUITestCase->fieldUIAddNewField()
Field was created and appears in the overview page.Otherfield_ui.test73FieldUITestCase->fieldUIAddNewField()
The field is displayed as expected in view modes that use 'default' settings.Otherfield_ui.test543FieldUIManageDisplayTestCase->testViewModeCustom()
Failed to set field fields[field_test][type] to field_test_with_prepare_viewOtherfield_ui.test551FieldUIManageDisplayTestCase->testViewModeCustom()
Found the Save buttonOtherfield_ui.test551FieldUIManageDisplayTestCase->testViewModeCustom()
Found the requested form fields at admin/structure/types/manage/sflzgzuc-test/displayOtherfield_ui.test551FieldUIManageDisplayTestCase->testViewModeCustom()
The field is displayed as expected in view modes that use 'default' settings.Otherfield_ui.test552FieldUIManageDisplayTestCase->testViewModeCustom()
Failed to set field view_modes_custom[rss] to 1Otherfield_ui.test558FieldUIManageDisplayTestCase->testViewModeCustom()
Found the Save buttonOtherfield_ui.test558FieldUIManageDisplayTestCase->testViewModeCustom()
Found the requested form fields at admin/structure/types/manage/sflzgzuc-test/displayOtherfield_ui.test558FieldUIManageDisplayTestCase->testViewModeCustom()
The field is displayed as expected in newly specialized 'rss' mode.Otherfield_ui.test559FieldUIManageDisplayTestCase->testViewModeCustom()
Failed to set field fields[field_test][type] to hiddenOtherfield_ui.test566FieldUIManageDisplayTestCase->testViewModeCustom()
Found the Save buttonOtherfield_ui.test566FieldUIManageDisplayTestCase->testViewModeCustom()
Found the requested form fields at admin/structure/types/manage/sflzgzuc-test/display/rssOtherfield_ui.test566FieldUIManageDisplayTestCase->testViewModeCustom()
Failed to set field view_modes_custom[rss] to Otherfield_ui.test574FieldUIManageDisplayTestCase->testViewModeCustom()
Found the Save buttonOtherfield_ui.test574FieldUIManageDisplayTestCase->testViewModeCustom()
Found the requested form fields at admin/structure/types/manage/sflzgzuc-test/displayOtherfield_ui.test574FieldUIManageDisplayTestCase->testViewModeCustom()
The field is displayed as expected when 'rss' mode is set back to 'default' settings.Otherfield_ui.test575FieldUIManageDisplayTestCase->testViewModeCustom()
Failed to set field view_modes_custom[rss] to 1Otherfield_ui.test581FieldUIManageDisplayTestCase->testViewModeCustom()
Found the Save buttonOtherfield_ui.test581FieldUIManageDisplayTestCase->testViewModeCustom()
Found the requested form fields at admin/structure/types/manage/sflzgzuc-test/displayOtherfield_ui.test581FieldUIManageDisplayTestCase->testViewModeCustom()
ExpandManage fields (FieldUIManageFieldsTestCase) [Field UI]9274
MessageGroupFilenameLineFunctionStatus
The test did not complete due to a fatal error.Completion checkfield_ui.test160FieldUIManageFieldsTestCase->testCRUDFields()
Invalid permission administer taxonomy.Rolefield_ui.test25FieldUITestCase->setUp()
Argument 1 passed to DrupalWebTestCase::drupalLogin() must be an instance of stdClass, boolean given, called in /var/lib/drupaltestbot/sites/default/files/checkout/modules/field_ui/field_ui.test on line 26 and definedRecoverable errordrupal_web_test_case.php1226DrupalWebTestCase->drupalLogin()
Trying to get property of non-objectNoticedrupal_web_test_case.php1232DrupalWebTestCase->drupalLogin()
Trying to get property of non-objectNoticedrupal_web_test_case.php1233DrupalWebTestCase->drupalLogin()
Failed to set field name to Otherfield_ui.test26FieldUITestCase->setUp()
Failed to set field pass to Otherfield_ui.test26FieldUITestCase->setUp()
Found the requested form fields at userOtherfield_ui.test26FieldUITestCase->setUp()
Trying to get property of non-objectNoticedrupal_web_test_case.php1239DrupalWebTestCase->drupalLogin()
User successfully logged in.User loginfield_ui.test26FieldUITestCase->setUp()
Label table header was found.Otherfield_ui.test182FieldUIManageFieldsTestCase->manageFieldsPage()
Machine name table header was found.Otherfield_ui.test182FieldUIManageFieldsTestCase->manageFieldsPage()
Field table header was found.Otherfield_ui.test182FieldUIManageFieldsTestCase->manageFieldsPage()
Widget table header was found.Otherfield_ui.test182FieldUIManageFieldsTestCase->manageFieldsPage()
Operations table header was found.Otherfield_ui.test182FieldUIManageFieldsTestCase->manageFieldsPage()
"Add new field" was found.Otherfield_ui.test188FieldUIManageFieldsTestCase->manageFieldsPage()
"Add existing field" was found.Otherfield_ui.test188FieldUIManageFieldsTestCase->manageFieldsPage()
Failed to set field fields[_add_new_field][label] to dxNPixfQOtherfield_ui.test61FieldUITestCase->fieldUIAddNewField()
Failed to set field fields[_add_new_field][field_name] to umxvrondOtherfield_ui.test61FieldUITestCase->fieldUIAddNewField()
Failed to set field fields[_add_new_field][type] to test_fieldOtherfield_ui.test61FieldUITestCase->fieldUIAddNewField()
Failed to set field fields[_add_new_field][widget_type] to test_field_widgetOtherfield_ui.test61FieldUITestCase->fieldUIAddNewField()
Found the Save buttonOtherfield_ui.test61FieldUITestCase->fieldUIAddNewField()
Found the requested form fields at admin/structure/types/manage/d4s9ym0e-test/fieldsOtherfield_ui.test61FieldUITestCase->fieldUIAddNewField()
Field settings page was displayed.Otherfield_ui.test62FieldUITestCase->fieldUIAddNewField()
Found the Save field settings buttonOtherfield_ui.test65FieldUITestCase->fieldUIAddNewField()
Found the requested form fields at Otherfield_ui.test65FieldUITestCase->fieldUIAddNewField()
Redirected to instance and widget settings page.Otherfield_ui.test66FieldUITestCase->fieldUIAddNewField()
Found the Save settings buttonOtherfield_ui.test69FieldUITestCase->fieldUIAddNewField()
Found the requested form fields at Otherfield_ui.test69FieldUITestCase->fieldUIAddNewField()
Redirected to "Manage fields" page.Otherfield_ui.test70FieldUITestCase->fieldUIAddNewField()
Field was created and appears in the overview page.Otherfield_ui.test73FieldUITestCase->fieldUIAddNewField()
LeafManaged file element test (FileManagedFileElementTestCase) [File]26800
LeafMenu link creation/deletion (MenuTestCase) [Menu]81200
LeafMenu links (MenuLinksUnitTestCase) [Menu]5000
LeafMenu rebuild test (MenuRebuildTestCase) [Menu]500
LeafMenu router (MenuRouterTestCase) [Menu]24100
LeafMenu settings for nodes (MenuNodeTestCase) [Menu]6100
LeafMenu tree generation (MenuTreeDataTestCase) [Menu]400
LeafMenu tree output (MenuTreeOutputTestCase) [Menu]700
LeafMenu upgrade path (MenuUpgradePathTestCase) [Upgrade path]7800
LeafMerge tests (DatabaseMergeTestCase) [Database]8300
LeafMiscellaneous AJAX tests (AJAXElementValidation) [AJAX]700
LeafMiscellaneous bootstrap unit tests (BootstrapMiscTestCase) [Bootstrap]100
LeafMissing update dependencies (UpdateDependencyMissingTestCase) [Update API]400
LeafModule API (ModuleUnitTest) [Module]6600
ExpandModule dependencies (ModuleDependencyTestCase) [Module]17310
MessageGroupFilenameLineFunctionStatus
"You must enable the Taxonomy, Options, Comment, Poll, PHP Filter modules to install Forum." foundOthersystem.test533ModuleDependencyTestCase->testModuleEnableOrder()
LeafModule installation (ModuleInstallTestCase) [Module]300
LeafModule uninstallation (ModuleUninstallTestCase) [Module]200
LeafModule versions (ModuleVersionTestCase) [Module]8700
LeafMultilingual fields (LocaleMultilingualFieldsFunctionalTest) [Locale]6400
LeafMultiple vocabulary term reference field (TaxonomyTermFieldMultipleVocabularyTestCase) [Taxonomy]2600
LeafMultistep form using form storage (FormsFormStorageTestCase) [Form API]12000
LeafMultistep node form basic options (MultiStepNodeFormBasicOptionsTest) [Node]3200
LeafNew default theme blocks (NewDefaultThemeBlocks) [Block]2200
LeafNo help (NoHelpTestCase) [Help]1200
LeafNode access (NodeAccessTestCase) [Node]3400
LeafNode Access on any table (NodeAccessBaseTableTestCase) [Node]16300
LeafNode access pagination (NodeAccessPagerTestCase) [Node]3000
LeafNode access rebuild (NodeAccessRebuildTestCase) [Node]1900
LeafNode access records (NodeAccessRecordsTestCase) [Node]2600
LeafNode administration (NodeAdminTestCase) [Node]14800
LeafNode blocks (NodeBlockFunctionalTest) [Node]8600
LeafNode body upgrade path (NodeBodyUpgradePathTestCase) [Upgrade path]4500
LeafNode creation (NodeCreationTestCase) [Node]3100
LeafNode edit (PageEditTestCase) [Node]9900
LeafNode edit permissions (PageViewTestCase) [Node]3500
LeafNode entity query alter (NodeEntityFieldQueryAlter) [Node]3300
LeafNode feed (NodeFeedTestCase) [Node]100
LeafNode load hooks (NodeLoadHooksTestCase) [Node]700
LeafNode post information display (NodePostSettingsTestCase) [Node]4000
LeafNode preview (PagePreviewTestCase) [Node]4100
LeafNode query alter (NodeQueryAlter) [Node]9400
LeafNode revision permissions (NodeRevisionPermissionsTestCase) [Node]3400
LeafNode revisions (NodeRevisionsTestCase) [Node]5000
LeafNode RSS Content (NodeRSSContentTestCase) [Node]1900
LeafNode save (NodeSaveTestCase) [Node]4800
LeafNode title (NodeTitleTestCase) [Node]2300
LeafNode title XSS filtering (NodeTitleXSSTestCase) [Node]2300
LeafNode token replacement (NodeTokenReplaceTestCase) [Node]3700
LeafNode type persist (NodeTypePersistenceTestCase) [Node]6500
LeafNode types (NodeTypeTestCase) [Node]12500
LeafNon default theme admin (NonDefaultBlockAdmin) [Block]1100
LeafNumber field (NumberFieldTestCase) [Field types]8800
LeafOpenID account registration (OpenIDRegistrationTestCase) [OpenID]14400
LeafOpenID account update (OpenIDInvalidIdentifierTransitionTestCase) [OpenID]35900
LeafOpenID discovery and login (OpenIDFunctionalTestCase) [OpenID]29500
LeafOpenID helper functions (OpenIDTestCase) [OpenID]4500
LeafOptions widgets (OptionsWidgetsTestCase) [Field types]26200
LeafOther Installation profiles (SimpleTestOtherInstallationProfileModuleTestsTestCase) [SimpleTest]1200
LeafOverriding server variables (BootstrapOverrideServerVariablesTestCase) [Bootstrap]600
LeafPage cache test (BootstrapPageCacheTestCase) [Bootstrap]7700
LeafPager functionality (PagerFunctionalWebTestCase) [Pager]12300
LeafPager query tests (DatabaseSelectPagerDefaultTestCase) [Database]4700
LeafParsing .info files (ParseInfoFilesTestCase) [System]300
LeafPassword hashing (PasswordHashingTest) [System]1000
LeafPath alias functionality (PathAliasTestCase) [Path]13200
LeafPath aliases with languages (PathLanguageUITestCase) [Path]7800
LeafPath aliases with translated nodes (PathLanguageTestCase) [Path]6600
LeafPath language settings (LocalePathFunctionalTest) [Locale]5100
LeafPath lookup (PathLookupTest) [Path API]1300
LeafPath save (PathSaveTest) [Path API]400
LeafPaths on non-English monolingual sites (PathMonolingualTestCase) [Path]3700
LeafPersonal contact form (ContactPersonalTestCase) [Contact]13600
LeafPHP filter access check (PHPAccessTestCase) [PHP]3900
LeafPHP filter functionality (PHPFilterTestCase) [PHP]4300
LeafPlural formula evaluation (LocalePluralFormatTest) [Locale]3300
LeafPoll add choice (PollJSAddChoice) [Poll]1600
LeafPoll choice deletion (PollDeleteChoiceTestCase) [Poll]5500
LeafPoll create (PollCreateTestCase) [Poll]19300
LeafPoll expiration (PollExpirationTestCase) [Poll]5300
LeafPoll token replacement (PollTokenReplaceTestCase) [Poll]13100
LeafPoll translation (PollTranslateTestCase) [Poll]7500
LeafPoll upgrade path (PollUpgradePathTestCase) [Upgrade path]21600
LeafPoll vote (PollVoteTestCase) [Poll]10500
LeafPrivate file test (FilePrivateTestCase) [File]3800
ExpandProfile browsing (ProfileTestBrowsing) [Profile]15225
MessageGroupFilenameLineFunctionStatus
Invalid permission administer blocks.Roleprofile.test19ProfileTestCase->setUp()
Argument 1 passed to DrupalWebTestCase::drupalLogin() must be an instance of stdClass, boolean given, called in /var/lib/drupaltestbot/sites/default/files/checkout/modules/profile/profile.test on line 472 and definedRecoverable errordrupal_web_test_case.php1226DrupalWebTestCase->drupalLogin()
Trying to get property of non-objectNoticedrupal_web_test_case.php1232DrupalWebTestCase->drupalLogin()
Trying to get property of non-objectNoticedrupal_web_test_case.php1233DrupalWebTestCase->drupalLogin()
Failed to set field name to Otherprofile.test472ProfileTestBrowsing->testProfileBrowsing()
Failed to set field pass to Otherprofile.test472ProfileTestBrowsing->testProfileBrowsing()
Found the requested form fields at userOtherprofile.test472ProfileTestBrowsing->testProfileBrowsing()
Trying to get property of non-objectNoticedrupal_web_test_case.php1239DrupalWebTestCase->drupalLogin()
User successfully logged in.User loginprofile.test472ProfileTestBrowsing->testProfileBrowsing()
Failed to set field page to %valueOtherprofile.test43ProfileTestCase->createProfileField()
Failed to set field title to n6KN3Y8MOtherprofile.test43ProfileTestCase->createProfileField()
Failed to set field name to profile_n6KN3Y8MOtherprofile.test43ProfileTestCase->createProfileField()
Failed to set field category to simpletestOtherprofile.test43ProfileTestCase->createProfileField()
Failed to set field explanation to cSdXmqO7EP9NY6VVvJy7HmBLj8pk4tLNAIkqcwIDOhTtB5Znb7Otherprofile.test43ProfileTestCase->createProfileField()
Found the Save field buttonOtherprofile.test43ProfileTestCase->createProfileField()
Found the requested form fields at admin/config/people/profile/add/listOtherprofile.test43ProfileTestCase->createProfileField()
New Profile field has been entered in the databaseOtherprofile.test45ProfileTestCase->createProfileField()
Trying to get property of non-objectNoticeprofile.test48ProfileTestCase->createProfileField()
Found form named profile_n6KN3Y8MOtherprofile.test57ProfileTestCase->createProfileField()
Checking title for field n6KN3Y8MOtherprofile.test61ProfileTestCase->createProfileField()
Checking explanation for field n6KN3Y8MOtherprofile.test63ProfileTestCase->createProfileField()
Failed to set field profile_n6KN3Y8M to jS7hsGsGOtherprofile.test140ProfileTestCase->setProfileField()
Found the Save buttonOtherprofile.test140ProfileTestCase->setProfileField()
Found the requested form fields at user/2/edit/simpletestOtherprofile.test140ProfileTestCase->setProfileField()
Found profile field with title n6KN3Y8MOtherprofile.test144ProfileTestCase->setProfileField()
Found profile field with value jS7hsGsGOtherprofile.test148ProfileTestCase->setProfileField()
"uzd6k6FP" foundOtherprofile.test480ProfileTestBrowsing->testProfileBrowsing()
ExpandProfile CRUD tests (ProfileCrudTestCase) [Profile]210
MessageGroupFilenameLineFunctionStatus
Invalid permission administer blocks.Roleprofile.test19ProfileTestCase->setUp()
LeafProgrammatic form submissions (FormsProgrammaticTestCase) [Form API]2400
LeafQuery altering tests (DatabaseAlterTestCase) [Database]6200
LeafQuery logging (DatabaseLoggingTestCase) [Database]4300
LeafQuery tagging tests (DatabaseTaggingTestCase) [Database]3200
LeafQueue functionality (QueueTestCase) [System]700
LeafRange query test (DatabaseRangeQueryTestCase) [Database]300
LeafRDF comment mapping (RdfCommentAttributesTestCase) [RDF]20700
ExpandRDF mapping CRUD functions (RdfCrudTestCase) [RDF]010
MessageGroupFilenameLineFunctionStatus
The test did not complete due to a fatal error.Completion checkrdf.test229RdfCrudTestCase->testCRUD()
LeafRDF mapping definition functionality (RdfMappingDefinitionTestCase) [RDF]6100
ExpandRDF mapping hook (RdfMappingHookTestCase) [RDF]010
MessageGroupFilenameLineFunctionStatus
The test did not complete due to a fatal error.Completion checkrdf.test24RdfMappingHookTestCase->testMapping()
ExpandRDF namespaces (RdfGetRdfNamespacesTestCase) [RDF]010
MessageGroupFilenameLineFunctionStatus
The test did not complete due to a fatal error.Completion checkrdf.test712RdfGetRdfNamespacesTestCase->testGetRdfNamespaces()
ExpandRDF namespaces XML serialization tests (DrupalGetRdfNamespacesTestCase) [System]010
MessageGroupFilenameLineFunctionStatus
The test did not complete due to a fatal error.Completion checkcommon.test2454DrupalGetRdfNamespacesTestCase->testGetRdfNamespaces()
LeafRDF tracker page mapping (RdfTrackerAttributesTestCase) [RDF]3300
LeafRDFa markup (RdfRdfaMarkupTestCase) [RDF]2900
LeafRebuild arbitrary forms (FormsArbitraryRebuildTestCase) [Form API]1600
LeafRebuild content (NodeBuildContent) [Node]400
LeafRegistry parse file test (RegistryParseFileTestCase) [System]200
LeafRegistry parse files test (RegistryParseFilesTestCase) [System]600
LeafRegression tests (DatabaseRegressionTestCase) [Database]3100
LeafRemove feed functionality (RemoveFeedTestCase) [Unknown]2500
LeafRemove feed item functionality (RemoveFeedItemTestCase) [Unknown]27000
LeafRequired modules (ModuleRequiredTestCase) [Module]1900
LeafRequirements hook failure (HookRequirementsTestCase) [Module]1600
LeafResettable static variables test (BootstrapResettableStaticTestCase) [Bootstrap]500
LeafRole assignment (UserRolesAssignmentTestCase) [User]5100
LeafRole permissions (UserPermissionsTestCase) [User]5000
LeafSchema API (SchemaTestCase) [Database]58800
LeafSearch and node access (SearchNodeAccessTest) [Search]1600
LeafSearch engine phrase queries (SearchExactTestCase) [Search]2500
LeafSearch engine queries (SearchMatchTestCase) [Search]14700
LeafSearch engine ranking (SearchRankingTestCase) [Search]6900
LeafSearch excerpt extraction (SearchExcerptTestCase) [Search]1600
LeafSearch expression insert/extract (SearchExpressionInsertExtractTestCase) [Search]2400
LeafSearch language selection (SearchLanguageTestCase) [Search]4800
LeafSearch number matching (SearchNumberMatchingTestCase) [Search]29500
LeafSearch numbers (SearchNumbersTestCase) [Search]17500
LeafSearch page override (SearchPageOverride) [Search]1500
LeafSearch page text (SearchPageText) [Search]3700
LeafSearch simplify (SearchSimplifyTestCase) [Search]65700
LeafSecurity (FilterSecurityTestCase) [Filter]2800
LeafSelect tests (DatabaseSelectTestCase) [Database]13800
LeafSelect tests, complex (DatabaseSelectComplexTestCase) [Database]14300
LeafSelect tests, complex 2 (DatabaseSelectComplexTestCase2) [Database]1500
LeafSelect tests, ordered (DatabaseSelectOrderedTestCase) [Database]2900
LeafSelect tests, subqueries (DatabaseSelectSubqueryTestCase) [Database]4300
LeafSequences API (DatabaseNextIdCase) [Database]200
LeafSerialize query (DatabaseSerializeQueryTestCase) [Database]700
LeafSession https handling (SessionHttpsTestCase) [Session]8300
LeafSession tests (SessionTestCase) [Session]19200
LeafShortcut link functionality (ShortcutLinksTestCase) [Shortcut]16000
LeafShortcut set functionality (ShortcutSetsTestCase) [Shortcut]21800
LeafShutdown functions (ShutdownFunctionsTest) [System]500
LeafSimpleTest browser (SimpleTestBrowserTestCase) [SimpleTest]1600
LeafSimpleTest e-mail capturing (SimpleTestMailCaptureTestCase) [SimpleTest]1300
LeafSimpleTest error collector (DrupalErrorCollectionUnitTest) [SimpleTest]1600
LeafSimpleTest functionality (SimpleTestFunctionalTest) [SimpleTest]11600
LeafSite maintenance mode functionality (SiteMaintenanceTestCase) [System]8100
LeafSite-wide contact form (ContactSitewideTestCase) [Contact]23900
LeafSize parsing test (CommonSizeTestCase) [System]3500
LeafStatistics logging tests (StatisticsLoggingTestCase) [Statistics]3500
LeafStatistics reports tests (StatisticsReportsTestCase) [Statistics]11300
LeafStatistics token replacement (StatisticsTokenReplaceTestCase) [Statistics]6100
LeafStream wrappers (StreamWrapperTest) [File API]1900
LeafString filtering tests (CommonXssUnitTest) [System]1700
LeafString translate, search and validate (LocaleTranslationFunctionalTest) [Locale]25200
LeafString translation using st() (LocaleInstallTest) [Locale]200
LeafSummary length (SummaryLengthTestCase) [Node]1800
LeafSyslog functionality (SyslogTestCase) [Syslog]3300
LeafSystem info alter (SystemInfoAlterTestCase) [System]1000
LeafTableselect form element type test (FormsElementsTableSelectFunctionalTest) [Form API]6000
LeafTablesort (TableSortTest) [System]600
LeafTablesort query tests (DatabaseSelectTableSortDefaultTestCase) [Database]4400
LeafTaxonomy RSS Content. (TaxonomyRSSTestCase) [Taxonomy]2400
LeafTaxonomy term functions and forms. (TaxonomyTermTestCase) [Taxonomy]22600
LeafTaxonomy term hooks (TaxonomyHooksTestCase) [Taxonomy]2100
LeafTaxonomy term index (TaxonomyTermIndexTestCase) [Taxonomy]4600
LeafTaxonomy term multiple loading (TaxonomyLoadMultipleTestCase) [Taxonomy]1900
LeafTaxonomy term reference field (TaxonomyTermFieldTestCase) [Taxonomy]4700
LeafTaxonomy term unit tests (TaxonomyTermFunctionTestCase) [Taxonomy]1100
LeafTaxonomy term URL aliases (PathTaxonomyTermTestCase) [Path]3700
LeafTaxonomy theme switching (TaxonomyThemeTestCase) [Taxonomy]1900
LeafTaxonomy token replacement (TaxonomyTokenReplaceTestCase) [Taxonomy]5500
LeafTaxonomy upgrade path (UpgradePathTaxonomyTestCase) [Upgrade path]131700
LeafTaxonomy vocabularies (TaxonomyVocabularyTestCase) [Taxonomy]8100
LeafTaxonomy vocabulary interface (TaxonomyVocabularyFunctionalTest) [Taxonomy]10400
LeafTemporary query test (DatabaseTemporaryQueryTestCase) [Database]600
ExpandTest date field (ProfileTestDate) [Profile]22376
MessageGroupFilenameLineFunctionStatus
Invalid permission administer blocks.Roleprofile.test19ProfileTestCase->setUp()
Argument 1 passed to DrupalWebTestCase::drupalLogin() must be an instance of stdClass, boolean given, called in /var/lib/drupaltestbot/sites/default/files/checkout/modules/profile/profile.test on line 257 and definedRecoverable errordrupal_web_test_case.php1226DrupalWebTestCase->drupalLogin()
Trying to get property of non-objectNoticedrupal_web_test_case.php1232DrupalWebTestCase->drupalLogin()
Trying to get property of non-objectNoticedrupal_web_test_case.php1233DrupalWebTestCase->drupalLogin()
Failed to set field name to Otherprofile.test257ProfileTestDate->testProfileDateField()
Failed to set field pass to Otherprofile.test257ProfileTestDate->testProfileDateField()
Found the requested form fields at userOtherprofile.test257ProfileTestDate->testProfileDateField()
Trying to get property of non-objectNoticedrupal_web_test_case.php1239DrupalWebTestCase->drupalLogin()
User successfully logged in.User loginprofile.test257ProfileTestDate->testProfileDateField()
Failed to set field title to xwROlfmSOtherprofile.test43ProfileTestCase->createProfileField()
Failed to set field name to profile_xwROlfmSOtherprofile.test43ProfileTestCase->createProfileField()
Failed to set field category to simpletestOtherprofile.test43ProfileTestCase->createProfileField()
Failed to set field explanation to qsBv7Kg3AgeA5MsE94FyswCuHivWtoV2Zu7wJ1ZBbseoRhEt1QOtherprofile.test43ProfileTestCase->createProfileField()
Found the Save field buttonOtherprofile.test43ProfileTestCase->createProfileField()
Found the requested form fields at admin/config/people/profile/add/dateOtherprofile.test43ProfileTestCase->createProfileField()
New Profile field has been entered in the databaseOtherprofile.test45ProfileTestCase->createProfileField()
Trying to get property of non-objectNoticeprofile.test48ProfileTestCase->createProfileField()
Found month selection fieldOtherprofile.test52ProfileTestCase->createProfileField()
Found day selection fieldOtherprofile.test53ProfileTestCase->createProfileField()
Found day selection fieldOtherprofile.test54ProfileTestCase->createProfileField()
Checking title for field xwROlfmSOtherprofile.test61ProfileTestCase->createProfileField()
Checking explanation for field xwROlfmSOtherprofile.test63ProfileTestCase->createProfileField()
Failed to set field profile_xwROlfmS[month] to 1Otherprofile.test269ProfileTestDate->testProfileDateField()
Failed to set field profile_xwROlfmS[day] to 9Otherprofile.test269ProfileTestDate->testProfileDateField()
Failed to set field profile_xwROlfmS[year] to 1983Otherprofile.test269ProfileTestDate->testProfileDateField()
Found the Save buttonOtherprofile.test269ProfileTestDate->testProfileDateField()
Found the requested form fields at user/2/edit/simpletestOtherprofile.test269ProfileTestDate->testProfileDateField()
Found profile field with title xwROlfmSOtherprofile.test273ProfileTestDate->testProfileDateField()
Found date profile field.Otherprofile.test275ProfileTestDate->testProfileDateField()
Failed to set field name to profile_xwROlfmSOtherprofile.test92ProfileTestCase->updateProfileField()
Failed to set field title to dh3MzzVtOtherprofile.test92ProfileTestCase->updateProfileField()
Failed to set field category to simpletestOtherprofile.test92ProfileTestCase->updateProfileField()
Failed to set field explanation to koYBvYcOOtherprofile.test92ProfileTestCase->updateProfileField()
Found the Save field buttonOtherprofile.test92ProfileTestCase->updateProfileField()
Found the requested form fields at admin/config/people/profile/edit/Otherprofile.test92ProfileTestCase->updateProfileField()
Trying to get property of non-objectNoticeprofile.test95ProfileTestCase->updateProfileField()
Found month selection fieldOtherprofile.test99ProfileTestCase->updateProfileField()
Found day selection fieldOtherprofile.test100ProfileTestCase->updateProfileField()
Found day selection fieldOtherprofile.test101ProfileTestCase->updateProfileField()
Checking title for field dh3MzzVtOtherprofile.test108ProfileTestCase->updateProfileField()
Checking explanation for field dh3MzzVtOtherprofile.test110ProfileTestCase->updateProfileField()
Found the Delete buttonOtherprofile.test161ProfileTestCase->deleteProfileField()
Found the requested form fields at admin/config/people/profile/delete/Otherprofile.test161ProfileTestCase->deleteProfileField()
ExpandTest field weights (ProfileTestWeights) [Profile]25396
MessageGroupFilenameLineFunctionStatus
Invalid permission administer blocks.Roleprofile.test19ProfileTestCase->setUp()
Argument 1 passed to DrupalWebTestCase::drupalLogin() must be an instance of stdClass, boolean given, called in /var/lib/drupaltestbot/sites/default/files/checkout/modules/profile/profile.test on line 298 and definedRecoverable errordrupal_web_test_case.php1226DrupalWebTestCase->drupalLogin()
Trying to get property of non-objectNoticedrupal_web_test_case.php1232DrupalWebTestCase->drupalLogin()
Trying to get property of non-objectNoticedrupal_web_test_case.php1233DrupalWebTestCase->drupalLogin()
Failed to set field name to Otherprofile.test298ProfileTestWeights->testProfileFieldWeights()
Failed to set field pass to Otherprofile.test298ProfileTestWeights->testProfileFieldWeights()
Found the requested form fields at userOtherprofile.test298ProfileTestWeights->testProfileFieldWeights()
Trying to get property of non-objectNoticedrupal_web_test_case.php1239DrupalWebTestCase->drupalLogin()
User successfully logged in.User loginprofile.test298ProfileTestWeights->testProfileFieldWeights()
Failed to set field weight to 1Otherprofile.test43ProfileTestCase->createProfileField()
Failed to set field title to nyYUzRyDOtherprofile.test43ProfileTestCase->createProfileField()
Failed to set field name to profile_nyYUzRyDOtherprofile.test43ProfileTestCase->createProfileField()
Failed to set field category to nAZ99PzuOtherprofile.test43ProfileTestCase->createProfileField()
Failed to set field explanation to vLdIZkkpANVAu3o35MOr2unzFVSMBhyVhwOnzm7tGdacxNKILvOtherprofile.test43ProfileTestCase->createProfileField()
Found the Save field buttonOtherprofile.test43ProfileTestCase->createProfileField()
Found the requested form fields at admin/config/people/profile/add/textfieldOtherprofile.test43ProfileTestCase->createProfileField()
New Profile field has been entered in the databaseOtherprofile.test45ProfileTestCase->createProfileField()
Trying to get property of non-objectNoticeprofile.test48ProfileTestCase->createProfileField()
Found form named profile_nyYUzRyDOtherprofile.test57ProfileTestCase->createProfileField()
Checking title for field nyYUzRyDOtherprofile.test61ProfileTestCase->createProfileField()
Checking explanation for field nyYUzRyDOtherprofile.test63ProfileTestCase->createProfileField()
Failed to set field weight to -1Otherprofile.test43ProfileTestCase->createProfileField()
Failed to set field title to hIYnfcVvOtherprofile.test43ProfileTestCase->createProfileField()
Failed to set field name to profile_hIYnfcVvOtherprofile.test43ProfileTestCase->createProfileField()
Failed to set field category to nAZ99PzuOtherprofile.test43ProfileTestCase->createProfileField()
Failed to set field explanation to zzV5abcgnRXrI5cRVi6hUSwDx2anglWIhojlqaJNeyk1bwtBTnOtherprofile.test43ProfileTestCase->createProfileField()
Found the Save field buttonOtherprofile.test43ProfileTestCase->createProfileField()
Found the requested form fields at admin/config/people/profile/add/textfieldOtherprofile.test43ProfileTestCase->createProfileField()
New Profile field has been entered in the databaseOtherprofile.test45ProfileTestCase->createProfileField()
Trying to get property of non-objectNoticeprofile.test48ProfileTestCase->createProfileField()
Found form named profile_hIYnfcVvOtherprofile.test57ProfileTestCase->createProfileField()
Checking title for field hIYnfcVvOtherprofile.test61ProfileTestCase->createProfileField()
Checking explanation for field hIYnfcVvOtherprofile.test63ProfileTestCase->createProfileField()
Failed to set field profile_nyYUzRyD to bincXVnUOtherprofile.test140ProfileTestCase->setProfileField()
Found the Save buttonOtherprofile.test140ProfileTestCase->setProfileField()
Found the requested form fields at user/2/edit/nAZ99PzuOtherprofile.test140ProfileTestCase->setProfileField()
Found profile field with title nyYUzRyDOtherprofile.test144ProfileTestCase->setProfileField()
Found profile field with value bincXVnUOtherprofile.test148ProfileTestCase->setProfileField()
Failed to set field profile_hIYnfcVv to dn6affFROtherprofile.test140ProfileTestCase->setProfileField()
Found the Save buttonOtherprofile.test140ProfileTestCase->setProfileField()
Found the requested form fields at user/2/edit/nAZ99PzuOtherprofile.test140ProfileTestCase->setProfileField()
Found profile field with title hIYnfcVvOtherprofile.test144ProfileTestCase->setProfileField()
Found profile field with value dn6affFROtherprofile.test148ProfileTestCase->setProfileField()
Profile field weights are respected on the user edit form.Otherprofile.test308ProfileTestWeights->testProfileFieldWeights()
Profile field weights are respected on the user profile page.Otherprofile.test311ProfileTestWeights->testProfileFieldWeights()
LeafTest for legacy node bug. (TaxonomyLegacyTestCase) [Taxonomy]1400
ExpandTest select field (ProfileTestSelect) [Profile]23316
MessageGroupFilenameLineFunctionStatus
Invalid permission administer blocks.Roleprofile.test19ProfileTestCase->setUp()
Argument 1 passed to DrupalWebTestCase::drupalLogin() must be an instance of stdClass, boolean given, called in /var/lib/drupaltestbot/sites/default/files/checkout/modules/profile/profile.test on line 224 and definedRecoverable errordrupal_web_test_case.php1226DrupalWebTestCase->drupalLogin()
Trying to get property of non-objectNoticedrupal_web_test_case.php1232DrupalWebTestCase->drupalLogin()
Trying to get property of non-objectNoticedrupal_web_test_case.php1233DrupalWebTestCase->drupalLogin()
Failed to set field name to Otherprofile.test224ProfileTestSelect->testProfileSelectionField()
Failed to set field pass to Otherprofile.test224ProfileTestSelect->testProfileSelectionField()
Found the requested form fields at userOtherprofile.test224ProfileTestSelect->testProfileSelectionField()
Trying to get property of non-objectNoticedrupal_web_test_case.php1239DrupalWebTestCase->drupalLogin()
User successfully logged in.User loginprofile.test224ProfileTestSelect->testProfileSelectionField()
Failed to set field options to 1 2 3 4 5 6 7 8 9 10Otherprofile.test43ProfileTestCase->createProfileField()
Failed to set field title to hR4YCCAEOtherprofile.test43ProfileTestCase->createProfileField()
Failed to set field name to profile_hR4YCCAEOtherprofile.test43ProfileTestCase->createProfileField()
Failed to set field category to simpletestOtherprofile.test43ProfileTestCase->createProfileField()
Failed to set field explanation to bO6DSP2EaAPD2vVitMO4xU5sF9zvxE52NPe7vLQYLwUnz2Vw0LOtherprofile.test43ProfileTestCase->createProfileField()
Found the Save field buttonOtherprofile.test43ProfileTestCase->createProfileField()
Found the requested form fields at admin/config/people/profile/add/selectionOtherprofile.test43ProfileTestCase->createProfileField()
New Profile field has been entered in the databaseOtherprofile.test45ProfileTestCase->createProfileField()
Trying to get property of non-objectNoticeprofile.test48ProfileTestCase->createProfileField()
Found form named profile_hR4YCCAEOtherprofile.test57ProfileTestCase->createProfileField()
Checking title for field hR4YCCAEOtherprofile.test61ProfileTestCase->createProfileField()
Checking explanation for field hR4YCCAEOtherprofile.test63ProfileTestCase->createProfileField()
Failed to set field profile_hR4YCCAE to 6Otherprofile.test140ProfileTestCase->setProfileField()
Found the Save buttonOtherprofile.test140ProfileTestCase->setProfileField()
Found the requested form fields at user/2/edit/simpletestOtherprofile.test140ProfileTestCase->setProfileField()
Found profile field with title hR4YCCAEOtherprofile.test144ProfileTestCase->setProfileField()
Failed to set field name to profile_hR4YCCAEOtherprofile.test92ProfileTestCase->updateProfileField()
Failed to set field title to bKUmmsMKOtherprofile.test92ProfileTestCase->updateProfileField()
Failed to set field category to simpletestOtherprofile.test92ProfileTestCase->updateProfileField()
Failed to set field explanation to zmVfOQ9IOtherprofile.test92ProfileTestCase->updateProfileField()
Found the Save field buttonOtherprofile.test92ProfileTestCase->updateProfileField()
Found the requested form fields at admin/config/people/profile/edit/Otherprofile.test92ProfileTestCase->updateProfileField()
Trying to get property of non-objectNoticeprofile.test95ProfileTestCase->updateProfileField()
Found form named profile_hR4YCCAEOtherprofile.test104ProfileTestCase->updateProfileField()
Checking title for field bKUmmsMKOtherprofile.test108ProfileTestCase->updateProfileField()
Checking explanation for field bKUmmsMKOtherprofile.test110ProfileTestCase->updateProfileField()
Found the Delete buttonOtherprofile.test161ProfileTestCase->deleteProfileField()
Found the requested form fields at admin/config/people/profile/delete/Otherprofile.test161ProfileTestCase->deleteProfileField()
ExpandTest single fields (ProfileTestFields) [Profile]9013414
MessageGroupFilenameLineFunctionStatus
Invalid permission administer blocks.Roleprofile.test19ProfileTestCase->setUp()
Argument 1 passed to DrupalWebTestCase::drupalLogin() must be an instance of stdClass, boolean given, called in /var/lib/drupaltestbot/sites/default/files/checkout/modules/profile/profile.test on line 181 and definedRecoverable errordrupal_web_test_case.php1226DrupalWebTestCase->drupalLogin()
Trying to get property of non-objectNoticedrupal_web_test_case.php1232DrupalWebTestCase->drupalLogin()
Trying to get property of non-objectNoticedrupal_web_test_case.php1233DrupalWebTestCase->drupalLogin()
Failed to set field name to Otherprofile.test181ProfileTestFields->testProfileFields()
Failed to set field pass to Otherprofile.test181ProfileTestFields->testProfileFields()
Found the requested form fields at userOtherprofile.test181ProfileTestFields->testProfileFields()
Trying to get property of non-objectNoticedrupal_web_test_case.php1239DrupalWebTestCase->drupalLogin()
User successfully logged in.User loginprofile.test181ProfileTestFields->testProfileFields()
Failed to set field title to bK6WaiYuOtherprofile.test43ProfileTestCase->createProfileField()
Failed to set field name to profile_bK6WaiYuOtherprofile.test43ProfileTestCase->createProfileField()
Failed to set field category to simpletestOtherprofile.test43ProfileTestCase->createProfileField()
Failed to set field explanation to v8bSgnemD6S7Y0uGx7Il8gY5MibFincyh6kyEfCdB8fvOo0iWdOtherprofile.test43ProfileTestCase->createProfileField()
Found the Save field buttonOtherprofile.test43ProfileTestCase->createProfileField()
Found the requested form fields at admin/config/people/profile/add/textfieldOtherprofile.test43ProfileTestCase->createProfileField()
New Profile field has been entered in the databaseOtherprofile.test45ProfileTestCase->createProfileField()
Trying to get property of non-objectNoticeprofile.test48ProfileTestCase->createProfileField()
Found form named profile_bK6WaiYuOtherprofile.test57ProfileTestCase->createProfileField()
Checking title for field bK6WaiYuOtherprofile.test61ProfileTestCase->createProfileField()
Checking explanation for field bK6WaiYuOtherprofile.test63ProfileTestCase->createProfileField()
Failed to set field profile_bK6WaiYu to cFj7QS01Otherprofile.test140ProfileTestCase->setProfileField()
Found the Save buttonOtherprofile.test140ProfileTestCase->setProfileField()
Found the requested form fields at user/2/edit/simpletestOtherprofile.test140ProfileTestCase->setProfileField()
Found profile field with title bK6WaiYuOtherprofile.test144ProfileTestCase->setProfileField()
Found profile field with value cFj7QS01Otherprofile.test148ProfileTestCase->setProfileField()
Failed to set field name to profile_bK6WaiYuOtherprofile.test92ProfileTestCase->updateProfileField()
Failed to set field title to cWRlWi1OOtherprofile.test92ProfileTestCase->updateProfileField()
Failed to set field category to simpletestOtherprofile.test92ProfileTestCase->updateProfileField()
Failed to set field explanation to dqTtsh8kOtherprofile.test92ProfileTestCase->updateProfileField()
Found the Save field buttonOtherprofile.test92ProfileTestCase->updateProfileField()
Found the requested form fields at admin/config/people/profile/edit/Otherprofile.test92ProfileTestCase->updateProfileField()
Trying to get property of non-objectNoticeprofile.test95ProfileTestCase->updateProfileField()
Found form named profile_bK6WaiYuOtherprofile.test104ProfileTestCase->updateProfileField()
Checking title for field cWRlWi1OOtherprofile.test108ProfileTestCase->updateProfileField()
Checking explanation for field cWRlWi1OOtherprofile.test110ProfileTestCase->updateProfileField()
Found the Delete buttonOtherprofile.test161ProfileTestCase->deleteProfileField()
Found the requested form fields at admin/config/people/profile/delete/Otherprofile.test161ProfileTestCase->deleteProfileField()
Failed to set field title to s891qU42Otherprofile.test43ProfileTestCase->createProfileField()
Failed to set field name to profile_s891qU42Otherprofile.test43ProfileTestCase->createProfileField()
Failed to set field category to simpletestOtherprofile.test43ProfileTestCase->createProfileField()
Failed to set field explanation to fN75xHXE0AzteCzMXfABVtcyjIPtot7Bm7chfrDrStqpU1W0s9Otherprofile.test43ProfileTestCase->createProfileField()
Found the Save field buttonOtherprofile.test43ProfileTestCase->createProfileField()
Found the requested form fields at admin/config/people/profile/add/textareaOtherprofile.test43ProfileTestCase->createProfileField()
New Profile field has been entered in the databaseOtherprofile.test45ProfileTestCase->createProfileField()
Trying to get property of non-objectNoticeprofile.test48ProfileTestCase->createProfileField()
Found form named profile_s891qU42Otherprofile.test57ProfileTestCase->createProfileField()
Checking title for field s891qU42Otherprofile.test61ProfileTestCase->createProfileField()
Checking explanation for field s891qU42Otherprofile.test63ProfileTestCase->createProfileField()
Failed to set field profile_s891qU42 to ujXWcBxJOtherprofile.test140ProfileTestCase->setProfileField()
Found the Save buttonOtherprofile.test140ProfileTestCase->setProfileField()
Found the requested form fields at user/2/edit/simpletestOtherprofile.test140ProfileTestCase->setProfileField()
Found profile field with title s891qU42Otherprofile.test144ProfileTestCase->setProfileField()
Found profile field with value ujXWcBxJOtherprofile.test148ProfileTestCase->setProfileField()
Failed to set field name to profile_s891qU42Otherprofile.test92ProfileTestCase->updateProfileField()
Failed to set field title to jM9GBk7jOtherprofile.test92ProfileTestCase->updateProfileField()
Failed to set field category to simpletestOtherprofile.test92ProfileTestCase->updateProfileField()
Failed to set field explanation to pCxw3UHtOtherprofile.test92ProfileTestCase->updateProfileField()
Found the Save field buttonOtherprofile.test92ProfileTestCase->updateProfileField()
Found the requested form fields at admin/config/people/profile/edit/Otherprofile.test92ProfileTestCase->updateProfileField()
Trying to get property of non-objectNoticeprofile.test95ProfileTestCase->updateProfileField()
Found form named profile_s891qU42Otherprofile.test104ProfileTestCase->updateProfileField()
Checking title for field jM9GBk7jOtherprofile.test108ProfileTestCase->updateProfileField()
Checking explanation for field jM9GBk7jOtherprofile.test110ProfileTestCase->updateProfileField()
Found the Delete buttonOtherprofile.test161ProfileTestCase->deleteProfileField()
Found the requested form fields at admin/config/people/profile/delete/Otherprofile.test161ProfileTestCase->deleteProfileField()
Failed to set field title to r3YZrY50Otherprofile.test43ProfileTestCase->createProfileField()
Failed to set field name to profile_r3YZrY50Otherprofile.test43ProfileTestCase->createProfileField()
Failed to set field category to simpletestOtherprofile.test43ProfileTestCase->createProfileField()
Failed to set field explanation to haUuIW6gbZeLMeWdlDgI4TuSL3KOT8tRUNiYNWSnlgZTuaazgTOtherprofile.test43ProfileTestCase->createProfileField()
Found the Save field buttonOtherprofile.test43ProfileTestCase->createProfileField()
Found the requested form fields at admin/config/people/profile/add/listOtherprofile.test43ProfileTestCase->createProfileField()
New Profile field has been entered in the databaseOtherprofile.test45ProfileTestCase->createProfileField()
Trying to get property of non-objectNoticeprofile.test48ProfileTestCase->createProfileField()
Found form named profile_r3YZrY50Otherprofile.test57ProfileTestCase->createProfileField()
Checking title for field r3YZrY50Otherprofile.test61ProfileTestCase->createProfileField()
Checking explanation for field r3YZrY50Otherprofile.test63ProfileTestCase->createProfileField()
Failed to set field profile_r3YZrY50 to zXmrp27xOtherprofile.test140ProfileTestCase->setProfileField()
Found the Save buttonOtherprofile.test140ProfileTestCase->setProfileField()
Found the requested form fields at user/2/edit/simpletestOtherprofile.test140ProfileTestCase->setProfileField()
Found profile field with title r3YZrY50Otherprofile.test144ProfileTestCase->setProfileField()
Found profile field with value zXmrp27xOtherprofile.test148ProfileTestCase->setProfileField()
Failed to set field name to profile_r3YZrY50Otherprofile.test92ProfileTestCase->updateProfileField()
Failed to set field title to fJmAJtutOtherprofile.test92ProfileTestCase->updateProfileField()
Failed to set field category to simpletestOtherprofile.test92ProfileTestCase->updateProfileField()
Failed to set field explanation to tCf5gYjQOtherprofile.test92ProfileTestCase->updateProfileField()
Found the Save field buttonOtherprofile.test92ProfileTestCase->updateProfileField()
Found the requested form fields at admin/config/people/profile/edit/Otherprofile.test92ProfileTestCase->updateProfileField()
Trying to get property of non-objectNoticeprofile.test95ProfileTestCase->updateProfileField()
Found form named profile_r3YZrY50Otherprofile.test104ProfileTestCase->updateProfileField()
Checking title for field fJmAJtutOtherprofile.test108ProfileTestCase->updateProfileField()
Checking explanation for field fJmAJtutOtherprofile.test110ProfileTestCase->updateProfileField()
Found the Delete buttonOtherprofile.test161ProfileTestCase->deleteProfileField()
Found the requested form fields at admin/config/people/profile/delete/Otherprofile.test161ProfileTestCase->deleteProfileField()
Failed to set field title to oF0jePKPOtherprofile.test43ProfileTestCase->createProfileField()
Failed to set field name to profile_oF0jePKPOtherprofile.test43ProfileTestCase->createProfileField()
Failed to set field category to simpletestOtherprofile.test43ProfileTestCase->createProfileField()
Failed to set field explanation to r4FWIiM0xCwDXtWzZMLnw06s0etZ1uugfygQOtjcSb1agX32jbOtherprofile.test43ProfileTestCase->createProfileField()
Found the Save field buttonOtherprofile.test43ProfileTestCase->createProfileField()
Found the requested form fields at admin/config/people/profile/add/checkboxOtherprofile.test43ProfileTestCase->createProfileField()
New Profile field has been entered in the databaseOtherprofile.test45ProfileTestCase->createProfileField()
Trying to get property of non-objectNoticeprofile.test48ProfileTestCase->createProfileField()
Found form named profile_oF0jePKPOtherprofile.test57ProfileTestCase->createProfileField()
Checking title for field oF0jePKPOtherprofile.test61ProfileTestCase->createProfileField()
Checking explanation for field oF0jePKPOtherprofile.test63ProfileTestCase->createProfileField()
Failed to set field profile_oF0jePKP to 1Otherprofile.test140ProfileTestCase->setProfileField()
Found the Save buttonOtherprofile.test140ProfileTestCase->setProfileField()
Found the requested form fields at user/2/edit/simpletestOtherprofile.test140ProfileTestCase->setProfileField()
Found profile field with title oF0jePKPOtherprofile.test144ProfileTestCase->setProfileField()
Failed to set field name to profile_oF0jePKPOtherprofile.test92ProfileTestCase->updateProfileField()
Failed to set field title to ih9MBl8mOtherprofile.test92ProfileTestCase->updateProfileField()
Failed to set field category to simpletestOtherprofile.test92ProfileTestCase->updateProfileField()
Failed to set field explanation to gQEKJ8QNOtherprofile.test92ProfileTestCase->updateProfileField()
Found the Save field buttonOtherprofile.test92ProfileTestCase->updateProfileField()
Found the requested form fields at admin/config/people/profile/edit/Otherprofile.test92ProfileTestCase->updateProfileField()
Trying to get property of non-objectNoticeprofile.test95ProfileTestCase->updateProfileField()
Found form named profile_oF0jePKPOtherprofile.test104ProfileTestCase->updateProfileField()
Checking title for field ih9MBl8mOtherprofile.test108ProfileTestCase->updateProfileField()
Checking explanation for field ih9MBl8mOtherprofile.test110ProfileTestCase->updateProfileField()
Found the Delete buttonOtherprofile.test161ProfileTestCase->deleteProfileField()
Found the requested form fields at admin/config/people/profile/delete/Otherprofile.test161ProfileTestCase->deleteProfileField()
Failed to set field title to wEiePK9LOtherprofile.test43ProfileTestCase->createProfileField()
Failed to set field name to profile_wEiePK9LOtherprofile.test43ProfileTestCase->createProfileField()
Failed to set field category to simpletestOtherprofile.test43ProfileTestCase->createProfileField()
Failed to set field explanation to k4IRRLsSvEBIPtlesMi0Rsx9VhiaiffSEOKjkzhaiCUzUHjUDxOtherprofile.test43ProfileTestCase->createProfileField()
Found the Save field buttonOtherprofile.test43ProfileTestCase->createProfileField()
Found the requested form fields at admin/config/people/profile/add/urlOtherprofile.test43ProfileTestCase->createProfileField()
New Profile field has been entered in the databaseOtherprofile.test45ProfileTestCase->createProfileField()
Trying to get property of non-objectNoticeprofile.test48ProfileTestCase->createProfileField()
Found form named profile_wEiePK9LOtherprofile.test57ProfileTestCase->createProfileField()
Checking title for field wEiePK9LOtherprofile.test61ProfileTestCase->createProfileField()
Checking explanation for field wEiePK9LOtherprofile.test63ProfileTestCase->createProfileField()
Failed to set field profile_wEiePK9L to http://www.frR5i3N1Wg.orgOtherprofile.test140ProfileTestCase->setProfileField()
Found the Save buttonOtherprofile.test140ProfileTestCase->setProfileField()
Found the requested form fields at user/2/edit/simpletestOtherprofile.test140ProfileTestCase->setProfileField()
Found profile field with title wEiePK9LOtherprofile.test144ProfileTestCase->setProfileField()
Found profile field with value http://www.frR5i3N1Wg.orgOtherprofile.test148ProfileTestCase->setProfileField()
Failed to set field name to profile_wEiePK9LOtherprofile.test92ProfileTestCase->updateProfileField()
Failed to set field title to n2XvjjH2Otherprofile.test92ProfileTestCase->updateProfileField()
Failed to set field category to simpletestOtherprofile.test92ProfileTestCase->updateProfileField()
Failed to set field explanation to sASir1knOtherprofile.test92ProfileTestCase->updateProfileField()
Found the Save field buttonOtherprofile.test92ProfileTestCase->updateProfileField()
Found the requested form fields at admin/config/people/profile/edit/Otherprofile.test92ProfileTestCase->updateProfileField()
Trying to get property of non-objectNoticeprofile.test95ProfileTestCase->updateProfileField()
Found form named profile_wEiePK9LOtherprofile.test104ProfileTestCase->updateProfileField()
Checking title for field n2XvjjH2Otherprofile.test108ProfileTestCase->updateProfileField()
Checking explanation for field n2XvjjH2Otherprofile.test110ProfileTestCase->updateProfileField()
Found the Delete buttonOtherprofile.test161ProfileTestCase->deleteProfileField()
Found the requested form fields at admin/config/people/profile/delete/Otherprofile.test161ProfileTestCase->deleteProfileField()
LeafTest statistics admin. (StatisticsAdminTestCase) [Statistics]15500
ExpandTest user actions (TriggerUserActionTestCase) [Trigger]13259
MessageGroupFilenameLineFunctionStatus
Invalid permission create article content.Roletrigger.test504TriggerUserActionTestCase->testUserActionAssignmentExecution()
Invalid permission access comments.Roletrigger.test504TriggerUserActionTestCase->testUserActionAssignmentExecution()
Invalid permission administer comments.Roletrigger.test504TriggerUserActionTestCase->testUserActionAssignmentExecution()
Invalid permission skip comment approval.Roletrigger.test504TriggerUserActionTestCase->testUserActionAssignmentExecution()
Invalid permission edit own comments.Roletrigger.test504TriggerUserActionTestCase->testUserActionAssignmentExecution()
Argument 1 passed to DrupalWebTestCase::drupalLogin() must be an instance of stdClass, boolean given, called in /var/lib/drupaltestbot/sites/default/files/checkout/modules/trigger/trigger.test on line 505 and definedRecoverable errordrupal_web_test_case.php1226DrupalWebTestCase->drupalLogin()
Trying to get property of non-objectNoticedrupal_web_test_case.php1232DrupalWebTestCase->drupalLogin()
Trying to get property of non-objectNoticedrupal_web_test_case.php1233DrupalWebTestCase->drupalLogin()
Failed to set field name to Othertrigger.test505TriggerUserActionTestCase->testUserActionAssignmentExecution()
Failed to set field pass to Othertrigger.test505TriggerUserActionTestCase->testUserActionAssignmentExecution()
Found the requested form fields at userOthertrigger.test505TriggerUserActionTestCase->testUserActionAssignmentExecution()
Trying to get property of non-objectNoticedrupal_web_test_case.php1239DrupalWebTestCase->drupalLogin()
User successfully logged in.User logintrigger.test505TriggerUserActionTestCase->testUserActionAssignmentExecution()
Failed to set field aid to yaTqy7bmnYJ6r1fXPw4VFTrvUwdnohYrF5kvg9scbRIOthertrigger.test322TriggerActionTestCase->assignSimpleAction()
Found the Assign buttonOthertrigger.test322TriggerActionTestCase->assignSimpleAction()
Found the requested form fields at admin/structure/trigger/commentOthertrigger.test322TriggerActionTestCase->assignSimpleAction()
Simple action user_block_user_action assigned to trigger comment_presaveOthertrigger.test324TriggerActionTestCase->assignSimpleAction()
Failed to set field aid to yaTqy7bmnYJ6r1fXPw4VFTrvUwdnohYrF5kvg9scbRIOthertrigger.test322TriggerActionTestCase->assignSimpleAction()
Found the Assign buttonOthertrigger.test322TriggerActionTestCase->assignSimpleAction()
Found the requested form fields at admin/structure/trigger/commentOthertrigger.test322TriggerActionTestCase->assignSimpleAction()
Simple action user_block_user_action assigned to trigger comment_insertOthertrigger.test324TriggerActionTestCase->assignSimpleAction()
Failed to set field aid to yaTqy7bmnYJ6r1fXPw4VFTrvUwdnohYrF5kvg9scbRIOthertrigger.test322TriggerActionTestCase->assignSimpleAction()
Found the Assign buttonOthertrigger.test322TriggerActionTestCase->assignSimpleAction()
Found the requested form fields at admin/structure/trigger/commentOthertrigger.test322TriggerActionTestCase->assignSimpleAction()
Simple action user_block_user_action assigned to trigger comment_updateOthertrigger.test324TriggerActionTestCase->assignSimpleAction()
Failed to set field comment_body[und][0][value] to my commentOthertrigger.test517TriggerUserActionTestCase->testUserActionAssignmentExecution()
Failed to set field subject to my comment subjectOthertrigger.test517TriggerUserActionTestCase->testUserActionAssignmentExecution()
Found the Save buttonOthertrigger.test517TriggerUserActionTestCase->testUserActionAssignmentExecution()
Found the requested form fields at node/1Othertrigger.test517TriggerUserActionTestCase->testUserActionAssignmentExecution()
Trying to get property of non-objectNoticetrigger.test519TriggerUserActionTestCase->testUserActionAssignmentExecution()
array_flip(): Can only flip STRING and INTEGER values!Warningentity.inc178DrupalDefaultEntityController->load()
Trying to get property of non-objectNoticetrigger.test520TriggerUserActionTestCase->testUserActionAssignmentExecution()
Trying to get property of non-objectNoticetrigger.test521TriggerUserActionTestCase->testUserActionAssignmentExecution()
PDOException: SQLSTATE[23000]: Integrity constraint violation: 1062 Duplicate entry '' for key 'name': INSERT INTO {users} (uid, created, status) VALUES (:db_insert_placeholder_0, :db_insert_placeholder_1, :db_insert_placeholder_2); Array ( [:db_insert_placeholder_0] => 2 [:db_insert_placeholder_1] => 1333768890 [:db_insert_placeholder_2] => 1 ) in drupal_write_record() (line 7001 of /var/lib/drupaltestbot/sites/default/files/checkout/includes/common.inc).Uncaught exceptiondatabase.inc2136PDOStatement->execute()
LeafTest user triggers (TriggerUserTokenTestCase) [Trigger]18600
LeafTesting SimpleTest setUp (SimpleTestFolderTestCase) [SimpleTest]200
LeafText field (TextFieldTestCase) [Field types]19200
LeafText summary (TextSummaryTestCase) [Field types]13800
LeafText translation (TextTranslationTestCase) [Field types]10600
LeafTheme API (ThemeTestCase) [Theme]2500
LeafTheme fast initialization (ThemeFastTestCase) [Theme]1100
LeafTheme HTML Tag (ThemeHtmlTag) [Theme]200
LeafTheme initialization in hook_init() (ThemeHookInitTestCase) [Theme]500
ExpandTheme interface functionality (SystemThemeFunctionalTest) [System]524514
MessageGroupFilenameLineFunctionStatus
Invalid permission administer blocks.Rolesystem.test1647SystemThemeFunctionalTest->setUp()
Argument 1 passed to DrupalWebTestCase::drupalLogin() must be an instance of stdClass, boolean given, called in /var/lib/drupaltestbot/sites/default/files/checkout/modules/system/system.test on line 1648 and definedRecoverable errordrupal_web_test_case.php1226DrupalWebTestCase->drupalLogin()
Trying to get property of non-objectNoticedrupal_web_test_case.php1232DrupalWebTestCase->drupalLogin()
Trying to get property of non-objectNoticedrupal_web_test_case.php1233DrupalWebTestCase->drupalLogin()
Failed to set field name to Othersystem.test1648SystemThemeFunctionalTest->setUp()
Failed to set field pass to Othersystem.test1648SystemThemeFunctionalTest->setUp()
Found the requested form fields at userOthersystem.test1648SystemThemeFunctionalTest->setUp()
Trying to get property of non-objectNoticedrupal_web_test_case.php1239DrupalWebTestCase->drupalLogin()
User successfully logged in.User loginsystem.test1648SystemThemeFunctionalTest->setUp()
Failed to set field default_logo to Othersystem.test1663SystemThemeFunctionalTest->testThemeSettings()
Failed to set field logo_path to /var/lib/drupaltestbot/sites/default/files/checkout/sites/default/files/simpletest/998001/image-test.pngOthersystem.test1663SystemThemeFunctionalTest->testThemeSettings()
Found the Save configuration buttonOthersystem.test1663SystemThemeFunctionalTest->testThemeSettings()
Found the requested form fields at admin/appearance/settingsOthersystem.test1663SystemThemeFunctionalTest->testThemeSettings()
Logo path successfully changed.Othersystem.test1665SystemThemeFunctionalTest->testThemeSettings()
Failed to set field default_logo to Othersystem.test1675SystemThemeFunctionalTest->testThemeSettings()
Failed to set field logo_path to Othersystem.test1675SystemThemeFunctionalTest->testThemeSettings()
Failed to set field files[logo_upload] to /var/lib/drupaltestbot/sites/default/files/checkout/sites/default/files/simpletest/998001/image-test.pngOthersystem.test1675SystemThemeFunctionalTest->testThemeSettings()
Found the Save configuration buttonOthersystem.test1675SystemThemeFunctionalTest->testThemeSettings()
Found the requested form fields at admin/appearance/settingsOthersystem.test1675SystemThemeFunctionalTest->testThemeSettings()
Logo file successfully uploaded.Othersystem.test1677SystemThemeFunctionalTest->testThemeSettings()
Invalid permission administer blocks.Rolesystem.test1647SystemThemeFunctionalTest->setUp()
Argument 1 passed to DrupalWebTestCase::drupalLogin() must be an instance of stdClass, boolean given, called in /var/lib/drupaltestbot/sites/default/files/checkout/modules/system/system.test on line 1648 and definedRecoverable errordrupal_web_test_case.php1226DrupalWebTestCase->drupalLogin()
Trying to get property of non-objectNoticedrupal_web_test_case.php1232DrupalWebTestCase->drupalLogin()
Trying to get property of non-objectNoticedrupal_web_test_case.php1233DrupalWebTestCase->drupalLogin()
Failed to set field name to Othersystem.test1648SystemThemeFunctionalTest->setUp()
Failed to set field pass to Othersystem.test1648SystemThemeFunctionalTest->setUp()
Found the requested form fields at userOthersystem.test1648SystemThemeFunctionalTest->setUp()
Trying to get property of non-objectNoticedrupal_web_test_case.php1239DrupalWebTestCase->drupalLogin()
User successfully logged in.User loginsystem.test1648SystemThemeFunctionalTest->setUp()
Failed to set field admin_theme to sevenOthersystem.test1691SystemThemeFunctionalTest->testAdministrationTheme()
Failed to set field node_admin_theme to 1Othersystem.test1691SystemThemeFunctionalTest->testAdministrationTheme()
Found the Save configuration buttonOthersystem.test1691SystemThemeFunctionalTest->testAdministrationTheme()
Found the requested form fields at admin/appearanceOthersystem.test1691SystemThemeFunctionalTest->testAdministrationTheme()
Administration theme used on an administration page.Othersystem.test1694SystemThemeFunctionalTest->testAdministrationTheme()
Administration theme used on the add content page.Othersystem.test1700SystemThemeFunctionalTest->testAdministrationTheme()
Administration theme used on the edit content page.Othersystem.test1703SystemThemeFunctionalTest->testAdministrationTheme()
Failed to set field node_admin_theme to Othersystem.test1709SystemThemeFunctionalTest->testAdministrationTheme()
Found the Save configuration buttonOthersystem.test1709SystemThemeFunctionalTest->testAdministrationTheme()
Found the requested form fields at admin/appearanceOthersystem.test1709SystemThemeFunctionalTest->testAdministrationTheme()
Administration theme used on an administration page.Othersystem.test1712SystemThemeFunctionalTest->testAdministrationTheme()
Failed to set field admin_theme to 0Othersystem.test1723SystemThemeFunctionalTest->testAdministrationTheme()
Failed to set field node_admin_theme to Othersystem.test1723SystemThemeFunctionalTest->testAdministrationTheme()
Found the Save configuration buttonOthersystem.test1723SystemThemeFunctionalTest->testAdministrationTheme()
Found the requested form fields at admin/appearanceOthersystem.test1723SystemThemeFunctionalTest->testAdministrationTheme()
Invalid permission administer blocks.Rolesystem.test1647SystemThemeFunctionalTest->setUp()
Argument 1 passed to DrupalWebTestCase::drupalLogin() must be an instance of stdClass, boolean given, called in /var/lib/drupaltestbot/sites/default/files/checkout/modules/system/system.test on line 1648 and definedRecoverable errordrupal_web_test_case.php1226DrupalWebTestCase->drupalLogin()
Trying to get property of non-objectNoticedrupal_web_test_case.php1232DrupalWebTestCase->drupalLogin()
Trying to get property of non-objectNoticedrupal_web_test_case.php1233DrupalWebTestCase->drupalLogin()
Failed to set field name to Othersystem.test1648SystemThemeFunctionalTest->setUp()
Failed to set field pass to Othersystem.test1648SystemThemeFunctionalTest->setUp()
Found the requested form fields at userOthersystem.test1648SystemThemeFunctionalTest->setUp()
Trying to get property of non-objectNoticedrupal_web_test_case.php1239DrupalWebTestCase->drupalLogin()
User successfully logged in.User loginsystem.test1648SystemThemeFunctionalTest->setUp()
Undefined variable: url_targetNoticedrupal_web_test_case.php2546DrupalWebTestCase->clickLink()
Clicked link Set default () from http://drupaltestbot654-mysql/checkout/?q=admin/appearanceBrowsersystem.test1739SystemThemeFunctionalTest->testSwitchDefaultTheme()
Default local task on blocks admin page is the default theme.Othersystem.test1744SystemThemeFunctionalTest->testSwitchDefaultTheme()
Undefined variable: url_targetNoticedrupal_web_test_case.php2546DrupalWebTestCase->clickLink()
Clicked link Set default () from http://drupaltestbot654-mysql/checkout/?q=admin/appearanceBrowsersystem.test1747SystemThemeFunctionalTest->testSwitchDefaultTheme()
Default local task on blocks admin page has changed.Othersystem.test1749SystemThemeFunctionalTest->testSwitchDefaultTheme()
LeafTheme item list (ThemeItemListUnitTest) [Theme]100
LeafTheme Table (ThemeTableTestCase) [Theme]600
LeafThemeRegistry (ThemeRegistryTestCase) [Theme]600
LeafTimer test (BootstrapTimerTestCase) [Bootstrap]500
LeafToken replacement (TokenReplaceTestCase) [System]3600
LeafTop visitor blocking (StatisticsBlockVisitorsTestCase) [Statistics]4700
LeafTracker (TrackerTest) [Tracker]23400
LeafTransaction tests (DatabaseTransactionTestCase) [Database]7400
LeafTranslatable content upgrade path (TranslatableUpgradePathTestCase) [Upgrade path]3600
LeafTranslation export (LocaleExportFunctionalTest) [Locale]3100
LeafTranslation functionality (TranslationTestCase) [Translation]56000
LeafTranslation import (LocaleImportFunctionalTest) [Locale]13000
ExpandTrigger content (node) actions (TriggerContentTestCase) [Trigger]2678734
MessageGroupFilenameLineFunctionStatus
Invalid permission create page content.Roletrigger.test66TriggerContentTestCase->testActionsContent()
Argument 1 passed to DrupalWebTestCase::drupalLogin() must be an instance of stdClass, boolean given, called in /var/lib/drupaltestbot/sites/default/files/checkout/modules/trigger/trigger.test on line 77 and definedRecoverable errordrupal_web_test_case.php1226DrupalWebTestCase->drupalLogin()
Trying to get property of non-objectNoticedrupal_web_test_case.php1232DrupalWebTestCase->drupalLogin()
Trying to get property of non-objectNoticedrupal_web_test_case.php1233DrupalWebTestCase->drupalLogin()
Failed to set field name to Othertrigger.test77TriggerContentTestCase->testActionsContent()
Failed to set field pass to Othertrigger.test77TriggerContentTestCase->testActionsContent()
Found the requested form fields at userOthertrigger.test77TriggerContentTestCase->testActionsContent()
Trying to get property of non-objectNoticedrupal_web_test_case.php1239DrupalWebTestCase->drupalLogin()
User successfully logged in.User logintrigger.test77TriggerContentTestCase->testActionsContent()
Failed to set field title to !SimpleTest test node! qNfvzQzZJ7Othertrigger.test83TriggerContentTestCase->testActionsContent()
Failed to set field body[und][0][value] to !SimpleTest test body! uGE3R4VgkQxjJKJApVOLNlvotn9wvhum wSDbUjNcLgKffGbC3LOxZ7HQ9BNRgIxZOthertrigger.test83TriggerContentTestCase->testActionsContent()
Failed to set field status to Othertrigger.test83TriggerContentTestCase->testActionsContent()
Found the Save buttonOthertrigger.test83TriggerContentTestCase->testActionsContent()
Found the requested form fields at node/add/pageOthertrigger.test83TriggerContentTestCase->testActionsContent()
Make sure the Basic page has actually been createdOthertrigger.test85TriggerContentTestCase->testActionsContent()
Trying to get property of non-objectNoticetrigger.test88TriggerContentTestCase->testActionsContent()
Make sure the publish content action fired.Othertrigger.test88TriggerContentTestCase->testActionsContent()
Argument 1 passed to DrupalWebTestCase::drupalLogin() must be an instance of stdClass, boolean given, called in /var/lib/drupaltestbot/sites/default/files/checkout/modules/trigger/trigger.test on line 77 and definedRecoverable errordrupal_web_test_case.php1226DrupalWebTestCase->drupalLogin()
Trying to get property of non-objectNoticedrupal_web_test_case.php1232DrupalWebTestCase->drupalLogin()
Trying to get property of non-objectNoticedrupal_web_test_case.php1233DrupalWebTestCase->drupalLogin()
Failed to set field name to Othertrigger.test77TriggerContentTestCase->testActionsContent()
Failed to set field pass to Othertrigger.test77TriggerContentTestCase->testActionsContent()
Found the requested form fields at userOthertrigger.test77TriggerContentTestCase->testActionsContent()
Trying to get property of non-objectNoticedrupal_web_test_case.php1239DrupalWebTestCase->drupalLogin()
User successfully logged in.User logintrigger.test77TriggerContentTestCase->testActionsContent()
Failed to set field title to !SimpleTest test node! isdAQ3LLn0Othertrigger.test83TriggerContentTestCase->testActionsContent()
Failed to set field body[und][0][value] to !SimpleTest test body! sSEIfzw39ZA6PXZ2r6bu98CaDXLMu3rk bcpD2no0wsDLiHBRYKoQgnS1f0lstlgpOthertrigger.test83TriggerContentTestCase->testActionsContent()
Failed to set field status to 1Othertrigger.test83TriggerContentTestCase->testActionsContent()
Found the Save buttonOthertrigger.test83TriggerContentTestCase->testActionsContent()
Found the requested form fields at node/add/pageOthertrigger.test83TriggerContentTestCase->testActionsContent()
Make sure the Basic page has actually been createdOthertrigger.test85TriggerContentTestCase->testActionsContent()
Trying to get property of non-objectNoticetrigger.test88TriggerContentTestCase->testActionsContent()
Argument 1 passed to DrupalWebTestCase::drupalLogin() must be an instance of stdClass, boolean given, called in /var/lib/drupaltestbot/sites/default/files/checkout/modules/trigger/trigger.test on line 77 and definedRecoverable errordrupal_web_test_case.php1226DrupalWebTestCase->drupalLogin()
Trying to get property of non-objectNoticedrupal_web_test_case.php1232DrupalWebTestCase->drupalLogin()
Trying to get property of non-objectNoticedrupal_web_test_case.php1233DrupalWebTestCase->drupalLogin()
Failed to set field name to Othertrigger.test77TriggerContentTestCase->testActionsContent()
Failed to set field pass to Othertrigger.test77TriggerContentTestCase->testActionsContent()
Found the requested form fields at userOthertrigger.test77TriggerContentTestCase->testActionsContent()
Trying to get property of non-objectNoticedrupal_web_test_case.php1239DrupalWebTestCase->drupalLogin()
User successfully logged in.User logintrigger.test77TriggerContentTestCase->testActionsContent()
Failed to set field title to !SimpleTest test node! puIZqIuWgbOthertrigger.test83TriggerContentTestCase->testActionsContent()
Failed to set field body[und][0][value] to !SimpleTest test body! rmdD3ejtxW5etpg3kpQBKAuAib6vW9qY vnuFqtqcoqcU88aZ7T9nwhJo5vnG881jOthertrigger.test83TriggerContentTestCase->testActionsContent()
Failed to set field sticky to Othertrigger.test83TriggerContentTestCase->testActionsContent()
Found the Save buttonOthertrigger.test83TriggerContentTestCase->testActionsContent()
Found the requested form fields at node/add/pageOthertrigger.test83TriggerContentTestCase->testActionsContent()
Make sure the Basic page has actually been createdOthertrigger.test85TriggerContentTestCase->testActionsContent()
Trying to get property of non-objectNoticetrigger.test88TriggerContentTestCase->testActionsContent()
Make sure the make content sticky action fired.Othertrigger.test88TriggerContentTestCase->testActionsContent()
Argument 1 passed to DrupalWebTestCase::drupalLogin() must be an instance of stdClass, boolean given, called in /var/lib/drupaltestbot/sites/default/files/checkout/modules/trigger/trigger.test on line 77 and definedRecoverable errordrupal_web_test_case.php1226DrupalWebTestCase->drupalLogin()
Trying to get property of non-objectNoticedrupal_web_test_case.php1232DrupalWebTestCase->drupalLogin()
Trying to get property of non-objectNoticedrupal_web_test_case.php1233DrupalWebTestCase->drupalLogin()
Failed to set field name to Othertrigger.test77TriggerContentTestCase->testActionsContent()
Failed to set field pass to Othertrigger.test77TriggerContentTestCase->testActionsContent()
Found the requested form fields at userOthertrigger.test77TriggerContentTestCase->testActionsContent()
Trying to get property of non-objectNoticedrupal_web_test_case.php1239DrupalWebTestCase->drupalLogin()
User successfully logged in.User logintrigger.test77TriggerContentTestCase->testActionsContent()
Failed to set field title to !SimpleTest test node! zLj5g1i7IzOthertrigger.test83TriggerContentTestCase->testActionsContent()
Failed to set field body[und][0][value] to !SimpleTest test body! lHI3HAMlnSphVd0fFx2DrRajNYgpjV4q m99XosElF8gmONUumPPemzlnverLU0bGOthertrigger.test83TriggerContentTestCase->testActionsContent()
Failed to set field sticky to 1Othertrigger.test83TriggerContentTestCase->testActionsContent()
Found the Save buttonOthertrigger.test83TriggerContentTestCase->testActionsContent()
Found the requested form fields at node/add/pageOthertrigger.test83TriggerContentTestCase->testActionsContent()
Make sure the Basic page has actually been createdOthertrigger.test85TriggerContentTestCase->testActionsContent()
Trying to get property of non-objectNoticetrigger.test88TriggerContentTestCase->testActionsContent()
Argument 1 passed to DrupalWebTestCase::drupalLogin() must be an instance of stdClass, boolean given, called in /var/lib/drupaltestbot/sites/default/files/checkout/modules/trigger/trigger.test on line 77 and definedRecoverable errordrupal_web_test_case.php1226DrupalWebTestCase->drupalLogin()
Trying to get property of non-objectNoticedrupal_web_test_case.php1232DrupalWebTestCase->drupalLogin()
Trying to get property of non-objectNoticedrupal_web_test_case.php1233DrupalWebTestCase->drupalLogin()
Failed to set field name to Othertrigger.test77TriggerContentTestCase->testActionsContent()
Failed to set field pass to Othertrigger.test77TriggerContentTestCase->testActionsContent()
Found the requested form fields at userOthertrigger.test77TriggerContentTestCase->testActionsContent()
Trying to get property of non-objectNoticedrupal_web_test_case.php1239DrupalWebTestCase->drupalLogin()
User successfully logged in.User logintrigger.test77TriggerContentTestCase->testActionsContent()
Failed to set field title to !SimpleTest test node! n60nEV1wSqOthertrigger.test83TriggerContentTestCase->testActionsContent()
Failed to set field body[und][0][value] to !SimpleTest test body! bsNOb9RGEOhLbFTGPpzdTFF6XgS4xTGJ o2ag3rLsn3C5a5bFqfeDZbvAosBAz29yOthertrigger.test83TriggerContentTestCase->testActionsContent()
Failed to set field promote to Othertrigger.test83TriggerContentTestCase->testActionsContent()
Found the Save buttonOthertrigger.test83TriggerContentTestCase->testActionsContent()
Found the requested form fields at node/add/pageOthertrigger.test83TriggerContentTestCase->testActionsContent()
Make sure the Basic page has actually been createdOthertrigger.test85TriggerContentTestCase->testActionsContent()
Trying to get property of non-objectNoticetrigger.test88TriggerContentTestCase->testActionsContent()
Make sure the promote content to front page action fired.Othertrigger.test88TriggerContentTestCase->testActionsContent()
Argument 1 passed to DrupalWebTestCase::drupalLogin() must be an instance of stdClass, boolean given, called in /var/lib/drupaltestbot/sites/default/files/checkout/modules/trigger/trigger.test on line 77 and definedRecoverable errordrupal_web_test_case.php1226DrupalWebTestCase->drupalLogin()
Trying to get property of non-objectNoticedrupal_web_test_case.php1232DrupalWebTestCase->drupalLogin()
Trying to get property of non-objectNoticedrupal_web_test_case.php1233DrupalWebTestCase->drupalLogin()
Failed to set field name to Othertrigger.test77TriggerContentTestCase->testActionsContent()
Failed to set field pass to Othertrigger.test77TriggerContentTestCase->testActionsContent()
Found the requested form fields at userOthertrigger.test77TriggerContentTestCase->testActionsContent()
Trying to get property of non-objectNoticedrupal_web_test_case.php1239DrupalWebTestCase->drupalLogin()
User successfully logged in.User logintrigger.test77TriggerContentTestCase->testActionsContent()
Failed to set field title to !SimpleTest test node! jv5RoiQY6xOthertrigger.test83TriggerContentTestCase->testActionsContent()
Failed to set field body[und][0][value] to !SimpleTest test body! cEl9yA5IvokQ3UE0Dt64KDTNsdYRNh3r zubfTRkU5M3HcR67dxddPvDqTeBfWbitOthertrigger.test83TriggerContentTestCase->testActionsContent()
Failed to set field promote to 1Othertrigger.test83TriggerContentTestCase->testActionsContent()
Found the Save buttonOthertrigger.test83TriggerContentTestCase->testActionsContent()
Found the requested form fields at node/add/pageOthertrigger.test83TriggerContentTestCase->testActionsContent()
Make sure the Basic page has actually been createdOthertrigger.test85TriggerContentTestCase->testActionsContent()
Trying to get property of non-objectNoticetrigger.test88TriggerContentTestCase->testActionsContent()
Invalid permission create page content.Roletrigger.test115TriggerContentTestCase->testActionContentMultiple()
Argument 1 passed to DrupalWebTestCase::drupalLogin() must be an instance of stdClass, boolean given, called in /var/lib/drupaltestbot/sites/default/files/checkout/modules/trigger/trigger.test on line 116 and definedRecoverable errordrupal_web_test_case.php1226DrupalWebTestCase->drupalLogin()
Trying to get property of non-objectNoticedrupal_web_test_case.php1232DrupalWebTestCase->drupalLogin()
Trying to get property of non-objectNoticedrupal_web_test_case.php1233DrupalWebTestCase->drupalLogin()
Failed to set field name to Othertrigger.test116TriggerContentTestCase->testActionContentMultiple()
Failed to set field pass to Othertrigger.test116TriggerContentTestCase->testActionContentMultiple()
Found the requested form fields at userOthertrigger.test116TriggerContentTestCase->testActionContentMultiple()
Trying to get property of non-objectNoticedrupal_web_test_case.php1239DrupalWebTestCase->drupalLogin()
User successfully logged in.User logintrigger.test116TriggerContentTestCase->testActionContentMultiple()
Failed to set field title to gmZ71zxBOthertrigger.test120TriggerContentTestCase->testActionContentMultiple()
Found the Save buttonOthertrigger.test120TriggerContentTestCase->testActionContentMultiple()
Found the requested form fields at node/add/pageOthertrigger.test120TriggerContentTestCase->testActionContentMultiple()
Failed to set field title to nkoYhECfOthertrigger.test120TriggerContentTestCase->testActionContentMultiple()
Found the Save buttonOthertrigger.test120TriggerContentTestCase->testActionContentMultiple()
Found the requested form fields at node/add/pageOthertrigger.test120TriggerContentTestCase->testActionContentMultiple()
Failed to set field title to wTVtAJyVOthertrigger.test120TriggerContentTestCase->testActionContentMultiple()
Found the Save buttonOthertrigger.test120TriggerContentTestCase->testActionContentMultiple()
Found the requested form fields at node/add/pageOthertrigger.test120TriggerContentTestCase->testActionContentMultiple()
Failed to set field aid to -NDFpvNNrSPLf6XQK2zJKAgAiqq7X3jTPpDqSItKCGkOthertrigger.test126TriggerContentTestCase->testActionContentMultiple()
Found the Assign buttonOthertrigger.test126TriggerContentTestCase->testActionContentMultiple()
Found the requested form fields at admin/structure/trigger/nodeOthertrigger.test126TriggerContentTestCase->testActionContentMultiple()
Failed to set field operation to unpublishOthertrigger.test133TriggerContentTestCase->testActionContentMultiple()
Failed to set field nodes[1] to 1Othertrigger.test133TriggerContentTestCase->testActionContentMultiple()
Failed to set field nodes[2] to 1Othertrigger.test133TriggerContentTestCase->testActionContentMultiple()
Found the Update buttonOthertrigger.test133TriggerContentTestCase->testActionContentMultiple()
Found the requested form fields at admin/contentOthertrigger.test133TriggerContentTestCase->testActionContentMultiple()
Action was triggered 2 times. Actual: 0Othertrigger.test135TriggerContentTestCase->testActionContentMultiple()
LeafTrigger cron (system) actions (TriggerCronTestCase) [Trigger]3400
ExpandTrigger orphaned actions (TriggerOrphanedActionsTestCase) [Trigger]26175
MessageGroupFilenameLineFunctionStatus
Invalid permission create page content.Roletrigger.test719TriggerOrphanedActionsTestCase->testActionsOrphaned()
Invalid permission edit own page content.Roletrigger.test719TriggerOrphanedActionsTestCase->testActionsOrphaned()
Argument 1 passed to DrupalWebTestCase::drupalLogin() must be an instance of stdClass, boolean given, called in /var/lib/drupaltestbot/sites/default/files/checkout/modules/trigger/trigger.test on line 720 and definedRecoverable errordrupal_web_test_case.php1226DrupalWebTestCase->drupalLogin()
Trying to get property of non-objectNoticedrupal_web_test_case.php1232DrupalWebTestCase->drupalLogin()
Trying to get property of non-objectNoticedrupal_web_test_case.php1233DrupalWebTestCase->drupalLogin()
Failed to set field name to Othertrigger.test720TriggerOrphanedActionsTestCase->testActionsOrphaned()
Failed to set field pass to Othertrigger.test720TriggerOrphanedActionsTestCase->testActionsOrphaned()
Found the requested form fields at userOthertrigger.test720TriggerOrphanedActionsTestCase->testActionsOrphaned()
Trying to get property of non-objectNoticedrupal_web_test_case.php1239DrupalWebTestCase->drupalLogin()
User successfully logged in.User logintrigger.test720TriggerOrphanedActionsTestCase->testActionsOrphaned()
Failed to set field title to !SimpleTest test node! cBCVI62CqgOthertrigger.test725TriggerOrphanedActionsTestCase->testActionsOrphaned()
Failed to set field body[und][0][value] to !SimpleTest test body! erBwejnjAec0FqB32OEt6fhSpVq6Uo11 tUB0HrlUUvyxx5JSNAPwdtizldqMSKaZOthertrigger.test725TriggerOrphanedActionsTestCase->testActionsOrphaned()
Found the Save buttonOthertrigger.test725TriggerOrphanedActionsTestCase->testActionsOrphaned()
Found the requested form fields at node/add/pageOthertrigger.test725TriggerOrphanedActionsTestCase->testActionsOrphaned()
Make sure the Basic page has actually been createdOthertrigger.test726TriggerOrphanedActionsTestCase->testActionsOrphaned()
Trigger test action successfully fired.Othertrigger.test729TriggerOrphanedActionsTestCase->testActionsOrphaned()
Trying to get property of non-objectNoticetrigger.test736TriggerOrphanedActionsTestCase->testActionsOrphaned()
Failed to set field title to !SimpleTest test node! cBCVI62CqgOthertrigger.test736TriggerOrphanedActionsTestCase->testActionsOrphaned()
Failed to set field body[und][0][value] to !SimpleTest test body! r293HZ8TbAqWHgfvMg5xUijkBC0g9BaD xcx8I5NzQj5DeXoyydwsTEz7KeoL0GogOthertrigger.test736TriggerOrphanedActionsTestCase->testActionsOrphaned()
Found the Save buttonOthertrigger.test736TriggerOrphanedActionsTestCase->testActionsOrphaned()
Found the requested form fields at node//editOthertrigger.test736TriggerOrphanedActionsTestCase->testActionsOrphaned()
Make sure the Basic page can be updated with the missing trigger function.Othertrigger.test740TriggerOrphanedActionsTestCase->testActionsOrphaned()
ExpandTrigger other actions (TriggerOtherTestCase) [Trigger]106134
MessageGroupFilenameLineFunctionStatus
Invalid permission create article content.Roletrigger.test636TriggerOtherTestCase->testActionsComment()
Invalid permission skip comment approval.Roletrigger.test636TriggerOtherTestCase->testActionsComment()
Invalid permission post comments.Roletrigger.test636TriggerOtherTestCase->testActionsComment()
Argument 1 passed to DrupalWebTestCase::drupalLogin() must be an instance of stdClass, boolean given, called in /var/lib/drupaltestbot/sites/default/files/checkout/modules/trigger/trigger.test on line 637 and definedRecoverable errordrupal_web_test_case.php1226DrupalWebTestCase->drupalLogin()
Trying to get property of non-objectNoticedrupal_web_test_case.php1232DrupalWebTestCase->drupalLogin()
Trying to get property of non-objectNoticedrupal_web_test_case.php1233DrupalWebTestCase->drupalLogin()
Failed to set field name to Othertrigger.test637TriggerOtherTestCase->testActionsComment()
Failed to set field pass to Othertrigger.test637TriggerOtherTestCase->testActionsComment()
Found the requested form fields at userOthertrigger.test637TriggerOtherTestCase->testActionsComment()
Trying to get property of non-objectNoticedrupal_web_test_case.php1239DrupalWebTestCase->drupalLogin()
User successfully logged in.User logintrigger.test637TriggerOtherTestCase->testActionsComment()
Failed to set field subject to bCDOuQjcqnOthertrigger.test643TriggerOtherTestCase->testActionsComment()
Failed to set field comment_body[und][0][value] to nxExVvdQ6M qTrWUbayb4Othertrigger.test643TriggerOtherTestCase->testActionsComment()
Found the Save buttonOthertrigger.test643TriggerOtherTestCase->testActionsComment()
Found the requested form fields at Othertrigger.test643TriggerOtherTestCase->testActionsComment()
Check that creating a comment triggered the action.Othertrigger.test646TriggerOtherTestCase->testActionsComment()
The test did not complete due to a fatal error.Completion checktrigger.test652TriggerOtherTestCase->testActionsTaxonomy()
LeafTrigger update path (TriggerUpdatePathTestCase) [Upgrade path]2000
LeafTrigger upgrade path (UpgradePathTriggerTestCase) [Upgrade path]4100
ExpandUI language negotiation (LocaleUILanguageNegotiationTest) [Locale]9611
MessageGroupFilenameLineFunctionStatus
Undefined offset: 0Noticelocale.test2454LocaleUILanguageNegotiationTest->testUrlLanguageFallback()
The browser language is the URL active languageOtherlocale.test2454LocaleUILanguageNegotiationTest->testUrlLanguageFallback()
LeafUnassigned text format functionality (FilterNoFormatTestCase) [Filter]100
LeafUnicode handling (UnicodeUnitTest) [System]17600
LeafUnmanaged file copying (FileUnmanagedCopyTest) [File API]3100
LeafUnmanaged file copying (RemoteFileUnmanagedCopyTest) [File API (remote)]3400
LeafUnmanaged file delete (FileUnmanagedDeleteTest) [File API]800
LeafUnmanaged file delete (RemoteFileUnmanagedDeleteTest) [File API (remote)]1100
LeafUnmanaged file moving (FileUnmanagedMoveTest) [File API]2200
LeafUnmanaged file moving (RemoteFileUnmanagedMoveTest) [File API (remote)]2500
LeafUnmanaged file save data (FileUnmanagedSaveDataTest) [File API]700
LeafUnmanaged file save data (RemoteFileUnmanagedSaveDataTest) [File API (remote)]800
LeafUnmanaged recursive file delete (FileUnmanagedDeleteRecursiveTest) [File API]1700
LeafUnmanaged recursive file delete (RemoteFileUnmanagedDeleteRecursiveTest) [File API (remote)]2100
LeafUpdate contrib functionality (UpdateTestContribCase) [Update]18800
LeafUpdate core functionality (UpdateCoreTestCase) [Update]20000
LeafUpdate dependency hook invocation (UpdateDependencyHookInvocationTestCase) [Update API]400
LeafUpdate dependency ordering (UpdateDependencyOrderingTestCase) [Update API]500
LeafUpdate feed functionality (UpdateFeedTestCase) [Unknown]7600
LeafUpdate feed item functionality (UpdateFeedItemTestCase) [Unknown]6500
ExpandUpdate functionality (UpdateScriptFunctionalTest) [System]20410
MessageGroupFilenameLineFunctionStatus
Link with label logged found.Othersystem.test2305UpdateScriptFunctionalTest->testSuccessfulUpdateFunctionality()
LeafUpdate on cron functionality (AggregatorCronTestCase) [Unknown]5500
LeafUpdate tests (DatabaseUpdateTestCase) [Database]5600
LeafUpdate tests, Complex (DatabaseUpdateComplexTestCase) [Database]5900
LeafUpdate tests, LOB (DatabaseUpdateLOBTestCase) [Database]1500
LeafUpload and extract module functionality (UpdateTestUploadCase) [Update]6400
LeafUpload upgrade path (UploadUpgradePathTestCase) [Upgrade path]4100
LeafUpload user picture (UserPictureTestCase) [User]10500
LeafURL altering (UrlAlterFunctionalTest) [Path API]3400
LeafURL generation tests (CommonURLUnitTest) [System]5600
LeafURL rewriting (LocaleUrlRewritingTest) [Locale]3300
LeafUser account links (UserAccountLinksUnitTests) [User]1900
LeafUser administration (UserAdminTestCase) [User]6200
LeafUser autocompletion (UserAutocompleteTestCase) [User]2600
LeafUser blocks (UserBlocksUnitTests) [User]3900
LeafUser create (UserCreateTestCase) [User]2700
LeafUser creation (LocaleUserCreationTest) [Locale]6900
LeafUser edit (UserEditTestCase) [User]6600
LeafUser edited own account (UserEditedOwnAccountTestCase) [User]2300
LeafUser language settings (LocaleUserLanguageFunctionalTest) [Locale]5000
LeafUser login (UserLoginTestCase) [User]16300
LeafUser poll vote capability. (PollVoteCheckHostname) [Poll]14500
LeafUser registration (UserRegistrationTestCase) [User]13500
LeafUser role administration (UserRoleAdminTestCase) [User]5300
LeafUser save test (UserSaveTestCase) [User]300
LeafUser search (UserUserSearchTestCase) [User]3900
LeafUser signatures (UserSignatureTestCase) [User]4700
LeafUser time zones (UserTimeZoneFunctionalTest) [User]2900
LeafUser token replacement (UserTokenReplaceTestCase) [User]3900
LeafUser upgrade path (password token involved) (UserUpgradePathPasswordTokenTestCase) [Upgrade path]3000
LeafUser upgrade path (password token not involved) (UserUpgradePathNoPasswordTokenTestCase) [Upgrade path]2900
LeafUser validate current pass custom form (UserValidateCurrentPassCustomForm) [User]1700
LeafUsername/e-mail validation (UserValidationTestCase) [User]1900
LeafValid Url (ValidUrlTestCase) [System]7900
LeafVariable test (BootstrapVariableTestCase) [Bootstrap]900
LeafVertical tabs form element type test (FormsElementsVerticalTabsFunctionalTest) [Form API]400
LeafWidget customization (FieldUIAlterTestCase) [Field UI]2000
LeafXML-RPC basic (XMLRPCBasicTestCase) [XML-RPC]600
LeafXML-RPC message and alteration (XMLRPCMessagesTestCase) [XML-RPC]700
LeafXML-RPC validator (XMLRPCValidator1IncTestCase) [XML-RPC]1000