1463656-drupal-kernel_18.patch

Test status
StatusResult
Last receivedFri, 04/06/2012 - 21:40:45
Last requestedFri, 04/06/2012 - 21:41:02
Last testedFri, 04/06/2012 - 22:03:38
Test count1
Environment status
MySQLfail
File information
File1463656-drupal-kernel_18.patch
BranchDrupal core - 8.x
LinkIssue Link
SummaryFAILED: [[SimpleTest]]: [MySQL] 35,437 pass(es), 604 fail(s), and 186 exception(s).
Details

MySQL

  1. Setup environment
  2. Detect an invalid patch URL
  3. Detect invalid repository information
  4. Detect invalid patch format
  5. Detect a non-applicable patch
  6. Detect invalid PHP syntax
  7. Detect a Drupal installation failure
  8. Detect a test run failure
  9. Detect a failing test
    Review the test failures below then if necessary run them locally until the problem has been fixed.
  10. Complete test suite with all tests passing
35,437 pass(es), 604 fail(s), and 186 exception(s)

Non-pass

Test namePassFailException
ExpandActive trail (MenuTrailTestCase) [Menu]601010
MessageGroupFilenameLineFunctionStatus
The initial active trail for a 403 page contains the expected number of items (expected: 2, found: 1).Othermenu.test1688MenuTrailTestCase->testCustom403And404Pages()
Undefined offset: 1Noticemenu.test1690MenuTrailTestCase->testCustom403And404Pages()
Undefined offset: 1Noticemenu.test1694MenuTrailTestCase->testCustom403And404Pages()
Element number 2 of the initial active trail for a 403 page contains the correct path (expected: admin/config, found: )Othermenu.test1695MenuTrailTestCase->testCustom403And404Pages()
The final active trail for a 403 page contains the expected number of items (expected: 3, found: 1).Othermenu.test1705MenuTrailTestCase->testCustom403And404Pages()
Undefined offset: 1Noticemenu.test1707MenuTrailTestCase->testCustom403And404Pages()
Undefined offset: 1Noticemenu.test1711MenuTrailTestCase->testCustom403And404Pages()
Element number 2 of the final active trail for a 403 page contains the correct path (expected: menu-test, found: )Othermenu.test1712MenuTrailTestCase->testCustom403And404Pages()
Undefined offset: 2Noticemenu.test1707MenuTrailTestCase->testCustom403And404Pages()
Undefined offset: 2Noticemenu.test1711MenuTrailTestCase->testCustom403And404Pages()
Element number 3 of the final active trail for a 403 page contains the correct path (expected: menu-test/custom-403-page, found: )Othermenu.test1712MenuTrailTestCase->testCustom403And404Pages()
Breadcrumb Home » Menu test root found on http://drupaltestbot699-mysql/checkout/index.php/admin/config.Othermenu.test1720MenuTrailTestCase->testCustom403And404Pages()
The final active trail for a 404 page contains the expected number of items (expected: 3, found: 1).Othermenu.test1705MenuTrailTestCase->testCustom403And404Pages()
Undefined offset: 1Noticemenu.test1707MenuTrailTestCase->testCustom403And404Pages()
Undefined offset: 1Noticemenu.test1711MenuTrailTestCase->testCustom403And404Pages()
Element number 2 of the final active trail for a 404 page contains the correct path (expected: menu-test, found: )Othermenu.test1712MenuTrailTestCase->testCustom403And404Pages()
Undefined offset: 2Noticemenu.test1707MenuTrailTestCase->testCustom403And404Pages()
Undefined offset: 2Noticemenu.test1711MenuTrailTestCase->testCustom403And404Pages()
Element number 3 of the final active trail for a 404 page contains the correct path (expected: menu-test/custom-404-page, found: )Othermenu.test1712MenuTrailTestCase->testCustom403And404Pages()
Breadcrumb Home » Menu test root found on http://drupaltestbot699-mysql/checkout/index.php/b8yP5wZK.Othermenu.test1720MenuTrailTestCase->testCustom403And404Pages()
ExpandBatch progress page (BatchPageTestCase) [Batch API]1510
MessageGroupFilenameLineFunctionStatus
A progressive batch correctly uses the theme of the page that started the batch.Otherbatch.test311BatchPageTestCase->testBatchProgressPageTheme()
ExpandBoot and exit hook invocation (HookBootExitTestCase) [Bootstrap]1180
MessageGroupFilenameLineFunctionStatus
hook_exit called with disabled cache.Otherbootstrap.test310HookBootExitTestCase->testHookBootExit()
hook_exit called with normal cache.Otherbootstrap.test318HookBootExitTestCase->testHookBootExit()
Page has been cached.Otherbootstrap.test322HookBootExitTestCase->testHookBootExit()
hook_boot not called with aggressive cache and a cached page.Otherbootstrap.test324HookBootExitTestCase->testHookBootExit()
hook_exit not called with aggressive cache and a cached page.Otherbootstrap.test325HookBootExitTestCase->testHookBootExit()
Page cache cleared.Otherbootstrap.test328HookBootExitTestCase->testHookBootExit()
hook_boot called with aggressive cache and no cached page.Otherbootstrap.test331HookBootExitTestCase->testHookBootExit()
hook_exit called with aggressive cache and no cached page.Otherbootstrap.test332HookBootExitTestCase->testHookBootExit()
ExpandCategorize feed item functionality (CategorizeFeedItemTestCase) [Unknown]5725
MessageGroupFilenameLineFunctionStatus
Cannot use a scalar value as an arrayWarningblock.module281block_page_build()
Cannot use a scalar value as an arrayWarningblock.module281block_page_build()
Invalid argument supplied for foreach()Warningcommon.inc6456element_children()
Cannot use a scalar value as an arrayWarningcommon.inc5898drupal_render()
Cannot use a scalar value as an arrayWarningcommon.inc5951drupal_render()
HTTP response expected 403, actual 200Browseraggregator.test103AggregatorTestCase->updateFeedItems()
Total items in feed equal to the total items in database (5 != 0)Otheraggregator.test117AggregatorTestCase->updateFeedItems()
ExpandChecks display of aggregator items (AggregatorRenderingTestCase) [Unknown]217710
MessageGroupFilenameLineFunctionStatus
Cannot use a scalar value as an arrayWarningblock.module281block_page_build()
Cannot use a scalar value as an arrayWarningblock.module281block_page_build()
Invalid argument supplied for foreach()Warningcommon.inc6456element_children()
Cannot use a scalar value as an arrayWarningcommon.inc5898drupal_render()
Cannot use a scalar value as an arrayWarningcommon.inc5951drupal_render()
HTTP response expected 403, actual 200Browseraggregator.test103AggregatorTestCase->updateFeedItems()
Total items in feed equal to the total items in database (5 != 0)Otheraggregator.test117AggregatorTestCase->updateFeedItems()
Feed block is displayed on the page.Otheraggregator.test879AggregatorRenderingTestCase->testBlockLinks()
Link to href aggregator/sources/1 found.Otheraggregator.test884AggregatorRenderingTestCase->testBlockLinks()
Cannot use a scalar value as an arrayWarningblock.module281block_page_build()
Cannot use a scalar value as an arrayWarningblock.module281block_page_build()
Invalid argument supplied for foreach()Warningcommon.inc6456element_children()
Cannot use a scalar value as an arrayWarningcommon.inc5898drupal_render()
Cannot use a scalar value as an arrayWarningcommon.inc5951drupal_render()
HTTP response expected 403, actual 200Browseraggregator.test103AggregatorTestCase->updateFeedItems()
Total items in feed equal to the total items in database (30 != 0)Otheraggregator.test117AggregatorTestCase->updateFeedItems()
Individual source page contains a pager.Otheraggregator.test908AggregatorRenderingTestCase->testFeedPage()
ExpandComment approval (CommentApprovalTest) [Comment]152216
MessageGroupFilenameLineFunctionStatus
Cannot use a scalar value as an arrayWarningblock.module281block_page_build()
Cannot use a scalar value as an arrayWarningblock.module281block_page_build()
Cannot use a scalar value as an arrayWarningblock.module281block_page_build()
Cannot use a scalar value as an arrayWarningblock.module281block_page_build()
Cannot use a scalar value as an arrayWarningtoolbar.module122toolbar_page_build()
Invalid argument supplied for foreach()Warningcommon.inc6456element_children()
Cannot use a scalar value as an arrayWarningcommon.inc5898drupal_render()
Cannot use a scalar value as an arrayWarningcommon.inc5951drupal_render()
Forged comment approval was denied.Browsercomment.test1677CommentApprovalTest->testApprovalNodeInterface()
Cannot use a scalar value as an arrayWarningblock.module281block_page_build()
Cannot use a scalar value as an arrayWarningblock.module281block_page_build()
Cannot use a scalar value as an arrayWarningblock.module281block_page_build()
Cannot use a scalar value as an arrayWarningblock.module281block_page_build()
Cannot use a scalar value as an arrayWarningtoolbar.module122toolbar_page_build()
Invalid argument supplied for foreach()Warningcommon.inc6456element_children()
Cannot use a scalar value as an arrayWarningcommon.inc5898drupal_render()
Cannot use a scalar value as an arrayWarningcommon.inc5951drupal_render()
Forged comment approval was denied.Browsercomment.test1679CommentApprovalTest->testApprovalNodeInterface()
ExpandComment language (LocaleCommentLanguageFunctionalTest) [Locale]4780
MessageGroupFilenameLineFunctionStatus
Failed to set field comment_body[und][0][value] to rnr3DViTOtherlocale.test2881LocaleCommentLanguageFunctionalTest->testCommentLanguage()
Found the Save buttonOtherlocale.test2881LocaleCommentLanguageFunctionalTest->testCommentLanguage()
Found the requested form fields at fr/node/1Otherlocale.test2881LocaleCommentLanguageFunctionalTest->testCommentLanguage()
The comment posted with content language fr and belonging to the node with language en has language enOtherlocale.test2891LocaleCommentLanguageFunctionalTest->testCommentLanguage()
Failed to set field comment_body[und][0][value] to pxWA647vOtherlocale.test2881LocaleCommentLanguageFunctionalTest->testCommentLanguage()
Found the Save buttonOtherlocale.test2881LocaleCommentLanguageFunctionalTest->testCommentLanguage()
Found the requested form fields at fr/node/2Otherlocale.test2881LocaleCommentLanguageFunctionalTest->testCommentLanguage()
The comment posted with content language fr and belonging to the node with language fr has language enOtherlocale.test2891LocaleCommentLanguageFunctionalTest->testCommentLanguage()
ExpandContent language settings (LocaleContentFunctionalTest) [Locale]16210
MessageGroupFilenameLineFunctionStatus
The machine name field is LTR when the default language is RTL.Otherlocale.test2093LocaleContentFunctionalTest->testMachineNameLTR()
ExpandCron run (CronRunTestCase) [System]4832
MessageGroupFilenameLineFunctionStatus
Symfony\Component\HttpKernel\Exception\AccessDeniedHttpExceptioncommon.inc734drupal_access_denied()
HTTP response expected 403, actual 500Browsersystem.test814CronRunTestCase->testCronRun()
Symfony\Component\HttpKernel\Exception\AccessDeniedHttpExceptioncommon.inc734drupal_access_denied()
HTTP response expected 403, actual 500Browsersystem.test819CronRunTestCase->testCronRun()
Cron runs when the cron threshold is passed.Othersystem.test848CronRunTestCase->testAutomaticCron()
ExpandDBLog functionality (DBLogTestCase) [DBLog]52150
MessageGroupFilenameLineFunctionStatus
DBLog event was recorded: [access denied]Otherdblog.test317DBLogTestCase->doNode()
DBLog event was recorded: [access denied]Otherdblog.test317DBLogTestCase->doNode()
DBLog event was recorded: [access denied]Otherdblog.test317DBLogTestCase->doNode()
DBLog event was recorded: [access denied]Otherdblog.test317DBLogTestCase->doNode()
DBLog event was recorded: [access denied]Otherdblog.test317DBLogTestCase->doNode()
ExpandDrupal error handlers (DrupalErrorHandlerUnitTest) [System]2260
MessageGroupFilenameLineFunctionStatus
Received expected HTTP status line.Othererror.test87DrupalErrorHandlerUnitTest->testExceptionHandler()
Found error message: Exception: Drupal is awesome in error_test_trigger_exception() (line .Othererror.test88DrupalErrorHandlerUnitTest->testExceptionHandler()
Received expected HTTP status line.Othererror.test91DrupalErrorHandlerUnitTest->testExceptionHandler()
Found PDOException in error page.Othererror.test94DrupalErrorHandlerUnitTest->testExceptionHandler()
Found SELECT * FROM bananas_are_awesome in error page.Othererror.test95DrupalErrorHandlerUnitTest->testExceptionHandler()
Found 'in error_test_trigger_pdo_exception() (line ' in error page.Othererror.test97DrupalErrorHandlerUnitTest->testExceptionHandler()
ExpandDrupal HTTP request (CommonDrupalHTTPRequestTestCase) [Common]2962
MessageGroupFilenameLineFunctionStatus
Fetched page successfully.Othercommon.test961CommonDrupalHTTPRequestTestCase->testDrupalHTTPRequest()
Site title matches.Othercommon.test963CommonDrupalHTTPRequestTestCase->testDrupalHTTPRequest()
$_SERVER["PHP_AUTH_USER"] is passed correctly.Othercommon.test999CommonDrupalHTTPRequestTestCase->testDrupalHTTPRequestBasicAuth()
$_SERVER["PHP_AUTH_PW"] is passed correctly.Othercommon.test1000CommonDrupalHTTPRequestTestCase->testDrupalHTTPRequestBasicAuth()
Undefined index: content-languageNoticecommon.test1048CommonDrupalHTTPRequestTestCase->testDrupalHTTPRequestHeaders()
Content-Language HTTP header is English.Othercommon.test1048CommonDrupalHTTPRequestTestCase->testDrupalHTTPRequestHeaders()
Undefined index: content-languageNoticecommon.test1059CommonDrupalHTTPRequestTestCase->testDrupalHTTPRequestHeaders()
Content-Language HTTP header is French.Othercommon.test1059CommonDrupalHTTPRequestTestCase->testDrupalHTTPRequestHeaders()
ExpandFront page (FrontPageTestCase) [System]3340
MessageGroupFilenameLineFunctionStatus
Path is the front page.Othersystem.test1503FrontPageTestCase->testDrupalIsFrontPage()
Path is the front page.Othersystem.test1505FrontPageTestCase->testDrupalIsFrontPage()
Path is the front page.Othersystem.test1520FrontPageTestCase->testDrupalIsFrontPage()
Path is the front page.Othersystem.test1524FrontPageTestCase->testDrupalIsFrontPage()
ExpandHelp functionality (HelpTestCase) [Help]277300
MessageGroupFilenameLineFunctionStatus
[block] Heading was displayedOtherhelp.test85HelpTestCase->verifyHelp()
[color] Heading was displayedOtherhelp.test85HelpTestCase->verifyHelp()
[comment] Heading was displayedOtherhelp.test85HelpTestCase->verifyHelp()
[contextual] Heading was displayedOtherhelp.test85HelpTestCase->verifyHelp()
[dashboard] Heading was displayedOtherhelp.test85HelpTestCase->verifyHelp()
[dblog] Heading was displayedOtherhelp.test85HelpTestCase->verifyHelp()
[entity] Heading was displayedOtherhelp.test85HelpTestCase->verifyHelp()
[field] Heading was displayedOtherhelp.test85HelpTestCase->verifyHelp()
[field_sql_storage] Heading was displayedOtherhelp.test85HelpTestCase->verifyHelp()
[list] Heading was displayedOtherhelp.test85HelpTestCase->verifyHelp()
[number] Heading was displayedOtherhelp.test85HelpTestCase->verifyHelp()
[options] Heading was displayedOtherhelp.test85HelpTestCase->verifyHelp()
[text] Heading was displayedOtherhelp.test85HelpTestCase->verifyHelp()
[field_ui] Heading was displayedOtherhelp.test85HelpTestCase->verifyHelp()
[file] Heading was displayedOtherhelp.test85HelpTestCase->verifyHelp()
[filter] Heading was displayedOtherhelp.test85HelpTestCase->verifyHelp()
[help] Heading was displayedOtherhelp.test85HelpTestCase->verifyHelp()
[image] Heading was displayedOtherhelp.test85HelpTestCase->verifyHelp()
[menu] Heading was displayedOtherhelp.test85HelpTestCase->verifyHelp()
[node] Heading was displayedOtherhelp.test85HelpTestCase->verifyHelp()
[overlay] Heading was displayedOtherhelp.test85HelpTestCase->verifyHelp()
[path] Heading was displayedOtherhelp.test85HelpTestCase->verifyHelp()
[poll] Heading was displayedOtherhelp.test85HelpTestCase->verifyHelp()
[rdf] Heading was displayedOtherhelp.test85HelpTestCase->verifyHelp()
[search] Heading was displayedOtherhelp.test85HelpTestCase->verifyHelp()
[shortcut] Heading was displayedOtherhelp.test85HelpTestCase->verifyHelp()
[system] Heading was displayedOtherhelp.test85HelpTestCase->verifyHelp()
[taxonomy] Heading was displayedOtherhelp.test85HelpTestCase->verifyHelp()
[toolbar] Heading was displayedOtherhelp.test85HelpTestCase->verifyHelp()
[user] Heading was displayedOtherhelp.test85HelpTestCase->verifyHelp()
ExpandImage field display tests (ImageFieldDisplayTestCase) [Image]16110
MessageGroupFilenameLineFunctionStatus
Cache-Control header was sent.Otherimage.test638ImageFieldDisplayTestCase->_testImageFieldFormatters()
ExpandImage styles path and URL functions (ImageStylesPathAndUrlUnitTest) [Image]4520
MessageGroupFilenameLineFunctionStatus
When using non-clean URLS, the system path contains the query string.Otherimage.test213ImageStylesPathAndUrlUnitTest->_testImageStyleUrlAndPath()
When using non-clean URLS, the system path contains the query string.Otherimage.test213ImageStylesPathAndUrlUnitTest->_testImageStyleUrlAndPath()
ExpandIndex.php handling (SystemIndexPhpTest) [System]810
MessageGroupFilenameLineFunctionStatus
Make sure index.php/user returns a 'page not found'.Browsersystem.test2674SystemIndexPhpTest->testIndexPhpHandling()
ExpandLanguage negotiation autoconfiguration (LocaleConfigurationTest) [Locale]3430
MessageGroupFilenameLineFunctionStatus
Default language updated.Browserlocale.test77LocaleConfigurationTest->testLanguageConfiguration()
A valid path prefix has been added to the previous default language.Otherlocale.test83LocaleConfigurationTest->testLanguageConfiguration()
French still has a path prefix.Otherlocale.test86LocaleConfigurationTest->testLanguageConfiguration()
ExpandLocalize date formats (LocaleDateFormatsFunctionalTest) [Locale]3610
MessageGroupFilenameLineFunctionStatus
French date format appearsOtherlocale.test2965LocaleDateFormatsFunctionalTest->testLocalizeDateFormats()
ExpandManage fields (FieldUIManageFieldsTestCase) [Field UI]19710
MessageGroupFilenameLineFunctionStatus
Field was created and appears in the overview page.Otherfield_ui.test435FieldUIManageFieldsTestCase->testHiddenFields()
ExpandMenu router (MenuRouterTestCase) [Menu]222100
MessageGroupFilenameLineFunctionStatus
The administrative theme can be correctly set in a theme callback.Othermenu.test187MenuRouterTestCase->testThemeCallbackAdministrative()
The administrative theme's CSS appears on the page.Othermenu.test188MenuRouterTestCase->testThemeCallbackAdministrative()
Theme callback inheritance correctly uses the administrative theme.Othermenu.test196MenuRouterTestCase->testThemeCallbackInheritance()
The administrative theme's CSS appears on the page.Othermenu.test197MenuRouterTestCase->testThemeCallbackInheritance()
The theme callback system is correctly triggered for an administrator when the site is in maintenance mode.Othermenu.test235MenuRouterTestCase->testThemeCallbackMaintenanceMode()
The administrative theme's CSS appears on the page.Othermenu.test236MenuRouterTestCase->testThemeCallbackMaintenanceMode()
The theme callback system uses an optional theme once it has been enabled.Othermenu.test284MenuRouterTestCase->testThemeCallbackOptionalTheme()
The optional theme's CSS appears on the page.Othermenu.test285MenuRouterTestCase->testThemeCallbackOptionalTheme()
The result of hook_custom_theme() does not override what was set in a theme callback.Othermenu.test334MenuRouterTestCase->testThemeCallbackHookCustomTheme()
The Seven theme's CSS appears on the page.Othermenu.test335MenuRouterTestCase->testThemeCallbackHookCustomTheme()
ExpandModule API (ModuleUnitTest) [Module]6420
MessageGroupFilenameLineFunctionStatus
The module implements cache is populated after requesting a page.Othermodule.test95ModuleUnitTest->testModuleImplements()
The module implements cache is populated after requesting a page.Othermodule.test102ModuleUnitTest->testModuleImplements()
ExpandMultilingual fields (LocaleMultilingualFieldsFunctionalTest) [Locale]6310
MessageGroupFilenameLineFunctionStatus
Body correctly displayed using Italian as requested languageOtherlocale.test2764LocaleMultilingualFieldsFunctionalTest->testMultilingualNodeForm()
ExpandOpenID account registration (OpenIDRegistrationTestCase) [OpenID]836520
MessageGroupFilenameLineFunctionStatus
OpenID redirect page was displayed.Otheropenid.test53OpenIDWebTestCase->submitLoginForm()
Found the Send buttonOtheropenid.test56OpenIDWebTestCase->submitLoginForm()
Found the requested form fields at Otheropenid.test56OpenIDWebTestCase->submitLoginForm()
User was asked to verify e-mail address.Otheropenid.test479OpenIDRegistrationTestCase->testRegisterUserWithEmailVerification()
A welcome message was sent to the user.Otheropenid.test480OpenIDRegistrationTestCase->testRegisterUserWithEmailVerification()
Undefined offset: 0Noticeopenid.test66OpenIDWebTestCase->getPasswordResetURLFromMail()
User was registered with right username.Otheropenid.test484OpenIDRegistrationTestCase->testRegisterUserWithEmailVerification()
Trying to get property of non-objectNoticeopenid.test485OpenIDRegistrationTestCase->testRegisterUserWithEmailVerification()
User was registered with right email address.Otheropenid.test485OpenIDRegistrationTestCase->testRegisterUserWithEmailVerification()
Trying to get property of non-objectNoticeopenid.test486OpenIDRegistrationTestCase->testRegisterUserWithEmailVerification()
User was registered with right timezone.Otheropenid.test486OpenIDRegistrationTestCase->testRegisterUserWithEmailVerification()
Trying to get property of non-objectNoticeopenid.test487OpenIDRegistrationTestCase->testRegisterUserWithEmailVerification()
User was registered with right language.Otheropenid.test487OpenIDRegistrationTestCase->testRegisterUserWithEmailVerification()
Trying to get property of non-objectNoticeopenid.test488OpenIDRegistrationTestCase->testRegisterUserWithEmailVerification()
OpenID redirect page was displayed.Otheropenid.test53OpenIDWebTestCase->submitLoginForm()
Found the Send buttonOtheropenid.test56OpenIDWebTestCase->submitLoginForm()
Found the requested form fields at Otheropenid.test56OpenIDWebTestCase->submitLoginForm()
Raw "You must validate your email address for this account before logging in via OpenID." foundOtheropenid.test491OpenIDRegistrationTestCase->testRegisterUserWithEmailVerification()
OpenID redirect page was displayed.Otheropenid.test53OpenIDWebTestCase->submitLoginForm()
Found the Send buttonOtheropenid.test56OpenIDWebTestCase->submitLoginForm()
Found the requested form fields at Otheropenid.test56OpenIDWebTestCase->submitLoginForm()
User was logged in.Otheropenid.test501OpenIDRegistrationTestCase->testRegisterUserWithEmailVerification()
OpenID redirect page was displayed.Otheropenid.test53OpenIDWebTestCase->submitLoginForm()
Found the Send buttonOtheropenid.test56OpenIDWebTestCase->submitLoginForm()
Found the requested form fields at Otheropenid.test56OpenIDWebTestCase->submitLoginForm()
User was logged in.Otheropenid.test523OpenIDRegistrationTestCase->testRegisterUserWithoutEmailVerification()
User was registered with right username.Otheropenid.test526OpenIDRegistrationTestCase->testRegisterUserWithoutEmailVerification()
Trying to get property of non-objectNoticeopenid.test527OpenIDRegistrationTestCase->testRegisterUserWithoutEmailVerification()
User was registered with right email address.Otheropenid.test527OpenIDRegistrationTestCase->testRegisterUserWithoutEmailVerification()
Trying to get property of non-objectNoticeopenid.test528OpenIDRegistrationTestCase->testRegisterUserWithoutEmailVerification()
User was registered with right timezone.Otheropenid.test528OpenIDRegistrationTestCase->testRegisterUserWithoutEmailVerification()
Trying to get property of non-objectNoticeopenid.test529OpenIDRegistrationTestCase->testRegisterUserWithoutEmailVerification()
User was registered with right language.Otheropenid.test529OpenIDRegistrationTestCase->testRegisterUserWithoutEmailVerification()
Trying to get property of non-objectNoticeopenid.test530OpenIDRegistrationTestCase->testRegisterUserWithoutEmailVerification()
OpenID redirect page was displayed.Otheropenid.test53OpenIDWebTestCase->submitLoginForm()
Found the Send buttonOtheropenid.test56OpenIDWebTestCase->submitLoginForm()
Found the requested form fields at Otheropenid.test56OpenIDWebTestCase->submitLoginForm()
User was logged in.Otheropenid.test535OpenIDRegistrationTestCase->testRegisterUserWithoutEmailVerification()
OpenID redirect page was displayed.Otheropenid.test53OpenIDWebTestCase->submitLoginForm()
Found the Send buttonOtheropenid.test56OpenIDWebTestCase->submitLoginForm()
Found the requested form fields at Otheropenid.test56OpenIDWebTestCase->submitLoginForm()
User was asked to complete the registration process manually.Otheropenid.test559OpenIDRegistrationTestCase->testRegisterUserWithInvalidSreg()
Form validation error for username was displayed.Otheropenid.test560OpenIDRegistrationTestCase->testRegisterUserWithInvalidSreg()
Form validation error for e-mail address was displayed.Otheropenid.test561OpenIDRegistrationTestCase->testRegisterUserWithInvalidSreg()
hook_openid_response() was invoked.Otheropenid.test562OpenIDRegistrationTestCase->testRegisterUserWithInvalidSreg()
No user object passed to hook_openid_response().Otheropenid.test563OpenIDRegistrationTestCase->testRegisterUserWithInvalidSreg()
Failed to set field mail to john@example.comOtheropenid.test568OpenIDRegistrationTestCase->testRegisterUserWithInvalidSreg()
Found the Create new account buttonOtheropenid.test568OpenIDRegistrationTestCase->testRegisterUserWithInvalidSreg()
Found the requested form fields at Otheropenid.test568OpenIDRegistrationTestCase->testRegisterUserWithInvalidSreg()
User was asked to verify e-mail address.Otheropenid.test569OpenIDRegistrationTestCase->testRegisterUserWithInvalidSreg()
Undefined offset: 0Noticeopenid.test66OpenIDWebTestCase->getPasswordResetURLFromMail()
User was registered with right username.Otheropenid.test573OpenIDRegistrationTestCase->testRegisterUserWithInvalidSreg()
Trying to get property of non-objectNoticeopenid.test574OpenIDRegistrationTestCase->testRegisterUserWithInvalidSreg()
Trying to get property of non-objectNoticeopenid.test575OpenIDRegistrationTestCase->testRegisterUserWithInvalidSreg()
User was registered with right e-mail address.Browseropenid.test583OpenIDRegistrationTestCase->testRegisterUserWithInvalidSreg()
Undefined variable: url_targetNoticedrupal_web_test_case.php2579DrupalWebTestCase->clickLink()
Clicked link OpenID identities () from http://drupaltestbot699-mysql/checkout/index.php/Browseropenid.test585OpenIDRegistrationTestCase->testRegisterUserWithInvalidSreg()
OpenID identity was registered.Otheropenid.test586OpenIDRegistrationTestCase->testRegisterUserWithInvalidSreg()
OpenID redirect page was displayed.Otheropenid.test53OpenIDWebTestCase->submitLoginForm()
Found the Send buttonOtheropenid.test56OpenIDWebTestCase->submitLoginForm()
Found the requested form fields at Otheropenid.test56OpenIDWebTestCase->submitLoginForm()
User was asked to complete the registration process manually.Otheropenid.test602OpenIDRegistrationTestCase->testRegisterUserWithoutSreg()
Failed to set field mail to john@example.comOtheropenid.test608OpenIDRegistrationTestCase->testRegisterUserWithoutSreg()
Found the Create new account buttonOtheropenid.test608OpenIDRegistrationTestCase->testRegisterUserWithoutSreg()
Found the requested form fields at Otheropenid.test608OpenIDRegistrationTestCase->testRegisterUserWithoutSreg()
User was asked to verify e-mail address.Otheropenid.test609OpenIDRegistrationTestCase->testRegisterUserWithoutSreg()
Undefined offset: 0Noticeopenid.test66OpenIDWebTestCase->getPasswordResetURLFromMail()
User was registered with right username.Otheropenid.test613OpenIDRegistrationTestCase->testRegisterUserWithoutSreg()
Trying to get property of non-objectNoticeopenid.test614OpenIDRegistrationTestCase->testRegisterUserWithoutSreg()
Trying to get property of non-objectNoticeopenid.test615OpenIDRegistrationTestCase->testRegisterUserWithoutSreg()
User was registered with right e-mail address.Browseropenid.test622OpenIDRegistrationTestCase->testRegisterUserWithoutSreg()
Undefined variable: url_targetNoticedrupal_web_test_case.php2579DrupalWebTestCase->clickLink()
Clicked link OpenID identities () from http://drupaltestbot699-mysql/checkout/index.php/Browseropenid.test624OpenIDRegistrationTestCase->testRegisterUserWithoutSreg()
OpenID identity was registered.Otheropenid.test625OpenIDRegistrationTestCase->testRegisterUserWithoutSreg()
OpenID redirect page was displayed.Otheropenid.test53OpenIDWebTestCase->submitLoginForm()
Found the Send buttonOtheropenid.test56OpenIDWebTestCase->submitLoginForm()
Found the requested form fields at Otheropenid.test56OpenIDWebTestCase->submitLoginForm()
User was logged in.Otheropenid.test653OpenIDRegistrationTestCase->testRegisterUserWithAXButNoSREG()
User was registered with right username.Otheropenid.test656OpenIDRegistrationTestCase->testRegisterUserWithAXButNoSREG()
Trying to get property of non-objectNoticeopenid.test657OpenIDRegistrationTestCase->testRegisterUserWithAXButNoSREG()
User was registered with right email address.Otheropenid.test657OpenIDRegistrationTestCase->testRegisterUserWithAXButNoSREG()
Trying to get property of non-objectNoticeopenid.test658OpenIDRegistrationTestCase->testRegisterUserWithAXButNoSREG()
User was registered with right timezone.Otheropenid.test658OpenIDRegistrationTestCase->testRegisterUserWithAXButNoSREG()
Trying to get property of non-objectNoticeopenid.test659OpenIDRegistrationTestCase->testRegisterUserWithAXButNoSREG()
User was registered with right language.Otheropenid.test659OpenIDRegistrationTestCase->testRegisterUserWithAXButNoSREG()
ExpandOpenID discovery and login (OpenIDFunctionalTestCase) [OpenID]2111013
MessageGroupFilenameLineFunctionStatus
OpenID redirect page was displayed.Otheropenid.test344OpenIDFunctionalTestCase->addIdentity()
Found the Send buttonOtheropenid.test347OpenIDFunctionalTestCase->addIdentity()
Found the requested form fields at Otheropenid.test347OpenIDFunctionalTestCase->addIdentity()
Identity drupaltestbot699-mysql/checkout/index.php/openid-test/yadis/xrds was added.Otheropenid.test353OpenIDFunctionalTestCase->addIdentity()
OpenID redirect page was displayed.Otheropenid.test344OpenIDFunctionalTestCase->addIdentity()
Found the Send buttonOtheropenid.test347OpenIDFunctionalTestCase->addIdentity()
Found the requested form fields at Otheropenid.test347OpenIDFunctionalTestCase->addIdentity()
Identity drupaltestbot699-mysql/checkout/index.php/openid-test/yadis/xrds/delegate was added.Otheropenid.test353OpenIDFunctionalTestCase->addIdentity()
OpenID redirect page was displayed.Otheropenid.test344OpenIDFunctionalTestCase->addIdentity()
Found the Send buttonOtheropenid.test347OpenIDFunctionalTestCase->addIdentity()
Found the requested form fields at Otheropenid.test347OpenIDFunctionalTestCase->addIdentity()
Identity http://drupaltestbot699-mysql/checkout/index.php/openid-test/yadis/xrds/server was added.Otheropenid.test353OpenIDFunctionalTestCase->addIdentity()
OpenID redirect page was displayed.Otheropenid.test344OpenIDFunctionalTestCase->addIdentity()
Found the Send buttonOtheropenid.test347OpenIDFunctionalTestCase->addIdentity()
Found the requested form fields at Otheropenid.test347OpenIDFunctionalTestCase->addIdentity()
Identity http://drupaltestbot699-mysql/checkout/index.php/openid-test/yadis/x-xrds-location was added.Otheropenid.test353OpenIDFunctionalTestCase->addIdentity()
OpenID redirect page was displayed.Otheropenid.test344OpenIDFunctionalTestCase->addIdentity()
Found the Send buttonOtheropenid.test347OpenIDFunctionalTestCase->addIdentity()
Found the requested form fields at Otheropenid.test347OpenIDFunctionalTestCase->addIdentity()
Identity http://drupaltestbot699-mysql/checkout/index.php/openid-test/yadis/http-equiv was added.Otheropenid.test353OpenIDFunctionalTestCase->addIdentity()
OpenID redirect page was displayed.Otheropenid.test344OpenIDFunctionalTestCase->addIdentity()
Found the Send buttonOtheropenid.test347OpenIDFunctionalTestCase->addIdentity()
Found the requested form fields at Otheropenid.test347OpenIDFunctionalTestCase->addIdentity()
Identity @example*résumé;%25 was added.Otheropenid.test353OpenIDFunctionalTestCase->addIdentity()
Identity http://drupaltestbot699-mysql/checkout/index.php/openid-test/html/openid1 was added.Otheropenid.test353OpenIDFunctionalTestCase->addIdentity()
OpenID redirect page was displayed.Otheropenid.test344OpenIDFunctionalTestCase->addIdentity()
Found the Send buttonOtheropenid.test347OpenIDFunctionalTestCase->addIdentity()
Found the requested form fields at Otheropenid.test347OpenIDFunctionalTestCase->addIdentity()
Identity http://drupaltestbot699-mysql/checkout/index.php/openid-test/html/openid2 was added.Otheropenid.test353OpenIDFunctionalTestCase->addIdentity()
OpenID redirect page was displayed.Otheropenid.test344OpenIDFunctionalTestCase->addIdentity()
Found the Send buttonOtheropenid.test347OpenIDFunctionalTestCase->addIdentity()
Found the requested form fields at Otheropenid.test347OpenIDFunctionalTestCase->addIdentity()
Identity http://drupaltestbot699-mysql/checkout/index.php/openid-test/redirect/0 was added.Otheropenid.test353OpenIDFunctionalTestCase->addIdentity()
OpenID redirect page was displayed.Otheropenid.test344OpenIDFunctionalTestCase->addIdentity()
Found the Send buttonOtheropenid.test347OpenIDFunctionalTestCase->addIdentity()
Found the requested form fields at Otheropenid.test347OpenIDFunctionalTestCase->addIdentity()
Identity http://drupaltestbot699-mysql/checkout/index.php/openid-test/redirect/2 was added.Otheropenid.test353OpenIDFunctionalTestCase->addIdentity()
OpenID redirect page was displayed.Otheropenid.test344OpenIDFunctionalTestCase->addIdentity()
Found the Send buttonOtheropenid.test347OpenIDFunctionalTestCase->addIdentity()
Found the requested form fields at Otheropenid.test347OpenIDFunctionalTestCase->addIdentity()
Identity http://drupaltestbot699-mysql/checkout/index.php/openid-test/yadis/xrds was added.Otheropenid.test353OpenIDFunctionalTestCase->addIdentity()
hook_openid_response() was invoked.Otheropenid.test193OpenIDFunctionalTestCase->testLogin()
Trying to get property of non-objectNoticeopenid.test194OpenIDFunctionalTestCase->testLogin()
Proper user object passed to hook_openid_response().Otheropenid.test194OpenIDFunctionalTestCase->testLogin()
OpenID redirect page was displayed.Otheropenid.test53OpenIDWebTestCase->submitLoginForm()
Found the Send buttonOtheropenid.test56OpenIDWebTestCase->submitLoginForm()
Found the requested form fields at Otheropenid.test56OpenIDWebTestCase->submitLoginForm()
User was logged in.Otheropenid.test202OpenIDFunctionalTestCase->testLogin()
hook_openid_response() was invoked.Otheropenid.test205OpenIDFunctionalTestCase->testLogin()
Trying to get property of non-objectNoticeopenid.test206OpenIDFunctionalTestCase->testLogin()
Proper user object passed to hook_openid_response().Otheropenid.test206OpenIDFunctionalTestCase->testLogin()
OpenID redirect page was displayed.Otheropenid.test215OpenIDFunctionalTestCase->testLogin()
Found the Send buttonOtheropenid.test218OpenIDFunctionalTestCase->testLogin()
Found the requested form fields at Otheropenid.test218OpenIDFunctionalTestCase->testLogin()
User was logged in.Otheropenid.test220OpenIDFunctionalTestCase->testLogin()
OpenID redirect page was displayed.Otheropenid.test53OpenIDWebTestCase->submitLoginForm()
Found the Send buttonOtheropenid.test56OpenIDWebTestCase->submitLoginForm()
Found the requested form fields at Otheropenid.test56OpenIDWebTestCase->submitLoginForm()
User was logged in.Otheropenid.test232OpenIDFunctionalTestCase->testLogin()
hook_openid_request_alter() were invoked.Otheropenid.test234OpenIDFunctionalTestCase->testLogin()
OpenID redirect page was displayed.Otheropenid.test344OpenIDFunctionalTestCase->addIdentity()
Found the Send buttonOtheropenid.test347OpenIDFunctionalTestCase->addIdentity()
Found the requested form fields at Otheropenid.test347OpenIDFunctionalTestCase->addIdentity()
Identity http://drupaltestbot699-mysql/checkout/index.php/openid-test/yadis/xrds was added.Otheropenid.test353OpenIDFunctionalTestCase->addIdentity()
OpenID redirect page was displayed.Otheropenid.test257OpenIDFunctionalTestCase->testLoginMaintenanceMode()
Found the Send buttonOtheropenid.test260OpenIDFunctionalTestCase->testLoginMaintenanceMode()
Found the requested form fields at Otheropenid.test260OpenIDFunctionalTestCase->testLoginMaintenanceMode()
User was logged in.Otheropenid.test262OpenIDFunctionalTestCase->testLoginMaintenanceMode()
"Operating in maintenance mode." foundOtheropenid.test265OpenIDFunctionalTestCase->testLoginMaintenanceMode()
OpenID redirect page was displayed.Otheropenid.test344OpenIDFunctionalTestCase->addIdentity()
Found the Send buttonOtheropenid.test347OpenIDFunctionalTestCase->addIdentity()
Found the requested form fields at Otheropenid.test347OpenIDFunctionalTestCase->addIdentity()
Identity http://drupaltestbot699-mysql/checkout/index.php/openid-test/yadis/xrds was added.Otheropenid.test353OpenIDFunctionalTestCase->addIdentity()
Identity appears in list.Otheropenid.test278OpenIDFunctionalTestCase->testDelete()
Undefined variable: url_targetNoticedrupal_web_test_case.php2579DrupalWebTestCase->clickLink()
Clicked link Delete () from http://drupaltestbot699-mysql/checkout/index.php/user/2/openidBrowseropenid.test281OpenIDFunctionalTestCase->testDelete()
Found the Confirm buttonOtheropenid.test282OpenIDFunctionalTestCase->testDelete()
Found the requested form fields at Otheropenid.test282OpenIDFunctionalTestCase->testDelete()
Identity deletedOtheropenid.test284OpenIDFunctionalTestCase->testDelete()
OpenID redirect page was displayed.Otheropenid.test344OpenIDFunctionalTestCase->addIdentity()
Found the Send buttonOtheropenid.test347OpenIDFunctionalTestCase->addIdentity()
Found the requested form fields at Otheropenid.test347OpenIDFunctionalTestCase->addIdentity()
Identity http://drupaltestbot699-mysql/checkout/index.php/openid-test/yadis/xrds was added.Otheropenid.test353OpenIDFunctionalTestCase->addIdentity()
OpenID redirect page was displayed.Otheropenid.test53OpenIDWebTestCase->submitLoginForm()
Found the Send buttonOtheropenid.test56OpenIDWebTestCase->submitLoginForm()
Found the requested form fields at Otheropenid.test56OpenIDWebTestCase->submitLoginForm()
User login was blocked.Otheropenid.test313OpenIDFunctionalTestCase->testBlockedUserLogin()
OpenID redirect page was displayed.Otheropenid.test53OpenIDWebTestCase->submitLoginForm()
Found the Send buttonOtheropenid.test56OpenIDWebTestCase->submitLoginForm()
Found the requested form fields at Otheropenid.test56OpenIDWebTestCase->submitLoginForm()
Raw "OpenID login failed." foundOtheropenid.test401OpenIDFunctionalTestCase->testSignatureValidation()
OpenID redirect page was displayed.Otheropenid.test53OpenIDWebTestCase->submitLoginForm()
Found the Send buttonOtheropenid.test56OpenIDWebTestCase->submitLoginForm()
Found the requested form fields at Otheropenid.test56OpenIDWebTestCase->submitLoginForm()
Raw "OpenID login failed." foundOtheropenid.test406OpenIDFunctionalTestCase->testSignatureValidation()
OpenID redirect page was displayed.Otheropenid.test53OpenIDWebTestCase->submitLoginForm()
Found the Send buttonOtheropenid.test56OpenIDWebTestCase->submitLoginForm()
Found the requested form fields at Otheropenid.test56OpenIDWebTestCase->submitLoginForm()
No e-mail address was supplied by provider.Browseropenid.test427OpenIDFunctionalTestCase->testSignatureValidation()
OpenID redirect page was displayed.Otheropenid.test53OpenIDWebTestCase->submitLoginForm()
Found the Send buttonOtheropenid.test56OpenIDWebTestCase->submitLoginForm()
Found the requested form fields at Otheropenid.test56OpenIDWebTestCase->submitLoginForm()
Username was supplied by provider.Browseropenid.test438OpenIDFunctionalTestCase->testSignatureValidation()
E-mail address supplied by provider was ignored.Browseropenid.test439OpenIDFunctionalTestCase->testSignatureValidation()
ExpandPage cache test (BootstrapPageCacheTestCase) [Bootstrap]66140
MessageGroupFilenameLineFunctionStatus
Page was cached.Otherbootstrap.test130BootstrapPageCacheTestCase->testConditionalRequests()
Conditional request returned 304 Not Modified.Browserbootstrap.test135BootstrapPageCacheTestCase->testConditionalRequests()
Conditional request with obsolete If-Modified-Since date returned 304 Not Modified.Browserbootstrap.test138BootstrapPageCacheTestCase->testConditionalRequests()
Conditional request with obsolete If-Modified-Since date returned 304 Not Modified.Browserbootstrap.test141BootstrapPageCacheTestCase->testConditionalRequests()
Page was cached.Otherbootstrap.test145BootstrapPageCacheTestCase->testConditionalRequests()
Page was cached.Otherbootstrap.test149BootstrapPageCacheTestCase->testConditionalRequests()
Vary header was sent.Otherbootstrap.test169BootstrapPageCacheTestCase->testPageCache()
Cache-Control header was sent.Otherbootstrap.test170BootstrapPageCacheTestCase->testPageCache()
Page was cached.Otherbootstrap.test176BootstrapPageCacheTestCase->testPageCache()
Vary: Cookie header was sent.Otherbootstrap.test177BootstrapPageCacheTestCase->testPageCache()
Cache-Control header was sent.Otherbootstrap.test178BootstrapPageCacheTestCase->testPageCache()
Cache-Control header was sent.Otherbootstrap.test194BootstrapPageCacheTestCase->testPageCache()
Page was cached.Otherbootstrap.test220BootstrapPageCacheTestCase->testPageCompression()
Page was cached.Otherbootstrap.test227BootstrapPageCacheTestCase->testPageCompression()
ExpandPath alias functionality (PathAliasTestCase) [Path]122100
MessageGroupFilenameLineFunctionStatus
Cache entry was created.Otherpath.test66PathAliasTestCase->testPathCache()
Cache entry was created.Otherpath.test71PathAliasTestCase->testPathCache()
Alias works.Otherpath.test89PathAliasTestCase->testAdminAlias()
HTTP response expected 200, actual 404Browserpath.test90PathAliasTestCase->testAdminAlias()
Changed alias works.Otherpath.test103PathAliasTestCase->testAdminAlias()
HTTP response expected 200, actual 404Browserpath.test104PathAliasTestCase->testAdminAlias()
Alias works.Otherpath.test147PathAliasTestCase->testNodeAlias()
HTTP response expected 200, actual 404Browserpath.test148PathAliasTestCase->testNodeAlias()
Changed alias works.Otherpath.test159PathAliasTestCase->testNodeAlias()
HTTP response expected 200, actual 404Browserpath.test160PathAliasTestCase->testNodeAlias()
ExpandPath aliases with languages (PathLanguageUITestCase) [Path]7530
MessageGroupFilenameLineFunctionStatus
Language-neutral URL alias worksOtherpath.test472PathLanguageUITestCase->testLanguageNeutralURLs()
English URL alias worksOtherpath.test487PathLanguageUITestCase->testDefaultLanguageURLs()
Foreign URL alias worksOtherpath.test502PathLanguageUITestCase->testNonDefaultURLs()
ExpandPath aliases with translated nodes (PathLanguageTestCase) [Path]531613
MessageGroupFilenameLineFunctionStatus
Alias works.Otherpath.test336PathLanguageTestCase->testAliasTranslation()
Failed to set field title to w0eRV7RJOtherpath.test347PathLanguageTestCase->testAliasTranslation()
Failed to set field body[und][0][value] to eEuMF1xoOtherpath.test347PathLanguageTestCase->testAliasTranslation()
Failed to set field path[alias] to eLWfqeGFOtherpath.test347PathLanguageTestCase->testAliasTranslation()
Found the Save buttonOtherpath.test347PathLanguageTestCase->testAliasTranslation()
Found the requested form fields at Otherpath.test347PathLanguageTestCase->testAliasTranslation()
Node found in database.Otherpath.test354PathLanguageTestCase->testAliasTranslation()
Trying to get property of non-objectNoticepath.test358PathLanguageTestCase->testAliasTranslation()
Alias for French translation works.Otherpath.test358PathLanguageTestCase->testAliasTranslation()
Trying to get property of non-objectNoticepath.test366PathLanguageTestCase->testAliasTranslation()
Trying to get property of non-objectNoticepath.test366PathLanguageTestCase->testAliasTranslation()
Undefined index: Noticepath.test366PathLanguageTestCase->testAliasTranslation()
URL contains the path alias.Otherpath.test367PathLanguageTestCase->testAliasTranslation()
Alias for English translation works.Otherpath.test392PathLanguageTestCase->testAliasTranslation()
Trying to get property of non-objectNoticepath.test396PathLanguageTestCase->testAliasTranslation()
Alias for French translation works.Otherpath.test396PathLanguageTestCase->testAliasTranslation()
Alias for English translation works.Otherpath.test404PathLanguageTestCase->testAliasTranslation()
Trying to get property of non-objectNoticepath.test416PathLanguageTestCase->testAliasTranslation()
Trying to get property of non-objectNoticepath.test417PathLanguageTestCase->testAliasTranslation()
Normal path works.Otherpath.test417PathLanguageTestCase->testAliasTranslation()
Trying to get property of non-objectNoticepath.test419PathLanguageTestCase->testAliasTranslation()
Trying to get property of non-objectNoticepath.test420PathLanguageTestCase->testAliasTranslation()
Normal path is the same.Otherpath.test420PathLanguageTestCase->testAliasTranslation()
Trying to get property of non-objectNoticepath.test423PathLanguageTestCase->testAliasTranslation()
Trying to get property of non-objectNoticepath.test423PathLanguageTestCase->testAliasTranslation()
Alias works.Otherpath.test424PathLanguageTestCase->testAliasTranslation()
Trying to get property of non-objectNoticepath.test426PathLanguageTestCase->testAliasTranslation()
Trying to get property of non-objectNoticepath.test426PathLanguageTestCase->testAliasTranslation()
Alias is the same.Otherpath.test427PathLanguageTestCase->testAliasTranslation()
ExpandPath language settings (LocalePathFunctionalTest) [Locale]4070
MessageGroupFilenameLineFunctionStatus
The "xx" front page is readibly available.Otherlocale.test1962LocalePathFunctionalTest->testPathLanguageConfiguration()
English alias works.Otherlocale.test1988LocalePathFunctionalTest->testPathLanguageConfiguration()
Custom language alias works.Otherlocale.test1992LocalePathFunctionalTest->testPathLanguageConfiguration()
First node links to the path alias.Otherlocale.test2035LocalePathFunctionalTest->testPathLanguageConfiguration()
Second node links to the path alias.Otherlocale.test2037LocalePathFunctionalTest->testPathLanguageConfiguration()
Custom alias returns first node.Otherlocale.test2041LocalePathFunctionalTest->testPathLanguageConfiguration()
Custom alias with prefix returns second node.Otherlocale.test2045LocalePathFunctionalTest->testPathLanguageConfiguration()
ExpandPaths on non-English monolingual sites (PathMonolingualTestCase) [Path]27101
MessageGroupFilenameLineFunctionStatus
Failed to set field languages[en][enabled] to Otherpath.test537PathMonolingualTestCase->setUp()
Found the Save configuration buttonOtherpath.test537PathMonolingualTestCase->setUp()
Found the requested form fields at admin/config/regional/languageOtherpath.test537PathMonolingualTestCase->setUp()
Site is mono-lingualOtherpath.test540PathMonolingualTestCase->setUp()
Failed to set field language_interface[enabled][locale-url] to 1Otherpath.test545PathMonolingualTestCase->setUp()
Found the Save settings buttonOtherpath.test545PathMonolingualTestCase->setUp()
Found the requested form fields at admin/config/regional/language/detectionOtherpath.test545PathMonolingualTestCase->setUp()
Undefined variable: url_targetNoticedrupal_web_test_case.php2579DrupalWebTestCase->clickLink()
Clicked link Languages () from http://drupaltestbot699-mysql/checkout/index.php/fr/admin/configBrowserpath.test562PathMonolingualTestCase->testPageLinks()
Clicked link results in a valid pageBrowserpath.test563PathMonolingualTestCase->testPageLinks()
Page contains the add language textOtherpath.test564PathMonolingualTestCase->testPageLinks()
ExpandRemove feed item functionality (RemoveFeedItemTestCase) [Unknown]2223660
MessageGroupFilenameLineFunctionStatus
Cannot use a scalar value as an arrayWarningblock.module281block_page_build()
Cannot use a scalar value as an arrayWarningblock.module281block_page_build()
Invalid argument supplied for foreach()Warningcommon.inc6456element_children()
Cannot use a scalar value as an arrayWarningcommon.inc5898drupal_render()
Cannot use a scalar value as an arrayWarningcommon.inc5951drupal_render()
HTTP response expected 403, actual 200Browseraggregator.test103AggregatorTestCase->updateFeedItems()
Total items in feed equal to the total items in database (2 != 0)Otheraggregator.test117AggregatorTestCase->updateFeedItems()
Value '0' is TRUE.Otheraggregator.test142AggregatorTestCase->updateAndRemove()
Cannot use a scalar value as an arrayWarningblock.module281block_page_build()
Cannot use a scalar value as an arrayWarningblock.module281block_page_build()
Invalid argument supplied for foreach()Warningcommon.inc6456element_children()
Cannot use a scalar value as an arrayWarningcommon.inc5898drupal_render()
Cannot use a scalar value as an arrayWarningcommon.inc5951drupal_render()
HTTP response expected 403, actual 200Browseraggregator.test103AggregatorTestCase->updateFeedItems()
Total items in feed equal to the total items in database (2 != 0)Otheraggregator.test117AggregatorTestCase->updateFeedItems()
Value '0' is TRUE.Otheraggregator.test142AggregatorTestCase->updateAndRemove()
Cannot use a scalar value as an arrayWarningblock.module281block_page_build()
Cannot use a scalar value as an arrayWarningblock.module281block_page_build()
Invalid argument supplied for foreach()Warningcommon.inc6456element_children()
Cannot use a scalar value as an arrayWarningcommon.inc5898drupal_render()
Cannot use a scalar value as an arrayWarningcommon.inc5951drupal_render()
HTTP response expected 403, actual 200Browseraggregator.test103AggregatorTestCase->updateFeedItems()
Total items in feed equal to the total items in database (2 != 0)Otheraggregator.test117AggregatorTestCase->updateFeedItems()
Value '0' is TRUE.Otheraggregator.test142AggregatorTestCase->updateAndRemove()
Cannot use a scalar value as an arrayWarningblock.module281block_page_build()
Cannot use a scalar value as an arrayWarningblock.module281block_page_build()
Invalid argument supplied for foreach()Warningcommon.inc6456element_children()
Cannot use a scalar value as an arrayWarningcommon.inc5898drupal_render()
Cannot use a scalar value as an arrayWarningcommon.inc5951drupal_render()
HTTP response expected 403, actual 200Browseraggregator.test103AggregatorTestCase->updateFeedItems()
Total items in feed equal to the total items in database (2 != 0)Otheraggregator.test117AggregatorTestCase->updateFeedItems()
Value '0' is TRUE.Otheraggregator.test142AggregatorTestCase->updateAndRemove()
Cannot use a scalar value as an arrayWarningblock.module281block_page_build()
Cannot use a scalar value as an arrayWarningblock.module281block_page_build()
Invalid argument supplied for foreach()Warningcommon.inc6456element_children()
Cannot use a scalar value as an arrayWarningcommon.inc5898drupal_render()
Cannot use a scalar value as an arrayWarningcommon.inc5951drupal_render()
HTTP response expected 403, actual 200Browseraggregator.test103AggregatorTestCase->updateFeedItems()
Total items in feed equal to the total items in database (2 != 0)Otheraggregator.test117AggregatorTestCase->updateFeedItems()
Value '0' is TRUE.Otheraggregator.test142AggregatorTestCase->updateAndRemove()
Cannot use a scalar value as an arrayWarningblock.module281block_page_build()
Cannot use a scalar value as an arrayWarningblock.module281block_page_build()
Invalid argument supplied for foreach()Warningcommon.inc6456element_children()
Cannot use a scalar value as an arrayWarningcommon.inc5898drupal_render()
Cannot use a scalar value as an arrayWarningcommon.inc5951drupal_render()
HTTP response expected 403, actual 200Browseraggregator.test103AggregatorTestCase->updateFeedItems()
Total items in feed equal to the total items in database (2 != 0)Otheraggregator.test117AggregatorTestCase->updateFeedItems()
Value '0' is TRUE.Otheraggregator.test142AggregatorTestCase->updateAndRemove()
Cannot use a scalar value as an arrayWarningblock.module281block_page_build()
Cannot use a scalar value as an arrayWarningblock.module281block_page_build()
Invalid argument supplied for foreach()Warningcommon.inc6456element_children()
Cannot use a scalar value as an arrayWarningcommon.inc5898drupal_render()
Cannot use a scalar value as an arrayWarningcommon.inc5951drupal_render()
HTTP response expected 403, actual 200Browseraggregator.test103AggregatorTestCase->updateFeedItems()
Total items in feed equal to the total items in database (2 != 0)Otheraggregator.test117AggregatorTestCase->updateFeedItems()
Value '0' is TRUE.Otheraggregator.test142AggregatorTestCase->updateAndRemove()
Cannot use a scalar value as an arrayWarningblock.module281block_page_build()
Cannot use a scalar value as an arrayWarningblock.module281block_page_build()
Invalid argument supplied for foreach()Warningcommon.inc6456element_children()
Cannot use a scalar value as an arrayWarningcommon.inc5898drupal_render()
Cannot use a scalar value as an arrayWarningcommon.inc5951drupal_render()
HTTP response expected 403, actual 200Browseraggregator.test103AggregatorTestCase->updateFeedItems()
Total items in feed equal to the total items in database (2 != 0)Otheraggregator.test117AggregatorTestCase->updateFeedItems()
Value '0' is TRUE.Otheraggregator.test142AggregatorTestCase->updateAndRemove()
Cannot use a scalar value as an arrayWarningblock.module281block_page_build()
Cannot use a scalar value as an arrayWarningblock.module281block_page_build()
Invalid argument supplied for foreach()Warningcommon.inc6456element_children()
Cannot use a scalar value as an arrayWarningcommon.inc5898drupal_render()
Cannot use a scalar value as an arrayWarningcommon.inc5951drupal_render()
HTTP response expected 403, actual 200Browseraggregator.test103AggregatorTestCase->updateFeedItems()
Total items in feed equal to the total items in database (2 != 0)Otheraggregator.test117AggregatorTestCase->updateFeedItems()
Value '0' is TRUE.Otheraggregator.test142AggregatorTestCase->updateAndRemove()
Cannot use a scalar value as an arrayWarningblock.module281block_page_build()
Cannot use a scalar value as an arrayWarningblock.module281block_page_build()
Invalid argument supplied for foreach()Warningcommon.inc6456element_children()
Cannot use a scalar value as an arrayWarningcommon.inc5898drupal_render()
Cannot use a scalar value as an arrayWarningcommon.inc5951drupal_render()
HTTP response expected 403, actual 200Browseraggregator.test103AggregatorTestCase->updateFeedItems()
Total items in feed equal to the total items in database (2 != 0)Otheraggregator.test117AggregatorTestCase->updateFeedItems()
Value '0' is TRUE.Otheraggregator.test142AggregatorTestCase->updateAndRemove()
Cannot use a scalar value as an arrayWarningblock.module281block_page_build()
Cannot use a scalar value as an arrayWarningblock.module281block_page_build()
Invalid argument supplied for foreach()Warningcommon.inc6456element_children()
Cannot use a scalar value as an arrayWarningcommon.inc5898drupal_render()
Cannot use a scalar value as an arrayWarningcommon.inc5951drupal_render()
HTTP response expected 403, actual 200Browseraggregator.test103AggregatorTestCase->updateFeedItems()
Total items in feed equal to the total items in database (2 != 0)Otheraggregator.test117AggregatorTestCase->updateFeedItems()
Value '0' is TRUE.Otheraggregator.test142AggregatorTestCase->updateAndRemove()
Cannot use a scalar value as an arrayWarningblock.module281block_page_build()
Cannot use a scalar value as an arrayWarningblock.module281block_page_build()
Invalid argument supplied for foreach()Warningcommon.inc6456element_children()
Cannot use a scalar value as an arrayWarningcommon.inc5898drupal_render()
Cannot use a scalar value as an arrayWarningcommon.inc5951drupal_render()
HTTP response expected 403, actual 200Browseraggregator.test103AggregatorTestCase->updateFeedItems()
Total items in feed equal to the total items in database (2 != 0)Otheraggregator.test117AggregatorTestCase->updateFeedItems()
Value '0' is TRUE.Otheraggregator.test142AggregatorTestCase->updateAndRemove()
ExpandSearch engine ranking (SearchRankingTestCase) [Search]9210
MessageGroupFilenameLineFunctionStatus
Search ranking "views" order.Othersearch.test466SearchRankingTestCase->testRankings()
ExpandSearch language selection (SearchLanguageTestCase) [Search]4450
MessageGroupFilenameLineFunctionStatus
Default language updated.Browsersearch.test1984SearchLanguageTestCase->testLanguages()
Failed to set field languages[en][enabled] to Othersearch.test1986SearchLanguageTestCase->testLanguages()
Found the Save configuration buttonOthersearch.test1986SearchLanguageTestCase->testLanguages()
Found the requested form fields at admin/config/regional/languageOthersearch.test1986SearchLanguageTestCase->testLanguages()
Language disabled.Browsersearch.test1987SearchLanguageTestCase->testLanguages()
ExpandSession https handling (SessionHttpsTestCase) [Session]12322
MessageGroupFilenameLineFunctionStatus
Undefined index: SESS70d42d05e6511615380c9441a1407b7bNoticesession.test403SessionHttpsTestCase->testHttpsSession()
Undefined index: SESS70d42d05e6511615380c9441a1407b7bNoticesession.test407SessionHttpsTestCase->testHttpsSession()
Session correctly returned the stored data set by the anonymous session.Othersession.test442SessionHttpsTestCase->testHttpsSession()
Session correctly returned the stored data set by the anonymous session.Othersession.test442SessionHttpsTestCase->testHttpsSession()
ExpandSession tests (SessionTestCase) [Session]22190
MessageGroupFilenameLineFunctionStatus
Session correctly returned the stored data for an anonymous user.Sessionsession.test111SessionTestCase->testDataPersistence()
Session data is not saved for drupal_save_session(FALSE).Sessionsession.test118SessionTestCase->testDataPersistence()
Session cookie was sent.Othersession.test152SessionTestCase->testEmptyAnonymousSession()
New session was started.Othersession.test153SessionTestCase->testEmptyAnonymousSession()
Session was not empty.Othersession.test159SessionTestCase->testEmptyAnonymousSession()
Caching was bypassed.Othersession.test160SessionTestCase->testEmptyAnonymousSession()
Message was displayed.Othersession.test161SessionTestCase->testEmptyAnonymousSession()
Session cookie was deleted.Othersession.test162SessionTestCase->testEmptyAnonymousSession()
Page was cached.Othersession.test169SessionTestCase->testEmptyAnonymousSession()
ExpandShortcut link functionality (ShortcutLinksTestCase) [Shortcut]17810
MessageGroupFilenameLineFunctionStatus
"Add to shortcuts" link properly switched to "Remove from shortcuts".Othershortcut.test164ShortcutLinksTestCase->testShortcutQuickLink()
ExpandSite maintenance mode functionality (SiteMaintenanceTestCase) [System]8010
MessageGroupFilenameLineFunctionStatus
Site maintenance mode message not displayed.Othersystem.test1137SiteMaintenanceTestCase->testSiteMaintenance()
ExpandStatistics logging tests (StatisticsLoggingTestCase) [Statistics]21149
MessageGroupFilenameLineFunctionStatus
Page request was logged.Otherstatistics.test109StatisticsLoggingTestCase->testLogging()
Undefined offset: 0Noticestatistics.test110StatisticsLoggingTestCase->testLogging()
array_intersect_key(): Argument #1 is not an arrayWarningstatistics.test110StatisticsLoggingTestCase->testLogging()
Value NULL is equal to value array ( 'title' => 'pdDzkOQXgo1vjv3TnM1q8Zn4tgEVkLUU1ipdXnLsFGcBWUof8tnoeMNON6tnk5ZEAbtPGGuE0zLQWyFBUkj3rJK8kwSikYAYOTPZETjg06JYvADMTQhxmkV3u2M1BFyy5DXtOp1SgvIj8ASK3AHrR5sKmFRaypjNnKhs2K4FcHO9nIWJwr8Cxcip46NkzNmCjJZsycPjwtQIxnMOwrssOfNUMxWGQo7p3hwvOM6syrXF8Scaknda8gvSucS6pyJ', 'path' => 'node/1', ).Otherstatistics.test110StatisticsLoggingTestCase->testLogging()
Value NULL is identical to value '1'.Otherstatistics.test112StatisticsLoggingTestCase->testLogging()
Testing a cached page.Otherstatistics.test116StatisticsLoggingTestCase->testLogging()
Page request was logged.Otherstatistics.test118StatisticsLoggingTestCase->testLogging()
Undefined offset: 1Noticestatistics.test119StatisticsLoggingTestCase->testLogging()
array_intersect_key(): Argument #1 is not an arrayWarningstatistics.test119StatisticsLoggingTestCase->testLogging()
Value NULL is equal to value array ( 'title' => 'pdDzkOQXgo1vjv3TnM1q8Zn4tgEVkLUU1ipdXnLsFGcBWUof8tnoeMNON6tnk5ZEAbtPGGuE0zLQWyFBUkj3rJK8kwSikYAYOTPZETjg06JYvADMTQhxmkV3u2M1BFyy5DXtOp1SgvIj8ASK3AHrR5sKmFRaypjNnKhs2K4FcHO9nIWJwr8Cxcip46NkzNmCjJZsycPjwtQIxnMOwrssOfNUMxWGQo7p3hwvOM6syrXF8Scaknda8gvSucS6pyJ', 'path' => 'node/1', ).Otherstatistics.test119StatisticsLoggingTestCase->testLogging()
Value NULL is identical to value '2'.Otherstatistics.test121StatisticsLoggingTestCase->testLogging()
Page request was logged.Otherstatistics.test128StatisticsLoggingTestCase->testLogging()
Undefined offset: 5Noticestatistics.test129StatisticsLoggingTestCase->testLogging()
array_intersect_key(): Argument #1 is not an arrayWarningstatistics.test129StatisticsLoggingTestCase->testLogging()
Value NULL is equal to value array ( 'title' => 'pdDzkOQXgo1vjv3TnM1q8Zn4tgEVkLUU1ipdXnLsFGcBWUof8tnoeMNON6tnk5ZEAbtPGGuE0zLQWyFBUkj3rJK8kwSikYAYOTPZETjg06JYvADMTQhxmkV3u2M1BFyy5DXtOp1SgvIj8ASK3AHrR5sKmFRaypjNnKhs2K4FcHO9nIWJwr8Cxcip46NkzNmCjJZsycPjwtQIxnMOwrssOfNUMxWGQo7p3hwvOM6syrXF8Scaknda8gvSucS6pyJ', 'path' => 'node/1', ).Otherstatistics.test129StatisticsLoggingTestCase->testLogging()
Value NULL is identical to value '3'.Otherstatistics.test131StatisticsLoggingTestCase->testLogging()
Page request was logged.Otherstatistics.test141StatisticsLoggingTestCase->testLogging()
Undefined offset: 6Noticestatistics.test142StatisticsLoggingTestCase->testLogging()
array_intersect_key(): Argument #1 is not an arrayWarningstatistics.test142StatisticsLoggingTestCase->testLogging()
Value NULL is equal to value array ( 'title' => 'Edit Basic page pdDzkOQXgo1vjv3TnM1q8Zn4tgEVkLUU1ipdXnLsFGcBWUof8tnoeMNON6tnk5ZEAbtPGGuE0zLQWyFBUkj3rJK8kwSikYAYOTPZETjg06JYvADMTQhxmkV3u2M1BFyy5DXtOp1SgvIj8ASK3AHrR5sKmFRaypjNnKhs2K4FcHO9nIWJwr8Cxcip46NkzNmCjJZsycPjwtQIxnMOwrssOfNUMxWGQo7p3hwvOM6syrXF8Sc', 'path' => 'node/1/edit', ).Otherstatistics.test142StatisticsLoggingTestCase->testLogging()
Page request was logged for a path over 255 characters.Otherstatistics.test150StatisticsLoggingTestCase->testLogging()
Undefined offset: 7Noticestatistics.test151StatisticsLoggingTestCase->testLogging()
Value NULL is equal to value 'fKjEsF7ng7mQBKYlk8OpHjRMj1Y0nZ5OGGS4NK7AnXnwajsgNG9tiZGAcKUSx6C4ziWiUbLpCAEysU3gKUiz3oanTSvFM68e6249699raVx5aV6KDtpRYU5oLHIxQq62MwYWZgCIFZSPX2aDC1WtgPtBQNf8OI3fWYwFHhq5qMH008ByGZEDkqgzVDRRCIDFcMXwAeTy7jANuGXjY0ptk6Zan5M9L1MhtcjhEGnp6qsYa5g0pO3kCenI5MJBMF9'.Otherstatistics.test151StatisticsLoggingTestCase->testLogging()
ExpandStatistics reports tests (StatisticsReportsTestCase) [Statistics]8570
MessageGroupFilenameLineFunctionStatus
Hit title found.Otherstatistics.test211StatisticsReportsTestCase->testAccessLogging()
Hit URL found.Otherstatistics.test212StatisticsReportsTestCase->testAccessLogging()
Found the popular content block.Otherstatistics.test237StatisticsReportsTestCase->testPopularContentBlock()
Found today's popular content.Otherstatistics.test238StatisticsReportsTestCase->testPopularContentBlock()
Found the alll time popular content.Otherstatistics.test239StatisticsReportsTestCase->testPopularContentBlock()
Found the last viewed popular content.Otherstatistics.test240StatisticsReportsTestCase->testPopularContentBlock()
Found link to visited node.Otherstatistics.test242StatisticsReportsTestCase->testPopularContentBlock()
ExpandStatistics token replacement (StatisticsTokenReplaceTestCase) [Statistics]2746
MessageGroupFilenameLineFunctionStatus
date_timezone_set() expects parameter 1 to be DateTime, boolean givenWarningcommon.inc1985format_date()
date_format() expects parameter 1 to be DateTime, boolean givenWarningcommon.inc1995format_date()
date_timezone_set() expects parameter 1 to be DateTime, boolean givenWarningcommon.inc1985format_date()
date_format() expects parameter 1 to be DateTime, boolean givenWarningcommon.inc1995format_date()
No empty tokens generated.Otherstatistics.test480StatisticsTokenReplaceTestCase->testStatisticsTokenReplacement()
Statistics token [node:total-count] replaced.Otherstatistics.test484StatisticsTokenReplaceTestCase->testStatisticsTokenReplacement()
Statistics token [node:day-count] replaced.Otherstatistics.test484StatisticsTokenReplaceTestCase->testStatisticsTokenReplacement()
date_timezone_set() expects parameter 1 to be DateTime, boolean givenWarningcommon.inc1985format_date()
date_format() expects parameter 1 to be DateTime, boolean givenWarningcommon.inc1995format_date()
Statistics token [node:last-view:short] replaced.Otherstatistics.test484StatisticsTokenReplaceTestCase->testStatisticsTokenReplacement()
ExpandTaxonomy term URL aliases (PathTaxonomyTermTestCase) [Path]3520
MessageGroupFilenameLineFunctionStatus
Term can be accessed on URL alias.Otherpath.test259PathTaxonomyTermTestCase->testTermAlias()
Term can be accessed on changed URL alias.Otherpath.test269PathTaxonomyTermTestCase->testTermAlias()
ExpandTaxonomy theme switching (TaxonomyThemeTestCase) [Taxonomy]1720
MessageGroupFilenameLineFunctionStatus
The administrative theme's CSS appears on the page for adding a taxonomy term.Othertaxonomy.test1888TaxonomyThemeTestCase->testTaxonomyTermThemes()
The administrative theme's CSS appears on the page for editing a taxonomy term.Othertaxonomy.test1897TaxonomyThemeTestCase->testTaxonomyTermThemes()
ExpandTest statistics admin. (StatisticsAdminTestCase) [Statistics]10660
MessageGroupFilenameLineFunctionStatus
Test node found.Otherstatistics.test344StatisticsAdminTestCase->testStatisticsSettings()
Node is viewed once.Otherstatistics.test349StatisticsAdminTestCase->testStatisticsSettings()
Node is viewed 2 times.Otherstatistics.test352StatisticsAdminTestCase->testStatisticsSettings()
Verifying that the node counter is incremented.Otherstatistics.test368StatisticsAdminTestCase->testDeleteNode()
Node is viewed once.Otherstatistics.test422StatisticsAdminTestCase->testExpiredLogs()
Hit URL found.Otherstatistics.test425StatisticsAdminTestCase->testExpiredLogs()
ExpandText translation (TextTranslationTestCase) [Field types]10420
MessageGroupFilenameLineFunctionStatus
The textfield widget is populated.Othertext.test471TextTranslationTestCase->testTextField()
The body field with delta 1 is shown.Othertext.test519TextTranslationTestCase->testTextFieldFormatted()
ExpandTheme API (ThemeUnitTest) [Theme]3740
MessageGroupFilenameLineFunctionStatus
Theme hook suggestion ran with data available from a preprocess function for the base hook.Othertheme.test64ThemeUnitTest->testPreprocessForSuggestions()
Theme hook suggestion ran with data available from a preprocess function for the base hook.Othertheme.test64ThemeUnitTest->testPreprocessForSuggestions()
The theme was able to implement an alter hook during page building before anything was rendered.Othertheme.test88ThemeUnitTest->testAlter()
The theme's .info file is able to override a module CSS file from being added to the page.Othertheme.test105ThemeUnitTest->testCSSOverride()
ExpandTheme fast initialization (ThemeFastTestCase) [Theme]1010
MessageGroupFilenameLineFunctionStatus
The registry was not initializedOthertheme.test529ThemeFastTestCase->testUserAutocomplete()
ExpandTheme initialization in hook_init() (ThemeHookInitUnitTest) [Theme]221
MessageGroupFilenameLineFunctionStatus
Undefined index: theme_test_outputNoticetheme_test.module101theme_test_hook_init_page_callback()
Raw "Themed output generated in hook_init()" foundOthertheme.test499ThemeHookInitUnitTest->testThemeInitializationHookInit()
Raw "stark/css/layout.css" foundOthertheme.test502ThemeHookInitUnitTest->testThemeInitializationHookInit()
ExpandTheme interface functionality (SystemThemeFunctionalTest) [System]18740
MessageGroupFilenameLineFunctionStatus
Administration theme used on an administration page.Othersystem.test1835SystemThemeFunctionalTest->testAdministrationTheme()
Administration theme used on the add content page.Othersystem.test1841SystemThemeFunctionalTest->testAdministrationTheme()
Administration theme used on the edit content page.Othersystem.test1844SystemThemeFunctionalTest->testAdministrationTheme()
Administration theme used on an administration page.Othersystem.test1853SystemThemeFunctionalTest->testAdministrationTheme()
ExpandTranslation functionality (TranslationTestCase) [Translation]54320
MessageGroupFilenameLineFunctionStatus
[Spanish] Language switch item found for English language in the node page area.Othertranslation.test166TranslationTestCase->testLanguageSwitchLinks()
[Spanish] Language switch item found for English language in the block-locale page area.Othertranslation.test166TranslationTestCase->testLanguageSwitchLinks()
ExpandUI language negotiation (LocaleUILanguageNegotiationTest) [Locale]105212
MessageGroupFilenameLineFunctionStatus
URL (PATH) > DEFAULT: with language prefix, UI language is switched based on path prefixOtherlocale.test2482LocaleUILanguageNegotiationTest->runTest()
"Language negotiation method: locale-url" foundOtherlocale.test2483LocaleUILanguageNegotiationTest->runTest()
URL (PATH) > BROWSER: with langage prefix, UI language is based on path prefixOtherlocale.test2482LocaleUILanguageNegotiationTest->runTest()
"Language negotiation method: locale-url" foundOtherlocale.test2483LocaleUILanguageNegotiationTest->runTest()
Failed to set field language_interface[enabled][locale-browser] to 1Otherlocale.test2510LocaleUILanguageNegotiationTest->testUrlLanguageFallback()
Failed to set field language_interface[enabled][locale-url] to 1Otherlocale.test2510LocaleUILanguageNegotiationTest->testUrlLanguageFallback()
Failed to set field language_interface[weight][locale-browser] to -8Otherlocale.test2510LocaleUILanguageNegotiationTest->testUrlLanguageFallback()
Failed to set field language_interface[weight][locale-url] to -10Otherlocale.test2510LocaleUILanguageNegotiationTest->testUrlLanguageFallback()
Found the Save settings buttonOtherlocale.test2510LocaleUILanguageNegotiationTest->testUrlLanguageFallback()
Found the requested form fields at admin/config/regional/language/detectionOtherlocale.test2510LocaleUILanguageNegotiationTest->testUrlLanguageFallback()
Failed to set field blocks[locale_language_interface][region] to sidebar_firstOtherlocale.test2515LocaleUILanguageNegotiationTest->testUrlLanguageFallback()
Found the Save blocks buttonOtherlocale.test2515LocaleUILanguageNegotiationTest->testUrlLanguageFallback()
Found the requested form fields at admin/structure/blockOtherlocale.test2515LocaleUILanguageNegotiationTest->testUrlLanguageFallback()
Undefined offset: 0Noticelocale.test2527LocaleUILanguageNegotiationTest->testUrlLanguageFallback()
The browser language is the URL active languageOtherlocale.test2527LocaleUILanguageNegotiationTest->testUrlLanguageFallback()
Undefined offset: 0Noticelocale.test2531LocaleUILanguageNegotiationTest->testUrlLanguageFallback()
URLs are rewritten using the browser language.Otherlocale.test2531LocaleUILanguageNegotiationTest->testUrlLanguageFallback()
The url() function returns the right url (http://it.example.com/index.php/admin) in accordance with the chosen languageOtherlocale.test2570LocaleUILanguageNegotiationTest->testLanguageDomain()
The url() function returns the right https url (via options) (https://it.example.com/index.php/admin) in accordance with the chosen languageOtherlocale.test2576LocaleUILanguageNegotiationTest->testLanguageDomain()
The url() function returns the right url (via current url scheme) (https://it.example.com/index.php/admin) in accordance with the chosen languageOtherlocale.test2584LocaleUILanguageNegotiationTest->testLanguageDomain()
The url() function returns the right url (http://it.example.com/index.php/admin) in accordance with the chosen languageOtherlocale.test2570LocaleUILanguageNegotiationTest->testLanguageDomain()
The url() function returns the right https url (via options) (https://it.example.com/index.php/admin) in accordance with the chosen languageOtherlocale.test2576LocaleUILanguageNegotiationTest->testLanguageDomain()
The url() function returns the right url (via current url scheme) (https://it.example.com/index.php/admin) in accordance with the chosen languageOtherlocale.test2584LocaleUILanguageNegotiationTest->testLanguageDomain()
ExpandUpdate contrib functionality (UpdateTestContribCase) [Update]164240
MessageGroupFilenameLineFunctionStatus
Raw "<a href="http://example.com/project/drupal">Drupal</a>" foundOtherupdate.test275UpdateTestContribCase->testNoReleasesAvailable()
"Up to date" foundOtherupdate.test276UpdateTestContribCase->testNoReleasesAvailable()
"No available releases found" foundOtherupdate.test279UpdateTestContribCase->testNoReleasesAvailable()
Link to the Drupal project appears.Otherupdate.test49UpdateTestHelper->standardTests()
"Up to date" foundOtherupdate.test305UpdateTestContribCase->testUpdateContribBasic()
Link to aaa_update_test project appears.Otherupdate.test308UpdateTestContribCase->testUpdateContribBasic()
Link to the Drupal project appears.Otherupdate.test49UpdateTestHelper->standardTests()
"Up to date" foundOtherupdate.test360UpdateTestContribCase->testUpdateContribOrder()
Link to bbb_update_test project appears.Otherupdate.test371UpdateTestContribCase->testUpdateContribOrder()
Link to bbb_update_test project appears.Otherupdate.test372UpdateTestContribCase->testUpdateContribOrder()
'BBB Update test' project is listed before the 'CCC Update test' projectOtherupdate.test380UpdateTestContribCase->testUpdateContribOrder()
"Security update required!" foundOtherupdate.test420UpdateTestContribCase->testUpdateBaseThemeSecurityUpdate()
Link to the Update test base theme project appears.Otherupdate.test421UpdateTestContribCase->testUpdateBaseThemeSecurityUpdate()
Link to the Update test base theme project appears.Otherupdate.test474UpdateTestContribCase->testUpdateShowDisabledThemes()
Link to the Update test subtheme project appears.Otherupdate.test475UpdateTestContribCase->testUpdateShowDisabledThemes()
"Up to date" foundOtherupdate.test519UpdateTestContribCase->testUpdateBrokenFetchURL()
"Up to date" found more than onceOtherupdate.test522UpdateTestContribCase->testUpdateBrokenFetchURL()
"Checked available update data for 3 projects." found only onceOtherupdate.test532UpdateTestContribCase->testUpdateBrokenFetchURL()
"Failed to get available update data for one project." found only onceOtherupdate.test533UpdateTestContribCase->testUpdateBrokenFetchURL()
Link to aaa_update_test project appears.Otherupdate.test536UpdateTestContribCase->testUpdateBrokenFetchURL()
Link to bbb_update_test project appears.Otherupdate.test538UpdateTestContribCase->testUpdateBrokenFetchURL()
Link to aaa_update_test project appears.Otherupdate.test581UpdateTestContribCase->testHookUpdateStatusAlter()
Link to aaa_update_test project appears.Otherupdate.test589UpdateTestContribCase->testHookUpdateStatusAlter()
"Security update" foundOtherupdate.test594UpdateTestContribCase->testHookUpdateStatusAlter()
ExpandUpdate core functionality (UpdateCoreTestCase) [Update]181190
MessageGroupFilenameLineFunctionStatus
Link to the Drupal project appears.Otherupdate.test49UpdateTestHelper->standardTests()
"Up to date" foundOtherupdate.test78UpdateCoreTestCase->testNoUpdatesAvailable()
Link to the Drupal project appears.Otherupdate.test49UpdateTestHelper->standardTests()
"Update available" foundOtherupdate.test91UpdateCoreTestCase->testNormalUpdateAvailable()
Link to release appears.Otherupdate.test93UpdateCoreTestCase->testNormalUpdateAvailable()
Link to download appears.Otherupdate.test94UpdateCoreTestCase->testNormalUpdateAvailable()
Link to release notes appears.Otherupdate.test95UpdateCoreTestCase->testNormalUpdateAvailable()
Link to the Drupal project appears.Otherupdate.test49UpdateTestHelper->standardTests()
"Security update required!" foundOtherupdate.test107UpdateCoreTestCase->testSecurityUpdateAvailable()
Link to release appears.Otherupdate.test108UpdateCoreTestCase->testSecurityUpdateAvailable()
Link to download appears.Otherupdate.test109UpdateCoreTestCase->testSecurityUpdateAvailable()
Link to release notes appears.Otherupdate.test110UpdateCoreTestCase->testSecurityUpdateAvailable()
"Up to date" foundOtherupdate.test131UpdateCoreTestCase->testDatestampMismatch()
"Checked available update data for one project." foundOtherupdate.test160UpdateCoreTestCase->testModulePageUpToDate()
"Checked available update data for one project." foundOtherupdate.test177UpdateCoreTestCase->testModulePageRegularUpdate()
"There are updates available for your version of Drupal." foundOtherupdate.test179UpdateCoreTestCase->testModulePageRegularUpdate()
"Checked available update data for one project." foundOtherupdate.test194UpdateCoreTestCase->testModulePageSecurityUpdate()
"There is a security update available for your version of Drupal." foundOtherupdate.test197UpdateCoreTestCase->testModulePageSecurityUpdate()
"There is a security update available for your version of Drupal." foundOtherupdate.test202UpdateCoreTestCase->testModulePageSecurityUpdate()
ExpandUpdate feed item functionality (UpdateFeedItemTestCase) [Unknown]6225
MessageGroupFilenameLineFunctionStatus
Cannot use a scalar value as an arrayWarningblock.module281block_page_build()
Cannot use a scalar value as an arrayWarningblock.module281block_page_build()
Invalid argument supplied for foreach()Warningcommon.inc6456element_children()
Cannot use a scalar value as an arrayWarningcommon.inc5898drupal_render()
Cannot use a scalar value as an arrayWarningcommon.inc5951drupal_render()
HTTP response expected 403, actual 200Browseraggregator.test103AggregatorTestCase->updateFeedItems()
Total items in feed equal to the total items in database (5 != 0)Otheraggregator.test117AggregatorTestCase->updateFeedItems()
ExpandUpdate on cron functionality (AggregatorCronTestCase) [Unknown]5230
MessageGroupFilenameLineFunctionStatus
Expected number of items in database.Otheraggregator.test805AggregatorCronTestCase->testCron()
Expected number of items in database.Otheraggregator.test809AggregatorCronTestCase->testCron()
Expected number of items in database.Otheraggregator.test828AggregatorCronTestCase->testCron()
ExpandURL altering (UrlAlterFunctionalTest) [Path API]2690
MessageGroupFilenameLineFunctionStatus
Altered outbound URL user/2, expected user/hnMY4F45, and got ex.php/user/hnMY4F45.Otherpath.test157UrlAlterFunctionalTest->testUrlAlter()
Altered outbound URL user/2/test1, expected alias/test1, and got ex.php/alias/test1.Otherpath.test163UrlAlterFunctionalTest->testUrlAlter()
Altered outbound URL user/2/edit, expected alias/test2, and got ex.php/alias/test2.Otherpath.test172UrlAlterFunctionalTest->testUrlAlter()
Altered outbound URL user/3, expected user/3, and got ex.php/user/3.Otherpath.test177UrlAlterFunctionalTest->testUrlAlter()
Altered outbound URL forum, expected community, and got ex.php/community.Otherpath.test182UrlAlterFunctionalTest->testUrlAlter()
Altered outbound URL forum/2, expected community/2, and got ex.php/community/2.Otherpath.test191UrlAlterFunctionalTest->testUrlAlter()
request_path() returns the requested path.Otherpath.test199UrlAlterFunctionalTest->testCurrentUrlRequestedPath()
current_path() returns the internal path.Otherpath.test200UrlAlterFunctionalTest->testCurrentUrlRequestedPath()
$_GET['q'] is initialized with an empty request path.Otherpath.test208UrlAlterFunctionalTest->testGetQInitialized()
ExpandURL generation tests (CommonURLUnitTestCase) [Common]40160
MessageGroupFilenameLineFunctionStatus
/checkout/?q=node/123 == /checkout/index.php/node/123Othercommon.test260CommonURLUnitTestCase->testUrl()
/checkout/?q=node/123#foo == /checkout/index.php/node/123#fooOthercommon.test264CommonURLUnitTestCase->testUrl()
/checkout/?q=node/123&foo == /checkout/index.php/node/123?fooOthercommon.test268CommonURLUnitTestCase->testUrl()
/checkout/?q=node/123&foo=bar&bar=baz == /checkout/index.php/node/123?foo=bar&bar=bazOthercommon.test272CommonURLUnitTestCase->testUrl()
/checkout/?q=node/123&foo#bar == /checkout/index.php/node/123?foo#barOthercommon.test276CommonURLUnitTestCase->testUrl()
/checkout/?q=node/123&foo#0 == /checkout/index.php/node/123?foo#0Othercommon.test280CommonURLUnitTestCase->testUrl()
/checkout/?q=node/123&foo == /checkout/index.php/node/123?fooOthercommon.test284CommonURLUnitTestCase->testUrl()
/checkout/ == /checkout/index.php/Othercommon.test288CommonURLUnitTestCase->testUrl()
http://drupaltestbot699-mysql/checkout/?q=node/123 == http://drupaltestbot699-mysql/checkout/index.php/node/123Othercommon.test260CommonURLUnitTestCase->testUrl()
http://drupaltestbot699-mysql/checkout/?q=node/123#foo == http://drupaltestbot699-mysql/checkout/index.php/node/123#fooOthercommon.test264CommonURLUnitTestCase->testUrl()
http://drupaltestbot699-mysql/checkout/?q=node/123&foo == http://drupaltestbot699-mysql/checkout/index.php/node/123?fooOthercommon.test268CommonURLUnitTestCase->testUrl()
http://drupaltestbot699-mysql/checkout/?q=node/123&foo=bar&bar=baz == http://drupaltestbot699-mysql/checkout/index.php/node/123?foo=bar&bar=bazOthercommon.test272CommonURLUnitTestCase->testUrl()
http://drupaltestbot699-mysql/checkout/?q=node/123&foo#bar == http://drupaltestbot699-mysql/checkout/index.php/node/123?foo#barOthercommon.test276CommonURLUnitTestCase->testUrl()
http://drupaltestbot699-mysql/checkout/?q=node/123&foo#0 == http://drupaltestbot699-mysql/checkout/index.php/node/123?foo#0Othercommon.test280CommonURLUnitTestCase->testUrl()
http://drupaltestbot699-mysql/checkout/?q=node/123&foo == http://drupaltestbot699-mysql/checkout/index.php/node/123?fooOthercommon.test284CommonURLUnitTestCase->testUrl()
http://drupaltestbot699-mysql/checkout/ == http://drupaltestbot699-mysql/checkout/index.php/Othercommon.test288CommonURLUnitTestCase->testUrl()
ExpandUser creation (LocaleUserCreationTest) [Locale]874716
MessageGroupFilenameLineFunctionStatus
Global language set in the language selector.Browserlocale.test1852LocaleUserCreationTest->testLocalUserCreation()
Failed to set field name to qGrEe9uoWGOtherlocale.test1864LocaleUserCreationTest->testLocalUserCreation()
Failed to set field mail to l7Es@example.comOtherlocale.test1864LocaleUserCreationTest->testLocalUserCreation()
Failed to set field pass[pass1] to qGrEe9uoWGOtherlocale.test1864LocaleUserCreationTest->testLocalUserCreation()
Failed to set field pass[pass2] to qGrEe9uoWGOtherlocale.test1864LocaleUserCreationTest->testLocalUserCreation()
Found the Create new account buttonOtherlocale.test1864LocaleUserCreationTest->testLocalUserCreation()
Found the requested form fields at fr/admin/people/createOtherlocale.test1864LocaleUserCreationTest->testLocalUserCreation()
Trying to get property of non-objectNoticelocale.test1867LocaleUserCreationTest->testLocalUserCreation()
New user has correct preferred language set.Otherlocale.test1867LocaleUserCreationTest->testLocalUserCreation()
Trying to get property of non-objectNoticelocale.test1868LocaleUserCreationTest->testLocalUserCreation()
New user has correct profile language set.Otherlocale.test1868LocaleUserCreationTest->testLocalUserCreation()
Failed to set field name to ejCxLDhEOlOtherlocale.test1882LocaleUserCreationTest->testLocalUserCreation()
Failed to set field mail to tzRW@example.comOtherlocale.test1882LocaleUserCreationTest->testLocalUserCreation()
Found the Create new account buttonOtherlocale.test1882LocaleUserCreationTest->testLocalUserCreation()
Found the requested form fields at fr/user/registerOtherlocale.test1882LocaleUserCreationTest->testLocalUserCreation()
Trying to get property of non-objectNoticelocale.test1885LocaleUserCreationTest->testLocalUserCreation()
New user has correct preferred language set.Otherlocale.test1885LocaleUserCreationTest->testLocalUserCreation()
Trying to get property of non-objectNoticelocale.test1886LocaleUserCreationTest->testLocalUserCreation()
New user has correct profile language set.Otherlocale.test1886LocaleUserCreationTest->testLocalUserCreation()
Trying to get property of non-objectNoticelocale.test1890LocaleUserCreationTest->testLocalUserCreation()
Language selector is accessible and correct language is selected.Browserlocale.test1894LocaleUserCreationTest->testLocalUserCreation()
Creating default object from empty valueRun-time noticelocale.test1897LocaleUserCreationTest->testLocalUserCreation()
Failed to set field pass[pass1] to a1zws3RbNyOtherlocale.test1903LocaleUserCreationTest->testLocalUserCreation()
Failed to set field pass[pass2] to a1zws3RbNyOtherlocale.test1903LocaleUserCreationTest->testLocalUserCreation()
Found the Save buttonOtherlocale.test1903LocaleUserCreationTest->testLocalUserCreation()
Found the requested form fields at fr/user//editOtherlocale.test1903LocaleUserCreationTest->testLocalUserCreation()
Undefined property: stdClass::$nameNoticedrupal_web_test_case.php1239DrupalWebTestCase->drupalLogin()
Failed to set field name to Otherlocale.test1905LocaleUserCreationTest->testLocalUserCreation()
Found the requested form fields at userOtherlocale.test1905LocaleUserCreationTest->testLocalUserCreation()
Undefined property: stdClass::$nameNoticedrupal_web_test_case.php1246DrupalWebTestCase->drupalLogin()
User successfully logged in.User loginlocale.test1905LocaleUserCreationTest->testLocalUserCreation()
Language selector is accessible and correct language is selected.Browserlocale.test1907LocaleUserCreationTest->testLocalUserCreation()
Failed to set field name to qGrEe9uoWGOtherlocale.test1864LocaleUserCreationTest->testLocalUserCreation()
Failed to set field mail to l7Es@example.comOtherlocale.test1864LocaleUserCreationTest->testLocalUserCreation()
Failed to set field pass[pass1] to qGrEe9uoWGOtherlocale.test1864LocaleUserCreationTest->testLocalUserCreation()
Failed to set field pass[pass2] to qGrEe9uoWGOtherlocale.test1864LocaleUserCreationTest->testLocalUserCreation()
Found the Create new account buttonOtherlocale.test1864LocaleUserCreationTest->testLocalUserCreation()
Found the requested form fields at fr/admin/people/createOtherlocale.test1864LocaleUserCreationTest->testLocalUserCreation()
Trying to get property of non-objectNoticelocale.test1867LocaleUserCreationTest->testLocalUserCreation()
New user has correct preferred language set.Otherlocale.test1867LocaleUserCreationTest->testLocalUserCreation()
Trying to get property of non-objectNoticelocale.test1868LocaleUserCreationTest->testLocalUserCreation()
New user has correct profile language set.Otherlocale.test1868LocaleUserCreationTest->testLocalUserCreation()
Failed to set field name to ejCxLDhEOlOtherlocale.test1882LocaleUserCreationTest->testLocalUserCreation()
Failed to set field mail to tzRW@example.comOtherlocale.test1882LocaleUserCreationTest->testLocalUserCreation()
Found the Create new account buttonOtherlocale.test1882LocaleUserCreationTest->testLocalUserCreation()
Found the requested form fields at fr/user/registerOtherlocale.test1882LocaleUserCreationTest->testLocalUserCreation()
Trying to get property of non-objectNoticelocale.test1885LocaleUserCreationTest->testLocalUserCreation()
New user has correct preferred language set.Otherlocale.test1885LocaleUserCreationTest->testLocalUserCreation()
Trying to get property of non-objectNoticelocale.test1886LocaleUserCreationTest->testLocalUserCreation()
New user has correct profile language set.Otherlocale.test1886LocaleUserCreationTest->testLocalUserCreation()
Trying to get property of non-objectNoticelocale.test1890LocaleUserCreationTest->testLocalUserCreation()
Language selector is accessible and correct language is selected.Browserlocale.test1894LocaleUserCreationTest->testLocalUserCreation()
Creating default object from empty valueRun-time noticelocale.test1897LocaleUserCreationTest->testLocalUserCreation()
Failed to set field pass[pass1] to a1zws3RbNyOtherlocale.test1903LocaleUserCreationTest->testLocalUserCreation()
Failed to set field pass[pass2] to a1zws3RbNyOtherlocale.test1903LocaleUserCreationTest->testLocalUserCreation()
Found the Save buttonOtherlocale.test1903LocaleUserCreationTest->testLocalUserCreation()
Found the requested form fields at fr/user//editOtherlocale.test1903LocaleUserCreationTest->testLocalUserCreation()
Undefined property: stdClass::$nameNoticedrupal_web_test_case.php1239DrupalWebTestCase->drupalLogin()
Failed to set field name to Otherlocale.test1905LocaleUserCreationTest->testLocalUserCreation()
Found the requested form fields at userOtherlocale.test1905LocaleUserCreationTest->testLocalUserCreation()
Undefined property: stdClass::$nameNoticedrupal_web_test_case.php1246DrupalWebTestCase->drupalLogin()
User successfully logged in.User loginlocale.test1905LocaleUserCreationTest->testLocalUserCreation()
Language selector is accessible and correct language is selected.Browserlocale.test1907LocaleUserCreationTest->testLocalUserCreation()
ExpandUser poll vote capability. (PollVoteCheckHostname) [Poll]14410
MessageGroupFilenameLineFunctionStatus
Page was cached.Otherpoll.test547PollVoteCheckHostname->testHostnamePollVote()
ExpandXML-RPC basic (XMLRPCBasicTestCase) [XML-RPC]421
MessageGroupFilenameLineFunctionStatus
Invalid argument supplied for foreach()Warningxmlrpc.test35XMLRPCBasicTestCase->testListMethods()
system.listMethods returned at least the minimum listingOtherxmlrpc.test41XMLRPCBasicTestCase->testListMethods()
system.methodSignature returns an array of signature arrays.Otherxmlrpc.test51XMLRPCBasicTestCase->testMethodSignature()
ExpandXML-RPC message and alteration (XMLRPCMessagesTestCase) [XML-RPC]252
MessageGroupFilenameLineFunctionStatus
XML-RPC messages.messageSizedInKB of 8 Kb size receivedOtherxmlrpc.test220XMLRPCMessagesTestCase->testSizedMessages()
XML-RPC messages.messageSizedInKB of 80 Kb size receivedOtherxmlrpc.test220XMLRPCMessagesTestCase->testSizedMessages()
XML-RPC messages.messageSizedInKB of 160 Kb size receivedOtherxmlrpc.test220XMLRPCMessagesTestCase->testSizedMessages()
array_diff(): Argument #1 is not an arrayWarningxmlrpc.test238XMLRPCMessagesTestCase->testAlterListMethods()
Method list is altered by hook_xmlrpc_alterOtherxmlrpc.test239XMLRPCMessagesTestCase->testAlterListMethods()
reset() expects parameter 1 to be array, null givenWarningxmlrpc.test240XMLRPCMessagesTestCase->testAlterListMethods()
Hiding builting system.methodSignature with hook_xmlrpc_alter worksOtherxmlrpc.test241XMLRPCMessagesTestCase->testAlterListMethods()
ExpandXML-RPC validator (XMLRPCValidator1IncTestCase) [XML-RPC]190
MessageGroupFilenameLineFunctionStatus
Value 15 is identical to value false.Otherxmlrpc.test114XMLRPCValidator1IncTestCase->testValidator1()
Value array ( 'ctLeftAngleBrackets' => 4, 'ctRightAngleBrackets' => 10, 'ctAmpersands' => 9, 'ctApostrophes' => 2, 'ctQuotes' => 6, ) is identical to value false.Otherxmlrpc.test119XMLRPCValidator1IncTestCase->testValidator1()
Value -69 is identical to value false.Otherxmlrpc.test124XMLRPCValidator1IncTestCase->testValidator1()
Value array ( 'sub1' => array ( 'bar' => 13, ), 'sub2' => 14, 'sub3' => array ( 'foo' => 1, 'baz' => 2, ), 'sub4' => array ( 'ss' => array ( 'sss' => array ( 'ssss' => 'sssss', ), ), ), ) is identical to value false.Otherxmlrpc.test132XMLRPCValidator1IncTestCase->testValidator1()
Value array ( 0 => -96, 1 => true, 2 => 'd5FfFCMd', 3 => -2.09, 4 => stdClass::__set_state(array( 'is_date' => true, 'year' => '2012', 'month' => '04', 'day' => '06', 'hour' => '22', 'minute' => '01', 'second' => '58', 'iso8601' => '20120406T22:01:58', )), 5 => 'zOpiADao7wfYEkes3qv9aGqXOpvMw5XT870xzZh0fwaysRf2ddlyiJgJNP7ECuc4IIW4boe4217IZhwTESEGsgA3ZGVCKV0337KT', ) is equal to value false.Otherxmlrpc.test145XMLRPCValidator1IncTestCase->testValidator1()
Value 'liUgu4Csl5y8Wv3BO3KE' is identical to value false.Otherxmlrpc.test155XMLRPCValidator1IncTestCase->testValidator1()
Value -60 is identical to value false.Otherxmlrpc.test172XMLRPCValidator1IncTestCase->testValidator1()
Value array ( 'times10' => -790, 'times100' => -7900, 'times1000' => -79000, ) is identical to value false.Otherxmlrpc.test178XMLRPCValidator1IncTestCase->testValidator1()
Value array ( 0 => 15, 1 => array ( 'ctLeftAngleBrackets' => 4, 'ctRightAngleBrackets' => 10, 'ctAmpersands' => 9, 'ctApostrophes' => 2, 'ctQuotes' => 6, ), 2 => -69, 3 => array ( 'sub1' => array ( 'bar' => 13, ), 'sub2' => 14, 'sub3' => array ( 'foo' => 1, 'baz' => 2, ), 'sub4' => array ( 'ss' => array ( 'sss' => array ( 'ssss' => 'sssss', ), ), ), ), 4 => array ( 0 => -96, 1 => true, 2 => 'd5FfFCMd', 3 => -2.09, 4 => stdClass::__set_state(array( 'is_date' => true, 'year' => '2012', 'month' => '04', 'day' => '06', 'hour' => '22', 'minute' => '01', 'second' => '58', 'iso8601' => '20120406T22:01:58', )), 5 => 'zOpiADao7wfYEkes3qv9aGqXOpvMw5XT870xzZh0fwaysRf2ddlyiJgJNP7ECuc4IIW4boe4217IZhwTESEGsgA3ZGVCKV0337KT', ), 5 => 'liUgu4Csl5y8Wv3BO3KE', 6 => -60, 7 => array ( 'times10' => -790, 'times100' => -7900, 'times1000' => -79000, ), ) is equal to value false.Otherxmlrpc.test193XMLRPCValidator1IncTestCase->testValidator1()

All

Test namePassFailException
Leaf403 functionality (AccessDeniedTestCase) [System]7100
Leaf404 functionality (PageNotFoundTestCase) [System]1800
LeafActionLoopTestCase2300
LeafActionsConfigurationTestCase3800
ExpandActive trail (MenuTrailTestCase) [Menu]601010
MessageGroupFilenameLineFunctionStatus
The initial active trail for a 403 page contains the expected number of items (expected: 2, found: 1).Othermenu.test1688MenuTrailTestCase->testCustom403And404Pages()
Undefined offset: 1Noticemenu.test1690MenuTrailTestCase->testCustom403And404Pages()
Undefined offset: 1Noticemenu.test1694MenuTrailTestCase->testCustom403And404Pages()
Element number 2 of the initial active trail for a 403 page contains the correct path (expected: admin/config, found: )Othermenu.test1695MenuTrailTestCase->testCustom403And404Pages()
The final active trail for a 403 page contains the expected number of items (expected: 3, found: 1).Othermenu.test1705MenuTrailTestCase->testCustom403And404Pages()
Undefined offset: 1Noticemenu.test1707MenuTrailTestCase->testCustom403And404Pages()
Undefined offset: 1Noticemenu.test1711MenuTrailTestCase->testCustom403And404Pages()
Element number 2 of the final active trail for a 403 page contains the correct path (expected: menu-test, found: )Othermenu.test1712MenuTrailTestCase->testCustom403And404Pages()
Undefined offset: 2Noticemenu.test1707MenuTrailTestCase->testCustom403And404Pages()
Undefined offset: 2Noticemenu.test1711MenuTrailTestCase->testCustom403And404Pages()
Element number 3 of the final active trail for a 403 page contains the correct path (expected: menu-test/custom-403-page, found: )Othermenu.test1712MenuTrailTestCase->testCustom403And404Pages()
Breadcrumb Home » Menu test root found on http://drupaltestbot699-mysql/checkout/index.php/admin/config.Othermenu.test1720MenuTrailTestCase->testCustom403And404Pages()
The final active trail for a 404 page contains the expected number of items (expected: 3, found: 1).Othermenu.test1705MenuTrailTestCase->testCustom403And404Pages()
Undefined offset: 1Noticemenu.test1707MenuTrailTestCase->testCustom403And404Pages()
Undefined offset: 1Noticemenu.test1711MenuTrailTestCase->testCustom403And404Pages()
Element number 2 of the final active trail for a 404 page contains the correct path (expected: menu-test, found: )Othermenu.test1712MenuTrailTestCase->testCustom403And404Pages()
Undefined offset: 2Noticemenu.test1707MenuTrailTestCase->testCustom403And404Pages()
Undefined offset: 2Noticemenu.test1711MenuTrailTestCase->testCustom403And404Pages()
Element number 3 of the final active trail for a 404 page contains the correct path (expected: menu-test/custom-404-page, found: )Othermenu.test1712MenuTrailTestCase->testCustom403And404Pages()
Breadcrumb Home » Menu test root found on http://drupaltestbot699-mysql/checkout/index.php/b8yP5wZK.Othermenu.test1720MenuTrailTestCase->testCustom403And404Pages()
LeafAddFeedTestCase7100
LeafAdmin theme block admin accessibility (BlockAdminThemeTestCase) [Block]1900
LeafAdministrative pages (SystemAdminTestCase) [System]18700
LeafAdvanced search form (SearchAdvancedSearchForm) [Search]3400
LeafAggregator configuration (AggregatorConfigurationTestCase) [Unknown]2000
LeafAJAX command form values (AJAXFormValuesTestCase) [AJAX]2900
LeafAJAX commands (AJAXCommandsTestCase) [AJAX]6900
LeafAJAX framework (AJAXFrameworkTestCase) [AJAX]3400
LeafAJAX multi form (AJAXMultiFormTestCase) [AJAX]3600
LeafAlter hook functionality (CommonDrupalAlterTestCase) [Common]700
LeafAnonymous comments (CommentAnonymous) [Comment]16600
LeafAuthmap assignment (UserAuthmapAssignmentTestCase) [User]600
LeafAuthorize API (SystemAuthorizeCase) [System]1600
LeafAutocomplete tags (CommonAutocompleteTagsTestCase) [Common]800
LeafBare upgrade test (BareUpgradePathTestCase) [Upgrade path]2400
LeafBasic SQL syntax tests (DatabaseBasicSyntaxTestCase) [Database]3000
LeafBatch percentages (BatchPercentagesUnitTestCase) [Batch API]1800
LeafBatch processing (BatchProcessingTestCase) [Batch API]16100
ExpandBatch progress page (BatchPageTestCase) [Batch API]1510
MessageGroupFilenameLineFunctionStatus
A progressive batch correctly uses the theme of the page that started the batch.Otherbatch.test311BatchPageTestCase->testBatchProgressPageTheme()
LeafBlock availability (DashboardBlockAvailabilityTestCase) [Dashboard]2600
LeafBlock availability (NodeBlockTestCase) [Node]2100
LeafBlock availability (PollBlockTestCase) [Poll]17600
LeafBlock availability (SearchBlockTestCase) [Search]6400
LeafBlock caching (BlockCacheTestCase) [Block]21300
LeafBlock functionality (BlockTestCase) [Block]36100
LeafBlock functionality (SystemBlockTestCase) [System]4500
LeafBlock HTML id (BlockHTMLIdTestCase) [Block]1600
LeafBlock template suggestions (BlockTemplateSuggestionsUnitTest) [Block]300
LeafBlocks not in hidden region (BlockHiddenRegionTestCase) [Block]1800
LeafBook functionality (BookTestCase) [Book]52800
ExpandBoot and exit hook invocation (HookBootExitTestCase) [Bootstrap]1180
MessageGroupFilenameLineFunctionStatus
hook_exit called with disabled cache.Otherbootstrap.test310HookBootExitTestCase->testHookBootExit()
hook_exit called with normal cache.Otherbootstrap.test318HookBootExitTestCase->testHookBootExit()
Page has been cached.Otherbootstrap.test322HookBootExitTestCase->testHookBootExit()
hook_boot not called with aggressive cache and a cached page.Otherbootstrap.test324HookBootExitTestCase->testHookBootExit()
hook_exit not called with aggressive cache and a cached page.Otherbootstrap.test325HookBootExitTestCase->testHookBootExit()
Page cache cleared.Otherbootstrap.test328HookBootExitTestCase->testHookBootExit()
hook_boot called with aggressive cache and no cached page.Otherbootstrap.test331HookBootExitTestCase->testHookBootExit()
hook_exit called with aggressive cache and no cached page.Otherbootstrap.test332HookBootExitTestCase->testHookBootExit()
LeafBreadcrumbs (MenuBreadcrumbTestCase) [Menu]41500
LeafBroken requirements test (SimpleTestMissingCheckedRequirements) [SimpleTest]1900
LeafBroken SimpleTest method (SimpleTestBrokenSetUp) [SimpleTest]3000
LeafBrowser language detection (LocaleBrowserDetectionTest) [Locale]4100
LeafCache clear test (CacheClearCase) [Cache]2600
LeafCache emptiness test (CacheIsEmptyCase) [Cache]500
LeafCache saving test (CacheSavingCase) [Cache]800
LeafCancel account (UserCancelTestCase) [User]23600
LeafCascading stylesheets (CommonCascadingStylesheetsTestCase) [Common]4000
LeafCategorize feed functionality (CategorizeFeedTestCase) [Unknown]2100
ExpandCategorize feed item functionality (CategorizeFeedItemTestCase) [Unknown]5725
MessageGroupFilenameLineFunctionStatus
Cannot use a scalar value as an arrayWarningblock.module281block_page_build()
Cannot use a scalar value as an arrayWarningblock.module281block_page_build()
Invalid argument supplied for foreach()Warningcommon.inc6456element_children()
Cannot use a scalar value as an arrayWarningcommon.inc5898drupal_render()
Cannot use a scalar value as an arrayWarningcommon.inc5951drupal_render()
HTTP response expected 403, actual 200Browseraggregator.test103AggregatorTestCase->updateFeedItems()
Total items in feed equal to the total items in database (5 != 0)Otheraggregator.test117AggregatorTestCase->updateFeedItems()
ExpandChecks display of aggregator items (AggregatorRenderingTestCase) [Unknown]217710
MessageGroupFilenameLineFunctionStatus
Cannot use a scalar value as an arrayWarningblock.module281block_page_build()
Cannot use a scalar value as an arrayWarningblock.module281block_page_build()
Invalid argument supplied for foreach()Warningcommon.inc6456element_children()
Cannot use a scalar value as an arrayWarningcommon.inc5898drupal_render()
Cannot use a scalar value as an arrayWarningcommon.inc5951drupal_render()
HTTP response expected 403, actual 200Browseraggregator.test103AggregatorTestCase->updateFeedItems()
Total items in feed equal to the total items in database (5 != 0)Otheraggregator.test117AggregatorTestCase->updateFeedItems()
Feed block is displayed on the page.Otheraggregator.test879AggregatorRenderingTestCase->testBlockLinks()
Link to href aggregator/sources/1 found.Otheraggregator.test884AggregatorRenderingTestCase->testBlockLinks()
Cannot use a scalar value as an arrayWarningblock.module281block_page_build()
Cannot use a scalar value as an arrayWarningblock.module281block_page_build()
Invalid argument supplied for foreach()Warningcommon.inc6456element_children()
Cannot use a scalar value as an arrayWarningcommon.inc5898drupal_render()
Cannot use a scalar value as an arrayWarningcommon.inc5951drupal_render()
HTTP response expected 403, actual 200Browseraggregator.test103AggregatorTestCase->updateFeedItems()
Total items in feed equal to the total items in database (30 != 0)Otheraggregator.test117AggregatorTestCase->updateFeedItems()
Individual source page contains a pager.Otheraggregator.test908AggregatorRenderingTestCase->testFeedPage()
LeafCJK tokenizer (SearchTokenizerTestCase) [Search]800
LeafClass loader (SymfonyClassLoaderTestCase) [Symfony]100
LeafColor functionality (ColorTestCase) [Color]8700
LeafComment actions (CommentActionsTestCase) [Comment]2900
ExpandComment approval (CommentApprovalTest) [Comment]152216
MessageGroupFilenameLineFunctionStatus
Cannot use a scalar value as an arrayWarningblock.module281block_page_build()
Cannot use a scalar value as an arrayWarningblock.module281block_page_build()
Cannot use a scalar value as an arrayWarningblock.module281block_page_build()
Cannot use a scalar value as an arrayWarningblock.module281block_page_build()
Cannot use a scalar value as an arrayWarningtoolbar.module122toolbar_page_build()
Invalid argument supplied for foreach()Warningcommon.inc6456element_children()
Cannot use a scalar value as an arrayWarningcommon.inc5898drupal_render()
Cannot use a scalar value as an arrayWarningcommon.inc5951drupal_render()
Forged comment approval was denied.Browsercomment.test1677CommentApprovalTest->testApprovalNodeInterface()
Cannot use a scalar value as an arrayWarningblock.module281block_page_build()
Cannot use a scalar value as an arrayWarningblock.module281block_page_build()
Cannot use a scalar value as an arrayWarningblock.module281block_page_build()
Cannot use a scalar value as an arrayWarningblock.module281block_page_build()
Cannot use a scalar value as an arrayWarningtoolbar.module122toolbar_page_build()
Invalid argument supplied for foreach()Warningcommon.inc6456element_children()
Cannot use a scalar value as an arrayWarningcommon.inc5898drupal_render()
Cannot use a scalar value as an arrayWarningcommon.inc5951drupal_render()
Forged comment approval was denied.Browsercomment.test1679CommentApprovalTest->testApprovalNodeInterface()
LeafComment blocks (CommentBlockFunctionalTest) [Comment]11600
LeafComment count toggle (SearchCommentCountToggleTestCase) [Search]3100
LeafComment fields (CommentFieldsTest) [Comment]10700
ExpandComment interface (CommentInterfaceTest) [Comment]214100
MessageGroupFilenameLineFunctionStatus
Changed environment:array ( 'authenticated' => false, 'comment count' => false, 'form' => 'below', 'user_register' => 1, 'contact' => 'optional', 'comments' => 'open', 'access comments' => 0, 'post comments' => 0, 'skip comment approval' => 1, 'edit own comments' => 0, )Debugcomment.test839CommentInterfaceTest->setEnvironment()
Changed environment:array ( 'authenticated' => true, 'comment count' => false, 'form' => 'below', 'user_register' => 1, 'contact' => 'optional', 'comments' => 'open', 'access comments' => 0, 'post comments' => 0, 'skip comment approval' => 1, 'edit own comments' => 0, )Debugcomment.test839CommentInterfaceTest->setEnvironment()
Changed environment:array ( 'authenticated' => false, 'comment count' => true, 'form' => 'below', 'user_register' => 1, 'contact' => 'optional', 'comments' => 'open', 'access comments' => 0, 'post comments' => 0, 'skip comment approval' => 1, 'edit own comments' => 0, )Debugcomment.test839CommentInterfaceTest->setEnvironment()
Changed environment:array ( 'authenticated' => true, 'comment count' => true, 'form' => 'below', 'user_register' => 1, 'contact' => 'optional', 'comments' => 'open', 'access comments' => 0, 'post comments' => 0, 'skip comment approval' => 1, 'edit own comments' => 0, )Debugcomment.test839CommentInterfaceTest->setEnvironment()
Changed environment:array ( 'authenticated' => false, 'comment count' => false, 'form' => 'below', 'user_register' => 1, 'contact' => 'optional', 'comments' => 'open', 'access comments' => 1, 'post comments' => 0, 'skip comment approval' => 1, 'edit own comments' => 0, )Debugcomment.test839CommentInterfaceTest->setEnvironment()
Changed environment:array ( 'authenticated' => true, 'comment count' => false, 'form' => 'below', 'user_register' => 1, 'contact' => 'optional', 'comments' => 'open', 'access comments' => 1, 'post comments' => 0, 'skip comment approval' => 1, 'edit own comments' => 0, )Debugcomment.test839CommentInterfaceTest->setEnvironment()
Changed environment:array ( 'authenticated' => false, 'comment count' => true, 'form' => 'below', 'user_register' => 1, 'contact' => 'optional', 'comments' => 'open', 'access comments' => 1, 'post comments' => 0, 'skip comment approval' => 1, 'edit own comments' => 0, )Debugcomment.test839CommentInterfaceTest->setEnvironment()
Changed environment:array ( 'authenticated' => true, 'comment count' => true, 'form' => 'below', 'user_register' => 1, 'contact' => 'optional', 'comments' => 'open', 'access comments' => 1, 'post comments' => 0, 'skip comment approval' => 1, 'edit own comments' => 0, )Debugcomment.test839CommentInterfaceTest->setEnvironment()
Changed environment:array ( 'authenticated' => false, 'comment count' => false, 'form' => 'below', 'user_register' => 1, 'contact' => 'optional', 'comments' => 'open', 'access comments' => 0, 'post comments' => 1, 'skip comment approval' => 1, 'edit own comments' => 0, )Debugcomment.test839CommentInterfaceTest->setEnvironment()
Changed environment:array ( 'authenticated' => true, 'comment count' => false, 'form' => 'below', 'user_register' => 1, 'contact' => 'optional', 'comments' => 'open', 'access comments' => 0, 'post comments' => 1, 'skip comment approval' => 1, 'edit own comments' => 0, )Debugcomment.test839CommentInterfaceTest->setEnvironment()
Changed environment:array ( 'authenticated' => false, 'comment count' => true, 'form' => 'below', 'user_register' => 1, 'contact' => 'optional', 'comments' => 'open', 'access comments' => 0, 'post comments' => 1, 'skip comment approval' => 1, 'edit own comments' => 0, )Debugcomment.test839CommentInterfaceTest->setEnvironment()
Changed environment:array ( 'authenticated' => true, 'comment count' => true, 'form' => 'below', 'user_register' => 1, 'contact' => 'optional', 'comments' => 'open', 'access comments' => 0, 'post comments' => 1, 'skip comment approval' => 1, 'edit own comments' => 0, )Debugcomment.test839CommentInterfaceTest->setEnvironment()
Changed environment:array ( 'authenticated' => false, 'comment count' => false, 'form' => 'below', 'user_register' => 1, 'contact' => 'optional', 'comments' => 'open', 'access comments' => 1, 'post comments' => 1, 'skip comment approval' => 1, 'edit own comments' => 0, )Debugcomment.test839CommentInterfaceTest->setEnvironment()
Changed environment:array ( 'authenticated' => true, 'comment count' => false, 'form' => 'below', 'user_register' => 1, 'contact' => 'optional', 'comments' => 'open', 'access comments' => 1, 'post comments' => 1, 'skip comment approval' => 1, 'edit own comments' => 0, )Debugcomment.test839CommentInterfaceTest->setEnvironment()
Changed environment:array ( 'authenticated' => false, 'comment count' => true, 'form' => 'below', 'user_register' => 1, 'contact' => 'optional', 'comments' => 'open', 'access comments' => 1, 'post comments' => 1, 'skip comment approval' => 1, 'edit own comments' => 0, )Debugcomment.test839CommentInterfaceTest->setEnvironment()
Changed environment:array ( 'authenticated' => true, 'comment count' => true, 'form' => 'below', 'user_register' => 1, 'contact' => 'optional', 'comments' => 'open', 'access comments' => 1, 'post comments' => 1, 'skip comment approval' => 1, 'edit own comments' => 0, )Debugcomment.test839CommentInterfaceTest->setEnvironment()
Changed environment:array ( 'authenticated' => false, 'comment count' => false, 'form' => 'separate page', 'user_register' => 1, 'contact' => 'optional', 'comments' => 'open', 'access comments' => 0, 'post comments' => 0, 'skip comment approval' => 1, 'edit own comments' => 0, )Debugcomment.test839CommentInterfaceTest->setEnvironment()
Changed environment:array ( 'authenticated' => true, 'comment count' => false, 'form' => 'separate page', 'user_register' => 1, 'contact' => 'optional', 'comments' => 'open', 'access comments' => 0, 'post comments' => 0, 'skip comment approval' => 1, 'edit own comments' => 0, )Debugcomment.test839CommentInterfaceTest->setEnvironment()
Changed environment:array ( 'authenticated' => false, 'comment count' => true, 'form' => 'separate page', 'user_register' => 1, 'contact' => 'optional', 'comments' => 'open', 'access comments' => 0, 'post comments' => 0, 'skip comment approval' => 1, 'edit own comments' => 0, )Debugcomment.test839CommentInterfaceTest->setEnvironment()
Changed environment:array ( 'authenticated' => true, 'comment count' => true, 'form' => 'separate page', 'user_register' => 1, 'contact' => 'optional', 'comments' => 'open', 'access comments' => 0, 'post comments' => 0, 'skip comment approval' => 1, 'edit own comments' => 0, )Debugcomment.test839CommentInterfaceTest->setEnvironment()
Changed environment:array ( 'authenticated' => false, 'comment count' => false, 'form' => 'separate page', 'user_register' => 1, 'contact' => 'optional', 'comments' => 'open', 'access comments' => 1, 'post comments' => 0, 'skip comment approval' => 1, 'edit own comments' => 0, )Debugcomment.test839CommentInterfaceTest->setEnvironment()
Changed environment:array ( 'authenticated' => true, 'comment count' => false, 'form' => 'separate page', 'user_register' => 1, 'contact' => 'optional', 'comments' => 'open', 'access comments' => 1, 'post comments' => 0, 'skip comment approval' => 1, 'edit own comments' => 0, )Debugcomment.test839CommentInterfaceTest->setEnvironment()
Changed environment:array ( 'authenticated' => false, 'comment count' => true, 'form' => 'separate page', 'user_register' => 1, 'contact' => 'optional', 'comments' => 'open', 'access comments' => 1, 'post comments' => 0, 'skip comment approval' => 1, 'edit own comments' => 0, )Debugcomment.test839CommentInterfaceTest->setEnvironment()
Changed environment:array ( 'authenticated' => true, 'comment count' => true, 'form' => 'separate page', 'user_register' => 1, 'contact' => 'optional', 'comments' => 'open', 'access comments' => 1, 'post comments' => 0, 'skip comment approval' => 1, 'edit own comments' => 0, )Debugcomment.test839CommentInterfaceTest->setEnvironment()
Changed environment:array ( 'authenticated' => false, 'comment count' => false, 'form' => 'separate page', 'user_register' => 1, 'contact' => 'optional', 'comments' => 'open', 'access comments' => 0, 'post comments' => 1, 'skip comment approval' => 1, 'edit own comments' => 0, )Debugcomment.test839CommentInterfaceTest->setEnvironment()
Changed environment:array ( 'authenticated' => true, 'comment count' => false, 'form' => 'separate page', 'user_register' => 1, 'contact' => 'optional', 'comments' => 'open', 'access comments' => 0, 'post comments' => 1, 'skip comment approval' => 1, 'edit own comments' => 0, )Debugcomment.test839CommentInterfaceTest->setEnvironment()
Changed environment:array ( 'authenticated' => false, 'comment count' => true, 'form' => 'separate page', 'user_register' => 1, 'contact' => 'optional', 'comments' => 'open', 'access comments' => 0, 'post comments' => 1, 'skip comment approval' => 1, 'edit own comments' => 0, )Debugcomment.test839CommentInterfaceTest->setEnvironment()
Changed environment:array ( 'authenticated' => true, 'comment count' => true, 'form' => 'separate page', 'user_register' => 1, 'contact' => 'optional', 'comments' => 'open', 'access comments' => 0, 'post comments' => 1, 'skip comment approval' => 1, 'edit own comments' => 0, )Debugcomment.test839CommentInterfaceTest->setEnvironment()
Changed environment:array ( 'authenticated' => false, 'comment count' => false, 'form' => 'separate page', 'user_register' => 1, 'contact' => 'optional', 'comments' => 'open', 'access comments' => 1, 'post comments' => 1, 'skip comment approval' => 1, 'edit own comments' => 0, )Debugcomment.test839CommentInterfaceTest->setEnvironment()
Changed environment:array ( 'authenticated' => true, 'comment count' => false, 'form' => 'separate page', 'user_register' => 1, 'contact' => 'optional', 'comments' => 'open', 'access comments' => 1, 'post comments' => 1, 'skip comment approval' => 1, 'edit own comments' => 0, )Debugcomment.test839CommentInterfaceTest->setEnvironment()
Changed environment:array ( 'authenticated' => false, 'comment count' => true, 'form' => 'separate page', 'user_register' => 1, 'contact' => 'optional', 'comments' => 'open', 'access comments' => 1, 'post comments' => 1, 'skip comment approval' => 1, 'edit own comments' => 0, )Debugcomment.test839CommentInterfaceTest->setEnvironment()
Changed environment:array ( 'authenticated' => true, 'comment count' => true, 'form' => 'separate page', 'user_register' => 1, 'contact' => 'optional', 'comments' => 'open', 'access comments' => 1, 'post comments' => 1, 'skip comment approval' => 1, 'edit own comments' => 0, )Debugcomment.test839CommentInterfaceTest->setEnvironment()
Changed environment:array ( 'authenticated' => false, 'comment count' => false, 'form' => 'below', 'user_register' => 0, 'contact' => 'optional', 'comments' => 'open', 'access comments' => 0, 'post comments' => 0, 'skip comment approval' => 1, 'edit own comments' => 0, )Debugcomment.test839CommentInterfaceTest->setEnvironment()
Changed environment:array ( 'authenticated' => true, 'comment count' => false, 'form' => 'below', 'user_register' => 0, 'contact' => 'optional', 'comments' => 'open', 'access comments' => 0, 'post comments' => 0, 'skip comment approval' => 1, 'edit own comments' => 0, )Debugcomment.test839CommentInterfaceTest->setEnvironment()
Changed environment:array ( 'authenticated' => false, 'comment count' => true, 'form' => 'below', 'user_register' => 0, 'contact' => 'optional', 'comments' => 'open', 'access comments' => 0, 'post comments' => 0, 'skip comment approval' => 1, 'edit own comments' => 0, )Debugcomment.test839CommentInterfaceTest->setEnvironment()
Changed environment:array ( 'authenticated' => true, 'comment count' => true, 'form' => 'below', 'user_register' => 0, 'contact' => 'optional', 'comments' => 'open', 'access comments' => 0, 'post comments' => 0, 'skip comment approval' => 1, 'edit own comments' => 0, )Debugcomment.test839CommentInterfaceTest->setEnvironment()
Changed environment:array ( 'authenticated' => false, 'comment count' => false, 'form' => 'below', 'user_register' => 0, 'contact' => 'optional', 'comments' => 'open', 'access comments' => 1, 'post comments' => 0, 'skip comment approval' => 1, 'edit own comments' => 0, )Debugcomment.test839CommentInterfaceTest->setEnvironment()
Changed environment:array ( 'authenticated' => true, 'comment count' => false, 'form' => 'below', 'user_register' => 0, 'contact' => 'optional', 'comments' => 'open', 'access comments' => 1, 'post comments' => 0, 'skip comment approval' => 1, 'edit own comments' => 0, )Debugcomment.test839CommentInterfaceTest->setEnvironment()
Changed environment:array ( 'authenticated' => false, 'comment count' => true, 'form' => 'below', 'user_register' => 0, 'contact' => 'optional', 'comments' => 'open', 'access comments' => 1, 'post comments' => 0, 'skip comment approval' => 1, 'edit own comments' => 0, )Debugcomment.test839CommentInterfaceTest->setEnvironment()
Changed environment:array ( 'authenticated' => true, 'comment count' => true, 'form' => 'below', 'user_register' => 0, 'contact' => 'optional', 'comments' => 'open', 'access comments' => 1, 'post comments' => 0, 'skip comment approval' => 1, 'edit own comments' => 0, )Debugcomment.test839CommentInterfaceTest->setEnvironment()
Changed environment:array ( 'authenticated' => false, 'comment count' => false, 'form' => 'below', 'user_register' => 0, 'contact' => 'optional', 'comments' => 'open', 'access comments' => 0, 'post comments' => 1, 'skip comment approval' => 1, 'edit own comments' => 0, )Debugcomment.test839CommentInterfaceTest->setEnvironment()
Changed environment:array ( 'authenticated' => true, 'comment count' => false, 'form' => 'below', 'user_register' => 0, 'contact' => 'optional', 'comments' => 'open', 'access comments' => 0, 'post comments' => 1, 'skip comment approval' => 1, 'edit own comments' => 0, )Debugcomment.test839CommentInterfaceTest->setEnvironment()
Changed environment:array ( 'authenticated' => false, 'comment count' => true, 'form' => 'below', 'user_register' => 0, 'contact' => 'optional', 'comments' => 'open', 'access comments' => 0, 'post comments' => 1, 'skip comment approval' => 1, 'edit own comments' => 0, )Debugcomment.test839CommentInterfaceTest->setEnvironment()
Changed environment:array ( 'authenticated' => true, 'comment count' => true, 'form' => 'below', 'user_register' => 0, 'contact' => 'optional', 'comments' => 'open', 'access comments' => 0, 'post comments' => 1, 'skip comment approval' => 1, 'edit own comments' => 0, )Debugcomment.test839CommentInterfaceTest->setEnvironment()
Changed environment:array ( 'authenticated' => false, 'comment count' => false, 'form' => 'below', 'user_register' => 0, 'contact' => 'optional', 'comments' => 'open', 'access comments' => 1, 'post comments' => 1, 'skip comment approval' => 1, 'edit own comments' => 0, )Debugcomment.test839CommentInterfaceTest->setEnvironment()
Changed environment:array ( 'authenticated' => true, 'comment count' => false, 'form' => 'below', 'user_register' => 0, 'contact' => 'optional', 'comments' => 'open', 'access comments' => 1, 'post comments' => 1, 'skip comment approval' => 1, 'edit own comments' => 0, )Debugcomment.test839CommentInterfaceTest->setEnvironment()
Changed environment:array ( 'authenticated' => false, 'comment count' => true, 'form' => 'below', 'user_register' => 0, 'contact' => 'optional', 'comments' => 'open', 'access comments' => 1, 'post comments' => 1, 'skip comment approval' => 1, 'edit own comments' => 0, )Debugcomment.test839CommentInterfaceTest->setEnvironment()
Changed environment:array ( 'authenticated' => true, 'comment count' => true, 'form' => 'below', 'user_register' => 0, 'contact' => 'optional', 'comments' => 'open', 'access comments' => 1, 'post comments' => 1, 'skip comment approval' => 1, 'edit own comments' => 0, )Debugcomment.test839CommentInterfaceTest->setEnvironment()
Changed environment:array ( 'authenticated' => false, 'comment count' => false, 'form' => 'separate page', 'user_register' => 0, 'contact' => 'optional', 'comments' => 'open', 'access comments' => 0, 'post comments' => 0, 'skip comment approval' => 1, 'edit own comments' => 0, )Debugcomment.test839CommentInterfaceTest->setEnvironment()
Changed environment:array ( 'authenticated' => true, 'comment count' => false, 'form' => 'separate page', 'user_register' => 0, 'contact' => 'optional', 'comments' => 'open', 'access comments' => 0, 'post comments' => 0, 'skip comment approval' => 1, 'edit own comments' => 0, )Debugcomment.test839CommentInterfaceTest->setEnvironment()
Changed environment:array ( 'authenticated' => false, 'comment count' => true, 'form' => 'separate page', 'user_register' => 0, 'contact' => 'optional', 'comments' => 'open', 'access comments' => 0, 'post comments' => 0, 'skip comment approval' => 1, 'edit own comments' => 0, )Debugcomment.test839CommentInterfaceTest->setEnvironment()
Changed environment:array ( 'authenticated' => true, 'comment count' => true, 'form' => 'separate page', 'user_register' => 0, 'contact' => 'optional', 'comments' => 'open', 'access comments' => 0, 'post comments' => 0, 'skip comment approval' => 1, 'edit own comments' => 0, )Debugcomment.test839CommentInterfaceTest->setEnvironment()
Changed environment:array ( 'authenticated' => false, 'comment count' => false, 'form' => 'separate page', 'user_register' => 0, 'contact' => 'optional', 'comments' => 'open', 'access comments' => 1, 'post comments' => 0, 'skip comment approval' => 1, 'edit own comments' => 0, )Debugcomment.test839CommentInterfaceTest->setEnvironment()
Changed environment:array ( 'authenticated' => true, 'comment count' => false, 'form' => 'separate page', 'user_register' => 0, 'contact' => 'optional', 'comments' => 'open', 'access comments' => 1, 'post comments' => 0, 'skip comment approval' => 1, 'edit own comments' => 0, )Debugcomment.test839CommentInterfaceTest->setEnvironment()
Changed environment:array ( 'authenticated' => false, 'comment count' => true, 'form' => 'separate page', 'user_register' => 0, 'contact' => 'optional', 'comments' => 'open', 'access comments' => 1, 'post comments' => 0, 'skip comment approval' => 1, 'edit own comments' => 0, )Debugcomment.test839CommentInterfaceTest->setEnvironment()
Changed environment:array ( 'authenticated' => true, 'comment count' => true, 'form' => 'separate page', 'user_register' => 0, 'contact' => 'optional', 'comments' => 'open', 'access comments' => 1, 'post comments' => 0, 'skip comment approval' => 1, 'edit own comments' => 0, )Debugcomment.test839CommentInterfaceTest->setEnvironment()
Changed environment:array ( 'authenticated' => false, 'comment count' => false, 'form' => 'separate page', 'user_register' => 0, 'contact' => 'optional', 'comments' => 'open', 'access comments' => 0, 'post comments' => 1, 'skip comment approval' => 1, 'edit own comments' => 0, )Debugcomment.test839CommentInterfaceTest->setEnvironment()
Changed environment:array ( 'authenticated' => true, 'comment count' => false, 'form' => 'separate page', 'user_register' => 0, 'contact' => 'optional', 'comments' => 'open', 'access comments' => 0, 'post comments' => 1, 'skip comment approval' => 1, 'edit own comments' => 0, )Debugcomment.test839CommentInterfaceTest->setEnvironment()
Changed environment:array ( 'authenticated' => false, 'comment count' => true, 'form' => 'separate page', 'user_register' => 0, 'contact' => 'optional', 'comments' => 'open', 'access comments' => 0, 'post comments' => 1, 'skip comment approval' => 1, 'edit own comments' => 0, )Debugcomment.test839CommentInterfaceTest->setEnvironment()
Changed environment:array ( 'authenticated' => true, 'comment count' => true, 'form' => 'separate page', 'user_register' => 0, 'contact' => 'optional', 'comments' => 'open', 'access comments' => 0, 'post comments' => 1, 'skip comment approval' => 1, 'edit own comments' => 0, )Debugcomment.test839CommentInterfaceTest->setEnvironment()
Changed environment:array ( 'authenticated' => false, 'comment count' => false, 'form' => 'separate page', 'user_register' => 0, 'contact' => 'optional', 'comments' => 'open', 'access comments' => 1, 'post comments' => 1, 'skip comment approval' => 1, 'edit own comments' => 0, )Debugcomment.test839CommentInterfaceTest->setEnvironment()
Changed environment:array ( 'authenticated' => true, 'comment count' => false, 'form' => 'separate page', 'user_register' => 0, 'contact' => 'optional', 'comments' => 'open', 'access comments' => 1, 'post comments' => 1, 'skip comment approval' => 1, 'edit own comments' => 0, )Debugcomment.test839CommentInterfaceTest->setEnvironment()
Changed environment:array ( 'authenticated' => false, 'comment count' => true, 'form' => 'separate page', 'user_register' => 0, 'contact' => 'optional', 'comments' => 'open', 'access comments' => 1, 'post comments' => 1, 'skip comment approval' => 1, 'edit own comments' => 0, )Debugcomment.test839CommentInterfaceTest->setEnvironment()
Changed environment:array ( 'authenticated' => true, 'comment count' => true, 'form' => 'separate page', 'user_register' => 0, 'contact' => 'optional', 'comments' => 'open', 'access comments' => 1, 'post comments' => 1, 'skip comment approval' => 1, 'edit own comments' => 0, )Debugcomment.test839CommentInterfaceTest->setEnvironment()
ExpandComment language (LocaleCommentLanguageFunctionalTest) [Locale]4780
MessageGroupFilenameLineFunctionStatus
Failed to set field comment_body[und][0][value] to rnr3DViTOtherlocale.test2881LocaleCommentLanguageFunctionalTest->testCommentLanguage()
Found the Save buttonOtherlocale.test2881LocaleCommentLanguageFunctionalTest->testCommentLanguage()
Found the requested form fields at fr/node/1Otherlocale.test2881LocaleCommentLanguageFunctionalTest->testCommentLanguage()
The comment posted with content language fr and belonging to the node with language en has language enOtherlocale.test2891LocaleCommentLanguageFunctionalTest->testCommentLanguage()
Failed to set field comment_body[und][0][value] to pxWA647vOtherlocale.test2881LocaleCommentLanguageFunctionalTest->testCommentLanguage()
Found the Save buttonOtherlocale.test2881LocaleCommentLanguageFunctionalTest->testCommentLanguage()
Found the requested form fields at fr/node/2Otherlocale.test2881LocaleCommentLanguageFunctionalTest->testCommentLanguage()
The comment posted with content language fr and belonging to the node with language fr has language enOtherlocale.test2891LocaleCommentLanguageFunctionalTest->testCommentLanguage()
LeafComment node access (CommentNodeAccessTest) [Comment]5400
LeafComment paging settings (CommentPagerTest) [Comment]21100
LeafComment preview (CommentPreviewTest) [Comment]9900
LeafComment Rebuild (CommentContentRebuild) [Comment]3300
LeafComment RSS (CommentRSSUnitTest) [Comment]2500
LeafComment Search tests (SearchCommentTestCase) [Search]21500
LeafComment Threading (CommentThreadingTestCase) [Comment]15700
LeafComment token replacement (CommentTokenReplaceTestCase) [Comment]6500
LeafConfig settings form (SearchConfigSettingsForm) [Search]12200
LeafConfiguration overrides (ConfOverrideTestCase) [Configuration]200
LeafConfiguration update from Drupal 7 to 8 (ConfUpdate7to8TestCase) [Configuration]300
LeafConnection tests (DatabaseConnectionTestCase) [Database]3800
ExpandContent language settings (LocaleContentFunctionalTest) [Locale]16210
MessageGroupFilenameLineFunctionStatus
The machine name field is LTR when the default language is RTL.Otherlocale.test2093LocaleContentFunctionalTest->testMachineNameLTR()
LeafContextual links on node lists (ContextualDynamicContextTestCase) [Contextual]1600
ExpandCron run (CronRunTestCase) [System]4832
MessageGroupFilenameLineFunctionStatus
Symfony\Component\HttpKernel\Exception\AccessDeniedHttpExceptioncommon.inc734drupal_access_denied()
HTTP response expected 403, actual 500Browsersystem.test814CronRunTestCase->testCronRun()
Symfony\Component\HttpKernel\Exception\AccessDeniedHttpExceptioncommon.inc734drupal_access_denied()
HTTP response expected 403, actual 500Browsersystem.test819CronRunTestCase->testCronRun()
Cron runs when the cron threshold is passed.Othersystem.test848CronRunTestCase->testAutomaticCron()
LeafCSS Unit Tests (CommonCascadingStylesheetsUnitTestCase) [Common]1200
LeafCustom query syntax tests (DatabaseQueryTestCase) [Database]700
LeafDashboard blocks (DashboardBlocksTestCase) [Dashboard]8500
LeafData record write functionality (CommonDrupalWriteRecordTestCase) [Common]3400
LeafDate and time (DateTimeFunctionalTest) [System]11300
ExpandDBLog functionality (DBLogTestCase) [DBLog]52150
MessageGroupFilenameLineFunctionStatus
DBLog event was recorded: [access denied]Otherdblog.test317DBLogTestCase->doNode()
DBLog event was recorded: [access denied]Otherdblog.test317DBLogTestCase->doNode()
DBLog event was recorded: [access denied]Otherdblog.test317DBLogTestCase->doNode()
DBLog event was recorded: [access denied]Otherdblog.test317DBLogTestCase->doNode()
DBLog event was recorded: [access denied]Otherdblog.test317DBLogTestCase->doNode()
LeafDefault text format functionality (FilterDefaultFormatTestCase) [Filter]3300
LeafDelete/Truncate tests (DatabaseDeleteTruncateTestCase) [Database]2300
ExpandDrupal error handlers (DrupalErrorHandlerUnitTest) [System]2260
MessageGroupFilenameLineFunctionStatus
Received expected HTTP status line.Othererror.test87DrupalErrorHandlerUnitTest->testExceptionHandler()
Found error message: Exception: Drupal is awesome in error_test_trigger_exception() (line .Othererror.test88DrupalErrorHandlerUnitTest->testExceptionHandler()
Received expected HTTP status line.Othererror.test91DrupalErrorHandlerUnitTest->testExceptionHandler()
Found PDOException in error page.Othererror.test94DrupalErrorHandlerUnitTest->testExceptionHandler()
Found SELECT * FROM bananas_are_awesome in error page.Othererror.test95DrupalErrorHandlerUnitTest->testExceptionHandler()
Found 'in error_test_trigger_pdo_exception() (line ' in error page.Othererror.test97DrupalErrorHandlerUnitTest->testExceptionHandler()
ExpandDrupal HTTP request (CommonDrupalHTTPRequestTestCase) [Common]2962
MessageGroupFilenameLineFunctionStatus
Fetched page successfully.Othercommon.test961CommonDrupalHTTPRequestTestCase->testDrupalHTTPRequest()
Site title matches.Othercommon.test963CommonDrupalHTTPRequestTestCase->testDrupalHTTPRequest()
$_SERVER["PHP_AUTH_USER"] is passed correctly.Othercommon.test999CommonDrupalHTTPRequestTestCase->testDrupalHTTPRequestBasicAuth()
$_SERVER["PHP_AUTH_PW"] is passed correctly.Othercommon.test1000CommonDrupalHTTPRequestTestCase->testDrupalHTTPRequestBasicAuth()
Undefined index: content-languageNoticecommon.test1048CommonDrupalHTTPRequestTestCase->testDrupalHTTPRequestHeaders()
Content-Language HTTP header is English.Othercommon.test1048CommonDrupalHTTPRequestTestCase->testDrupalHTTPRequestHeaders()
Undefined index: content-languageNoticecommon.test1059CommonDrupalHTTPRequestTestCase->testDrupalHTTPRequestHeaders()
Content-Language HTTP header is French.Othercommon.test1059CommonDrupalHTTPRequestTestCase->testDrupalHTTPRequestHeaders()
LeafDrupal match path (DrupalMatchPathTestCase) [Path API]4100
LeafDrupal system listing (CommonDrupalSystemListingTestCase) [Common]600
Leafdrupal_add_feed() tests (CommonDrupalAddFeedTestCase) [Common]600
Leafdrupal_array_*() tests (CommonDrupalArrayUnitTest) [System]1300
Leafdrupal_render() (CommonDrupalRenderTestCase) [Common]5200
LeafElement processing (FormElementTestCase) [Form API]3600
LeafEmbedded forms (SearchEmbedForm) [Search]3200
LeafEmpty statement (DatabaseEmptyStatementTestCase) [Database]400
LeafEnable/disable modules (EnableDisableTestCase) [Module]154300
LeafEntity CRUD (EntityAPITestCase) [Entity API]800
LeafEntity CRUD hooks (EntityCrudHookTestCase) [Entity API]15500
LeafEntity info (EntityAPIInfoTestCase) [Entity API]500
LeafEntity properties (EntityPropertiesTestCase) [Entity API]400
LeafEntity query (EntityFieldQueryTestCase) [Entity API]13200
LeafFeed parser functionality (FeedParserTestCase) [Unknown]6500
LeafFetch tests (DatabaseFetchTestCase) [Database]3700
LeafFetch tests, part 2 (DatabaseFetch2TestCase) [Database]2900
LeafFetching multiple cache items (CacheGetMultipleUnitTest) [Cache]700
LeafField attach tests (other) (FieldAttachOtherTestCase) [Field API]7300
LeafField attach tests (storage-related) (FieldAttachStorageTestCase) [Field API]14300
LeafField bulk delete tests (FieldBulkDeleteTestCase) [Field API]11800
LeafField CRUD tests (FieldCrudTestCase) [Field API]8700
LeafField Display API tests (FieldDisplayAPITestCase) [Field API]4600
LeafField form tests (FieldFormTestCase) [Field API]26100
LeafField info tests (FieldInfoTestCase) [Field API]9000
LeafField instance CRUD tests (FieldInstanceCrudTestCase) [Field API]3700
LeafField SQL Storage tests (FieldSqlStorageTestCase) [Field API]9200
LeafField translations tests (FieldTranslationsTestCase) [Field API]8300
LeafFile content (ConfigFileContentTestCase) [Configuration]2600
LeafFile copying (FileCopyTest) [File API]11000
LeafFile delete (FileDeleteTest) [File API]2000
LeafFile download (FileDownloadTest) [File API]3900
LeafFile field display tests (FileFieldDisplayTestCase) [File]5000
LeafFile field file path tests (FileFieldPathTestCase) [File]2700
LeafFile field revision test (FileFieldRevisionTestCase) [File]6700
LeafFile field validation tests (FileFieldValidateTestCase) [File]11800
LeafFile field widget test (FileFieldWidgetTestCase) [File]30000
LeafFile loading (FileLoadTest) [File API]3400
LeafFile mimetypes (FileMimeTypeTest) [File API]4200
LeafFile moving (FileMoveTest) [File API]11000
LeafFile naming (FileNameMungingTest) [File API]500
LeafFile paths and directories (FileDirectoryTest) [File API]2000
LeafFile paths and directories (RemoteFileDirectoryTest) [File API (remote)]2400
LeafFile save data (FileSaveDataTest) [File API]9300
LeafFile saving (FileSaveTest) [File API]1700
LeafFile scan directory (FileScanDirectoryTest) [File API]2300
LeafFile scan directory (RemoteFileScanDirectoryTest) [File API (remote)]2300
LeafFile security (ConfigFileSecurityTestCase) [Configuration]400
LeafFile space used tests (FileSpaceUsedTest) [File API]1100
LeafFile token replacement (FileTokenReplaceTestCase) [File]3500
LeafFile uploading (FileSaveUploadTest) [File API]27100
LeafFile uploading (RemoteFileSaveUploadTest) [File API (remote)]27100
LeafFile URL rewriting (FileURLRewritingTest) [File]1700
LeafFile usage (FileUsageTest) [File]2100
LeafFile validate (FileValidateTest) [File API]1200
LeafFile validator tests (FileValidatorTest) [File API]2500
LeafFileTransfer unit tests (FileTranferTest) [System]200
LeafFilled upgrade test (FilledUpgradePathTestCase) [Upgrade path]2300
LeafFilter administration functionality (FilterAdminTestCase) [Filter]16400
LeafFilter CRUD operations (FilterCRUDTestCase) [Filter]21500
LeafFilter format access (FilterFormatAccessTestCase) [Filter]24700
LeafFilter format hooks (FilterHooksTestCase) [Filter]3300
LeafFilter module filters (FilterUnitTestCase) [Filter]21300
LeafFilter settings (FilterSettingsTestCase) [Filter]1000
LeafFingerprinting meta tag (AdminMetaTagTestCase) [System]300
LeafFlood control mechanism (FloodFunctionalTest) [System]600
LeafForm alter hooks (FormAlterTestCase) [Form API]400
LeafForm API checkbox (FormCheckboxTestCase) [Form API]9700
LeafForm API email (FormEmailTestCase) [Form API]1700
LeafForm API file inclusion (FormsFileInclusionTestCase) [Form API]1100
LeafForm API url (FormUrlTestCase) [Form API]1700
LeafForm element and label output test (FormsElementsLabelsTestCase) [Form API]1800
LeafForm element validation (FormsTestCase) [Form API]38300
LeafForm rebuilding (FormsRebuildTestCase) [Form API]5400
LeafForm state values clearance (advanced) (FormStateValuesCleanAdvancedTestCase) [Form API]700
LeafForm state values clearance (FormStateValuesCleanTestCase) [Form API]1400
LeafForm triggering element determination (FormsTriggeringElementTestCase) [Form API]5000
LeafForm validation handlers (FormValidationTestCase) [Form API]5500
LeafForm wrapper callback (FormsFormWrapperTestCase) [Form API]500
LeafFormat date (CommonFormatDateTestCase) [Common]7200
LeafForum functionality (ForumTestCase) [Forum]63500
ExpandFront page (FrontPageTestCase) [System]3340
MessageGroupFilenameLineFunctionStatus
Path is the front page.Othersystem.test1503FrontPageTestCase->testDrupalIsFrontPage()
Path is the front page.Othersystem.test1505FrontPageTestCase->testDrupalIsFrontPage()
Path is the front page.Othersystem.test1520FrontPageTestCase->testDrupalIsFrontPage()
Path is the front page.Othersystem.test1524FrontPageTestCase->testDrupalIsFrontPage()
LeafGet filename test (BootstrapGetFilenameTestCase) [Bootstrap]500
LeafGraph (GraphUnitTest) [System]2800
ExpandHelp functionality (HelpTestCase) [Help]277300
MessageGroupFilenameLineFunctionStatus
[block] Heading was displayedOtherhelp.test85HelpTestCase->verifyHelp()
[color] Heading was displayedOtherhelp.test85HelpTestCase->verifyHelp()
[comment] Heading was displayedOtherhelp.test85HelpTestCase->verifyHelp()
[contextual] Heading was displayedOtherhelp.test85HelpTestCase->verifyHelp()
[dashboard] Heading was displayedOtherhelp.test85HelpTestCase->verifyHelp()
[dblog] Heading was displayedOtherhelp.test85HelpTestCase->verifyHelp()
[entity] Heading was displayedOtherhelp.test85HelpTestCase->verifyHelp()
[field] Heading was displayedOtherhelp.test85HelpTestCase->verifyHelp()
[field_sql_storage] Heading was displayedOtherhelp.test85HelpTestCase->verifyHelp()
[list] Heading was displayedOtherhelp.test85HelpTestCase->verifyHelp()
[number] Heading was displayedOtherhelp.test85HelpTestCase->verifyHelp()
[options] Heading was displayedOtherhelp.test85HelpTestCase->verifyHelp()
[text] Heading was displayedOtherhelp.test85HelpTestCase->verifyHelp()
[field_ui] Heading was displayedOtherhelp.test85HelpTestCase->verifyHelp()
[file] Heading was displayedOtherhelp.test85HelpTestCase->verifyHelp()
[filter] Heading was displayedOtherhelp.test85HelpTestCase->verifyHelp()
[help] Heading was displayedOtherhelp.test85HelpTestCase->verifyHelp()
[image] Heading was displayedOtherhelp.test85HelpTestCase->verifyHelp()
[menu] Heading was displayedOtherhelp.test85HelpTestCase->verifyHelp()
[node] Heading was displayedOtherhelp.test85HelpTestCase->verifyHelp()
[overlay] Heading was displayedOtherhelp.test85HelpTestCase->verifyHelp()
[path] Heading was displayedOtherhelp.test85HelpTestCase->verifyHelp()
[poll] Heading was displayedOtherhelp.test85HelpTestCase->verifyHelp()
[rdf] Heading was displayedOtherhelp.test85HelpTestCase->verifyHelp()
[search] Heading was displayedOtherhelp.test85HelpTestCase->verifyHelp()
[shortcut] Heading was displayedOtherhelp.test85HelpTestCase->verifyHelp()
[system] Heading was displayedOtherhelp.test85HelpTestCase->verifyHelp()
[taxonomy] Heading was displayedOtherhelp.test85HelpTestCase->verifyHelp()
[toolbar] Heading was displayedOtherhelp.test85HelpTestCase->verifyHelp()
[user] Heading was displayedOtherhelp.test85HelpTestCase->verifyHelp()
LeafHTML Attributes (CommonDrupalAttributesUnitTestCase) [Common]600
LeafHTML identifiers (CommonHTMLIdentifierTestCase) [Common]1000
LeafHTML in page titles (PageTitleFiltering) [System]4400
LeafHTML to text conversion (DrupalHtmlToTextTestCase) [Mail]15600
Leafhtml.tpl.php html and body attributes (ThemeHtmlTplPhpAttributesTestCase) [Theme]500
LeafHTTP file retrieval (RetrieveFileTestCase) [System]700
LeafImage dimensions (ImageDimensionsUnitTest) [Image]5600
LeafImage effects (ImageEffectsUnitTest) [Image]3900
ExpandImage field display tests (ImageFieldDisplayTestCase) [Image]16110
MessageGroupFilenameLineFunctionStatus
Cache-Control header was sent.Otherimage.test638ImageFieldDisplayTestCase->_testImageFieldFormatters()
LeafImage field validation tests (ImageFieldValidateTestCase) [Image]2100
LeafImage GD manipulation tests (ImageToolkitGdTestCase) [Image]9600
LeafImage moving (ImageFileMoveTest) [Image]400
LeafImage styles and effects UI configuration (ImageAdminStylesUnitTest) [Image]13200
ExpandImage styles path and URL functions (ImageStylesPathAndUrlUnitTest) [Image]4520
MessageGroupFilenameLineFunctionStatus
When using non-clean URLS, the system path contains the query string.Otherimage.test213ImageStylesPathAndUrlUnitTest->_testImageStyleUrlAndPath()
When using non-clean URLS, the system path contains the query string.Otherimage.test213ImageStylesPathAndUrlUnitTest->_testImageStyleUrlAndPath()
LeafImage toolkit tests (ImageToolkitUnitTest) [Image]5700
Leafimage_dimensions_scale() (ImageDimensionsScaleTestCase) [Image]1500
LeafImport feeds from OPML functionality (ImportOPMLTestCase) [Unknown]5500
ExpandIndex.php handling (SystemIndexPhpTest) [System]810
MessageGroupFilenameLineFunctionStatus
Make sure index.php/user returns a 'page not found'.Browsersystem.test2674SystemIndexPhpTest->testIndexPhpHandling()
LeafInfo file format parser (InfoFileParserTestCase) [System]900
LeafInsert tests (DatabaseInsertTestCase) [Database]5100
LeafInsert tests, default fields (DatabaseInsertDefaultsTestCase) [Database]2200
LeafInsert tests, LOB fields (DatabaseInsertLOBTestCase) [Database]1500
LeafInstallation profile module tests (SimpleTestInstallationProfileModuleTestsTestCase) [SimpleTest]1900
LeafInstaller language tests (InstallerLanguageTestCase) [Installer]800
LeafInvalid data (DatabaseInvalidDataTestCase) [Database]800
LeafIP address and HTTP_HOST test (BootstrapIPAddressTestCase) [Bootstrap]1100
LeafIP address blocking (IPAddressBlockingTestCase) [System]4200
LeafJavaScript (CommonJavaScriptTestCase) [Common]7500
LeafJavascript translation (LocaleJavascriptTranslationTest) [Locale]6600
LeafJSON (CommonJSONUnitTestCase) [Common]2100
LeafKeywords and conditions (SearchKeywordsConditions) [Search]2800
LeafLanguage list configuration (LanguageListTest) [Language]10700
ExpandLanguage negotiation autoconfiguration (LocaleConfigurationTest) [Locale]3430
MessageGroupFilenameLineFunctionStatus
Default language updated.Browserlocale.test77LocaleConfigurationTest->testLanguageConfiguration()
A valid path prefix has been added to the previous default language.Otherlocale.test83LocaleConfigurationTest->testLanguageConfiguration()
French still has a path prefix.Otherlocale.test86LocaleConfigurationTest->testLanguageConfiguration()
LeafLanguage negotiation info (LocaleLanguageNegotiationInfoFunctionalTest) [Locale]4900
LeafLanguage switching (LocaleLanguageSwitchingFunctionalTest) [Locale]2600
LeafLanguage upgrade test (LanguageUpgradePathTestCase) [Upgrade path]11100
LeafList field (ListFieldTestCase) [Field types]1600
LeafList field UI (ListFieldUITestCase) [Field types]20700
LeafLoad multiple nodes (NodeLoadMultipleUnitTest) [Node]3900
LeafLocale uninstall (EN) (LocaleUninstallFunctionalTest) [Locale]3200
LeafLocale uninstall (FR) (LocaleUninstallFrenchFunctionalTest) [Locale]3200
ExpandLocalize date formats (LocaleDateFormatsFunctionalTest) [Locale]3610
MessageGroupFilenameLineFunctionStatus
French date format appearsOtherlocale.test2965LocaleDateFormatsFunctionalTest->testLocalizeDateFormats()
LeafLocking framework tests (LockFunctionalTest) [System]1800
LeafMail system (MailTestCase) [Mail]800
LeafMain content rendering fallback (SystemMainContentFallback) [System]6200
LeafManage display (FieldUIManageDisplayTestCase) [Field UI]8300
ExpandManage fields (FieldUIManageFieldsTestCase) [Field UI]19710
MessageGroupFilenameLineFunctionStatus
Field was created and appears in the overview page.Otherfield_ui.test435FieldUIManageFieldsTestCase->testHiddenFields()
LeafManaged file element test (FileManagedFileElementTestCase) [File]26800
LeafMenu link creation/deletion (MenuTestCase) [Menu]65200
LeafMenu links (MenuLinksUnitTestCase) [Menu]10000
LeafMenu rebuild test (MenuRebuildTestCase) [Menu]1000
ExpandMenu router (MenuRouterTestCase) [Menu]222100
MessageGroupFilenameLineFunctionStatus
The administrative theme can be correctly set in a theme callback.Othermenu.test187MenuRouterTestCase->testThemeCallbackAdministrative()
The administrative theme's CSS appears on the page.Othermenu.test188MenuRouterTestCase->testThemeCallbackAdministrative()
Theme callback inheritance correctly uses the administrative theme.Othermenu.test196MenuRouterTestCase->testThemeCallbackInheritance()
The administrative theme's CSS appears on the page.Othermenu.test197MenuRouterTestCase->testThemeCallbackInheritance()
The theme callback system is correctly triggered for an administrator when the site is in maintenance mode.Othermenu.test235MenuRouterTestCase->testThemeCallbackMaintenanceMode()
The administrative theme's CSS appears on the page.Othermenu.test236MenuRouterTestCase->testThemeCallbackMaintenanceMode()
The theme callback system uses an optional theme once it has been enabled.Othermenu.test284MenuRouterTestCase->testThemeCallbackOptionalTheme()
The optional theme's CSS appears on the page.Othermenu.test285MenuRouterTestCase->testThemeCallbackOptionalTheme()
The result of hook_custom_theme() does not override what was set in a theme callback.Othermenu.test334MenuRouterTestCase->testThemeCallbackHookCustomTheme()
The Seven theme's CSS appears on the page.Othermenu.test335MenuRouterTestCase->testThemeCallbackHookCustomTheme()
LeafMenu settings for nodes (MenuNodeTestCase) [Menu]6200
LeafMenu tree generation (MenuTreeDataTestCase) [Menu]400
LeafMenu tree output (MenuTreeOutputTestCase) [Menu]700
LeafMerge tests (DatabaseMergeTestCase) [Database]8300
LeafMiscellaneous AJAX tests (AJAXElementValidation) [AJAX]700
LeafMiscellaneous bootstrap unit tests (BootstrapMiscTestCase) [Bootstrap]100
LeafMissing update dependencies (UpdateDependencyMissingTestCase) [Update API]400
ExpandModule API (ModuleUnitTest) [Module]6420
MessageGroupFilenameLineFunctionStatus
The module implements cache is populated after requesting a page.Othermodule.test95ModuleUnitTest->testModuleImplements()
The module implements cache is populated after requesting a page.Othermodule.test102ModuleUnitTest->testModuleImplements()
LeafModule class loader (ModuleClassLoaderTestCase) [Module]1000
LeafModule dependencies (ModuleDependencyTestCase) [Module]16200
LeafModule installation (ModuleInstallTestCase) [Module]300
LeafModule uninstallation (ModuleUninstallTestCase) [Module]200
LeafModule versions (ModuleVersionTestCase) [Module]5100
ExpandMultilingual fields (LocaleMultilingualFieldsFunctionalTest) [Locale]6310
MessageGroupFilenameLineFunctionStatus
Body correctly displayed using Italian as requested languageOtherlocale.test2764LocaleMultilingualFieldsFunctionalTest->testMultilingualNodeForm()
LeafMultiple vocabulary term reference field (TaxonomyTermFieldMultipleVocabularyTestCase) [Taxonomy]2600
LeafMultistep form using form storage (FormsFormStorageTestCase) [Form API]12000
LeafMultistep node form basic options (MultiStepNodeFormBasicOptionsTest) [Node]1600
LeafNew default theme blocks (NewDefaultThemeBlocks) [Block]2200
LeafNo help (NoHelpTestCase) [Help]1200
LeafNode access (NodeAccessUnitTest) [Node]3400
LeafNode Access on any table (NodeAccessBaseTableTestCase) [Node]16300
LeafNode access pagination (NodeAccessPagerTestCase) [Node]3000
LeafNode access rebuild (NodeAccessRebuildTestCase) [Node]1900
LeafNode access records (NodeAccessRecordsUnitTest) [Node]2600
LeafNode administration (NodeAdminTestCase) [Node]14800
LeafNode blocks (NodeBlockFunctionalTest) [Node]8600
LeafNode creation (NodeCreationTestCase) [Node]3100
LeafNode edit (PageEditTestCase) [Node]9900
LeafNode edit permissions (PageViewTestCase) [Node]3500
LeafNode entity query alter (NodeEntityFieldQueryAlter) [Node]3300
LeafNode feed (NodeFeedTestCase) [Node]100
LeafNode load hooks (NodeLoadHooksTestCase) [Node]700
LeafNode post information display (NodePostSettingsTestCase) [Node]4000
LeafNode preview (PagePreviewTestCase) [Node]4100
LeafNode query alter (NodeQueryAlter) [Node]9400
LeafNode revision permissions (NodeRevisionPermissionsTestCase) [Node]3400
LeafNode revisions (NodeRevisionsTestCase) [Node]5000
LeafNode RSS Content (NodeRSSContentTestCase) [Node]1900
LeafNode save (NodeSaveTestCase) [Node]4800
LeafNode title (NodeTitleTestCase) [Node]2300
LeafNode title XSS filtering (NodeTitleXSSTestCase) [Node]2300
LeafNode token replacement (NodeTokenReplaceTestCase) [Node]3700
LeafNode type persist (NodeTypePersistenceTestCase) [Node]6500
LeafNode types (NodeTypeTestCase) [Node]11700
LeafNon default theme admin (NonDefaultBlockAdmin) [Block]1100
LeafNumber field (NumberFieldTestCase) [Field types]8700
ExpandOpenID account registration (OpenIDRegistrationTestCase) [OpenID]836520
MessageGroupFilenameLineFunctionStatus
OpenID redirect page was displayed.Otheropenid.test53OpenIDWebTestCase->submitLoginForm()
Found the Send buttonOtheropenid.test56OpenIDWebTestCase->submitLoginForm()
Found the requested form fields at Otheropenid.test56OpenIDWebTestCase->submitLoginForm()
User was asked to verify e-mail address.Otheropenid.test479OpenIDRegistrationTestCase->testRegisterUserWithEmailVerification()
A welcome message was sent to the user.Otheropenid.test480OpenIDRegistrationTestCase->testRegisterUserWithEmailVerification()
Undefined offset: 0Noticeopenid.test66OpenIDWebTestCase->getPasswordResetURLFromMail()
User was registered with right username.Otheropenid.test484OpenIDRegistrationTestCase->testRegisterUserWithEmailVerification()
Trying to get property of non-objectNoticeopenid.test485OpenIDRegistrationTestCase->testRegisterUserWithEmailVerification()
User was registered with right email address.Otheropenid.test485OpenIDRegistrationTestCase->testRegisterUserWithEmailVerification()
Trying to get property of non-objectNoticeopenid.test486OpenIDRegistrationTestCase->testRegisterUserWithEmailVerification()
User was registered with right timezone.Otheropenid.test486OpenIDRegistrationTestCase->testRegisterUserWithEmailVerification()
Trying to get property of non-objectNoticeopenid.test487OpenIDRegistrationTestCase->testRegisterUserWithEmailVerification()
User was registered with right language.Otheropenid.test487OpenIDRegistrationTestCase->testRegisterUserWithEmailVerification()
Trying to get property of non-objectNoticeopenid.test488OpenIDRegistrationTestCase->testRegisterUserWithEmailVerification()
OpenID redirect page was displayed.Otheropenid.test53OpenIDWebTestCase->submitLoginForm()
Found the Send buttonOtheropenid.test56OpenIDWebTestCase->submitLoginForm()
Found the requested form fields at Otheropenid.test56OpenIDWebTestCase->submitLoginForm()
Raw "You must validate your email address for this account before logging in via OpenID." foundOtheropenid.test491OpenIDRegistrationTestCase->testRegisterUserWithEmailVerification()
OpenID redirect page was displayed.Otheropenid.test53OpenIDWebTestCase->submitLoginForm()
Found the Send buttonOtheropenid.test56OpenIDWebTestCase->submitLoginForm()
Found the requested form fields at Otheropenid.test56OpenIDWebTestCase->submitLoginForm()
User was logged in.Otheropenid.test501OpenIDRegistrationTestCase->testRegisterUserWithEmailVerification()
OpenID redirect page was displayed.Otheropenid.test53OpenIDWebTestCase->submitLoginForm()
Found the Send buttonOtheropenid.test56OpenIDWebTestCase->submitLoginForm()
Found the requested form fields at Otheropenid.test56OpenIDWebTestCase->submitLoginForm()
User was logged in.Otheropenid.test523OpenIDRegistrationTestCase->testRegisterUserWithoutEmailVerification()
User was registered with right username.Otheropenid.test526OpenIDRegistrationTestCase->testRegisterUserWithoutEmailVerification()
Trying to get property of non-objectNoticeopenid.test527OpenIDRegistrationTestCase->testRegisterUserWithoutEmailVerification()
User was registered with right email address.Otheropenid.test527OpenIDRegistrationTestCase->testRegisterUserWithoutEmailVerification()
Trying to get property of non-objectNoticeopenid.test528OpenIDRegistrationTestCase->testRegisterUserWithoutEmailVerification()
User was registered with right timezone.Otheropenid.test528OpenIDRegistrationTestCase->testRegisterUserWithoutEmailVerification()
Trying to get property of non-objectNoticeopenid.test529OpenIDRegistrationTestCase->testRegisterUserWithoutEmailVerification()
User was registered with right language.Otheropenid.test529OpenIDRegistrationTestCase->testRegisterUserWithoutEmailVerification()
Trying to get property of non-objectNoticeopenid.test530OpenIDRegistrationTestCase->testRegisterUserWithoutEmailVerification()
OpenID redirect page was displayed.Otheropenid.test53OpenIDWebTestCase->submitLoginForm()
Found the Send buttonOtheropenid.test56OpenIDWebTestCase->submitLoginForm()
Found the requested form fields at Otheropenid.test56OpenIDWebTestCase->submitLoginForm()
User was logged in.Otheropenid.test535OpenIDRegistrationTestCase->testRegisterUserWithoutEmailVerification()
OpenID redirect page was displayed.Otheropenid.test53OpenIDWebTestCase->submitLoginForm()
Found the Send buttonOtheropenid.test56OpenIDWebTestCase->submitLoginForm()
Found the requested form fields at Otheropenid.test56OpenIDWebTestCase->submitLoginForm()
User was asked to complete the registration process manually.Otheropenid.test559OpenIDRegistrationTestCase->testRegisterUserWithInvalidSreg()
Form validation error for username was displayed.Otheropenid.test560OpenIDRegistrationTestCase->testRegisterUserWithInvalidSreg()
Form validation error for e-mail address was displayed.Otheropenid.test561OpenIDRegistrationTestCase->testRegisterUserWithInvalidSreg()
hook_openid_response() was invoked.Otheropenid.test562OpenIDRegistrationTestCase->testRegisterUserWithInvalidSreg()
No user object passed to hook_openid_response().Otheropenid.test563OpenIDRegistrationTestCase->testRegisterUserWithInvalidSreg()
Failed to set field mail to john@example.comOtheropenid.test568OpenIDRegistrationTestCase->testRegisterUserWithInvalidSreg()
Found the Create new account buttonOtheropenid.test568OpenIDRegistrationTestCase->testRegisterUserWithInvalidSreg()
Found the requested form fields at Otheropenid.test568OpenIDRegistrationTestCase->testRegisterUserWithInvalidSreg()
User was asked to verify e-mail address.Otheropenid.test569OpenIDRegistrationTestCase->testRegisterUserWithInvalidSreg()
Undefined offset: 0Noticeopenid.test66OpenIDWebTestCase->getPasswordResetURLFromMail()
User was registered with right username.Otheropenid.test573OpenIDRegistrationTestCase->testRegisterUserWithInvalidSreg()
Trying to get property of non-objectNoticeopenid.test574OpenIDRegistrationTestCase->testRegisterUserWithInvalidSreg()
Trying to get property of non-objectNoticeopenid.test575OpenIDRegistrationTestCase->testRegisterUserWithInvalidSreg()
User was registered with right e-mail address.Browseropenid.test583OpenIDRegistrationTestCase->testRegisterUserWithInvalidSreg()
Undefined variable: url_targetNoticedrupal_web_test_case.php2579DrupalWebTestCase->clickLink()
Clicked link OpenID identities () from http://drupaltestbot699-mysql/checkout/index.php/Browseropenid.test585OpenIDRegistrationTestCase->testRegisterUserWithInvalidSreg()
OpenID identity was registered.Otheropenid.test586OpenIDRegistrationTestCase->testRegisterUserWithInvalidSreg()
OpenID redirect page was displayed.Otheropenid.test53OpenIDWebTestCase->submitLoginForm()
Found the Send buttonOtheropenid.test56OpenIDWebTestCase->submitLoginForm()
Found the requested form fields at Otheropenid.test56OpenIDWebTestCase->submitLoginForm()
User was asked to complete the registration process manually.Otheropenid.test602OpenIDRegistrationTestCase->testRegisterUserWithoutSreg()
Failed to set field mail to john@example.comOtheropenid.test608OpenIDRegistrationTestCase->testRegisterUserWithoutSreg()
Found the Create new account buttonOtheropenid.test608OpenIDRegistrationTestCase->testRegisterUserWithoutSreg()
Found the requested form fields at Otheropenid.test608OpenIDRegistrationTestCase->testRegisterUserWithoutSreg()
User was asked to verify e-mail address.Otheropenid.test609OpenIDRegistrationTestCase->testRegisterUserWithoutSreg()
Undefined offset: 0Noticeopenid.test66OpenIDWebTestCase->getPasswordResetURLFromMail()
User was registered with right username.Otheropenid.test613OpenIDRegistrationTestCase->testRegisterUserWithoutSreg()
Trying to get property of non-objectNoticeopenid.test614OpenIDRegistrationTestCase->testRegisterUserWithoutSreg()
Trying to get property of non-objectNoticeopenid.test615OpenIDRegistrationTestCase->testRegisterUserWithoutSreg()
User was registered with right e-mail address.Browseropenid.test622OpenIDRegistrationTestCase->testRegisterUserWithoutSreg()
Undefined variable: url_targetNoticedrupal_web_test_case.php2579DrupalWebTestCase->clickLink()
Clicked link OpenID identities () from http://drupaltestbot699-mysql/checkout/index.php/Browseropenid.test624OpenIDRegistrationTestCase->testRegisterUserWithoutSreg()
OpenID identity was registered.Otheropenid.test625OpenIDRegistrationTestCase->testRegisterUserWithoutSreg()
OpenID redirect page was displayed.Otheropenid.test53OpenIDWebTestCase->submitLoginForm()
Found the Send buttonOtheropenid.test56OpenIDWebTestCase->submitLoginForm()
Found the requested form fields at Otheropenid.test56OpenIDWebTestCase->submitLoginForm()
User was logged in.Otheropenid.test653OpenIDRegistrationTestCase->testRegisterUserWithAXButNoSREG()
User was registered with right username.Otheropenid.test656OpenIDRegistrationTestCase->testRegisterUserWithAXButNoSREG()
Trying to get property of non-objectNoticeopenid.test657OpenIDRegistrationTestCase->testRegisterUserWithAXButNoSREG()
User was registered with right email address.Otheropenid.test657OpenIDRegistrationTestCase->testRegisterUserWithAXButNoSREG()
Trying to get property of non-objectNoticeopenid.test658OpenIDRegistrationTestCase->testRegisterUserWithAXButNoSREG()
User was registered with right timezone.Otheropenid.test658OpenIDRegistrationTestCase->testRegisterUserWithAXButNoSREG()
Trying to get property of non-objectNoticeopenid.test659OpenIDRegistrationTestCase->testRegisterUserWithAXButNoSREG()
User was registered with right language.Otheropenid.test659OpenIDRegistrationTestCase->testRegisterUserWithAXButNoSREG()
ExpandOpenID discovery and login (OpenIDFunctionalTestCase) [OpenID]2111013
MessageGroupFilenameLineFunctionStatus
OpenID redirect page was displayed.Otheropenid.test344OpenIDFunctionalTestCase->addIdentity()
Found the Send buttonOtheropenid.test347OpenIDFunctionalTestCase->addIdentity()
Found the requested form fields at Otheropenid.test347OpenIDFunctionalTestCase->addIdentity()
Identity drupaltestbot699-mysql/checkout/index.php/openid-test/yadis/xrds was added.Otheropenid.test353OpenIDFunctionalTestCase->addIdentity()
OpenID redirect page was displayed.Otheropenid.test344OpenIDFunctionalTestCase->addIdentity()
Found the Send buttonOtheropenid.test347OpenIDFunctionalTestCase->addIdentity()
Found the requested form fields at Otheropenid.test347OpenIDFunctionalTestCase->addIdentity()
Identity drupaltestbot699-mysql/checkout/index.php/openid-test/yadis/xrds/delegate was added.Otheropenid.test353OpenIDFunctionalTestCase->addIdentity()
OpenID redirect page was displayed.Otheropenid.test344OpenIDFunctionalTestCase->addIdentity()
Found the Send buttonOtheropenid.test347OpenIDFunctionalTestCase->addIdentity()
Found the requested form fields at Otheropenid.test347OpenIDFunctionalTestCase->addIdentity()
Identity http://drupaltestbot699-mysql/checkout/index.php/openid-test/yadis/xrds/server was added.Otheropenid.test353OpenIDFunctionalTestCase->addIdentity()
OpenID redirect page was displayed.Otheropenid.test344OpenIDFunctionalTestCase->addIdentity()
Found the Send buttonOtheropenid.test347OpenIDFunctionalTestCase->addIdentity()
Found the requested form fields at Otheropenid.test347OpenIDFunctionalTestCase->addIdentity()
Identity http://drupaltestbot699-mysql/checkout/index.php/openid-test/yadis/x-xrds-location was added.Otheropenid.test353OpenIDFunctionalTestCase->addIdentity()
OpenID redirect page was displayed.Otheropenid.test344OpenIDFunctionalTestCase->addIdentity()
Found the Send buttonOtheropenid.test347OpenIDFunctionalTestCase->addIdentity()
Found the requested form fields at Otheropenid.test347OpenIDFunctionalTestCase->addIdentity()
Identity http://drupaltestbot699-mysql/checkout/index.php/openid-test/yadis/http-equiv was added.Otheropenid.test353OpenIDFunctionalTestCase->addIdentity()
OpenID redirect page was displayed.Otheropenid.test344OpenIDFunctionalTestCase->addIdentity()
Found the Send buttonOtheropenid.test347OpenIDFunctionalTestCase->addIdentity()
Found the requested form fields at Otheropenid.test347OpenIDFunctionalTestCase->addIdentity()
Identity @example*résumé;%25 was added.Otheropenid.test353OpenIDFunctionalTestCase->addIdentity()
Identity http://drupaltestbot699-mysql/checkout/index.php/openid-test/html/openid1 was added.Otheropenid.test353OpenIDFunctionalTestCase->addIdentity()
OpenID redirect page was displayed.Otheropenid.test344OpenIDFunctionalTestCase->addIdentity()
Found the Send buttonOtheropenid.test347OpenIDFunctionalTestCase->addIdentity()
Found the requested form fields at Otheropenid.test347OpenIDFunctionalTestCase->addIdentity()
Identity http://drupaltestbot699-mysql/checkout/index.php/openid-test/html/openid2 was added.Otheropenid.test353OpenIDFunctionalTestCase->addIdentity()
OpenID redirect page was displayed.Otheropenid.test344OpenIDFunctionalTestCase->addIdentity()
Found the Send buttonOtheropenid.test347OpenIDFunctionalTestCase->addIdentity()
Found the requested form fields at Otheropenid.test347OpenIDFunctionalTestCase->addIdentity()
Identity http://drupaltestbot699-mysql/checkout/index.php/openid-test/redirect/0 was added.Otheropenid.test353OpenIDFunctionalTestCase->addIdentity()
OpenID redirect page was displayed.Otheropenid.test344OpenIDFunctionalTestCase->addIdentity()
Found the Send buttonOtheropenid.test347OpenIDFunctionalTestCase->addIdentity()
Found the requested form fields at Otheropenid.test347OpenIDFunctionalTestCase->addIdentity()
Identity http://drupaltestbot699-mysql/checkout/index.php/openid-test/redirect/2 was added.Otheropenid.test353OpenIDFunctionalTestCase->addIdentity()
OpenID redirect page was displayed.Otheropenid.test344OpenIDFunctionalTestCase->addIdentity()
Found the Send buttonOtheropenid.test347OpenIDFunctionalTestCase->addIdentity()
Found the requested form fields at Otheropenid.test347OpenIDFunctionalTestCase->addIdentity()
Identity http://drupaltestbot699-mysql/checkout/index.php/openid-test/yadis/xrds was added.Otheropenid.test353OpenIDFunctionalTestCase->addIdentity()
hook_openid_response() was invoked.Otheropenid.test193OpenIDFunctionalTestCase->testLogin()
Trying to get property of non-objectNoticeopenid.test194OpenIDFunctionalTestCase->testLogin()
Proper user object passed to hook_openid_response().Otheropenid.test194OpenIDFunctionalTestCase->testLogin()
OpenID redirect page was displayed.Otheropenid.test53OpenIDWebTestCase->submitLoginForm()
Found the Send buttonOtheropenid.test56OpenIDWebTestCase->submitLoginForm()
Found the requested form fields at Otheropenid.test56OpenIDWebTestCase->submitLoginForm()
User was logged in.Otheropenid.test202OpenIDFunctionalTestCase->testLogin()
hook_openid_response() was invoked.Otheropenid.test205OpenIDFunctionalTestCase->testLogin()
Trying to get property of non-objectNoticeopenid.test206OpenIDFunctionalTestCase->testLogin()
Proper user object passed to hook_openid_response().Otheropenid.test206OpenIDFunctionalTestCase->testLogin()
OpenID redirect page was displayed.Otheropenid.test215OpenIDFunctionalTestCase->testLogin()
Found the Send buttonOtheropenid.test218OpenIDFunctionalTestCase->testLogin()
Found the requested form fields at Otheropenid.test218OpenIDFunctionalTestCase->testLogin()
User was logged in.Otheropenid.test220OpenIDFunctionalTestCase->testLogin()
OpenID redirect page was displayed.Otheropenid.test53OpenIDWebTestCase->submitLoginForm()
Found the Send buttonOtheropenid.test56OpenIDWebTestCase->submitLoginForm()
Found the requested form fields at Otheropenid.test56OpenIDWebTestCase->submitLoginForm()
User was logged in.Otheropenid.test232OpenIDFunctionalTestCase->testLogin()
hook_openid_request_alter() were invoked.Otheropenid.test234OpenIDFunctionalTestCase->testLogin()
OpenID redirect page was displayed.Otheropenid.test344OpenIDFunctionalTestCase->addIdentity()
Found the Send buttonOtheropenid.test347OpenIDFunctionalTestCase->addIdentity()
Found the requested form fields at Otheropenid.test347OpenIDFunctionalTestCase->addIdentity()
Identity http://drupaltestbot699-mysql/checkout/index.php/openid-test/yadis/xrds was added.Otheropenid.test353OpenIDFunctionalTestCase->addIdentity()
OpenID redirect page was displayed.Otheropenid.test257OpenIDFunctionalTestCase->testLoginMaintenanceMode()
Found the Send buttonOtheropenid.test260OpenIDFunctionalTestCase->testLoginMaintenanceMode()
Found the requested form fields at Otheropenid.test260OpenIDFunctionalTestCase->testLoginMaintenanceMode()
User was logged in.Otheropenid.test262OpenIDFunctionalTestCase->testLoginMaintenanceMode()
"Operating in maintenance mode." foundOtheropenid.test265OpenIDFunctionalTestCase->testLoginMaintenanceMode()
OpenID redirect page was displayed.Otheropenid.test344OpenIDFunctionalTestCase->addIdentity()
Found the Send buttonOtheropenid.test347OpenIDFunctionalTestCase->addIdentity()
Found the requested form fields at Otheropenid.test347OpenIDFunctionalTestCase->addIdentity()
Identity http://drupaltestbot699-mysql/checkout/index.php/openid-test/yadis/xrds was added.Otheropenid.test353OpenIDFunctionalTestCase->addIdentity()
Identity appears in list.Otheropenid.test278OpenIDFunctionalTestCase->testDelete()
Undefined variable: url_targetNoticedrupal_web_test_case.php2579DrupalWebTestCase->clickLink()
Clicked link Delete () from http://drupaltestbot699-mysql/checkout/index.php/user/2/openidBrowseropenid.test281OpenIDFunctionalTestCase->testDelete()
Found the Confirm buttonOtheropenid.test282OpenIDFunctionalTestCase->testDelete()
Found the requested form fields at Otheropenid.test282OpenIDFunctionalTestCase->testDelete()
Identity deletedOtheropenid.test284OpenIDFunctionalTestCase->testDelete()
OpenID redirect page was displayed.Otheropenid.test344OpenIDFunctionalTestCase->addIdentity()
Found the Send buttonOtheropenid.test347OpenIDFunctionalTestCase->addIdentity()
Found the requested form fields at Otheropenid.test347OpenIDFunctionalTestCase->addIdentity()
Identity http://drupaltestbot699-mysql/checkout/index.php/openid-test/yadis/xrds was added.Otheropenid.test353OpenIDFunctionalTestCase->addIdentity()
OpenID redirect page was displayed.Otheropenid.test53OpenIDWebTestCase->submitLoginForm()
Found the Send buttonOtheropenid.test56OpenIDWebTestCase->submitLoginForm()
Found the requested form fields at Otheropenid.test56OpenIDWebTestCase->submitLoginForm()
User login was blocked.Otheropenid.test313OpenIDFunctionalTestCase->testBlockedUserLogin()
OpenID redirect page was displayed.Otheropenid.test53OpenIDWebTestCase->submitLoginForm()
Found the Send buttonOtheropenid.test56OpenIDWebTestCase->submitLoginForm()
Found the requested form fields at Otheropenid.test56OpenIDWebTestCase->submitLoginForm()
Raw "OpenID login failed." foundOtheropenid.test401OpenIDFunctionalTestCase->testSignatureValidation()
OpenID redirect page was displayed.Otheropenid.test53OpenIDWebTestCase->submitLoginForm()
Found the Send buttonOtheropenid.test56OpenIDWebTestCase->submitLoginForm()
Found the requested form fields at Otheropenid.test56OpenIDWebTestCase->submitLoginForm()
Raw "OpenID login failed." foundOtheropenid.test406OpenIDFunctionalTestCase->testSignatureValidation()
OpenID redirect page was displayed.Otheropenid.test53OpenIDWebTestCase->submitLoginForm()
Found the Send buttonOtheropenid.test56OpenIDWebTestCase->submitLoginForm()
Found the requested form fields at Otheropenid.test56OpenIDWebTestCase->submitLoginForm()
No e-mail address was supplied by provider.Browseropenid.test427OpenIDFunctionalTestCase->testSignatureValidation()
OpenID redirect page was displayed.Otheropenid.test53OpenIDWebTestCase->submitLoginForm()
Found the Send buttonOtheropenid.test56OpenIDWebTestCase->submitLoginForm()
Found the requested form fields at Otheropenid.test56OpenIDWebTestCase->submitLoginForm()
Username was supplied by provider.Browseropenid.test438OpenIDFunctionalTestCase->testSignatureValidation()
E-mail address supplied by provider was ignored.Browseropenid.test439OpenIDFunctionalTestCase->testSignatureValidation()
LeafOpenID helper functions (OpenIDUnitTest) [OpenID]4500
LeafOptions widgets (OptionsWidgetsTestCase) [Field types]26200
LeafOther Installation profiles (SimpleTestOtherInstallationProfileModuleTestsTestCase) [SimpleTest]1200
LeafOverriding server variables (BootstrapOverrideServerVariablesTestCase) [Bootstrap]600
ExpandPage cache test (BootstrapPageCacheTestCase) [Bootstrap]66140
MessageGroupFilenameLineFunctionStatus
Page was cached.Otherbootstrap.test130BootstrapPageCacheTestCase->testConditionalRequests()
Conditional request returned 304 Not Modified.Browserbootstrap.test135BootstrapPageCacheTestCase->testConditionalRequests()
Conditional request with obsolete If-Modified-Since date returned 304 Not Modified.Browserbootstrap.test138BootstrapPageCacheTestCase->testConditionalRequests()
Conditional request with obsolete If-Modified-Since date returned 304 Not Modified.Browserbootstrap.test141BootstrapPageCacheTestCase->testConditionalRequests()
Page was cached.Otherbootstrap.test145BootstrapPageCacheTestCase->testConditionalRequests()
Page was cached.Otherbootstrap.test149BootstrapPageCacheTestCase->testConditionalRequests()
Vary header was sent.Otherbootstrap.test169BootstrapPageCacheTestCase->testPageCache()
Cache-Control header was sent.Otherbootstrap.test170BootstrapPageCacheTestCase->testPageCache()
Page was cached.Otherbootstrap.test176BootstrapPageCacheTestCase->testPageCache()
Vary: Cookie header was sent.Otherbootstrap.test177BootstrapPageCacheTestCase->testPageCache()
Cache-Control header was sent.Otherbootstrap.test178BootstrapPageCacheTestCase->testPageCache()
Cache-Control header was sent.Otherbootstrap.test194BootstrapPageCacheTestCase->testPageCache()
Page was cached.Otherbootstrap.test220BootstrapPageCacheTestCase->testPageCompression()
Page was cached.Otherbootstrap.test227BootstrapPageCacheTestCase->testPageCompression()
LeafPager functionality (PagerFunctionalWebTestCase) [Pager]12300
LeafPager query tests (DatabaseSelectPagerDefaultTestCase) [Database]4700
LeafParsing .info files (CommonDrupalParseInfoFileTestCase) [Common]300
LeafPassword hashing (PasswordHashingTest) [System]1000
ExpandPath alias functionality (PathAliasTestCase) [Path]122100
MessageGroupFilenameLineFunctionStatus
Cache entry was created.Otherpath.test66PathAliasTestCase->testPathCache()
Cache entry was created.Otherpath.test71PathAliasTestCase->testPathCache()
Alias works.Otherpath.test89PathAliasTestCase->testAdminAlias()
HTTP response expected 200, actual 404Browserpath.test90PathAliasTestCase->testAdminAlias()
Changed alias works.Otherpath.test103PathAliasTestCase->testAdminAlias()
HTTP response expected 200, actual 404Browserpath.test104PathAliasTestCase->testAdminAlias()
Alias works.Otherpath.test147PathAliasTestCase->testNodeAlias()
HTTP response expected 200, actual 404Browserpath.test148PathAliasTestCase->testNodeAlias()
Changed alias works.Otherpath.test159PathAliasTestCase->testNodeAlias()
HTTP response expected 200, actual 404Browserpath.test160PathAliasTestCase->testNodeAlias()
ExpandPath aliases with languages (PathLanguageUITestCase) [Path]7530
MessageGroupFilenameLineFunctionStatus
Language-neutral URL alias worksOtherpath.test472PathLanguageUITestCase->testLanguageNeutralURLs()
English URL alias worksOtherpath.test487PathLanguageUITestCase->testDefaultLanguageURLs()
Foreign URL alias worksOtherpath.test502PathLanguageUITestCase->testNonDefaultURLs()
ExpandPath aliases with translated nodes (PathLanguageTestCase) [Path]531613
MessageGroupFilenameLineFunctionStatus
Alias works.Otherpath.test336PathLanguageTestCase->testAliasTranslation()
Failed to set field title to w0eRV7RJOtherpath.test347PathLanguageTestCase->testAliasTranslation()
Failed to set field body[und][0][value] to eEuMF1xoOtherpath.test347PathLanguageTestCase->testAliasTranslation()
Failed to set field path[alias] to eLWfqeGFOtherpath.test347PathLanguageTestCase->testAliasTranslation()
Found the Save buttonOtherpath.test347PathLanguageTestCase->testAliasTranslation()
Found the requested form fields at Otherpath.test347PathLanguageTestCase->testAliasTranslation()
Node found in database.Otherpath.test354PathLanguageTestCase->testAliasTranslation()
Trying to get property of non-objectNoticepath.test358PathLanguageTestCase->testAliasTranslation()
Alias for French translation works.Otherpath.test358PathLanguageTestCase->testAliasTranslation()
Trying to get property of non-objectNoticepath.test366PathLanguageTestCase->testAliasTranslation()
Trying to get property of non-objectNoticepath.test366PathLanguageTestCase->testAliasTranslation()
Undefined index: Noticepath.test366PathLanguageTestCase->testAliasTranslation()
URL contains the path alias.Otherpath.test367PathLanguageTestCase->testAliasTranslation()
Alias for English translation works.Otherpath.test392PathLanguageTestCase->testAliasTranslation()
Trying to get property of non-objectNoticepath.test396PathLanguageTestCase->testAliasTranslation()
Alias for French translation works.Otherpath.test396PathLanguageTestCase->testAliasTranslation()
Alias for English translation works.Otherpath.test404PathLanguageTestCase->testAliasTranslation()
Trying to get property of non-objectNoticepath.test416PathLanguageTestCase->testAliasTranslation()
Trying to get property of non-objectNoticepath.test417PathLanguageTestCase->testAliasTranslation()
Normal path works.Otherpath.test417PathLanguageTestCase->testAliasTranslation()
Trying to get property of non-objectNoticepath.test419PathLanguageTestCase->testAliasTranslation()
Trying to get property of non-objectNoticepath.test420PathLanguageTestCase->testAliasTranslation()
Normal path is the same.Otherpath.test420PathLanguageTestCase->testAliasTranslation()
Trying to get property of non-objectNoticepath.test423PathLanguageTestCase->testAliasTranslation()
Trying to get property of non-objectNoticepath.test423PathLanguageTestCase->testAliasTranslation()
Alias works.Otherpath.test424PathLanguageTestCase->testAliasTranslation()
Trying to get property of non-objectNoticepath.test426PathLanguageTestCase->testAliasTranslation()
Trying to get property of non-objectNoticepath.test426PathLanguageTestCase->testAliasTranslation()
Alias is the same.Otherpath.test427PathLanguageTestCase->testAliasTranslation()
ExpandPath language settings (LocalePathFunctionalTest) [Locale]4070
MessageGroupFilenameLineFunctionStatus
The "xx" front page is readibly available.Otherlocale.test1962LocalePathFunctionalTest->testPathLanguageConfiguration()
English alias works.Otherlocale.test1988LocalePathFunctionalTest->testPathLanguageConfiguration()
Custom language alias works.Otherlocale.test1992LocalePathFunctionalTest->testPathLanguageConfiguration()
First node links to the path alias.Otherlocale.test2035LocalePathFunctionalTest->testPathLanguageConfiguration()
Second node links to the path alias.Otherlocale.test2037LocalePathFunctionalTest->testPathLanguageConfiguration()
Custom alias returns first node.Otherlocale.test2041LocalePathFunctionalTest->testPathLanguageConfiguration()
Custom alias with prefix returns second node.Otherlocale.test2045LocalePathFunctionalTest->testPathLanguageConfiguration()
LeafPath lookup (PathLookupTest) [Path API]1300
LeafPath save (PathSaveTest) [Path API]400
ExpandPaths on non-English monolingual sites (PathMonolingualTestCase) [Path]27101
MessageGroupFilenameLineFunctionStatus
Failed to set field languages[en][enabled] to Otherpath.test537PathMonolingualTestCase->setUp()
Found the Save configuration buttonOtherpath.test537PathMonolingualTestCase->setUp()
Found the requested form fields at admin/config/regional/languageOtherpath.test537PathMonolingualTestCase->setUp()
Site is mono-lingualOtherpath.test540PathMonolingualTestCase->setUp()
Failed to set field language_interface[enabled][locale-url] to 1Otherpath.test545PathMonolingualTestCase->setUp()
Found the Save settings buttonOtherpath.test545PathMonolingualTestCase->setUp()
Found the requested form fields at admin/config/regional/language/detectionOtherpath.test545PathMonolingualTestCase->setUp()
Undefined variable: url_targetNoticedrupal_web_test_case.php2579DrupalWebTestCase->clickLink()
Clicked link Languages () from http://drupaltestbot699-mysql/checkout/index.php/fr/admin/configBrowserpath.test562PathMonolingualTestCase->testPageLinks()
Clicked link results in a valid pageBrowserpath.test563PathMonolingualTestCase->testPageLinks()
Page contains the add language textOtherpath.test564PathMonolingualTestCase->testPageLinks()
LeafPersonal contact form (ContactPersonalTestCase) [Contact]13600
LeafPHP filter access check (PHPAccessTestCase) [PHP]3900
LeafPHP filter functionality (PHPFilterTestCase) [PHP]4300
LeafPlural handling (LocalePluralFormatTest) [Locale]11500
LeafPoll add choice (PollJSAddChoice) [Poll]1600
LeafPoll choice deletion (PollDeleteChoiceTestCase) [Poll]5500
LeafPoll create (PollCreateTestCase) [Poll]27400
LeafPoll expiration (PollExpirationTestCase) [Poll]5300
LeafPoll token replacement (PollTokenReplaceTestCase) [Poll]13100
LeafPoll translation (PollTranslateTestCase) [Poll]7500
LeafPoll vote (PollVoteTestCase) [Poll]14900
LeafPrivate file test (FilePrivateTestCase) [File]2500
LeafProgrammatic form submissions (FormsProgrammaticTestCase) [Form API]2400
LeafQuery altering tests (DatabaseAlterTestCase) [Database]6200
LeafQuery logging (DatabaseLoggingTestCase) [Database]4300
LeafQuery tagging tests (DatabaseTaggingTestCase) [Database]3200
LeafQueue functionality (QueueTestCase) [Queue]1400
LeafRange query test (DatabaseRangeQueryTestCase) [Database]300
LeafRDF comment mapping (RdfCommentAttributesTestCase) [RDF]20700
LeafRDF mapping CRUD functions (RdfCrudTestCase) [RDF]1000
LeafRDF mapping definition functionality (RdfMappingDefinitionTestCase) [RDF]7100
LeafRDF mapping hook (RdfMappingHookTestCase) [RDF]600
LeafRDF namespaces (RdfGetRdfNamespacesTestCase) [RDF]500
LeafRDF namespaces serialization test (DrupalGetRdfNamespacesTestCase) [RDF]700
LeafRDF tracker page mapping (RdfTrackerAttributesTestCase) [RDF]3300
LeafRDFa markup (RdfRdfaMarkupTestCase) [RDF]2900
LeafRebuild arbitrary forms (FormsArbitraryRebuildTestCase) [Form API]1600
LeafRebuild content (NodeBuildContent) [Node]400
LeafRedirect functionality (CommonDrupalGotoTestCase) [Common]2100
LeafRegion content (CommonRegionContentTestCase) [Common]3400
LeafRegistry parse file test (RegistryParseFileTestCase) [System]200
LeafRegistry parse files test (RegistryParseFilesTestCase) [System]600
LeafRegression tests (DatabaseRegressionTestCase) [Database]3100
LeafRemove feed functionality (RemoveFeedTestCase) [Unknown]2500
ExpandRemove feed item functionality (RemoveFeedItemTestCase) [Unknown]2223660
MessageGroupFilenameLineFunctionStatus
Cannot use a scalar value as an arrayWarningblock.module281block_page_build()
Cannot use a scalar value as an arrayWarningblock.module281block_page_build()
Invalid argument supplied for foreach()Warningcommon.inc6456element_children()
Cannot use a scalar value as an arrayWarningcommon.inc5898drupal_render()
Cannot use a scalar value as an arrayWarningcommon.inc5951drupal_render()
HTTP response expected 403, actual 200Browseraggregator.test103AggregatorTestCase->updateFeedItems()
Total items in feed equal to the total items in database (2 != 0)Otheraggregator.test117AggregatorTestCase->updateFeedItems()
Value '0' is TRUE.Otheraggregator.test142AggregatorTestCase->updateAndRemove()
Cannot use a scalar value as an arrayWarningblock.module281block_page_build()
Cannot use a scalar value as an arrayWarningblock.module281block_page_build()
Invalid argument supplied for foreach()Warningcommon.inc6456element_children()
Cannot use a scalar value as an arrayWarningcommon.inc5898drupal_render()
Cannot use a scalar value as an arrayWarningcommon.inc5951drupal_render()
HTTP response expected 403, actual 200Browseraggregator.test103AggregatorTestCase->updateFeedItems()
Total items in feed equal to the total items in database (2 != 0)Otheraggregator.test117AggregatorTestCase->updateFeedItems()
Value '0' is TRUE.Otheraggregator.test142AggregatorTestCase->updateAndRemove()
Cannot use a scalar value as an arrayWarningblock.module281block_page_build()
Cannot use a scalar value as an arrayWarningblock.module281block_page_build()
Invalid argument supplied for foreach()Warningcommon.inc6456element_children()
Cannot use a scalar value as an arrayWarningcommon.inc5898drupal_render()
Cannot use a scalar value as an arrayWarningcommon.inc5951drupal_render()
HTTP response expected 403, actual 200Browseraggregator.test103AggregatorTestCase->updateFeedItems()
Total items in feed equal to the total items in database (2 != 0)Otheraggregator.test117AggregatorTestCase->updateFeedItems()
Value '0' is TRUE.Otheraggregator.test142AggregatorTestCase->updateAndRemove()
Cannot use a scalar value as an arrayWarningblock.module281block_page_build()
Cannot use a scalar value as an arrayWarningblock.module281block_page_build()
Invalid argument supplied for foreach()Warningcommon.inc6456element_children()
Cannot use a scalar value as an arrayWarningcommon.inc5898drupal_render()
Cannot use a scalar value as an arrayWarningcommon.inc5951drupal_render()
HTTP response expected 403, actual 200Browseraggregator.test103AggregatorTestCase->updateFeedItems()
Total items in feed equal to the total items in database (2 != 0)Otheraggregator.test117AggregatorTestCase->updateFeedItems()
Value '0' is TRUE.Otheraggregator.test142AggregatorTestCase->updateAndRemove()
Cannot use a scalar value as an arrayWarningblock.module281block_page_build()
Cannot use a scalar value as an arrayWarningblock.module281block_page_build()
Invalid argument supplied for foreach()Warningcommon.inc6456element_children()
Cannot use a scalar value as an arrayWarningcommon.inc5898drupal_render()
Cannot use a scalar value as an arrayWarningcommon.inc5951drupal_render()
HTTP response expected 403, actual 200Browseraggregator.test103AggregatorTestCase->updateFeedItems()
Total items in feed equal to the total items in database (2 != 0)Otheraggregator.test117AggregatorTestCase->updateFeedItems()
Value '0' is TRUE.Otheraggregator.test142AggregatorTestCase->updateAndRemove()
Cannot use a scalar value as an arrayWarningblock.module281block_page_build()
Cannot use a scalar value as an arrayWarningblock.module281block_page_build()
Invalid argument supplied for foreach()Warningcommon.inc6456element_children()
Cannot use a scalar value as an arrayWarningcommon.inc5898drupal_render()
Cannot use a scalar value as an arrayWarningcommon.inc5951drupal_render()
HTTP response expected 403, actual 200Browseraggregator.test103AggregatorTestCase->updateFeedItems()
Total items in feed equal to the total items in database (2 != 0)Otheraggregator.test117AggregatorTestCase->updateFeedItems()
Value '0' is TRUE.Otheraggregator.test142AggregatorTestCase->updateAndRemove()
Cannot use a scalar value as an arrayWarningblock.module281block_page_build()
Cannot use a scalar value as an arrayWarningblock.module281block_page_build()
Invalid argument supplied for foreach()Warningcommon.inc6456element_children()
Cannot use a scalar value as an arrayWarningcommon.inc5898drupal_render()
Cannot use a scalar value as an arrayWarningcommon.inc5951drupal_render()
HTTP response expected 403, actual 200Browseraggregator.test103AggregatorTestCase->updateFeedItems()
Total items in feed equal to the total items in database (2 != 0)Otheraggregator.test117AggregatorTestCase->updateFeedItems()
Value '0' is TRUE.Otheraggregator.test142AggregatorTestCase->updateAndRemove()
Cannot use a scalar value as an arrayWarningblock.module281block_page_build()
Cannot use a scalar value as an arrayWarningblock.module281block_page_build()
Invalid argument supplied for foreach()Warningcommon.inc6456element_children()
Cannot use a scalar value as an arrayWarningcommon.inc5898drupal_render()
Cannot use a scalar value as an arrayWarningcommon.inc5951drupal_render()
HTTP response expected 403, actual 200Browseraggregator.test103AggregatorTestCase->updateFeedItems()
Total items in feed equal to the total items in database (2 != 0)Otheraggregator.test117AggregatorTestCase->updateFeedItems()
Value '0' is TRUE.Otheraggregator.test142AggregatorTestCase->updateAndRemove()
Cannot use a scalar value as an arrayWarningblock.module281block_page_build()
Cannot use a scalar value as an arrayWarningblock.module281block_page_build()
Invalid argument supplied for foreach()Warningcommon.inc6456element_children()
Cannot use a scalar value as an arrayWarningcommon.inc5898drupal_render()
Cannot use a scalar value as an arrayWarningcommon.inc5951drupal_render()
HTTP response expected 403, actual 200Browseraggregator.test103AggregatorTestCase->updateFeedItems()
Total items in feed equal to the total items in database (2 != 0)Otheraggregator.test117AggregatorTestCase->updateFeedItems()
Value '0' is TRUE.Otheraggregator.test142AggregatorTestCase->updateAndRemove()
Cannot use a scalar value as an arrayWarningblock.module281block_page_build()
Cannot use a scalar value as an arrayWarningblock.module281block_page_build()
Invalid argument supplied for foreach()Warningcommon.inc6456element_children()
Cannot use a scalar value as an arrayWarningcommon.inc5898drupal_render()
Cannot use a scalar value as an arrayWarningcommon.inc5951drupal_render()
HTTP response expected 403, actual 200Browseraggregator.test103AggregatorTestCase->updateFeedItems()
Total items in feed equal to the total items in database (2 != 0)Otheraggregator.test117AggregatorTestCase->updateFeedItems()
Value '0' is TRUE.Otheraggregator.test142AggregatorTestCase->updateAndRemove()
Cannot use a scalar value as an arrayWarningblock.module281block_page_build()
Cannot use a scalar value as an arrayWarningblock.module281block_page_build()
Invalid argument supplied for foreach()Warningcommon.inc6456element_children()
Cannot use a scalar value as an arrayWarningcommon.inc5898drupal_render()
Cannot use a scalar value as an arrayWarningcommon.inc5951drupal_render()
HTTP response expected 403, actual 200Browseraggregator.test103AggregatorTestCase->updateFeedItems()
Total items in feed equal to the total items in database (2 != 0)Otheraggregator.test117AggregatorTestCase->updateFeedItems()
Value '0' is TRUE.Otheraggregator.test142AggregatorTestCase->updateAndRemove()
Cannot use a scalar value as an arrayWarningblock.module281block_page_build()
Cannot use a scalar value as an arrayWarningblock.module281block_page_build()
Invalid argument supplied for foreach()Warningcommon.inc6456element_children()
Cannot use a scalar value as an arrayWarningcommon.inc5898drupal_render()
Cannot use a scalar value as an arrayWarningcommon.inc5951drupal_render()
HTTP response expected 403, actual 200Browseraggregator.test103AggregatorTestCase->updateFeedItems()
Total items in feed equal to the total items in database (2 != 0)Otheraggregator.test117AggregatorTestCase->updateFeedItems()
Value '0' is TRUE.Otheraggregator.test142AggregatorTestCase->updateAndRemove()
LeafRequired modules (ModuleRequiredTestCase) [Module]1900
LeafRequirements hook failure (HookRequirementsTestCase) [Module]1600
LeafResettable static variables test (BootstrapResettableStaticTestCase) [Bootstrap]500
LeafRole assignment (UserRolesAssignmentTestCase) [User]5100
LeafRole permissions (UserPermissionsTestCase) [User]5000
LeafSchema API (SchemaTestCase) [Database]58800
LeafSearch and node access (SearchNodeAccessTest) [Search]1600
LeafSearch engine phrase queries (SearchExactTestCase) [Search]2500
LeafSearch engine queries (SearchMatchTestCase) [Search]14700
ExpandSearch engine ranking (SearchRankingTestCase) [Search]9210
MessageGroupFilenameLineFunctionStatus
Search ranking "views" order.Othersearch.test466SearchRankingTestCase->testRankings()
LeafSearch excerpt extraction (SearchExcerptTestCase) [Search]1600
LeafSearch expression insert/extract (SearchExpressionInsertExtractTestCase) [Search]2400
ExpandSearch language selection (SearchLanguageTestCase) [Search]4450
MessageGroupFilenameLineFunctionStatus
Default language updated.Browsersearch.test1984SearchLanguageTestCase->testLanguages()
Failed to set field languages[en][enabled] to Othersearch.test1986SearchLanguageTestCase->testLanguages()
Found the Save configuration buttonOthersearch.test1986SearchLanguageTestCase->testLanguages()
Found the requested form fields at admin/config/regional/languageOthersearch.test1986SearchLanguageTestCase->testLanguages()
Language disabled.Browsersearch.test1987SearchLanguageTestCase->testLanguages()
LeafSearch number matching (SearchNumberMatchingTestCase) [Search]29500
LeafSearch numbers (SearchNumbersTestCase) [Search]17500
LeafSearch page override (SearchPageOverride) [Search]1500
LeafSearch page text (SearchPageText) [Search]3700
LeafSearch simplify (SearchSimplifyTestCase) [Search]65700
LeafSecurity (FilterSecurityTestCase) [Filter]2800
LeafSelect tests (DatabaseSelectTestCase) [Database]16800
LeafSelect tests, complex (DatabaseSelectComplexTestCase) [Database]14300
LeafSelect tests, complex 2 (DatabaseSelectComplexTestCase2) [Database]1300
LeafSelect tests, ordered (DatabaseSelectOrderedTestCase) [Database]2900
LeafSelect tests, subqueries (DatabaseSelectSubqueryTestCase) [Database]4300
LeafSequences API (DatabaseNextIdCase) [Database]200
LeafSerialize query (DatabaseSerializeQueryTestCase) [Database]700
ExpandSession https handling (SessionHttpsTestCase) [Session]12322
MessageGroupFilenameLineFunctionStatus
Undefined index: SESS70d42d05e6511615380c9441a1407b7bNoticesession.test403SessionHttpsTestCase->testHttpsSession()
Undefined index: SESS70d42d05e6511615380c9441a1407b7bNoticesession.test407SessionHttpsTestCase->testHttpsSession()
Session correctly returned the stored data set by the anonymous session.Othersession.test442SessionHttpsTestCase->testHttpsSession()
Session correctly returned the stored data set by the anonymous session.Othersession.test442SessionHttpsTestCase->testHttpsSession()
ExpandSession tests (SessionTestCase) [Session]22190
MessageGroupFilenameLineFunctionStatus
Session correctly returned the stored data for an anonymous user.Sessionsession.test111SessionTestCase->testDataPersistence()
Session data is not saved for drupal_save_session(FALSE).Sessionsession.test118SessionTestCase->testDataPersistence()
Session cookie was sent.Othersession.test152SessionTestCase->testEmptyAnonymousSession()
New session was started.Othersession.test153SessionTestCase->testEmptyAnonymousSession()
Session was not empty.Othersession.test159SessionTestCase->testEmptyAnonymousSession()
Caching was bypassed.Othersession.test160SessionTestCase->testEmptyAnonymousSession()
Message was displayed.Othersession.test161SessionTestCase->testEmptyAnonymousSession()
Session cookie was deleted.Othersession.test162SessionTestCase->testEmptyAnonymousSession()
Page was cached.Othersession.test169SessionTestCase->testEmptyAnonymousSession()
ExpandShortcut link functionality (ShortcutLinksTestCase) [Shortcut]17810
MessageGroupFilenameLineFunctionStatus
"Add to shortcuts" link properly switched to "Remove from shortcuts".Othershortcut.test164ShortcutLinksTestCase->testShortcutQuickLink()
LeafShortcut set functionality (ShortcutSetsTestCase) [Shortcut]21600
LeafShutdown functions (ShutdownFunctionsTest) [System]500
LeafSimpleTest browser (SimpleTestBrowserTestCase) [SimpleTest]1600
LeafSimpleTest e-mail capturing (SimpleTestMailCaptureTestCase) [SimpleTest]1300
LeafSimpleTest error collector (CommonSimpleTestErrorCollectorTestCase) [Common]1600
LeafSimpleTest functionality (SimpleTestFunctionalTest) [SimpleTest]11600
ExpandSite maintenance mode functionality (SiteMaintenanceTestCase) [System]8010
MessageGroupFilenameLineFunctionStatus
Site maintenance mode message not displayed.Othersystem.test1137SiteMaintenanceTestCase->testSiteMaintenance()
LeafSite-wide contact form (ContactSitewideTestCase) [Contact]23900
LeafSize parsing test (CommonSizeUnitTestCase) [Common]3500
ExpandStatistics logging tests (StatisticsLoggingTestCase) [Statistics]21149
MessageGroupFilenameLineFunctionStatus
Page request was logged.Otherstatistics.test109StatisticsLoggingTestCase->testLogging()
Undefined offset: 0Noticestatistics.test110StatisticsLoggingTestCase->testLogging()
array_intersect_key(): Argument #1 is not an arrayWarningstatistics.test110StatisticsLoggingTestCase->testLogging()
Value NULL is equal to value array ( 'title' => 'pdDzkOQXgo1vjv3TnM1q8Zn4tgEVkLUU1ipdXnLsFGcBWUof8tnoeMNON6tnk5ZEAbtPGGuE0zLQWyFBUkj3rJK8kwSikYAYOTPZETjg06JYvADMTQhxmkV3u2M1BFyy5DXtOp1SgvIj8ASK3AHrR5sKmFRaypjNnKhs2K4FcHO9nIWJwr8Cxcip46NkzNmCjJZsycPjwtQIxnMOwrssOfNUMxWGQo7p3hwvOM6syrXF8Scaknda8gvSucS6pyJ', 'path' => 'node/1', ).Otherstatistics.test110StatisticsLoggingTestCase->testLogging()
Value NULL is identical to value '1'.Otherstatistics.test112StatisticsLoggingTestCase->testLogging()
Testing a cached page.Otherstatistics.test116StatisticsLoggingTestCase->testLogging()
Page request was logged.Otherstatistics.test118StatisticsLoggingTestCase->testLogging()
Undefined offset: 1Noticestatistics.test119StatisticsLoggingTestCase->testLogging()
array_intersect_key(): Argument #1 is not an arrayWarningstatistics.test119StatisticsLoggingTestCase->testLogging()
Value NULL is equal to value array ( 'title' => 'pdDzkOQXgo1vjv3TnM1q8Zn4tgEVkLUU1ipdXnLsFGcBWUof8tnoeMNON6tnk5ZEAbtPGGuE0zLQWyFBUkj3rJK8kwSikYAYOTPZETjg06JYvADMTQhxmkV3u2M1BFyy5DXtOp1SgvIj8ASK3AHrR5sKmFRaypjNnKhs2K4FcHO9nIWJwr8Cxcip46NkzNmCjJZsycPjwtQIxnMOwrssOfNUMxWGQo7p3hwvOM6syrXF8Scaknda8gvSucS6pyJ', 'path' => 'node/1', ).Otherstatistics.test119StatisticsLoggingTestCase->testLogging()
Value NULL is identical to value '2'.Otherstatistics.test121StatisticsLoggingTestCase->testLogging()
Page request was logged.Otherstatistics.test128StatisticsLoggingTestCase->testLogging()
Undefined offset: 5Noticestatistics.test129StatisticsLoggingTestCase->testLogging()
array_intersect_key(): Argument #1 is not an arrayWarningstatistics.test129StatisticsLoggingTestCase->testLogging()
Value NULL is equal to value array ( 'title' => 'pdDzkOQXgo1vjv3TnM1q8Zn4tgEVkLUU1ipdXnLsFGcBWUof8tnoeMNON6tnk5ZEAbtPGGuE0zLQWyFBUkj3rJK8kwSikYAYOTPZETjg06JYvADMTQhxmkV3u2M1BFyy5DXtOp1SgvIj8ASK3AHrR5sKmFRaypjNnKhs2K4FcHO9nIWJwr8Cxcip46NkzNmCjJZsycPjwtQIxnMOwrssOfNUMxWGQo7p3hwvOM6syrXF8Scaknda8gvSucS6pyJ', 'path' => 'node/1', ).Otherstatistics.test129StatisticsLoggingTestCase->testLogging()
Value NULL is identical to value '3'.Otherstatistics.test131StatisticsLoggingTestCase->testLogging()
Page request was logged.Otherstatistics.test141StatisticsLoggingTestCase->testLogging()
Undefined offset: 6Noticestatistics.test142StatisticsLoggingTestCase->testLogging()
array_intersect_key(): Argument #1 is not an arrayWarningstatistics.test142StatisticsLoggingTestCase->testLogging()
Value NULL is equal to value array ( 'title' => 'Edit Basic page pdDzkOQXgo1vjv3TnM1q8Zn4tgEVkLUU1ipdXnLsFGcBWUof8tnoeMNON6tnk5ZEAbtPGGuE0zLQWyFBUkj3rJK8kwSikYAYOTPZETjg06JYvADMTQhxmkV3u2M1BFyy5DXtOp1SgvIj8ASK3AHrR5sKmFRaypjNnKhs2K4FcHO9nIWJwr8Cxcip46NkzNmCjJZsycPjwtQIxnMOwrssOfNUMxWGQo7p3hwvOM6syrXF8Sc', 'path' => 'node/1/edit', ).Otherstatistics.test142StatisticsLoggingTestCase->testLogging()
Page request was logged for a path over 255 characters.Otherstatistics.test150StatisticsLoggingTestCase->testLogging()
Undefined offset: 7Noticestatistics.test151StatisticsLoggingTestCase->testLogging()
Value NULL is equal to value 'fKjEsF7ng7mQBKYlk8OpHjRMj1Y0nZ5OGGS4NK7AnXnwajsgNG9tiZGAcKUSx6C4ziWiUbLpCAEysU3gKUiz3oanTSvFM68e6249699raVx5aV6KDtpRYU5oLHIxQq62MwYWZgCIFZSPX2aDC1WtgPtBQNf8OI3fWYwFHhq5qMH008ByGZEDkqgzVDRRCIDFcMXwAeTy7jANuGXjY0ptk6Zan5M9L1MhtcjhEGnp6qsYa5g0pO3kCenI5MJBMF9'.Otherstatistics.test151StatisticsLoggingTestCase->testLogging()
ExpandStatistics reports tests (StatisticsReportsTestCase) [Statistics]8570
MessageGroupFilenameLineFunctionStatus
Hit title found.Otherstatistics.test211StatisticsReportsTestCase->testAccessLogging()
Hit URL found.Otherstatistics.test212StatisticsReportsTestCase->testAccessLogging()
Found the popular content block.Otherstatistics.test237StatisticsReportsTestCase->testPopularContentBlock()
Found today's popular content.Otherstatistics.test238StatisticsReportsTestCase->testPopularContentBlock()
Found the alll time popular content.Otherstatistics.test239StatisticsReportsTestCase->testPopularContentBlock()
Found the last viewed popular content.Otherstatistics.test240StatisticsReportsTestCase->testPopularContentBlock()
Found link to visited node.Otherstatistics.test242StatisticsReportsTestCase->testPopularContentBlock()
ExpandStatistics token replacement (StatisticsTokenReplaceTestCase) [Statistics]2746
MessageGroupFilenameLineFunctionStatus
date_timezone_set() expects parameter 1 to be DateTime, boolean givenWarningcommon.inc1985format_date()
date_format() expects parameter 1 to be DateTime, boolean givenWarningcommon.inc1995format_date()
date_timezone_set() expects parameter 1 to be DateTime, boolean givenWarningcommon.inc1985format_date()
date_format() expects parameter 1 to be DateTime, boolean givenWarningcommon.inc1995format_date()
No empty tokens generated.Otherstatistics.test480StatisticsTokenReplaceTestCase->testStatisticsTokenReplacement()
Statistics token [node:total-count] replaced.Otherstatistics.test484StatisticsTokenReplaceTestCase->testStatisticsTokenReplacement()
Statistics token [node:day-count] replaced.Otherstatistics.test484StatisticsTokenReplaceTestCase->testStatisticsTokenReplacement()
date_timezone_set() expects parameter 1 to be DateTime, boolean givenWarningcommon.inc1985format_date()
date_format() expects parameter 1 to be DateTime, boolean givenWarningcommon.inc1995format_date()
Statistics token [node:last-view:short] replaced.Otherstatistics.test484StatisticsTokenReplaceTestCase->testStatisticsTokenReplacement()
LeafStream wrappers (StreamWrapperTest) [File API]1900
LeafString filtering tests (CommonXssUnitTestCase) [Common]1700
LeafString translate, search and validate (LocaleTranslationFunctionalTest) [Locale]35800
LeafString translation using st() (LocaleInstallTest) [Locale]200
LeafSummary length (SummaryLengthTestCase) [Node]1800
LeafSyslog functionality (SyslogTestCase) [Syslog]1700
LeafSystem info alter (SystemInfoAlterTestCase) [System]1000
LeafTableselect form element type test (FormsElementsTableSelectFunctionalTest) [Form API]6900
LeafTablesort (TableSortTest) [System]600
LeafTablesort query tests (DatabaseSelectTableSortDefaultTestCase) [Database]4400
LeafTaxonomy RSS Content. (TaxonomyRSSTestCase) [Taxonomy]2400
LeafTaxonomy term functions and forms (TaxonomyTermTestCase) [Taxonomy]23400
LeafTaxonomy term hooks (TaxonomyHooksTestCase) [Taxonomy]2100
LeafTaxonomy term index (TaxonomyTermIndexTestCase) [Taxonomy]4600
LeafTaxonomy term multiple loading (TaxonomyLoadMultipleUnitTest) [Taxonomy]1900
LeafTaxonomy term reference field (TaxonomyTermFieldTestCase) [Taxonomy]4500
LeafTaxonomy term unit tests (TaxonomyTermUnitTest) [Taxonomy]1100
ExpandTaxonomy term URL aliases (PathTaxonomyTermTestCase) [Path]3520
MessageGroupFilenameLineFunctionStatus
Term can be accessed on URL alias.Otherpath.test259PathTaxonomyTermTestCase->testTermAlias()
Term can be accessed on changed URL alias.Otherpath.test269PathTaxonomyTermTestCase->testTermAlias()
ExpandTaxonomy theme switching (TaxonomyThemeTestCase) [Taxonomy]1720
MessageGroupFilenameLineFunctionStatus
The administrative theme's CSS appears on the page for adding a taxonomy term.Othertaxonomy.test1888TaxonomyThemeTestCase->testTaxonomyTermThemes()
The administrative theme's CSS appears on the page for editing a taxonomy term.Othertaxonomy.test1897TaxonomyThemeTestCase->testTaxonomyTermThemes()
LeafTaxonomy token replacement (TaxonomyTokenReplaceTestCase) [Taxonomy]5500
LeafTaxonomy vocabularies (TaxonomyVocabularyUnitTest) [Taxonomy]8300
LeafTaxonomy vocabulary interface (TaxonomyVocabularyFunctionalTest) [Taxonomy]10400
LeafTemporary query test (DatabaseTemporaryQueryTestCase) [Database]600
LeafTest for legacy node bug. (TaxonomyLegacyTestCase) [Taxonomy]1400
ExpandTest statistics admin. (StatisticsAdminTestCase) [Statistics]10660
MessageGroupFilenameLineFunctionStatus
Test node found.Otherstatistics.test344StatisticsAdminTestCase->testStatisticsSettings()
Node is viewed once.Otherstatistics.test349StatisticsAdminTestCase->testStatisticsSettings()
Node is viewed 2 times.Otherstatistics.test352StatisticsAdminTestCase->testStatisticsSettings()
Verifying that the node counter is incremented.Otherstatistics.test368StatisticsAdminTestCase->testDeleteNode()
Node is viewed once.Otherstatistics.test422StatisticsAdminTestCase->testExpiredLogs()
Hit URL found.Otherstatistics.test425StatisticsAdminTestCase->testExpiredLogs()
LeafTesting SimpleTest setUp (SimpleTestFolderTestCase) [SimpleTest]200
LeafText field (TextFieldTestCase) [Field types]19200
LeafText summary (TextSummaryTestCase) [Field types]13800
ExpandText translation (TextTranslationTestCase) [Field types]10420
MessageGroupFilenameLineFunctionStatus
The textfield widget is populated.Othertext.test471TextTranslationTestCase->testTextField()
The body field with delta 1 is shown.Othertext.test519TextTranslationTestCase->testTextFieldFormatted()
ExpandTheme API (ThemeUnitTest) [Theme]3740
MessageGroupFilenameLineFunctionStatus
Theme hook suggestion ran with data available from a preprocess function for the base hook.Othertheme.test64ThemeUnitTest->testPreprocessForSuggestions()
Theme hook suggestion ran with data available from a preprocess function for the base hook.Othertheme.test64ThemeUnitTest->testPreprocessForSuggestions()
The theme was able to implement an alter hook during page building before anything was rendered.Othertheme.test88ThemeUnitTest->testAlter()
The theme's .info file is able to override a module CSS file from being added to the page.Othertheme.test105ThemeUnitTest->testCSSOverride()
LeafTheme Datetime (ThemeDatetime) [Theme]500
ExpandTheme fast initialization (ThemeFastTestCase) [Theme]1010
MessageGroupFilenameLineFunctionStatus
The registry was not initializedOthertheme.test529ThemeFastTestCase->testUserAutocomplete()
LeafTheme functions (ThemeFunctionsTestCase) [Theme]2500
LeafTheme HTML Tag (ThemeHtmlTag) [Theme]200
ExpandTheme initialization in hook_init() (ThemeHookInitUnitTest) [Theme]221
MessageGroupFilenameLineFunctionStatus
Undefined index: theme_test_outputNoticetheme_test.module101theme_test_hook_init_page_callback()
Raw "Themed output generated in hook_init()" foundOthertheme.test499ThemeHookInitUnitTest->testThemeInitializationHookInit()
Raw "stark/css/layout.css" foundOthertheme.test502ThemeHookInitUnitTest->testThemeInitializationHookInit()
ExpandTheme interface functionality (SystemThemeFunctionalTest) [System]18740
MessageGroupFilenameLineFunctionStatus
Administration theme used on an administration page.Othersystem.test1835SystemThemeFunctionalTest->testAdministrationTheme()
Administration theme used on the add content page.Othersystem.test1841SystemThemeFunctionalTest->testAdministrationTheme()
Administration theme used on the edit content page.Othersystem.test1844SystemThemeFunctionalTest->testAdministrationTheme()
Administration theme used on an administration page.Othersystem.test1853SystemThemeFunctionalTest->testAdministrationTheme()
LeafTheme Table (ThemeTableUnitTest) [Theme]600
LeafThemeRegistry (ThemeRegistryTestCase) [Theme]600
LeafTimer test (BootstrapTimerTestCase) [Bootstrap]500
LeafToken replacement (TokenReplaceTestCase) [System]3600
LeafTop visitor blocking (StatisticsBlockVisitorsTestCase) [Statistics]4700
LeafTracker (TrackerTest) [Tracker]23400
LeafTransaction tests (DatabaseTransactionTestCase) [Database]7400
LeafTranslation export (LocaleExportFunctionalTest) [Locale]3100
ExpandTranslation functionality (TranslationTestCase) [Translation]54320
MessageGroupFilenameLineFunctionStatus
[Spanish] Language switch item found for English language in the node page area.Othertranslation.test166TranslationTestCase->testLanguageSwitchLinks()
[Spanish] Language switch item found for English language in the block-locale page area.Othertranslation.test166TranslationTestCase->testLanguageSwitchLinks()
LeafTranslation import (LocaleImportFunctionalTest) [Locale]11500
ExpandUI language negotiation (LocaleUILanguageNegotiationTest) [Locale]105212
MessageGroupFilenameLineFunctionStatus
URL (PATH) > DEFAULT: with language prefix, UI language is switched based on path prefixOtherlocale.test2482LocaleUILanguageNegotiationTest->runTest()
"Language negotiation method: locale-url" foundOtherlocale.test2483LocaleUILanguageNegotiationTest->runTest()
URL (PATH) > BROWSER: with langage prefix, UI language is based on path prefixOtherlocale.test2482LocaleUILanguageNegotiationTest->runTest()
"Language negotiation method: locale-url" foundOtherlocale.test2483LocaleUILanguageNegotiationTest->runTest()
Failed to set field language_interface[enabled][locale-browser] to 1Otherlocale.test2510LocaleUILanguageNegotiationTest->testUrlLanguageFallback()
Failed to set field language_interface[enabled][locale-url] to 1Otherlocale.test2510LocaleUILanguageNegotiationTest->testUrlLanguageFallback()
Failed to set field language_interface[weight][locale-browser] to -8Otherlocale.test2510LocaleUILanguageNegotiationTest->testUrlLanguageFallback()
Failed to set field language_interface[weight][locale-url] to -10Otherlocale.test2510LocaleUILanguageNegotiationTest->testUrlLanguageFallback()
Found the Save settings buttonOtherlocale.test2510LocaleUILanguageNegotiationTest->testUrlLanguageFallback()
Found the requested form fields at admin/config/regional/language/detectionOtherlocale.test2510LocaleUILanguageNegotiationTest->testUrlLanguageFallback()
Failed to set field blocks[locale_language_interface][region] to sidebar_firstOtherlocale.test2515LocaleUILanguageNegotiationTest->testUrlLanguageFallback()
Found the Save blocks buttonOtherlocale.test2515LocaleUILanguageNegotiationTest->testUrlLanguageFallback()
Found the requested form fields at admin/structure/blockOtherlocale.test2515LocaleUILanguageNegotiationTest->testUrlLanguageFallback()
Undefined offset: 0Noticelocale.test2527LocaleUILanguageNegotiationTest->testUrlLanguageFallback()
The browser language is the URL active languageOtherlocale.test2527LocaleUILanguageNegotiationTest->testUrlLanguageFallback()
Undefined offset: 0Noticelocale.test2531LocaleUILanguageNegotiationTest->testUrlLanguageFallback()
URLs are rewritten using the browser language.Otherlocale.test2531LocaleUILanguageNegotiationTest->testUrlLanguageFallback()
The url() function returns the right url (http://it.example.com/index.php/admin) in accordance with the chosen languageOtherlocale.test2570LocaleUILanguageNegotiationTest->testLanguageDomain()
The url() function returns the right https url (via options) (https://it.example.com/index.php/admin) in accordance with the chosen languageOtherlocale.test2576LocaleUILanguageNegotiationTest->testLanguageDomain()
The url() function returns the right url (via current url scheme) (https://it.example.com/index.php/admin) in accordance with the chosen languageOtherlocale.test2584LocaleUILanguageNegotiationTest->testLanguageDomain()
The url() function returns the right url (http://it.example.com/index.php/admin) in accordance with the chosen languageOtherlocale.test2570LocaleUILanguageNegotiationTest->testLanguageDomain()
The url() function returns the right https url (via options) (https://it.example.com/index.php/admin) in accordance with the chosen languageOtherlocale.test2576LocaleUILanguageNegotiationTest->testLanguageDomain()
The url() function returns the right url (via current url scheme) (https://it.example.com/index.php/admin) in accordance with the chosen languageOtherlocale.test2584LocaleUILanguageNegotiationTest->testLanguageDomain()
LeafUnassigned text format functionality (FilterNoFormatTestCase) [Filter]100
LeafUnicode handling (UnicodeUnitTest) [System]18200
LeafUnit tests (UpdateCoreUnitTestCase) [Update]400
LeafUnmanaged file copying (FileUnmanagedCopyTest) [File API]3100
LeafUnmanaged file copying (RemoteFileUnmanagedCopyTest) [File API (remote)]3400
LeafUnmanaged file delete (FileUnmanagedDeleteTest) [File API]800
LeafUnmanaged file delete (RemoteFileUnmanagedDeleteTest) [File API (remote)]1100
LeafUnmanaged file moving (FileUnmanagedMoveTest) [File API]2200
LeafUnmanaged file moving (RemoteFileUnmanagedMoveTest) [File API (remote)]2500
LeafUnmanaged file save data (FileUnmanagedSaveDataTest) [File API]700
LeafUnmanaged file save data (RemoteFileUnmanagedSaveDataTest) [File API (remote)]800
LeafUnmanaged recursive file delete (FileUnmanagedDeleteRecursiveTest) [File API]1700
LeafUnmanaged recursive file delete (RemoteFileUnmanagedDeleteRecursiveTest) [File API (remote)]2100
ExpandUpdate contrib functionality (UpdateTestContribCase) [Update]164240
MessageGroupFilenameLineFunctionStatus
Raw "<a href="http://example.com/project/drupal">Drupal</a>" foundOtherupdate.test275UpdateTestContribCase->testNoReleasesAvailable()
"Up to date" foundOtherupdate.test276UpdateTestContribCase->testNoReleasesAvailable()
"No available releases found" foundOtherupdate.test279UpdateTestContribCase->testNoReleasesAvailable()
Link to the Drupal project appears.Otherupdate.test49UpdateTestHelper->standardTests()
"Up to date" foundOtherupdate.test305UpdateTestContribCase->testUpdateContribBasic()
Link to aaa_update_test project appears.Otherupdate.test308UpdateTestContribCase->testUpdateContribBasic()
Link to the Drupal project appears.Otherupdate.test49UpdateTestHelper->standardTests()
"Up to date" foundOtherupdate.test360UpdateTestContribCase->testUpdateContribOrder()
Link to bbb_update_test project appears.Otherupdate.test371UpdateTestContribCase->testUpdateContribOrder()
Link to bbb_update_test project appears.Otherupdate.test372UpdateTestContribCase->testUpdateContribOrder()
'BBB Update test' project is listed before the 'CCC Update test' projectOtherupdate.test380UpdateTestContribCase->testUpdateContribOrder()
"Security update required!" foundOtherupdate.test420UpdateTestContribCase->testUpdateBaseThemeSecurityUpdate()
Link to the Update test base theme project appears.Otherupdate.test421UpdateTestContribCase->testUpdateBaseThemeSecurityUpdate()
Link to the Update test base theme project appears.Otherupdate.test474UpdateTestContribCase->testUpdateShowDisabledThemes()
Link to the Update test subtheme project appears.Otherupdate.test475UpdateTestContribCase->testUpdateShowDisabledThemes()
"Up to date" foundOtherupdate.test519UpdateTestContribCase->testUpdateBrokenFetchURL()
"Up to date" found more than onceOtherupdate.test522UpdateTestContribCase->testUpdateBrokenFetchURL()
"Checked available update data for 3 projects." found only onceOtherupdate.test532UpdateTestContribCase->testUpdateBrokenFetchURL()
"Failed to get available update data for one project." found only onceOtherupdate.test533UpdateTestContribCase->testUpdateBrokenFetchURL()
Link to aaa_update_test project appears.Otherupdate.test536UpdateTestContribCase->testUpdateBrokenFetchURL()
Link to bbb_update_test project appears.Otherupdate.test538UpdateTestContribCase->testUpdateBrokenFetchURL()
Link to aaa_update_test project appears.Otherupdate.test581UpdateTestContribCase->testHookUpdateStatusAlter()
Link to aaa_update_test project appears.Otherupdate.test589UpdateTestContribCase->testHookUpdateStatusAlter()
"Security update" foundOtherupdate.test594UpdateTestContribCase->testHookUpdateStatusAlter()
ExpandUpdate core functionality (UpdateCoreTestCase) [Update]181190
MessageGroupFilenameLineFunctionStatus
Link to the Drupal project appears.Otherupdate.test49UpdateTestHelper->standardTests()
"Up to date" foundOtherupdate.test78UpdateCoreTestCase->testNoUpdatesAvailable()
Link to the Drupal project appears.Otherupdate.test49UpdateTestHelper->standardTests()
"Update available" foundOtherupdate.test91UpdateCoreTestCase->testNormalUpdateAvailable()
Link to release appears.Otherupdate.test93UpdateCoreTestCase->testNormalUpdateAvailable()
Link to download appears.Otherupdate.test94UpdateCoreTestCase->testNormalUpdateAvailable()
Link to release notes appears.Otherupdate.test95UpdateCoreTestCase->testNormalUpdateAvailable()
Link to the Drupal project appears.Otherupdate.test49UpdateTestHelper->standardTests()
"Security update required!" foundOtherupdate.test107UpdateCoreTestCase->testSecurityUpdateAvailable()
Link to release appears.Otherupdate.test108UpdateCoreTestCase->testSecurityUpdateAvailable()
Link to download appears.Otherupdate.test109UpdateCoreTestCase->testSecurityUpdateAvailable()
Link to release notes appears.Otherupdate.test110UpdateCoreTestCase->testSecurityUpdateAvailable()
"Up to date" foundOtherupdate.test131UpdateCoreTestCase->testDatestampMismatch()
"Checked available update data for one project." foundOtherupdate.test160UpdateCoreTestCase->testModulePageUpToDate()
"Checked available update data for one project." foundOtherupdate.test177UpdateCoreTestCase->testModulePageRegularUpdate()
"There are updates available for your version of Drupal." foundOtherupdate.test179UpdateCoreTestCase->testModulePageRegularUpdate()
"Checked available update data for one project." foundOtherupdate.test194UpdateCoreTestCase->testModulePageSecurityUpdate()
"There is a security update available for your version of Drupal." foundOtherupdate.test197UpdateCoreTestCase->testModulePageSecurityUpdate()
"There is a security update available for your version of Drupal." foundOtherupdate.test202UpdateCoreTestCase->testModulePageSecurityUpdate()
LeafUpdate dependency hook invocation (UpdateDependencyHookInvocationTestCase) [Update API]400
LeafUpdate dependency ordering (UpdateDependencyOrderingTestCase) [Update API]500
LeafUpdate feed functionality (UpdateFeedTestCase) [Unknown]7600
ExpandUpdate feed item functionality (UpdateFeedItemTestCase) [Unknown]6225
MessageGroupFilenameLineFunctionStatus
Cannot use a scalar value as an arrayWarningblock.module281block_page_build()
Cannot use a scalar value as an arrayWarningblock.module281block_page_build()
Invalid argument supplied for foreach()Warningcommon.inc6456element_children()
Cannot use a scalar value as an arrayWarningcommon.inc5898drupal_render()
Cannot use a scalar value as an arrayWarningcommon.inc5951drupal_render()
HTTP response expected 403, actual 200Browseraggregator.test103AggregatorTestCase->updateFeedItems()
Total items in feed equal to the total items in database (5 != 0)Otheraggregator.test117AggregatorTestCase->updateFeedItems()
LeafUpdate functionality (UpdateScriptFunctionalTest) [System]20500
ExpandUpdate on cron functionality (AggregatorCronTestCase) [Unknown]5230
MessageGroupFilenameLineFunctionStatus
Expected number of items in database.Otheraggregator.test805AggregatorCronTestCase->testCron()
Expected number of items in database.Otheraggregator.test809AggregatorCronTestCase->testCron()
Expected number of items in database.Otheraggregator.test828AggregatorCronTestCase->testCron()
LeafUpdate tests (DatabaseUpdateTestCase) [Database]6200
LeafUpdate tests, Complex (DatabaseUpdateComplexTestCase) [Database]5900
LeafUpdate tests, LOB (DatabaseUpdateLOBTestCase) [Database]1500
LeafUpload and extract module functionality (UpdateTestUploadCase) [Update]6400
LeafUpload user picture (UserPictureTestCase) [User]10500
ExpandURL altering (UrlAlterFunctionalTest) [Path API]2690
MessageGroupFilenameLineFunctionStatus
Altered outbound URL user/2, expected user/hnMY4F45, and got ex.php/user/hnMY4F45.Otherpath.test157UrlAlterFunctionalTest->testUrlAlter()
Altered outbound URL user/2/test1, expected alias/test1, and got ex.php/alias/test1.Otherpath.test163UrlAlterFunctionalTest->testUrlAlter()
Altered outbound URL user/2/edit, expected alias/test2, and got ex.php/alias/test2.Otherpath.test172UrlAlterFunctionalTest->testUrlAlter()
Altered outbound URL user/3, expected user/3, and got ex.php/user/3.Otherpath.test177UrlAlterFunctionalTest->testUrlAlter()
Altered outbound URL forum, expected community, and got ex.php/community.Otherpath.test182UrlAlterFunctionalTest->testUrlAlter()
Altered outbound URL forum/2, expected community/2, and got ex.php/community/2.Otherpath.test191UrlAlterFunctionalTest->testUrlAlter()
request_path() returns the requested path.Otherpath.test199UrlAlterFunctionalTest->testCurrentUrlRequestedPath()
current_path() returns the internal path.Otherpath.test200UrlAlterFunctionalTest->testCurrentUrlRequestedPath()
$_GET['q'] is initialized with an empty request path.Otherpath.test208UrlAlterFunctionalTest->testGetQInitialized()
ExpandURL generation tests (CommonURLUnitTestCase) [Common]40160
MessageGroupFilenameLineFunctionStatus
/checkout/?q=node/123 == /checkout/index.php/node/123Othercommon.test260CommonURLUnitTestCase->testUrl()
/checkout/?q=node/123#foo == /checkout/index.php/node/123#fooOthercommon.test264CommonURLUnitTestCase->testUrl()
/checkout/?q=node/123&foo == /checkout/index.php/node/123?fooOthercommon.test268CommonURLUnitTestCase->testUrl()
/checkout/?q=node/123&foo=bar&bar=baz == /checkout/index.php/node/123?foo=bar&bar=bazOthercommon.test272CommonURLUnitTestCase->testUrl()
/checkout/?q=node/123&foo#bar == /checkout/index.php/node/123?foo#barOthercommon.test276CommonURLUnitTestCase->testUrl()
/checkout/?q=node/123&foo#0 == /checkout/index.php/node/123?foo#0Othercommon.test280CommonURLUnitTestCase->testUrl()
/checkout/?q=node/123&foo == /checkout/index.php/node/123?fooOthercommon.test284CommonURLUnitTestCase->testUrl()
/checkout/ == /checkout/index.php/Othercommon.test288CommonURLUnitTestCase->testUrl()
http://drupaltestbot699-mysql/checkout/?q=node/123 == http://drupaltestbot699-mysql/checkout/index.php/node/123Othercommon.test260CommonURLUnitTestCase->testUrl()
http://drupaltestbot699-mysql/checkout/?q=node/123#foo == http://drupaltestbot699-mysql/checkout/index.php/node/123#fooOthercommon.test264CommonURLUnitTestCase->testUrl()
http://drupaltestbot699-mysql/checkout/?q=node/123&foo == http://drupaltestbot699-mysql/checkout/index.php/node/123?fooOthercommon.test268CommonURLUnitTestCase->testUrl()
http://drupaltestbot699-mysql/checkout/?q=node/123&foo=bar&bar=baz == http://drupaltestbot699-mysql/checkout/index.php/node/123?foo=bar&bar=bazOthercommon.test272CommonURLUnitTestCase->testUrl()
http://drupaltestbot699-mysql/checkout/?q=node/123&foo#bar == http://drupaltestbot699-mysql/checkout/index.php/node/123?foo#barOthercommon.test276CommonURLUnitTestCase->testUrl()
http://drupaltestbot699-mysql/checkout/?q=node/123&foo#0 == http://drupaltestbot699-mysql/checkout/index.php/node/123?foo#0Othercommon.test280CommonURLUnitTestCase->testUrl()
http://drupaltestbot699-mysql/checkout/?q=node/123&foo == http://drupaltestbot699-mysql/checkout/index.php/node/123?fooOthercommon.test284CommonURLUnitTestCase->testUrl()
http://drupaltestbot699-mysql/checkout/ == http://drupaltestbot699-mysql/checkout/index.php/Othercommon.test288CommonURLUnitTestCase->testUrl()
LeafURL rewriting (LocaleUrlRewritingTest) [Locale]3300
LeafURL validation (CommonValidUrlUnitTestCase) [Common]7900
LeafUser account links (UserAccountLinksUnitTests) [User]1900
LeafUser administration (UserAdminTestCase) [User]6200
LeafUser autocompletion (UserAutocompleteTestCase) [User]2600
LeafUser blocks (UserBlocksUnitTests) [User]3900
LeafUser create (UserCreateTestCase) [User]2700
ExpandUser creation (LocaleUserCreationTest) [Locale]874716
MessageGroupFilenameLineFunctionStatus
Global language set in the language selector.Browserlocale.test1852LocaleUserCreationTest->testLocalUserCreation()
Failed to set field name to qGrEe9uoWGOtherlocale.test1864LocaleUserCreationTest->testLocalUserCreation()
Failed to set field mail to l7Es@example.comOtherlocale.test1864LocaleUserCreationTest->testLocalUserCreation()
Failed to set field pass[pass1] to qGrEe9uoWGOtherlocale.test1864LocaleUserCreationTest->testLocalUserCreation()
Failed to set field pass[pass2] to qGrEe9uoWGOtherlocale.test1864LocaleUserCreationTest->testLocalUserCreation()
Found the Create new account buttonOtherlocale.test1864LocaleUserCreationTest->testLocalUserCreation()
Found the requested form fields at fr/admin/people/createOtherlocale.test1864LocaleUserCreationTest->testLocalUserCreation()
Trying to get property of non-objectNoticelocale.test1867LocaleUserCreationTest->testLocalUserCreation()
New user has correct preferred language set.Otherlocale.test1867LocaleUserCreationTest->testLocalUserCreation()
Trying to get property of non-objectNoticelocale.test1868LocaleUserCreationTest->testLocalUserCreation()
New user has correct profile language set.Otherlocale.test1868LocaleUserCreationTest->testLocalUserCreation()
Failed to set field name to ejCxLDhEOlOtherlocale.test1882LocaleUserCreationTest->testLocalUserCreation()
Failed to set field mail to tzRW@example.comOtherlocale.test1882LocaleUserCreationTest->testLocalUserCreation()
Found the Create new account buttonOtherlocale.test1882LocaleUserCreationTest->testLocalUserCreation()
Found the requested form fields at fr/user/registerOtherlocale.test1882LocaleUserCreationTest->testLocalUserCreation()
Trying to get property of non-objectNoticelocale.test1885LocaleUserCreationTest->testLocalUserCreation()
New user has correct preferred language set.Otherlocale.test1885LocaleUserCreationTest->testLocalUserCreation()
Trying to get property of non-objectNoticelocale.test1886LocaleUserCreationTest->testLocalUserCreation()
New user has correct profile language set.Otherlocale.test1886LocaleUserCreationTest->testLocalUserCreation()
Trying to get property of non-objectNoticelocale.test1890LocaleUserCreationTest->testLocalUserCreation()
Language selector is accessible and correct language is selected.Browserlocale.test1894LocaleUserCreationTest->testLocalUserCreation()
Creating default object from empty valueRun-time noticelocale.test1897LocaleUserCreationTest->testLocalUserCreation()
Failed to set field pass[pass1] to a1zws3RbNyOtherlocale.test1903LocaleUserCreationTest->testLocalUserCreation()
Failed to set field pass[pass2] to a1zws3RbNyOtherlocale.test1903LocaleUserCreationTest->testLocalUserCreation()
Found the Save buttonOtherlocale.test1903LocaleUserCreationTest->testLocalUserCreation()
Found the requested form fields at fr/user//editOtherlocale.test1903LocaleUserCreationTest->testLocalUserCreation()
Undefined property: stdClass::$nameNoticedrupal_web_test_case.php1239DrupalWebTestCase->drupalLogin()
Failed to set field name to Otherlocale.test1905LocaleUserCreationTest->testLocalUserCreation()
Found the requested form fields at userOtherlocale.test1905LocaleUserCreationTest->testLocalUserCreation()
Undefined property: stdClass::$nameNoticedrupal_web_test_case.php1246DrupalWebTestCase->drupalLogin()
User successfully logged in.User loginlocale.test1905LocaleUserCreationTest->testLocalUserCreation()
Language selector is accessible and correct language is selected.Browserlocale.test1907LocaleUserCreationTest->testLocalUserCreation()
Failed to set field name to qGrEe9uoWGOtherlocale.test1864LocaleUserCreationTest->testLocalUserCreation()
Failed to set field mail to l7Es@example.comOtherlocale.test1864LocaleUserCreationTest->testLocalUserCreation()
Failed to set field pass[pass1] to qGrEe9uoWGOtherlocale.test1864LocaleUserCreationTest->testLocalUserCreation()
Failed to set field pass[pass2] to qGrEe9uoWGOtherlocale.test1864LocaleUserCreationTest->testLocalUserCreation()
Found the Create new account buttonOtherlocale.test1864LocaleUserCreationTest->testLocalUserCreation()
Found the requested form fields at fr/admin/people/createOtherlocale.test1864LocaleUserCreationTest->testLocalUserCreation()
Trying to get property of non-objectNoticelocale.test1867LocaleUserCreationTest->testLocalUserCreation()
New user has correct preferred language set.Otherlocale.test1867LocaleUserCreationTest->testLocalUserCreation()
Trying to get property of non-objectNoticelocale.test1868LocaleUserCreationTest->testLocalUserCreation()
New user has correct profile language set.Otherlocale.test1868LocaleUserCreationTest->testLocalUserCreation()
Failed to set field name to ejCxLDhEOlOtherlocale.test1882LocaleUserCreationTest->testLocalUserCreation()
Failed to set field mail to tzRW@example.comOtherlocale.test1882LocaleUserCreationTest->testLocalUserCreation()
Found the Create new account buttonOtherlocale.test1882LocaleUserCreationTest->testLocalUserCreation()
Found the requested form fields at fr/user/registerOtherlocale.test1882LocaleUserCreationTest->testLocalUserCreation()
Trying to get property of non-objectNoticelocale.test1885LocaleUserCreationTest->testLocalUserCreation()
New user has correct preferred language set.Otherlocale.test1885LocaleUserCreationTest->testLocalUserCreation()
Trying to get property of non-objectNoticelocale.test1886LocaleUserCreationTest->testLocalUserCreation()
New user has correct profile language set.Otherlocale.test1886LocaleUserCreationTest->testLocalUserCreation()
Trying to get property of non-objectNoticelocale.test1890LocaleUserCreationTest->testLocalUserCreation()
Language selector is accessible and correct language is selected.Browserlocale.test1894LocaleUserCreationTest->testLocalUserCreation()
Creating default object from empty valueRun-time noticelocale.test1897LocaleUserCreationTest->testLocalUserCreation()
Failed to set field pass[pass1] to a1zws3RbNyOtherlocale.test1903LocaleUserCreationTest->testLocalUserCreation()
Failed to set field pass[pass2] to a1zws3RbNyOtherlocale.test1903LocaleUserCreationTest->testLocalUserCreation()
Found the Save buttonOtherlocale.test1903LocaleUserCreationTest->testLocalUserCreation()
Found the requested form fields at fr/user//editOtherlocale.test1903LocaleUserCreationTest->testLocalUserCreation()
Undefined property: stdClass::$nameNoticedrupal_web_test_case.php1239DrupalWebTestCase->drupalLogin()
Failed to set field name to Otherlocale.test1905LocaleUserCreationTest->testLocalUserCreation()
Found the requested form fields at userOtherlocale.test1905LocaleUserCreationTest->testLocalUserCreation()
Undefined property: stdClass::$nameNoticedrupal_web_test_case.php1246DrupalWebTestCase->drupalLogin()
User successfully logged in.User loginlocale.test1905LocaleUserCreationTest->testLocalUserCreation()
Language selector is accessible and correct language is selected.Browserlocale.test1907LocaleUserCreationTest->testLocalUserCreation()
LeafUser edit (UserEditTestCase) [User]6600
LeafUser edited own account (UserEditedOwnAccountTestCase) [User]2300
LeafUser entity callback tests (UserEntityCallbacksTestCase) [User]700
LeafUser language settings (LocaleUserLanguageFunctionalTest) [Locale]9900
LeafUser login (UserLoginTestCase) [User]16300
ExpandUser poll vote capability. (PollVoteCheckHostname) [Poll]14410
MessageGroupFilenameLineFunctionStatus
Page was cached.Otherpoll.test547PollVoteCheckHostname->testHostnamePollVote()
LeafUser registration (UserRegistrationTestCase) [User]13600
LeafUser role administration (UserRoleAdminTestCase) [User]5300
LeafUser save test (UserSaveTestCase) [User]300
LeafUser search (UserUserSearchTestCase) [User]3900
LeafUser signatures (UserSignatureTestCase) [User]4700
LeafUser time zones (UserTimeZoneFunctionalTest) [User]2900
LeafUser token replacement (UserTokenReplaceTestCase) [User]3900
LeafUser validate current pass custom form (UserValidateCurrentPassCustomForm) [User]1700
LeafUsername/e-mail validation (UserValidationTestCase) [User]1600
LeafUUID handling (UuidUnitTestCase) [UUID]700
LeafVariable test (BootstrapVariableTestCase) [Bootstrap]900
LeafVertical tabs form element type test (FormsElementsVerticalTabsFunctionalTest) [Form API]400
LeafWidget customization (FieldUIAlterTestCase) [Field UI]2000
ExpandXML-RPC basic (XMLRPCBasicTestCase) [XML-RPC]421
MessageGroupFilenameLineFunctionStatus
Invalid argument supplied for foreach()Warningxmlrpc.test35XMLRPCBasicTestCase->testListMethods()
system.listMethods returned at least the minimum listingOtherxmlrpc.test41XMLRPCBasicTestCase->testListMethods()
system.methodSignature returns an array of signature arrays.Otherxmlrpc.test51XMLRPCBasicTestCase->testMethodSignature()
ExpandXML-RPC message and alteration (XMLRPCMessagesTestCase) [XML-RPC]252
MessageGroupFilenameLineFunctionStatus
XML-RPC messages.messageSizedInKB of 8 Kb size receivedOtherxmlrpc.test220XMLRPCMessagesTestCase->testSizedMessages()
XML-RPC messages.messageSizedInKB of 80 Kb size receivedOtherxmlrpc.test220XMLRPCMessagesTestCase->testSizedMessages()
XML-RPC messages.messageSizedInKB of 160 Kb size receivedOtherxmlrpc.test220XMLRPCMessagesTestCase->testSizedMessages()
array_diff(): Argument #1 is not an arrayWarningxmlrpc.test238XMLRPCMessagesTestCase->testAlterListMethods()
Method list is altered by hook_xmlrpc_alterOtherxmlrpc.test239XMLRPCMessagesTestCase->testAlterListMethods()
reset() expects parameter 1 to be array, null givenWarningxmlrpc.test240XMLRPCMessagesTestCase->testAlterListMethods()
Hiding builting system.methodSignature with hook_xmlrpc_alter worksOtherxmlrpc.test241XMLRPCMessagesTestCase->testAlterListMethods()
ExpandXML-RPC validator (XMLRPCValidator1IncTestCase) [XML-RPC]190
MessageGroupFilenameLineFunctionStatus
Value 15 is identical to value false.Otherxmlrpc.test114XMLRPCValidator1IncTestCase->testValidator1()
Value array ( 'ctLeftAngleBrackets' => 4, 'ctRightAngleBrackets' => 10, 'ctAmpersands' => 9, 'ctApostrophes' => 2, 'ctQuotes' => 6, ) is identical to value false.Otherxmlrpc.test119XMLRPCValidator1IncTestCase->testValidator1()
Value -69 is identical to value false.Otherxmlrpc.test124XMLRPCValidator1IncTestCase->testValidator1()
Value array ( 'sub1' => array ( 'bar' => 13, ), 'sub2' => 14, 'sub3' => array ( 'foo' => 1, 'baz' => 2, ), 'sub4' => array ( 'ss' => array ( 'sss' => array ( 'ssss' => 'sssss', ), ), ), ) is identical to value false.Otherxmlrpc.test132XMLRPCValidator1IncTestCase->testValidator1()
Value array ( 0 => -96, 1 => true, 2 => 'd5FfFCMd', 3 => -2.09, 4 => stdClass::__set_state(array( 'is_date' => true, 'year' => '2012', 'month' => '04', 'day' => '06', 'hour' => '22', 'minute' => '01', 'second' => '58', 'iso8601' => '20120406T22:01:58', )), 5 => 'zOpiADao7wfYEkes3qv9aGqXOpvMw5XT870xzZh0fwaysRf2ddlyiJgJNP7ECuc4IIW4boe4217IZhwTESEGsgA3ZGVCKV0337KT', ) is equal to value false.Otherxmlrpc.test145XMLRPCValidator1IncTestCase->testValidator1()
Value 'liUgu4Csl5y8Wv3BO3KE' is identical to value false.Otherxmlrpc.test155XMLRPCValidator1IncTestCase->testValidator1()
Value -60 is identical to value false.Otherxmlrpc.test172XMLRPCValidator1IncTestCase->testValidator1()
Value array ( 'times10' => -790, 'times100' => -7900, 'times1000' => -79000, ) is identical to value false.Otherxmlrpc.test178XMLRPCValidator1IncTestCase->testValidator1()
Value array ( 0 => 15, 1 => array ( 'ctLeftAngleBrackets' => 4, 'ctRightAngleBrackets' => 10, 'ctAmpersands' => 9, 'ctApostrophes' => 2, 'ctQuotes' => 6, ), 2 => -69, 3 => array ( 'sub1' => array ( 'bar' => 13, ), 'sub2' => 14, 'sub3' => array ( 'foo' => 1, 'baz' => 2, ), 'sub4' => array ( 'ss' => array ( 'sss' => array ( 'ssss' => 'sssss', ), ), ), ), 4 => array ( 0 => -96, 1 => true, 2 => 'd5FfFCMd', 3 => -2.09, 4 => stdClass::__set_state(array( 'is_date' => true, 'year' => '2012', 'month' => '04', 'day' => '06', 'hour' => '22', 'minute' => '01', 'second' => '58', 'iso8601' => '20120406T22:01:58', )), 5 => 'zOpiADao7wfYEkes3qv9aGqXOpvMw5XT870xzZh0fwaysRf2ddlyiJgJNP7ECuc4IIW4boe4217IZhwTESEGsgA3ZGVCKV0337KT', ), 5 => 'liUgu4Csl5y8Wv3BO3KE', 6 => -60, 7 => array ( 'times10' => -790, 'times100' => -7900, 'times1000' => -79000, ), ) is equal to value false.Otherxmlrpc.test193XMLRPCValidator1IncTestCase->testValidator1()