entity_forms-1499596-3.patch

Test status
StatusResult
Last receivedMon, 03/26/2012 - 01:31:37
Last requestedMon, 03/26/2012 - 01:32:03
Last testedMon, 03/26/2012 - 01:52:54
Test count1
Environment status
MySQLfail
File information
Fileentity_forms-1499596-3.patch
BranchDrupal core - 8.x
LinkIssue Link
SummaryFAILED: [[SimpleTest]]: [MySQL] 35,541 pass(es), 189 fail(s), and 53 exception(s).
Details

MySQL

  1. Setup environment
  2. Detect an invalid patch URL
  3. Detect invalid repository information
  4. Detect invalid patch format
  5. Detect a non-applicable patch
  6. Detect invalid PHP syntax
  7. Detect a Drupal installation failure
  8. Detect a test run failure
  9. Detect a failing test
    Review the test failures below then if necessary run them locally until the problem has been fixed.
  10. Complete test suite with all tests passing
35,541 pass(es), 189 fail(s), and 53 exception(s)

Non-pass

Test namePassFailException
ExpandAJAX multi form (AJAXMultiFormTestCase) [AJAX]241212
MessageGroupFilenameLineFunctionStatus
Undefined index: page_node_formNoticeform.inc760drupal_retrieve_form()
call_user_func_array() expects parameter 1 to be a valid callback, function 'page_node_form' not found or invalid function nameWarningform.inc811drupal_retrieve_form()
Undefined index: page_node_formNoticeform.inc760drupal_retrieve_form()
call_user_func_array() expects parameter 1 to be a valid callback, function 'page_node_form' not found or invalid function nameWarningform.inc811drupal_retrieve_form()
Found the correct number of field items on the initial page.Otherajax.test482AJAXMultiFormTestCase->testMultiForm()
Found the "add more" button on the initial page.Otherajax.test483AJAXMultiFormTestCase->testMultiForm()
Found the correct number of field items on the initial page.Otherajax.test482AJAXMultiFormTestCase->testMultiForm()
Found the "add more" button on the initial page.Otherajax.test483AJAXMultiFormTestCase->testMultiForm()
Undefined offset: 0Noticedrupal_web_test_case.php2057DrupalWebTestCase->drupalPostAJAX()
Undefined index: ajaxNoticedrupal_web_test_case.php2058DrupalWebTestCase->drupalPostAJAX()
Found the correct number of field items after an AJAX submission.Otherajax.test492AJAXMultiFormTestCase->testMultiForm()
Found the "add more" button after an AJAX submission.Otherajax.test493AJAXMultiFormTestCase->testMultiForm()
Undefined offset: 0Noticedrupal_web_test_case.php2057DrupalWebTestCase->drupalPostAJAX()
Undefined index: ajaxNoticedrupal_web_test_case.php2058DrupalWebTestCase->drupalPostAJAX()
Found the correct number of field items after an AJAX submission.Otherajax.test492AJAXMultiFormTestCase->testMultiForm()
Found the "add more" button after an AJAX submission.Otherajax.test493AJAXMultiFormTestCase->testMultiForm()
Undefined offset: 0Noticedrupal_web_test_case.php2057DrupalWebTestCase->drupalPostAJAX()
Undefined index: ajaxNoticedrupal_web_test_case.php2058DrupalWebTestCase->drupalPostAJAX()
Found the correct number of field items after an AJAX submission.Otherajax.test492AJAXMultiFormTestCase->testMultiForm()
Found the "add more" button after an AJAX submission.Otherajax.test493AJAXMultiFormTestCase->testMultiForm()
Undefined offset: 0Noticedrupal_web_test_case.php2057DrupalWebTestCase->drupalPostAJAX()
Undefined index: ajaxNoticedrupal_web_test_case.php2058DrupalWebTestCase->drupalPostAJAX()
Found the correct number of field items after an AJAX submission.Otherajax.test492AJAXMultiFormTestCase->testMultiForm()
Found the "add more" button after an AJAX submission.Otherajax.test493AJAXMultiFormTestCase->testMultiForm()
ExpandBlock availability (PollBlockTestCase) [Poll]153302
MessageGroupFilenameLineFunctionStatus
Found choice 0 with weight 1.Browserpoll.test69PollWebTestCase->pollCreate()
Found choice 1 with weight 2.Browserpoll.test69PollWebTestCase->pollCreate()
Found choice 2 with weight 3.Browserpoll.test69PollWebTestCase->pollCreate()
Found choice 3 with weight 4.Browserpoll.test69PollWebTestCase->pollCreate()
Found choice 4 with weight 5.Browserpoll.test69PollWebTestCase->pollCreate()
Found choice 5 with weight 6.Browserpoll.test69PollWebTestCase->pollCreate()
Found choice 6 with weight 7.Browserpoll.test69PollWebTestCase->pollCreate()
Failed to set field choice[chid:0][chtext] to vXAFNiglOtherpoll.test73PollWebTestCase->pollCreate()
Failed to set field choice[chid:1][chtext] to v7KmiFWNOtherpoll.test73PollWebTestCase->pollCreate()
Failed to set field choice[chid:2][chtext] to wx9c0cPNOtherpoll.test73PollWebTestCase->pollCreate()
Failed to set field choice[chid:3][chtext] to jX6tMdelOtherpoll.test73PollWebTestCase->pollCreate()
Failed to set field choice[chid:4][chtext] to lU9LGZqOOtherpoll.test73PollWebTestCase->pollCreate()
Failed to set field choice[chid:5][chtext] to mMnRhWqPOtherpoll.test73PollWebTestCase->pollCreate()
Failed to set field choice[chid:6][chtext] to hCAN6bAIOtherpoll.test73PollWebTestCase->pollCreate()
Found the requested form fields at Otherpoll.test73PollWebTestCase->pollCreate()
Poll has been created.Otherpoll.test75PollWebTestCase->pollCreate()
Trying to get property of non-objectNoticepoll.test76PollWebTestCase->pollCreate()
Poll has been found in the database.Otherpoll.test76PollWebTestCase->pollCreate()
Poll appears in block.Otherpoll.test405PollBlockTestCase->testRecentBlock()
Failed to set field choice to 1Otherpoll.test416PollBlockTestCase->testRecentBlock()
Found the Vote buttonOtherpoll.test416PollBlockTestCase->testRecentBlock()
Found the requested form fields at user/5Otherpoll.test416PollBlockTestCase->testRecentBlock()
Your vote was recorded.Otherpoll.test417PollBlockTestCase->testRecentBlock()
Vote count updated correctly.Otherpoll.test418PollBlockTestCase->testRecentBlock()
Link to older polls appears.Otherpoll.test419PollBlockTestCase->testRecentBlock()
Undefined variable: url_targetNoticedrupal_web_test_case.php2576DrupalWebTestCase->clickLink()
Clicked link Older polls () from http://drupaltestbot664-mysql/checkout/?q=user/5Browserpoll.test420PollBlockTestCase->testRecentBlock()
Link to poll listing correct.Otherpoll.test421PollBlockTestCase->testRecentBlock()
Failed to set field active to 0Otherpoll.test188PollWebTestCase->pollUpdate()
Found the Save buttonOtherpoll.test188PollWebTestCase->pollUpdate()
Found the requested form fields at node//editOtherpoll.test188PollWebTestCase->pollUpdate()
Poll has been updated.Otherpoll.test189PollWebTestCase->pollUpdate()
ExpandBlock functionality (BlockTestCase) [Block]35760
MessageGroupFilenameLineFunctionStatus
Failed to set field block[block][1] to Otherblock.test288BlockTestCase->testBlockVisibilityPerUser()
Found the requested form fields at user/2/editOtherblock.test288BlockTestCase->testBlockVisibilityPerUser()
Block was not displayed according to per user block visibility setting.Otherblock.test291BlockTestCase->testBlockVisibilityPerUser()
Failed to set field block[block][1] to 1Otherblock.test301BlockTestCase->testBlockVisibilityPerUser()
Found the requested form fields at user/2/editOtherblock.test301BlockTestCase->testBlockVisibilityPerUser()
Block was displayed according to per user block visibility setting.Otherblock.test304BlockTestCase->testBlockVisibilityPerUser()
ExpandComment language (LocaleCommentLanguageFunctionalTest) [Locale]5220
MessageGroupFilenameLineFunctionStatus
Failed to set field preferred_langcode to frOtherlocale.test2848LocaleCommentLanguageFunctionalTest->setUp()
Found the requested form fields at user/2/editOtherlocale.test2848LocaleCommentLanguageFunctionalTest->setUp()
ExpandFilter format access (FilterFormatAccessTestCase) [Filter]236111
MessageGroupFilenameLineFunctionStatus
Undefined variable: url_targetNoticedrupal_web_test_case.php2576DrupalWebTestCase->clickLink()
Clicked link Edit () from http://drupaltestbot664-mysql/checkout/?q=node/1Browserfilter.test549FilterFormatAccessTestCase->testFormatWidgetPermissions()
Text format access denied message found.Otherfilter.test552FilterFormatAccessTestCase->testFormatWidgetPermissions()
Failed to set field title to dm6IlCbaOtherfilter.test557FilterFormatAccessTestCase->testFormatWidgetPermissions()
Found the Preview buttonOtherfilter.test557FilterFormatAccessTestCase->testFormatWidgetPermissions()
Found the requested form fields at Otherfilter.test557FilterFormatAccessTestCase->testFormatWidgetPermissions()
Failed to set field title to dm6IlCbaOtherfilter.test561FilterFormatAccessTestCase->testFormatWidgetPermissions()
Found the Save buttonOtherfilter.test561FilterFormatAccessTestCase->testFormatWidgetPermissions()
Found the requested form fields at Otherfilter.test561FilterFormatAccessTestCase->testFormatWidgetPermissions()
Old title not found.Otherfilter.test562FilterFormatAccessTestCase->testFormatWidgetPermissions()
New title found.Otherfilter.test563FilterFormatAccessTestCase->testFormatWidgetPermissions()
Old title found.Otherfilter.test601FilterFormatAccessTestCase->testFormatWidgetPermissions()
ExpandForm validation handlers (FormValidationTestCase) [Form API]4810
MessageGroupFilenameLineFunctionStatus
Form element #value was altered.Browserform.test604FormValidationTestCase->testValidate()
ExpandFormat date (CommonFormatDateTestCase) [Common]61130
MessageGroupFilenameLineFunctionStatus
Failed to set field preferred_langcode to xxOthercommon.test2404CommonFormatDateTestCase->testFormatDate()
Failed to set field timezone to America/Los_AngelesOthercommon.test2404CommonFormatDateTestCase->testFormatDate()
Found the requested form fields at user/3/editOthercommon.test2404CommonFormatDateTestCase->testFormatDate()
Test custom date format.Othercommon.test2418CommonFormatDateTestCase->testFormatDate()
Test long date format.Othercommon.test2419CommonFormatDateTestCase->testFormatDate()
Test medium date format.Othercommon.test2420CommonFormatDateTestCase->testFormatDate()
Test short date format.Othercommon.test2421CommonFormatDateTestCase->testFormatDate()
Test default date format.Othercommon.test2422CommonFormatDateTestCase->testFormatDate()
Test html_datetime date format.Othercommon.test2424CommonFormatDateTestCase->testFormatDate()
Test html_date date format.Othercommon.test2425CommonFormatDateTestCase->testFormatDate()
Test html_time date format.Othercommon.test2426CommonFormatDateTestCase->testFormatDate()
Test html_yearless_date date format.Othercommon.test2427CommonFormatDateTestCase->testFormatDate()
Test html_week date format.Othercommon.test2428CommonFormatDateTestCase->testFormatDate()
ExpandMultilingual fields (LocaleMultilingualFieldsFunctionalTest) [Locale]6131
MessageGroupFilenameLineFunctionStatus
Field language correctly set.Otherlocale.test2744LocaleMultilingualFieldsFunctionalTest->testMultilingualNodeForm()
Field language correctly changed.Otherlocale.test2757LocaleMultilingualFieldsFunctionalTest->testMultilingualNodeForm()
Undefined index: enNoticelocale.test2798LocaleMultilingualFieldsFunctionalTest->testMultilingualDisplaySettings()
Node body found.Otherlocale.test2798LocaleMultilingualFieldsFunctionalTest->testMultilingualDisplaySettings()
ExpandNode edit (PageEditTestCase) [Node]88111
MessageGroupFilenameLineFunctionStatus
Undefined variable: url_targetNoticedrupal_web_test_case.php2576DrupalWebTestCase->clickLink()
Clicked link Edit () from http://drupaltestbot664-mysql/checkout/?q=node/1Browsernode.test323PageEditTestCase->testPageEdit()
On edit page.Othernode.test326PageEditTestCase->testPageEdit()
"Edit(active tab)" foundEdit tab found and marked active.node.test331PageEditTestCase->testPageEdit()
Title field displayed.Browsernode.test332PageEditTestCase->testPageEdit()
Body field displayed.Browsernode.test333PageEditTestCase->testPageEdit()
Failed to set field title to fPfYHYMKOthernode.test340PageEditTestCase->testPageEdit()
Failed to set field body[und][0][value] to adSeAKkgCjzszoZtOthernode.test340PageEditTestCase->testPageEdit()
Found the Save buttonOthernode.test340PageEditTestCase->testPageEdit()
Found the requested form fields at Othernode.test340PageEditTestCase->testPageEdit()
Title displayed.Othernode.test343PageEditTestCase->testPageEdit()
Body displayed.Othernode.test344PageEditTestCase->testPageEdit()
ExpandOpenID account registration (OpenIDRegistrationTestCase) [OpenID]1292324
MessageGroupFilenameLineFunctionStatus
Undefined index: errorNoticeopenid.module752openid_authentication()
Invalid argument supplied for foreach()Warningopenid.module752openid_authentication()
User was asked to verify e-mail address.Otheropenid.test479OpenIDRegistrationTestCase->testRegisterUserWithEmailVerification()
A welcome message was sent to the user.Otheropenid.test480OpenIDRegistrationTestCase->testRegisterUserWithEmailVerification()
Undefined offset: 0Noticeopenid.test66OpenIDWebTestCase->getPasswordResetURLFromMail()
User was registered with right username.Otheropenid.test484OpenIDRegistrationTestCase->testRegisterUserWithEmailVerification()
Trying to get property of non-objectNoticeopenid.test485OpenIDRegistrationTestCase->testRegisterUserWithEmailVerification()
User was registered with right email address.Otheropenid.test485OpenIDRegistrationTestCase->testRegisterUserWithEmailVerification()
Trying to get property of non-objectNoticeopenid.test486OpenIDRegistrationTestCase->testRegisterUserWithEmailVerification()
User was registered with right timezone.Otheropenid.test486OpenIDRegistrationTestCase->testRegisterUserWithEmailVerification()
Trying to get property of non-objectNoticeopenid.test487OpenIDRegistrationTestCase->testRegisterUserWithEmailVerification()
User was registered with right language.Otheropenid.test487OpenIDRegistrationTestCase->testRegisterUserWithEmailVerification()
Trying to get property of non-objectNoticeopenid.test488OpenIDRegistrationTestCase->testRegisterUserWithEmailVerification()
Undefined index: errorNoticeopenid.module752openid_authentication()
Invalid argument supplied for foreach()Warningopenid.module752openid_authentication()
Raw "You must validate your email address for this account before logging in via OpenID." foundOtheropenid.test491OpenIDRegistrationTestCase->testRegisterUserWithEmailVerification()
Undefined index: errorNoticeopenid.module752openid_authentication()
Invalid argument supplied for foreach()Warningopenid.module752openid_authentication()
User was logged in.Otheropenid.test501OpenIDRegistrationTestCase->testRegisterUserWithEmailVerification()
Undefined index: errorNoticeopenid.module752openid_authentication()
Invalid argument supplied for foreach()Warningopenid.module752openid_authentication()
User was logged in.Otheropenid.test523OpenIDRegistrationTestCase->testRegisterUserWithoutEmailVerification()
User was registered with right username.Otheropenid.test526OpenIDRegistrationTestCase->testRegisterUserWithoutEmailVerification()
Trying to get property of non-objectNoticeopenid.test527OpenIDRegistrationTestCase->testRegisterUserWithoutEmailVerification()
User was registered with right email address.Otheropenid.test527OpenIDRegistrationTestCase->testRegisterUserWithoutEmailVerification()
Trying to get property of non-objectNoticeopenid.test528OpenIDRegistrationTestCase->testRegisterUserWithoutEmailVerification()
User was registered with right timezone.Otheropenid.test528OpenIDRegistrationTestCase->testRegisterUserWithoutEmailVerification()
Trying to get property of non-objectNoticeopenid.test529OpenIDRegistrationTestCase->testRegisterUserWithoutEmailVerification()
User was registered with right language.Otheropenid.test529OpenIDRegistrationTestCase->testRegisterUserWithoutEmailVerification()
Trying to get property of non-objectNoticeopenid.test530OpenIDRegistrationTestCase->testRegisterUserWithoutEmailVerification()
Undefined index: errorNoticeopenid.module752openid_authentication()
Invalid argument supplied for foreach()Warningopenid.module752openid_authentication()
User was logged in.Otheropenid.test535OpenIDRegistrationTestCase->testRegisterUserWithoutEmailVerification()
User was asked to verify e-mail address.Otheropenid.test569OpenIDRegistrationTestCase->testRegisterUserWithInvalidSreg()
OpenID identity was registered.Otheropenid.test586OpenIDRegistrationTestCase->testRegisterUserWithInvalidSreg()
User was asked to verify e-mail address.Otheropenid.test609OpenIDRegistrationTestCase->testRegisterUserWithoutSreg()
OpenID identity was registered.Otheropenid.test625OpenIDRegistrationTestCase->testRegisterUserWithoutSreg()
Undefined index: errorNoticeopenid.module752openid_authentication()
Invalid argument supplied for foreach()Warningopenid.module752openid_authentication()
User was logged in.Otheropenid.test653OpenIDRegistrationTestCase->testRegisterUserWithAXButNoSREG()
User was registered with right username.Otheropenid.test656OpenIDRegistrationTestCase->testRegisterUserWithAXButNoSREG()
Trying to get property of non-objectNoticeopenid.test657OpenIDRegistrationTestCase->testRegisterUserWithAXButNoSREG()
User was registered with right email address.Otheropenid.test657OpenIDRegistrationTestCase->testRegisterUserWithAXButNoSREG()
Trying to get property of non-objectNoticeopenid.test658OpenIDRegistrationTestCase->testRegisterUserWithAXButNoSREG()
User was registered with right timezone.Otheropenid.test658OpenIDRegistrationTestCase->testRegisterUserWithAXButNoSREG()
Trying to get property of non-objectNoticeopenid.test659OpenIDRegistrationTestCase->testRegisterUserWithAXButNoSREG()
User was registered with right language.Otheropenid.test659OpenIDRegistrationTestCase->testRegisterUserWithAXButNoSREG()
ExpandOpenID discovery and login (OpenIDFunctionalTestCase) [OpenID]31310
MessageGroupFilenameLineFunctionStatus
Username was supplied by provider.Browseropenid.test438OpenIDFunctionalTestCase->testSignatureValidation()
ExpandPath aliases with translated nodes (PathLanguageTestCase) [Path]6520
MessageGroupFilenameLineFunctionStatus
Failed to set field preferred_langcode to frOtherpath.test363PathLanguageTestCase->testAliasTranslation()
Found the requested form fields at user/2/editOtherpath.test363PathLanguageTestCase->testAliasTranslation()
ExpandPoll create (PollCreateTestCase) [Poll]250214
MessageGroupFilenameLineFunctionStatus
Found choice 0 with weight 1.Browserpoll.test69PollWebTestCase->pollCreate()
Found choice 1 with weight 2.Browserpoll.test69PollWebTestCase->pollCreate()
Found choice 2 with weight 3.Browserpoll.test69PollWebTestCase->pollCreate()
Found choice 3 with weight 4.Browserpoll.test69PollWebTestCase->pollCreate()
Found choice 4 with weight 5.Browserpoll.test69PollWebTestCase->pollCreate()
Found choice 5 with weight 6.Browserpoll.test69PollWebTestCase->pollCreate()
Found choice 6 with weight 7.Browserpoll.test69PollWebTestCase->pollCreate()
Failed to set field choice[chid:0][chtext] to ljDEopRIOtherpoll.test73PollWebTestCase->pollCreate()
Failed to set field choice[chid:1][chtext] to k5LjAQ71Otherpoll.test73PollWebTestCase->pollCreate()
Failed to set field choice[chid:2][chtext] to cpsLl2ByOtherpoll.test73PollWebTestCase->pollCreate()
Failed to set field choice[chid:3][chtext] to qj6Vfa6hOtherpoll.test73PollWebTestCase->pollCreate()
Failed to set field choice[chid:4][chtext] to alLcVc9NOtherpoll.test73PollWebTestCase->pollCreate()
Failed to set field choice[chid:5][chtext] to jIHJRPTXOtherpoll.test73PollWebTestCase->pollCreate()
Failed to set field choice[chid:6][chtext] to uzqbVyzEOtherpoll.test73PollWebTestCase->pollCreate()
Found the requested form fields at Otherpoll.test73PollWebTestCase->pollCreate()
Poll has been created.Otherpoll.test75PollWebTestCase->pollCreate()
Trying to get property of non-objectNoticepoll.test76PollWebTestCase->pollCreate()
Poll has been found in the database.Otherpoll.test76PollWebTestCase->pollCreate()
Poll appears in poll list.Otherpoll.test209PollCreateTestCase->testPollCreate()
Poll is active.Otherpoll.test210PollCreateTestCase->testPollCreate()
Undefined variable: url_targetNoticedrupal_web_test_case.php2576DrupalWebTestCase->clickLink()
Clicked link iR8erhFz () from http://drupaltestbot664-mysql/checkout/?q=pollBrowserpoll.test213PollCreateTestCase->testPollCreate()
Link to poll correct.Otherpoll.test214PollCreateTestCase->testPollCreate()
array_flip(): Can only flip STRING and INTEGER values!Warningentity.controller.inc186DrupalDefaultEntityController->load()
EntityMalformedException: Missing bundle property on entity of type node. in entity_extract_ids() (line 151 of /var/lib/drupaltestbot/sites/default/files/checkout/core/modules/entity/entity.module).Uncaught exceptionentity.module151entity_extract_ids()
ExpandRebuild arbitrary forms (FormsArbitraryRebuildTestCase) [Form API]6100
MessageGroupFilenameLineFunctionStatus
Found the Rebuild buttonOtherform.test1574FormsArbitraryRebuildTestCase->testUserRegistrationRebuild()
Found the requested form fields at user/registerOtherform.test1574FormsArbitraryRebuildTestCase->testUserRegistrationRebuild()
"Form rebuilt." foundOtherform.test1575FormsArbitraryRebuildTestCase->testUserRegistrationRebuild()
Entered user name has been kept.Browserform.test1576FormsArbitraryRebuildTestCase->testUserRegistrationRebuild()
Entered mail address has been kept.Browserform.test1577FormsArbitraryRebuildTestCase->testUserRegistrationRebuild()
Found the Add another item buttonOtherform.test1588FormsArbitraryRebuildTestCase->testUserRegistrationMultipleField()
Found the requested form fields at user/registerOtherform.test1588FormsArbitraryRebuildTestCase->testUserRegistrationMultipleField()
Form has been rebuilt.Otherform.test1589FormsArbitraryRebuildTestCase->testUserRegistrationMultipleField()
Entered user name has been kept.Browserform.test1590FormsArbitraryRebuildTestCase->testUserRegistrationMultipleField()
Entered mail address has been kept.Browserform.test1591FormsArbitraryRebuildTestCase->testUserRegistrationMultipleField()
ExpandTaxonomy term hooks (TaxonomyHooksTestCase) [Taxonomy]1686
MessageGroupFilenameLineFunctionStatus
Failed to set field antonym to LongOthertaxonomy.test1412TaxonomyHooksTestCase->testTaxonomyTermHooks()
Found the requested form fields at admin/structure/taxonomy/immt4xls/addOthertaxonomy.test1412TaxonomyHooksTestCase->testTaxonomyTermHooks()
Trying to get property of non-objectNoticetaxonomy.test1415TaxonomyHooksTestCase->testTaxonomyTermHooks()
Antonym was loaded into the term objectOthertaxonomy.test1415TaxonomyHooksTestCase->testTaxonomyTermHooks()
Trying to get property of non-objectNoticetaxonomy.test1422TaxonomyHooksTestCase->testTaxonomyTermHooks()
Failed to set field name to plcjWbKUOthertaxonomy.test1422TaxonomyHooksTestCase->testTaxonomyTermHooks()
Failed to set field antonym to ShortOthertaxonomy.test1422TaxonomyHooksTestCase->testTaxonomyTermHooks()
Found the Save buttonOthertaxonomy.test1422TaxonomyHooksTestCase->testTaxonomyTermHooks()
Found the requested form fields at taxonomy/term//editOthertaxonomy.test1422TaxonomyHooksTestCase->testTaxonomyTermHooks()
Trying to get property of non-objectNoticetaxonomy.test1424TaxonomyHooksTestCase->testTaxonomyTermHooks()
Trying to get property of non-objectNoticetaxonomy.test1425TaxonomyHooksTestCase->testTaxonomyTermHooks()
Antonym was successfully editedOthertaxonomy.test1425TaxonomyHooksTestCase->testTaxonomyTermHooks()
Trying to get property of non-objectNoticetaxonomy.test1428TaxonomyHooksTestCase->testTaxonomyTermHooks()
Trying to get property of non-objectNoticetaxonomy.test1429TaxonomyHooksTestCase->testTaxonomyTermHooks()
ExpandTaxonomy term URL aliases (PathTaxonomyTermTestCase) [Path]30100
MessageGroupFilenameLineFunctionStatus
Failed to set field path[alias] to x6wPhroTOtherpath.test240PathTaxonomyTermTestCase->testTermAlias()
Found the requested form fields at admin/structure/taxonomy/tags/addOtherpath.test240PathTaxonomyTermTestCase->testTermAlias()
Term can be accessed on URL alias.Otherpath.test244PathTaxonomyTermTestCase->testTermAlias()
Failed to set field path[alias] to d90TWcfjOtherpath.test250PathTaxonomyTermTestCase->testTermAlias()
Found the Save buttonOtherpath.test250PathTaxonomyTermTestCase->testTermAlias()
Found the requested form fields at taxonomy/term//editOtherpath.test250PathTaxonomyTermTestCase->testTermAlias()
Term can be accessed on changed URL alias.Otherpath.test254PathTaxonomyTermTestCase->testTermAlias()
Failed to set field path[alias] to Otherpath.test264PathTaxonomyTermTestCase->testTermAlias()
Found the Save buttonOtherpath.test264PathTaxonomyTermTestCase->testTermAlias()
Found the requested form fields at taxonomy/term//editOtherpath.test264PathTaxonomyTermTestCase->testTermAlias()
ExpandTaxonomy vocabulary interface (TaxonomyVocabularyFunctionalTest) [Taxonomy]10402
MessageGroupFilenameLineFunctionStatus
Trying to get property of non-objectNoticetaxonomy.admin.inc946taxonomy_vocabulary_confirm_delete()
Trying to get property of non-objectNoticetaxonomy.admin.inc950taxonomy_vocabulary_confirm_delete()
ExpandUser creation (LocaleUserCreationTest) [Locale]6470
MessageGroupFilenameLineFunctionStatus
Global language set in the language selector.Browserlocale.test1852LocaleUserCreationTest->testLocalUserCreation()
New user has correct preferred language set.Otherlocale.test1867LocaleUserCreationTest->testLocalUserCreation()
New user has correct profile language set.Otherlocale.test1868LocaleUserCreationTest->testLocalUserCreation()
New user has correct preferred language set.Otherlocale.test1885LocaleUserCreationTest->testLocalUserCreation()
New user has correct profile language set.Otherlocale.test1886LocaleUserCreationTest->testLocalUserCreation()
Language selector is accessible and correct language is selected.Browserlocale.test1894LocaleUserCreationTest->testLocalUserCreation()
Language selector is accessible and correct language is selected.Browserlocale.test1907LocaleUserCreationTest->testLocalUserCreation()
ExpandUser language settings (LocaleUserLanguageFunctionalTest) [Locale]86120
MessageGroupFilenameLineFunctionStatus
Language selector available.Otherlocale.test1787LocaleUserLanguageFunctionalTest->testUserLanguageConfiguration()
Language present on form.Otherlocale.test1789LocaleUserLanguageFunctionalTest->testUserLanguageConfiguration()
Failed to set field preferred_langcode to xxOtherlocale.test1796LocaleUserLanguageFunctionalTest->testUserLanguageConfiguration()
Found the requested form fields at user/3/editOtherlocale.test1796LocaleUserLanguageFunctionalTest->testUserLanguageConfiguration()
Changes were saved.Otherlocale.test1798LocaleUserLanguageFunctionalTest->testUserLanguageConfiguration()
Default language successfully updated.Otherlocale.test1801LocaleUserLanguageFunctionalTest->testUserLanguageConfiguration()
Language selector available.Otherlocale.test1787LocaleUserLanguageFunctionalTest->testUserLanguageConfiguration()
Language present on form.Otherlocale.test1789LocaleUserLanguageFunctionalTest->testUserLanguageConfiguration()
Failed to set field preferred_langcode to xxOtherlocale.test1796LocaleUserLanguageFunctionalTest->testUserLanguageConfiguration()
Found the requested form fields at user/3/editOtherlocale.test1796LocaleUserLanguageFunctionalTest->testUserLanguageConfiguration()
Changes were saved.Otherlocale.test1798LocaleUserLanguageFunctionalTest->testUserLanguageConfiguration()
Default language successfully updated.Otherlocale.test1801LocaleUserLanguageFunctionalTest->testUserLanguageConfiguration()
ExpandUser time zones (UserTimeZoneFunctionalTest) [User]2460
MessageGroupFilenameLineFunctionStatus
Failed to set field timezone to America/SantiagoOtheruser.test1363UserTimeZoneFunctionalTest->testUserTimeZone()
Found the requested form fields at user/2/editOtheruser.test1363UserTimeZoneFunctionalTest->testUserTimeZone()
Time zone changed to Santiago time.Otheruser.test1364UserTimeZoneFunctionalTest->testUserTimeZone()
Date should be Chile summer time; five hours ahead of PST.Otheruser.test1368UserTimeZoneFunctionalTest->testUserTimeZone()
Date should be Chile time; four hours ahead of PSTOtheruser.test1370UserTimeZoneFunctionalTest->testUserTimeZone()
Date should be Chile time; three hours ahead of PDT.Otheruser.test1372UserTimeZoneFunctionalTest->testUserTimeZone()

All

Test namePassFailException
Leaf403 functionality (AccessDeniedTestCase) [System]7100
Leaf404 functionality (PageNotFoundTestCase) [System]1800
LeafActionLoopTestCase2600
LeafActionsConfigurationTestCase3800
LeafActive trail (MenuTrailTestCase) [Menu]6600
LeafAddFeedTestCase7100
LeafAdmin theme block admin accessibility (BlockAdminThemeTestCase) [Block]1900
LeafAdministrative pages (SystemAdminTestCase) [System]18700
LeafAdvanced search form (SearchAdvancedSearchForm) [Search]3400
LeafAggregator configuration (AggregatorConfigurationTestCase) [Unknown]2000
LeafAJAX command form values (AJAXFormValuesTestCase) [AJAX]2900
LeafAJAX commands (AJAXCommandsTestCase) [AJAX]6900
LeafAJAX framework (AJAXFrameworkTestCase) [AJAX]3400
ExpandAJAX multi form (AJAXMultiFormTestCase) [AJAX]241212
MessageGroupFilenameLineFunctionStatus
Undefined index: page_node_formNoticeform.inc760drupal_retrieve_form()
call_user_func_array() expects parameter 1 to be a valid callback, function 'page_node_form' not found or invalid function nameWarningform.inc811drupal_retrieve_form()
Undefined index: page_node_formNoticeform.inc760drupal_retrieve_form()
call_user_func_array() expects parameter 1 to be a valid callback, function 'page_node_form' not found or invalid function nameWarningform.inc811drupal_retrieve_form()
Found the correct number of field items on the initial page.Otherajax.test482AJAXMultiFormTestCase->testMultiForm()
Found the "add more" button on the initial page.Otherajax.test483AJAXMultiFormTestCase->testMultiForm()
Found the correct number of field items on the initial page.Otherajax.test482AJAXMultiFormTestCase->testMultiForm()
Found the "add more" button on the initial page.Otherajax.test483AJAXMultiFormTestCase->testMultiForm()
Undefined offset: 0Noticedrupal_web_test_case.php2057DrupalWebTestCase->drupalPostAJAX()
Undefined index: ajaxNoticedrupal_web_test_case.php2058DrupalWebTestCase->drupalPostAJAX()
Found the correct number of field items after an AJAX submission.Otherajax.test492AJAXMultiFormTestCase->testMultiForm()
Found the "add more" button after an AJAX submission.Otherajax.test493AJAXMultiFormTestCase->testMultiForm()
Undefined offset: 0Noticedrupal_web_test_case.php2057DrupalWebTestCase->drupalPostAJAX()
Undefined index: ajaxNoticedrupal_web_test_case.php2058DrupalWebTestCase->drupalPostAJAX()
Found the correct number of field items after an AJAX submission.Otherajax.test492AJAXMultiFormTestCase->testMultiForm()
Found the "add more" button after an AJAX submission.Otherajax.test493AJAXMultiFormTestCase->testMultiForm()
Undefined offset: 0Noticedrupal_web_test_case.php2057DrupalWebTestCase->drupalPostAJAX()
Undefined index: ajaxNoticedrupal_web_test_case.php2058DrupalWebTestCase->drupalPostAJAX()
Found the correct number of field items after an AJAX submission.Otherajax.test492AJAXMultiFormTestCase->testMultiForm()
Found the "add more" button after an AJAX submission.Otherajax.test493AJAXMultiFormTestCase->testMultiForm()
Undefined offset: 0Noticedrupal_web_test_case.php2057DrupalWebTestCase->drupalPostAJAX()
Undefined index: ajaxNoticedrupal_web_test_case.php2058DrupalWebTestCase->drupalPostAJAX()
Found the correct number of field items after an AJAX submission.Otherajax.test492AJAXMultiFormTestCase->testMultiForm()
Found the "add more" button after an AJAX submission.Otherajax.test493AJAXMultiFormTestCase->testMultiForm()
LeafAlter hook functionality (CommonDrupalAlterTestCase) [Common]700
LeafAnonymous comments (CommentAnonymous) [Comment]16600
LeafAuthmap assignment (UserAuthmapAssignmentTestCase) [User]600
LeafAuthorize API (SystemAuthorizeCase) [System]1600
LeafAutocomplete tags (CommonAutocompleteTagsTestCase) [Common]800
LeafBare upgrade test (BareUpgradePathTestCase) [Upgrade path]2400
LeafBasic SQL syntax tests (DatabaseBasicSyntaxTestCase) [Database]3000
LeafBatch percentages (BatchPercentagesUnitTestCase) [Batch API]1800
LeafBatch processing (BatchProcessingTestCase) [Batch API]16100
LeafBatch progress page (BatchPageTestCase) [Batch API]1600
LeafBlock availability (DashboardBlockAvailabilityTestCase) [Dashboard]2600
LeafBlock availability (NodeBlockTestCase) [Node]2100
ExpandBlock availability (PollBlockTestCase) [Poll]153302
MessageGroupFilenameLineFunctionStatus
Found choice 0 with weight 1.Browserpoll.test69PollWebTestCase->pollCreate()
Found choice 1 with weight 2.Browserpoll.test69PollWebTestCase->pollCreate()
Found choice 2 with weight 3.Browserpoll.test69PollWebTestCase->pollCreate()
Found choice 3 with weight 4.Browserpoll.test69PollWebTestCase->pollCreate()
Found choice 4 with weight 5.Browserpoll.test69PollWebTestCase->pollCreate()
Found choice 5 with weight 6.Browserpoll.test69PollWebTestCase->pollCreate()
Found choice 6 with weight 7.Browserpoll.test69PollWebTestCase->pollCreate()
Failed to set field choice[chid:0][chtext] to vXAFNiglOtherpoll.test73PollWebTestCase->pollCreate()
Failed to set field choice[chid:1][chtext] to v7KmiFWNOtherpoll.test73PollWebTestCase->pollCreate()
Failed to set field choice[chid:2][chtext] to wx9c0cPNOtherpoll.test73PollWebTestCase->pollCreate()
Failed to set field choice[chid:3][chtext] to jX6tMdelOtherpoll.test73PollWebTestCase->pollCreate()
Failed to set field choice[chid:4][chtext] to lU9LGZqOOtherpoll.test73PollWebTestCase->pollCreate()
Failed to set field choice[chid:5][chtext] to mMnRhWqPOtherpoll.test73PollWebTestCase->pollCreate()
Failed to set field choice[chid:6][chtext] to hCAN6bAIOtherpoll.test73PollWebTestCase->pollCreate()
Found the requested form fields at Otherpoll.test73PollWebTestCase->pollCreate()
Poll has been created.Otherpoll.test75PollWebTestCase->pollCreate()
Trying to get property of non-objectNoticepoll.test76PollWebTestCase->pollCreate()
Poll has been found in the database.Otherpoll.test76PollWebTestCase->pollCreate()
Poll appears in block.Otherpoll.test405PollBlockTestCase->testRecentBlock()
Failed to set field choice to 1Otherpoll.test416PollBlockTestCase->testRecentBlock()
Found the Vote buttonOtherpoll.test416PollBlockTestCase->testRecentBlock()
Found the requested form fields at user/5Otherpoll.test416PollBlockTestCase->testRecentBlock()
Your vote was recorded.Otherpoll.test417PollBlockTestCase->testRecentBlock()
Vote count updated correctly.Otherpoll.test418PollBlockTestCase->testRecentBlock()
Link to older polls appears.Otherpoll.test419PollBlockTestCase->testRecentBlock()
Undefined variable: url_targetNoticedrupal_web_test_case.php2576DrupalWebTestCase->clickLink()
Clicked link Older polls () from http://drupaltestbot664-mysql/checkout/?q=user/5Browserpoll.test420PollBlockTestCase->testRecentBlock()
Link to poll listing correct.Otherpoll.test421PollBlockTestCase->testRecentBlock()
Failed to set field active to 0Otherpoll.test188PollWebTestCase->pollUpdate()
Found the Save buttonOtherpoll.test188PollWebTestCase->pollUpdate()
Found the requested form fields at node//editOtherpoll.test188PollWebTestCase->pollUpdate()
Poll has been updated.Otherpoll.test189PollWebTestCase->pollUpdate()
LeafBlock availability (SearchBlockTestCase) [Search]6400
LeafBlock caching (BlockCacheTestCase) [Block]21300
ExpandBlock functionality (BlockTestCase) [Block]35760
MessageGroupFilenameLineFunctionStatus
Failed to set field block[block][1] to Otherblock.test288BlockTestCase->testBlockVisibilityPerUser()
Found the requested form fields at user/2/editOtherblock.test288BlockTestCase->testBlockVisibilityPerUser()
Block was not displayed according to per user block visibility setting.Otherblock.test291BlockTestCase->testBlockVisibilityPerUser()
Failed to set field block[block][1] to 1Otherblock.test301BlockTestCase->testBlockVisibilityPerUser()
Found the requested form fields at user/2/editOtherblock.test301BlockTestCase->testBlockVisibilityPerUser()
Block was displayed according to per user block visibility setting.Otherblock.test304BlockTestCase->testBlockVisibilityPerUser()
LeafBlock functionality (SystemBlockTestCase) [System]4500
LeafBlock HTML id (BlockHTMLIdTestCase) [Block]1600
LeafBlock template suggestions (BlockTemplateSuggestionsUnitTest) [Block]300
LeafBlocks not in hidden region (BlockHiddenRegionTestCase) [Block]1800
LeafBook functionality (BookTestCase) [Book]52800
LeafBoot and exit hook invocation (HookBootExitTestCase) [Bootstrap]1900
LeafBreadcrumbs (MenuBreadcrumbTestCase) [Menu]42000
LeafBroken requirements test (SimpleTestMissingCheckedRequirements) [SimpleTest]3800
LeafBroken SimpleTest method (SimpleTestBrokenSetUp) [SimpleTest]2100
LeafBrowser language detection (LocaleBrowserDetectionTest) [Locale]4100
LeafCache clear test (CacheClearCase) [Cache]2600
LeafCache emptiness test (CacheIsEmptyCase) [Cache]500
LeafCache saving test (CacheSavingCase) [Cache]800
LeafCancel account (UserCancelTestCase) [User]23600
LeafCascading stylesheets (CommonCascadingStylesheetsTestCase) [Common]4000
LeafCategorize feed functionality (CategorizeFeedTestCase) [Unknown]2100
LeafCategorize feed item functionality (CategorizeFeedItemTestCase) [Unknown]6100
LeafChecks display of aggregator items (AggregatorRenderingTestCase) [Unknown]22600
LeafCJK tokenizer (SearchTokenizerTestCase) [Search]800
LeafClass loader (SymfonyClassLoaderTestCase) [Symfony]100
LeafColor functionality (ColorTestCase) [Color]8700
LeafComment actions (CommentActionsTestCase) [Comment]2900
LeafComment approval (CommentApprovalTest) [Comment]15600
LeafComment blocks (CommentBlockFunctionalTest) [Comment]11600
LeafComment count toggle (SearchCommentCountToggleTestCase) [Search]3100
LeafComment fields (CommentFieldsTest) [Comment]10700
ExpandComment interface (CommentInterfaceTest) [Comment]214100
MessageGroupFilenameLineFunctionStatus
Changed environment:array ( 'authenticated' => false, 'comment count' => false, 'form' => 'below', 'user_register' => 1, 'contact' => 'optional', 'comments' => 'open', 'access comments' => 0, 'post comments' => 0, 'skip comment approval' => 1, 'edit own comments' => 0, )Debugcomment.test839CommentInterfaceTest->setEnvironment()
Changed environment:array ( 'authenticated' => true, 'comment count' => false, 'form' => 'below', 'user_register' => 1, 'contact' => 'optional', 'comments' => 'open', 'access comments' => 0, 'post comments' => 0, 'skip comment approval' => 1, 'edit own comments' => 0, )Debugcomment.test839CommentInterfaceTest->setEnvironment()
Changed environment:array ( 'authenticated' => false, 'comment count' => true, 'form' => 'below', 'user_register' => 1, 'contact' => 'optional', 'comments' => 'open', 'access comments' => 0, 'post comments' => 0, 'skip comment approval' => 1, 'edit own comments' => 0, )Debugcomment.test839CommentInterfaceTest->setEnvironment()
Changed environment:array ( 'authenticated' => true, 'comment count' => true, 'form' => 'below', 'user_register' => 1, 'contact' => 'optional', 'comments' => 'open', 'access comments' => 0, 'post comments' => 0, 'skip comment approval' => 1, 'edit own comments' => 0, )Debugcomment.test839CommentInterfaceTest->setEnvironment()
Changed environment:array ( 'authenticated' => false, 'comment count' => false, 'form' => 'below', 'user_register' => 1, 'contact' => 'optional', 'comments' => 'open', 'access comments' => 1, 'post comments' => 0, 'skip comment approval' => 1, 'edit own comments' => 0, )Debugcomment.test839CommentInterfaceTest->setEnvironment()
Changed environment:array ( 'authenticated' => true, 'comment count' => false, 'form' => 'below', 'user_register' => 1, 'contact' => 'optional', 'comments' => 'open', 'access comments' => 1, 'post comments' => 0, 'skip comment approval' => 1, 'edit own comments' => 0, )Debugcomment.test839CommentInterfaceTest->setEnvironment()
Changed environment:array ( 'authenticated' => false, 'comment count' => true, 'form' => 'below', 'user_register' => 1, 'contact' => 'optional', 'comments' => 'open', 'access comments' => 1, 'post comments' => 0, 'skip comment approval' => 1, 'edit own comments' => 0, )Debugcomment.test839CommentInterfaceTest->setEnvironment()
Changed environment:array ( 'authenticated' => true, 'comment count' => true, 'form' => 'below', 'user_register' => 1, 'contact' => 'optional', 'comments' => 'open', 'access comments' => 1, 'post comments' => 0, 'skip comment approval' => 1, 'edit own comments' => 0, )Debugcomment.test839CommentInterfaceTest->setEnvironment()
Changed environment:array ( 'authenticated' => false, 'comment count' => false, 'form' => 'below', 'user_register' => 1, 'contact' => 'optional', 'comments' => 'open', 'access comments' => 0, 'post comments' => 1, 'skip comment approval' => 1, 'edit own comments' => 0, )Debugcomment.test839CommentInterfaceTest->setEnvironment()
Changed environment:array ( 'authenticated' => true, 'comment count' => false, 'form' => 'below', 'user_register' => 1, 'contact' => 'optional', 'comments' => 'open', 'access comments' => 0, 'post comments' => 1, 'skip comment approval' => 1, 'edit own comments' => 0, )Debugcomment.test839CommentInterfaceTest->setEnvironment()
Changed environment:array ( 'authenticated' => false, 'comment count' => true, 'form' => 'below', 'user_register' => 1, 'contact' => 'optional', 'comments' => 'open', 'access comments' => 0, 'post comments' => 1, 'skip comment approval' => 1, 'edit own comments' => 0, )Debugcomment.test839CommentInterfaceTest->setEnvironment()
Changed environment:array ( 'authenticated' => true, 'comment count' => true, 'form' => 'below', 'user_register' => 1, 'contact' => 'optional', 'comments' => 'open', 'access comments' => 0, 'post comments' => 1, 'skip comment approval' => 1, 'edit own comments' => 0, )Debugcomment.test839CommentInterfaceTest->setEnvironment()
Changed environment:array ( 'authenticated' => false, 'comment count' => false, 'form' => 'below', 'user_register' => 1, 'contact' => 'optional', 'comments' => 'open', 'access comments' => 1, 'post comments' => 1, 'skip comment approval' => 1, 'edit own comments' => 0, )Debugcomment.test839CommentInterfaceTest->setEnvironment()
Changed environment:array ( 'authenticated' => true, 'comment count' => false, 'form' => 'below', 'user_register' => 1, 'contact' => 'optional', 'comments' => 'open', 'access comments' => 1, 'post comments' => 1, 'skip comment approval' => 1, 'edit own comments' => 0, )Debugcomment.test839CommentInterfaceTest->setEnvironment()
Changed environment:array ( 'authenticated' => false, 'comment count' => true, 'form' => 'below', 'user_register' => 1, 'contact' => 'optional', 'comments' => 'open', 'access comments' => 1, 'post comments' => 1, 'skip comment approval' => 1, 'edit own comments' => 0, )Debugcomment.test839CommentInterfaceTest->setEnvironment()
Changed environment:array ( 'authenticated' => true, 'comment count' => true, 'form' => 'below', 'user_register' => 1, 'contact' => 'optional', 'comments' => 'open', 'access comments' => 1, 'post comments' => 1, 'skip comment approval' => 1, 'edit own comments' => 0, )Debugcomment.test839CommentInterfaceTest->setEnvironment()
Changed environment:array ( 'authenticated' => false, 'comment count' => false, 'form' => 'separate page', 'user_register' => 1, 'contact' => 'optional', 'comments' => 'open', 'access comments' => 0, 'post comments' => 0, 'skip comment approval' => 1, 'edit own comments' => 0, )Debugcomment.test839CommentInterfaceTest->setEnvironment()
Changed environment:array ( 'authenticated' => true, 'comment count' => false, 'form' => 'separate page', 'user_register' => 1, 'contact' => 'optional', 'comments' => 'open', 'access comments' => 0, 'post comments' => 0, 'skip comment approval' => 1, 'edit own comments' => 0, )Debugcomment.test839CommentInterfaceTest->setEnvironment()
Changed environment:array ( 'authenticated' => false, 'comment count' => true, 'form' => 'separate page', 'user_register' => 1, 'contact' => 'optional', 'comments' => 'open', 'access comments' => 0, 'post comments' => 0, 'skip comment approval' => 1, 'edit own comments' => 0, )Debugcomment.test839CommentInterfaceTest->setEnvironment()
Changed environment:array ( 'authenticated' => true, 'comment count' => true, 'form' => 'separate page', 'user_register' => 1, 'contact' => 'optional', 'comments' => 'open', 'access comments' => 0, 'post comments' => 0, 'skip comment approval' => 1, 'edit own comments' => 0, )Debugcomment.test839CommentInterfaceTest->setEnvironment()
Changed environment:array ( 'authenticated' => false, 'comment count' => false, 'form' => 'separate page', 'user_register' => 1, 'contact' => 'optional', 'comments' => 'open', 'access comments' => 1, 'post comments' => 0, 'skip comment approval' => 1, 'edit own comments' => 0, )Debugcomment.test839CommentInterfaceTest->setEnvironment()
Changed environment:array ( 'authenticated' => true, 'comment count' => false, 'form' => 'separate page', 'user_register' => 1, 'contact' => 'optional', 'comments' => 'open', 'access comments' => 1, 'post comments' => 0, 'skip comment approval' => 1, 'edit own comments' => 0, )Debugcomment.test839CommentInterfaceTest->setEnvironment()
Changed environment:array ( 'authenticated' => false, 'comment count' => true, 'form' => 'separate page', 'user_register' => 1, 'contact' => 'optional', 'comments' => 'open', 'access comments' => 1, 'post comments' => 0, 'skip comment approval' => 1, 'edit own comments' => 0, )Debugcomment.test839CommentInterfaceTest->setEnvironment()
Changed environment:array ( 'authenticated' => true, 'comment count' => true, 'form' => 'separate page', 'user_register' => 1, 'contact' => 'optional', 'comments' => 'open', 'access comments' => 1, 'post comments' => 0, 'skip comment approval' => 1, 'edit own comments' => 0, )Debugcomment.test839CommentInterfaceTest->setEnvironment()
Changed environment:array ( 'authenticated' => false, 'comment count' => false, 'form' => 'separate page', 'user_register' => 1, 'contact' => 'optional', 'comments' => 'open', 'access comments' => 0, 'post comments' => 1, 'skip comment approval' => 1, 'edit own comments' => 0, )Debugcomment.test839CommentInterfaceTest->setEnvironment()
Changed environment:array ( 'authenticated' => true, 'comment count' => false, 'form' => 'separate page', 'user_register' => 1, 'contact' => 'optional', 'comments' => 'open', 'access comments' => 0, 'post comments' => 1, 'skip comment approval' => 1, 'edit own comments' => 0, )Debugcomment.test839CommentInterfaceTest->setEnvironment()
Changed environment:array ( 'authenticated' => false, 'comment count' => true, 'form' => 'separate page', 'user_register' => 1, 'contact' => 'optional', 'comments' => 'open', 'access comments' => 0, 'post comments' => 1, 'skip comment approval' => 1, 'edit own comments' => 0, )Debugcomment.test839CommentInterfaceTest->setEnvironment()
Changed environment:array ( 'authenticated' => true, 'comment count' => true, 'form' => 'separate page', 'user_register' => 1, 'contact' => 'optional', 'comments' => 'open', 'access comments' => 0, 'post comments' => 1, 'skip comment approval' => 1, 'edit own comments' => 0, )Debugcomment.test839CommentInterfaceTest->setEnvironment()
Changed environment:array ( 'authenticated' => false, 'comment count' => false, 'form' => 'separate page', 'user_register' => 1, 'contact' => 'optional', 'comments' => 'open', 'access comments' => 1, 'post comments' => 1, 'skip comment approval' => 1, 'edit own comments' => 0, )Debugcomment.test839CommentInterfaceTest->setEnvironment()
Changed environment:array ( 'authenticated' => true, 'comment count' => false, 'form' => 'separate page', 'user_register' => 1, 'contact' => 'optional', 'comments' => 'open', 'access comments' => 1, 'post comments' => 1, 'skip comment approval' => 1, 'edit own comments' => 0, )Debugcomment.test839CommentInterfaceTest->setEnvironment()
Changed environment:array ( 'authenticated' => false, 'comment count' => true, 'form' => 'separate page', 'user_register' => 1, 'contact' => 'optional', 'comments' => 'open', 'access comments' => 1, 'post comments' => 1, 'skip comment approval' => 1, 'edit own comments' => 0, )Debugcomment.test839CommentInterfaceTest->setEnvironment()
Changed environment:array ( 'authenticated' => true, 'comment count' => true, 'form' => 'separate page', 'user_register' => 1, 'contact' => 'optional', 'comments' => 'open', 'access comments' => 1, 'post comments' => 1, 'skip comment approval' => 1, 'edit own comments' => 0, )Debugcomment.test839CommentInterfaceTest->setEnvironment()
Changed environment:array ( 'authenticated' => false, 'comment count' => false, 'form' => 'below', 'user_register' => 0, 'contact' => 'optional', 'comments' => 'open', 'access comments' => 0, 'post comments' => 0, 'skip comment approval' => 1, 'edit own comments' => 0, )Debugcomment.test839CommentInterfaceTest->setEnvironment()
Changed environment:array ( 'authenticated' => true, 'comment count' => false, 'form' => 'below', 'user_register' => 0, 'contact' => 'optional', 'comments' => 'open', 'access comments' => 0, 'post comments' => 0, 'skip comment approval' => 1, 'edit own comments' => 0, )Debugcomment.test839CommentInterfaceTest->setEnvironment()
Changed environment:array ( 'authenticated' => false, 'comment count' => true, 'form' => 'below', 'user_register' => 0, 'contact' => 'optional', 'comments' => 'open', 'access comments' => 0, 'post comments' => 0, 'skip comment approval' => 1, 'edit own comments' => 0, )Debugcomment.test839CommentInterfaceTest->setEnvironment()
Changed environment:array ( 'authenticated' => true, 'comment count' => true, 'form' => 'below', 'user_register' => 0, 'contact' => 'optional', 'comments' => 'open', 'access comments' => 0, 'post comments' => 0, 'skip comment approval' => 1, 'edit own comments' => 0, )Debugcomment.test839CommentInterfaceTest->setEnvironment()
Changed environment:array ( 'authenticated' => false, 'comment count' => false, 'form' => 'below', 'user_register' => 0, 'contact' => 'optional', 'comments' => 'open', 'access comments' => 1, 'post comments' => 0, 'skip comment approval' => 1, 'edit own comments' => 0, )Debugcomment.test839CommentInterfaceTest->setEnvironment()
Changed environment:array ( 'authenticated' => true, 'comment count' => false, 'form' => 'below', 'user_register' => 0, 'contact' => 'optional', 'comments' => 'open', 'access comments' => 1, 'post comments' => 0, 'skip comment approval' => 1, 'edit own comments' => 0, )Debugcomment.test839CommentInterfaceTest->setEnvironment()
Changed environment:array ( 'authenticated' => false, 'comment count' => true, 'form' => 'below', 'user_register' => 0, 'contact' => 'optional', 'comments' => 'open', 'access comments' => 1, 'post comments' => 0, 'skip comment approval' => 1, 'edit own comments' => 0, )Debugcomment.test839CommentInterfaceTest->setEnvironment()
Changed environment:array ( 'authenticated' => true, 'comment count' => true, 'form' => 'below', 'user_register' => 0, 'contact' => 'optional', 'comments' => 'open', 'access comments' => 1, 'post comments' => 0, 'skip comment approval' => 1, 'edit own comments' => 0, )Debugcomment.test839CommentInterfaceTest->setEnvironment()
Changed environment:array ( 'authenticated' => false, 'comment count' => false, 'form' => 'below', 'user_register' => 0, 'contact' => 'optional', 'comments' => 'open', 'access comments' => 0, 'post comments' => 1, 'skip comment approval' => 1, 'edit own comments' => 0, )Debugcomment.test839CommentInterfaceTest->setEnvironment()
Changed environment:array ( 'authenticated' => true, 'comment count' => false, 'form' => 'below', 'user_register' => 0, 'contact' => 'optional', 'comments' => 'open', 'access comments' => 0, 'post comments' => 1, 'skip comment approval' => 1, 'edit own comments' => 0, )Debugcomment.test839CommentInterfaceTest->setEnvironment()
Changed environment:array ( 'authenticated' => false, 'comment count' => true, 'form' => 'below', 'user_register' => 0, 'contact' => 'optional', 'comments' => 'open', 'access comments' => 0, 'post comments' => 1, 'skip comment approval' => 1, 'edit own comments' => 0, )Debugcomment.test839CommentInterfaceTest->setEnvironment()
Changed environment:array ( 'authenticated' => true, 'comment count' => true, 'form' => 'below', 'user_register' => 0, 'contact' => 'optional', 'comments' => 'open', 'access comments' => 0, 'post comments' => 1, 'skip comment approval' => 1, 'edit own comments' => 0, )Debugcomment.test839CommentInterfaceTest->setEnvironment()
Changed environment:array ( 'authenticated' => false, 'comment count' => false, 'form' => 'below', 'user_register' => 0, 'contact' => 'optional', 'comments' => 'open', 'access comments' => 1, 'post comments' => 1, 'skip comment approval' => 1, 'edit own comments' => 0, )Debugcomment.test839CommentInterfaceTest->setEnvironment()
Changed environment:array ( 'authenticated' => true, 'comment count' => false, 'form' => 'below', 'user_register' => 0, 'contact' => 'optional', 'comments' => 'open', 'access comments' => 1, 'post comments' => 1, 'skip comment approval' => 1, 'edit own comments' => 0, )Debugcomment.test839CommentInterfaceTest->setEnvironment()
Changed environment:array ( 'authenticated' => false, 'comment count' => true, 'form' => 'below', 'user_register' => 0, 'contact' => 'optional', 'comments' => 'open', 'access comments' => 1, 'post comments' => 1, 'skip comment approval' => 1, 'edit own comments' => 0, )Debugcomment.test839CommentInterfaceTest->setEnvironment()
Changed environment:array ( 'authenticated' => true, 'comment count' => true, 'form' => 'below', 'user_register' => 0, 'contact' => 'optional', 'comments' => 'open', 'access comments' => 1, 'post comments' => 1, 'skip comment approval' => 1, 'edit own comments' => 0, )Debugcomment.test839CommentInterfaceTest->setEnvironment()
Changed environment:array ( 'authenticated' => false, 'comment count' => false, 'form' => 'separate page', 'user_register' => 0, 'contact' => 'optional', 'comments' => 'open', 'access comments' => 0, 'post comments' => 0, 'skip comment approval' => 1, 'edit own comments' => 0, )Debugcomment.test839CommentInterfaceTest->setEnvironment()
Changed environment:array ( 'authenticated' => true, 'comment count' => false, 'form' => 'separate page', 'user_register' => 0, 'contact' => 'optional', 'comments' => 'open', 'access comments' => 0, 'post comments' => 0, 'skip comment approval' => 1, 'edit own comments' => 0, )Debugcomment.test839CommentInterfaceTest->setEnvironment()
Changed environment:array ( 'authenticated' => false, 'comment count' => true, 'form' => 'separate page', 'user_register' => 0, 'contact' => 'optional', 'comments' => 'open', 'access comments' => 0, 'post comments' => 0, 'skip comment approval' => 1, 'edit own comments' => 0, )Debugcomment.test839CommentInterfaceTest->setEnvironment()
Changed environment:array ( 'authenticated' => true, 'comment count' => true, 'form' => 'separate page', 'user_register' => 0, 'contact' => 'optional', 'comments' => 'open', 'access comments' => 0, 'post comments' => 0, 'skip comment approval' => 1, 'edit own comments' => 0, )Debugcomment.test839CommentInterfaceTest->setEnvironment()
Changed environment:array ( 'authenticated' => false, 'comment count' => false, 'form' => 'separate page', 'user_register' => 0, 'contact' => 'optional', 'comments' => 'open', 'access comments' => 1, 'post comments' => 0, 'skip comment approval' => 1, 'edit own comments' => 0, )Debugcomment.test839CommentInterfaceTest->setEnvironment()
Changed environment:array ( 'authenticated' => true, 'comment count' => false, 'form' => 'separate page', 'user_register' => 0, 'contact' => 'optional', 'comments' => 'open', 'access comments' => 1, 'post comments' => 0, 'skip comment approval' => 1, 'edit own comments' => 0, )Debugcomment.test839CommentInterfaceTest->setEnvironment()
Changed environment:array ( 'authenticated' => false, 'comment count' => true, 'form' => 'separate page', 'user_register' => 0, 'contact' => 'optional', 'comments' => 'open', 'access comments' => 1, 'post comments' => 0, 'skip comment approval' => 1, 'edit own comments' => 0, )Debugcomment.test839CommentInterfaceTest->setEnvironment()
Changed environment:array ( 'authenticated' => true, 'comment count' => true, 'form' => 'separate page', 'user_register' => 0, 'contact' => 'optional', 'comments' => 'open', 'access comments' => 1, 'post comments' => 0, 'skip comment approval' => 1, 'edit own comments' => 0, )Debugcomment.test839CommentInterfaceTest->setEnvironment()
Changed environment:array ( 'authenticated' => false, 'comment count' => false, 'form' => 'separate page', 'user_register' => 0, 'contact' => 'optional', 'comments' => 'open', 'access comments' => 0, 'post comments' => 1, 'skip comment approval' => 1, 'edit own comments' => 0, )Debugcomment.test839CommentInterfaceTest->setEnvironment()
Changed environment:array ( 'authenticated' => true, 'comment count' => false, 'form' => 'separate page', 'user_register' => 0, 'contact' => 'optional', 'comments' => 'open', 'access comments' => 0, 'post comments' => 1, 'skip comment approval' => 1, 'edit own comments' => 0, )Debugcomment.test839CommentInterfaceTest->setEnvironment()
Changed environment:array ( 'authenticated' => false, 'comment count' => true, 'form' => 'separate page', 'user_register' => 0, 'contact' => 'optional', 'comments' => 'open', 'access comments' => 0, 'post comments' => 1, 'skip comment approval' => 1, 'edit own comments' => 0, )Debugcomment.test839CommentInterfaceTest->setEnvironment()
Changed environment:array ( 'authenticated' => true, 'comment count' => true, 'form' => 'separate page', 'user_register' => 0, 'contact' => 'optional', 'comments' => 'open', 'access comments' => 0, 'post comments' => 1, 'skip comment approval' => 1, 'edit own comments' => 0, )Debugcomment.test839CommentInterfaceTest->setEnvironment()
Changed environment:array ( 'authenticated' => false, 'comment count' => false, 'form' => 'separate page', 'user_register' => 0, 'contact' => 'optional', 'comments' => 'open', 'access comments' => 1, 'post comments' => 1, 'skip comment approval' => 1, 'edit own comments' => 0, )Debugcomment.test839CommentInterfaceTest->setEnvironment()
Changed environment:array ( 'authenticated' => true, 'comment count' => false, 'form' => 'separate page', 'user_register' => 0, 'contact' => 'optional', 'comments' => 'open', 'access comments' => 1, 'post comments' => 1, 'skip comment approval' => 1, 'edit own comments' => 0, )Debugcomment.test839CommentInterfaceTest->setEnvironment()
Changed environment:array ( 'authenticated' => false, 'comment count' => true, 'form' => 'separate page', 'user_register' => 0, 'contact' => 'optional', 'comments' => 'open', 'access comments' => 1, 'post comments' => 1, 'skip comment approval' => 1, 'edit own comments' => 0, )Debugcomment.test839CommentInterfaceTest->setEnvironment()
Changed environment:array ( 'authenticated' => true, 'comment count' => true, 'form' => 'separate page', 'user_register' => 0, 'contact' => 'optional', 'comments' => 'open', 'access comments' => 1, 'post comments' => 1, 'skip comment approval' => 1, 'edit own comments' => 0, )Debugcomment.test839CommentInterfaceTest->setEnvironment()
ExpandComment language (LocaleCommentLanguageFunctionalTest) [Locale]5220
MessageGroupFilenameLineFunctionStatus
Failed to set field preferred_langcode to frOtherlocale.test2848LocaleCommentLanguageFunctionalTest->setUp()
Found the requested form fields at user/2/editOtherlocale.test2848LocaleCommentLanguageFunctionalTest->setUp()
LeafComment node access (CommentNodeAccessTest) [Comment]5400
LeafComment paging settings (CommentPagerTest) [Comment]21100
LeafComment preview (CommentPreviewTest) [Comment]9900
LeafComment Rebuild (CommentContentRebuild) [Comment]3300
LeafComment RSS (CommentRSSUnitTest) [Comment]2500
LeafComment Search tests (SearchCommentTestCase) [Search]19000
LeafComment Threading (CommentThreadingTestCase) [Comment]15700
LeafComment token replacement (CommentTokenReplaceTestCase) [Comment]6500
LeafConfig settings form (SearchConfigSettingsForm) [Search]12200
LeafConfiguration overrides (ConfOverrideTestCase) [Configuration]200
LeafConnection tests (DatabaseConnectionTestCase) [Database]3800
LeafContent language settings (LocaleContentFunctionalTest) [Locale]20000
LeafContextual links on node lists (ContextualDynamicContextTestCase) [Contextual]1600
LeafCron run (CronRunTestCase) [System]5100
LeafCSS Unit Tests (CommonCascadingStylesheetsUnitTestCase) [Common]1200
LeafCustom query syntax tests (DatabaseQueryTestCase) [Database]700
LeafDashboard blocks (DashboardBlocksTestCase) [Dashboard]8500
LeafData record write functionality (CommonDrupalWriteRecordTestCase) [Common]3400
LeafDate and time (DateTimeFunctionalTest) [System]11300
LeafDBLog functionality (DBLogTestCase) [DBLog]48700
LeafDefault text format functionality (FilterDefaultFormatTestCase) [Filter]3300
LeafDelete/Truncate tests (DatabaseDeleteTruncateTestCase) [Database]2300
LeafDrupal error handlers (DrupalErrorHandlerUnitTest) [System]3000
LeafDrupal HTTP request (CommonDrupalHTTPRequestTestCase) [Common]3500
LeafDrupal match path (DrupalMatchPathTestCase) [Path API]4100
LeafDrupal system listing (CommonDrupalSystemListingTestCase) [Common]600
Leafdrupal_add_feed() tests (CommonDrupalAddFeedTestCase) [Common]600
Leafdrupal_array_*() tests (CommonDrupalArrayUnitTest) [System]1300
Leafdrupal_render() (CommonDrupalRenderTestCase) [Common]5200
LeafElement processing (FormElementTestCase) [Form API]3600
LeafEmbedded forms (SearchEmbedForm) [Search]3200
LeafEmpty statement (DatabaseEmptyStatementTestCase) [Database]400
LeafEnable/disable modules (EnableDisableTestCase) [Module]141500
LeafEntity CRUD (EntityAPITestCase) [Entity API]800
LeafEntity CRUD hooks (EntityCrudHookTestCase) [Entity API]15300
LeafEntity info (EntityAPIInfoTestCase) [Entity API]500
LeafEntity properties (EntityPropertiesTestCase) [Entity API]400
LeafEntity query (EntityFieldQueryTestCase) [Entity API]13900
LeafFeed parser functionality (FeedParserTestCase) [Unknown]6500
LeafFetch tests (DatabaseFetchTestCase) [Database]3700
LeafFetch tests, part 2 (DatabaseFetch2TestCase) [Database]2900
LeafFetching multiple cache items (CacheGetMultipleUnitTest) [Cache]700
LeafField attach tests (other) (FieldAttachOtherTestCase) [Field API]8200
LeafField attach tests (storage-related) (FieldAttachStorageTestCase) [Field API]14500
LeafField bulk delete tests (FieldBulkDeleteTestCase) [Field API]14000
LeafField CRUD tests (FieldCrudTestCase) [Field API]8900
LeafField Display API tests (FieldDisplayAPITestCase) [Field API]4600
LeafField form tests (FieldFormTestCase) [Field API]26100
LeafField info tests (FieldInfoTestCase) [Field API]9000
LeafField instance CRUD tests (FieldInstanceCrudTestCase) [Field API]3700
LeafField SQL Storage tests (FieldSqlStorageTestCase) [Field API]9200
LeafField translations tests (FieldTranslationsTestCase) [Field API]7000
LeafFile content (ConfigFileContentTestCase) [Configuration]2600
LeafFile copying (FileCopyTest) [File API]11000
LeafFile delete (FileDeleteTest) [File API]2000
LeafFile download (FileDownloadTest) [File API]3900
LeafFile field display tests (FileFieldDisplayTestCase) [File]5000
LeafFile field file path tests (FileFieldPathTestCase) [File]2700
LeafFile field revision test (FileFieldRevisionTestCase) [File]6700
LeafFile field validation tests (FileFieldValidateTestCase) [File]11800
LeafFile field widget test (FileFieldWidgetTestCase) [File]30000
LeafFile loading (FileLoadTest) [File API]3400
LeafFile mimetypes (FileMimeTypeTest) [File API]4200
LeafFile moving (FileMoveTest) [File API]11000
LeafFile naming (FileNameMungingTest) [File API]500
LeafFile paths and directories (FileDirectoryTest) [File API]2000
LeafFile paths and directories (RemoteFileDirectoryTest) [File API (remote)]2400
LeafFile save data (FileSaveDataTest) [File API]9300
LeafFile saving (FileSaveTest) [File API]1700
LeafFile scan directory (FileScanDirectoryTest) [File API]2300
LeafFile scan directory (RemoteFileScanDirectoryTest) [File API (remote)]2300
LeafFile security (ConfigFileSecurityTestCase) [Configuration]400
LeafFile space used tests (FileSpaceUsedTest) [File API]1100
LeafFile token replacement (FileTokenReplaceTestCase) [File]3500
LeafFile uploading (FileSaveUploadTest) [File API]27100
LeafFile uploading (RemoteFileSaveUploadTest) [File API (remote)]27100
LeafFile URL rewriting (FileURLRewritingTest) [File]1700
LeafFile usage (FileUsageTest) [File]2100
LeafFile validate (FileValidateTest) [File API]1200
LeafFile validator tests (FileValidatorTest) [File API]2500
LeafFileTransfer unit tests (FileTranferTest) [System]200
LeafFilled upgrade test (FilledUpgradePathTestCase) [Upgrade path]2300
LeafFilter administration functionality (FilterAdminTestCase) [Filter]16400
LeafFilter CRUD operations (FilterCRUDTestCase) [Filter]21500
ExpandFilter format access (FilterFormatAccessTestCase) [Filter]236111
MessageGroupFilenameLineFunctionStatus
Undefined variable: url_targetNoticedrupal_web_test_case.php2576DrupalWebTestCase->clickLink()
Clicked link Edit () from http://drupaltestbot664-mysql/checkout/?q=node/1Browserfilter.test549FilterFormatAccessTestCase->testFormatWidgetPermissions()
Text format access denied message found.Otherfilter.test552FilterFormatAccessTestCase->testFormatWidgetPermissions()
Failed to set field title to dm6IlCbaOtherfilter.test557FilterFormatAccessTestCase->testFormatWidgetPermissions()
Found the Preview buttonOtherfilter.test557FilterFormatAccessTestCase->testFormatWidgetPermissions()
Found the requested form fields at Otherfilter.test557FilterFormatAccessTestCase->testFormatWidgetPermissions()
Failed to set field title to dm6IlCbaOtherfilter.test561FilterFormatAccessTestCase->testFormatWidgetPermissions()
Found the Save buttonOtherfilter.test561FilterFormatAccessTestCase->testFormatWidgetPermissions()
Found the requested form fields at Otherfilter.test561FilterFormatAccessTestCase->testFormatWidgetPermissions()
Old title not found.Otherfilter.test562FilterFormatAccessTestCase->testFormatWidgetPermissions()
New title found.Otherfilter.test563FilterFormatAccessTestCase->testFormatWidgetPermissions()
Old title found.Otherfilter.test601FilterFormatAccessTestCase->testFormatWidgetPermissions()
LeafFilter format hooks (FilterHooksTestCase) [Filter]3300
LeafFilter module filters (FilterUnitTestCase) [Filter]21300
LeafFilter settings (FilterSettingsTestCase) [Filter]1000
LeafFingerprinting meta tag (AdminMetaTagTestCase) [System]300
LeafFlood control mechanism (FloodFunctionalTest) [System]600
LeafForm alter hooks (FormAlterTestCase) [Form API]400
LeafForm API checkbox (FormCheckboxTestCase) [Form API]9700
LeafForm API email (FormEmailTestCase) [Form API]1700
LeafForm API file inclusion (FormsFileInclusionTestCase) [Form API]1100
LeafForm API url (FormUrlTestCase) [Form API]1700
LeafForm element and label output test (FormsElementsLabelsTestCase) [Form API]1800
LeafForm element validation (FormsTestCase) [Form API]35000
LeafForm rebuilding (FormsRebuildTestCase) [Form API]5400
LeafForm state values clearance (advanced) (FormStateValuesCleanAdvancedTestCase) [Form API]700
LeafForm state values clearance (FormStateValuesCleanTestCase) [Form API]1400
LeafForm triggering element determination (FormsTriggeringElementTestCase) [Form API]5000
ExpandForm validation handlers (FormValidationTestCase) [Form API]4810
MessageGroupFilenameLineFunctionStatus
Form element #value was altered.Browserform.test604FormValidationTestCase->testValidate()
LeafForm wrapper callback (FormsFormWrapperTestCase) [Form API]500
ExpandFormat date (CommonFormatDateTestCase) [Common]61130
MessageGroupFilenameLineFunctionStatus
Failed to set field preferred_langcode to xxOthercommon.test2404CommonFormatDateTestCase->testFormatDate()
Failed to set field timezone to America/Los_AngelesOthercommon.test2404CommonFormatDateTestCase->testFormatDate()
Found the requested form fields at user/3/editOthercommon.test2404CommonFormatDateTestCase->testFormatDate()
Test custom date format.Othercommon.test2418CommonFormatDateTestCase->testFormatDate()
Test long date format.Othercommon.test2419CommonFormatDateTestCase->testFormatDate()
Test medium date format.Othercommon.test2420CommonFormatDateTestCase->testFormatDate()
Test short date format.Othercommon.test2421CommonFormatDateTestCase->testFormatDate()
Test default date format.Othercommon.test2422CommonFormatDateTestCase->testFormatDate()
Test html_datetime date format.Othercommon.test2424CommonFormatDateTestCase->testFormatDate()
Test html_date date format.Othercommon.test2425CommonFormatDateTestCase->testFormatDate()
Test html_time date format.Othercommon.test2426CommonFormatDateTestCase->testFormatDate()
Test html_yearless_date date format.Othercommon.test2427CommonFormatDateTestCase->testFormatDate()
Test html_week date format.Othercommon.test2428CommonFormatDateTestCase->testFormatDate()
LeafForum functionality (ForumTestCase) [Forum]63500
LeafFront page (FrontPageTestCase) [System]3700
LeafGet filename test (BootstrapGetFilenameTestCase) [Bootstrap]500
LeafGraph (GraphUnitTest) [System]2800
LeafHelp functionality (HelpTestCase) [Help]30700
LeafHTML Attributes (CommonDrupalAttributesUnitTestCase) [Common]600
LeafHTML identifiers (CommonHTMLIdentifierTestCase) [Common]1000
LeafHTML in page titles (PageTitleFiltering) [System]4400
LeafHTML to text conversion (DrupalHtmlToTextTestCase) [Mail]9400
Leafhtml.tpl.php html and body attributes (ThemeHtmlTplPhpAttributesTestCase) [Theme]500
LeafHTTP file retrieval (RetrieveFileTestCase) [System]700
LeafImage dimensions (ImageDimensionsUnitTest) [Image]5600
LeafImage effects (ImageEffectsUnitTest) [Image]3900
LeafImage field display tests (ImageFieldDisplayTestCase) [Image]16200
LeafImage field validation tests (ImageFieldValidateTestCase) [Image]2100
LeafImage GD manipulation tests (ImageToolkitGdTestCase) [Image]9600
LeafImage moving (ImageFileMoveTest) [Image]400
LeafImage styles and effects UI configuration (ImageAdminStylesUnitTest) [Image]13200
LeafImage styles path and URL functions (ImageStylesPathAndUrlUnitTest) [Image]4700
LeafImage toolkit tests (ImageToolkitUnitTest) [Image]5300
Leafimage_dimensions_scale() (ImageDimensionsScaleTestCase) [Image]1500
LeafImport feeds from OPML functionality (ImportOPMLTestCase) [Unknown]5500
LeafIndex.php handling (SystemIndexPhpTest) [System]900
LeafInfo file format parser (InfoFileParserTestCase) [System]900
LeafInsert tests (DatabaseInsertTestCase) [Database]5100
LeafInsert tests, default fields (DatabaseInsertDefaultsTestCase) [Database]2200
LeafInsert tests, LOB fields (DatabaseInsertLOBTestCase) [Database]1500
LeafInstallation profile module tests (SimpleTestInstallationProfileModuleTestsTestCase) [SimpleTest]3200
LeafInstaller language tests (InstallerLanguageTestCase) [Installer]800
LeafInvalid data (DatabaseInvalidDataTestCase) [Database]800
LeafIP address and HTTP_HOST test (BootstrapIPAddressTestCase) [Bootstrap]1100
LeafIP address blocking (IPAddressBlockingTestCase) [System]4200
LeafJavaScript (CommonJavaScriptTestCase) [Common]7500
LeafJavascript translation (LocaleJavascriptTranslationTest) [Locale]6600
LeafJSON (CommonJSONUnitTestCase) [Common]2100
LeafKeywords and conditions (SearchKeywordsConditions) [Search]2800
LeafLanguage list configuration (LanguageListTest) [Language]10700
LeafLanguage negotiation autoconfiguration (LocaleConfigurationTest) [Locale]3700
LeafLanguage negotiation info (LocaleLanguageNegotiationInfoFunctionalTest) [Locale]4900
LeafLanguage switching (LocaleLanguageSwitchingFunctionalTest) [Locale]2600
LeafLanguage upgrade test (LanguageUpgradePathTestCase) [Upgrade path]11100
LeafList field (ListFieldTestCase) [Field types]1600
LeafList field UI (ListFieldUITestCase) [Field types]20700
LeafLoad multiple nodes (NodeLoadMultipleUnitTest) [Node]3900
LeafLocale uninstall (EN) (LocaleUninstallFunctionalTest) [Locale]3200
LeafLocale uninstall (FR) (LocaleUninstallFrenchFunctionalTest) [Locale]3200
LeafLocalize date formats (LocaleDateFormatsFunctionalTest) [Locale]3700
LeafLocking framework tests (LockFunctionalTest) [System]1800
LeafMail system (MailTestCase) [Mail]700
LeafMain content rendering fallback (SystemMainContentFallback) [System]6200
LeafManage display (FieldUIManageDisplayTestCase) [Field UI]8300
LeafManage fields (FieldUIManageFieldsTestCase) [Field UI]19800
LeafManaged file element test (FileManagedFileElementTestCase) [File]26800
LeafMenu link creation/deletion (MenuTestCase) [Menu]65200
LeafMenu links (MenuLinksUnitTestCase) [Menu]10000
LeafMenu rebuild test (MenuRebuildTestCase) [Menu]1000
LeafMenu router (MenuRouterTestCase) [Menu]23600
LeafMenu settings for nodes (MenuNodeTestCase) [Menu]6200
LeafMenu tree generation (MenuTreeDataTestCase) [Menu]800
LeafMenu tree output (MenuTreeOutputTestCase) [Menu]700
LeafMerge tests (DatabaseMergeTestCase) [Database]8300
LeafMiscellaneous AJAX tests (AJAXElementValidation) [AJAX]700
LeafMiscellaneous bootstrap unit tests (BootstrapMiscTestCase) [Bootstrap]100
LeafMissing update dependencies (UpdateDependencyMissingTestCase) [Update API]400
LeafModule API (ModuleUnitTest) [Module]6600
LeafModule class loader (ModuleClassLoaderTestCase) [Module]1000
LeafModule dependencies (ModuleDependencyTestCase) [Module]16200
LeafModule installation (ModuleInstallTestCase) [Module]300
LeafModule uninstallation (ModuleUninstallTestCase) [Module]200
LeafModule versions (ModuleVersionTestCase) [Module]5100
ExpandMultilingual fields (LocaleMultilingualFieldsFunctionalTest) [Locale]6131
MessageGroupFilenameLineFunctionStatus
Field language correctly set.Otherlocale.test2744LocaleMultilingualFieldsFunctionalTest->testMultilingualNodeForm()
Field language correctly changed.Otherlocale.test2757LocaleMultilingualFieldsFunctionalTest->testMultilingualNodeForm()
Undefined index: enNoticelocale.test2798LocaleMultilingualFieldsFunctionalTest->testMultilingualDisplaySettings()
Node body found.Otherlocale.test2798LocaleMultilingualFieldsFunctionalTest->testMultilingualDisplaySettings()
LeafMultiple vocabulary term reference field (TaxonomyTermFieldMultipleVocabularyTestCase) [Taxonomy]2600
LeafMultistep form using form storage (FormsFormStorageTestCase) [Form API]12000
LeafMultistep node form basic options (MultiStepNodeFormBasicOptionsTest) [Node]1600
LeafNew default theme blocks (NewDefaultThemeBlocks) [Block]2200
LeafNo help (NoHelpTestCase) [Help]1200
LeafNode access (NodeAccessUnitTest) [Node]3400
LeafNode Access on any table (NodeAccessBaseTableTestCase) [Node]16300
LeafNode access pagination (NodeAccessPagerTestCase) [Node]3000
LeafNode access rebuild (NodeAccessRebuildTestCase) [Node]1900
LeafNode access records (NodeAccessRecordsUnitTest) [Node]2600
LeafNode administration (NodeAdminTestCase) [Node]14800
LeafNode blocks (NodeBlockFunctionalTest) [Node]8600
LeafNode creation (NodeCreationTestCase) [Node]3100
ExpandNode edit (PageEditTestCase) [Node]88111
MessageGroupFilenameLineFunctionStatus
Undefined variable: url_targetNoticedrupal_web_test_case.php2576DrupalWebTestCase->clickLink()
Clicked link Edit () from http://drupaltestbot664-mysql/checkout/?q=node/1Browsernode.test323PageEditTestCase->testPageEdit()
On edit page.Othernode.test326PageEditTestCase->testPageEdit()
"Edit(active tab)" foundEdit tab found and marked active.node.test331PageEditTestCase->testPageEdit()
Title field displayed.Browsernode.test332PageEditTestCase->testPageEdit()
Body field displayed.Browsernode.test333PageEditTestCase->testPageEdit()
Failed to set field title to fPfYHYMKOthernode.test340PageEditTestCase->testPageEdit()
Failed to set field body[und][0][value] to adSeAKkgCjzszoZtOthernode.test340PageEditTestCase->testPageEdit()
Found the Save buttonOthernode.test340PageEditTestCase->testPageEdit()
Found the requested form fields at Othernode.test340PageEditTestCase->testPageEdit()
Title displayed.Othernode.test343PageEditTestCase->testPageEdit()
Body displayed.Othernode.test344PageEditTestCase->testPageEdit()
LeafNode edit permissions (PageViewTestCase) [Node]3500
LeafNode entity query alter (NodeEntityFieldQueryAlter) [Node]3300
LeafNode feed (NodeFeedTestCase) [Node]100
LeafNode load hooks (NodeLoadHooksTestCase) [Node]700
LeafNode post information display (NodePostSettingsTestCase) [Node]4000
LeafNode preview (PagePreviewTestCase) [Node]4100
LeafNode query alter (NodeQueryAlter) [Node]9400
LeafNode revision permissions (NodeRevisionPermissionsTestCase) [Node]3400
LeafNode revisions (NodeRevisionsTestCase) [Node]5000
LeafNode RSS Content (NodeRSSContentTestCase) [Node]1900
LeafNode save (NodeSaveTestCase) [Node]4800
LeafNode title (NodeTitleTestCase) [Node]2300
LeafNode title XSS filtering (NodeTitleXSSTestCase) [Node]2300
LeafNode token replacement (NodeTokenReplaceTestCase) [Node]3700
LeafNode type persist (NodeTypePersistenceTestCase) [Node]6500
LeafNode types (NodeTypeTestCase) [Node]11700
LeafNon default theme admin (NonDefaultBlockAdmin) [Block]1100
LeafNumber field (NumberFieldTestCase) [Field types]8700
ExpandOpenID account registration (OpenIDRegistrationTestCase) [OpenID]1292324
MessageGroupFilenameLineFunctionStatus
Undefined index: errorNoticeopenid.module752openid_authentication()
Invalid argument supplied for foreach()Warningopenid.module752openid_authentication()
User was asked to verify e-mail address.Otheropenid.test479OpenIDRegistrationTestCase->testRegisterUserWithEmailVerification()
A welcome message was sent to the user.Otheropenid.test480OpenIDRegistrationTestCase->testRegisterUserWithEmailVerification()
Undefined offset: 0Noticeopenid.test66OpenIDWebTestCase->getPasswordResetURLFromMail()
User was registered with right username.Otheropenid.test484OpenIDRegistrationTestCase->testRegisterUserWithEmailVerification()
Trying to get property of non-objectNoticeopenid.test485OpenIDRegistrationTestCase->testRegisterUserWithEmailVerification()
User was registered with right email address.Otheropenid.test485OpenIDRegistrationTestCase->testRegisterUserWithEmailVerification()
Trying to get property of non-objectNoticeopenid.test486OpenIDRegistrationTestCase->testRegisterUserWithEmailVerification()
User was registered with right timezone.Otheropenid.test486OpenIDRegistrationTestCase->testRegisterUserWithEmailVerification()
Trying to get property of non-objectNoticeopenid.test487OpenIDRegistrationTestCase->testRegisterUserWithEmailVerification()
User was registered with right language.Otheropenid.test487OpenIDRegistrationTestCase->testRegisterUserWithEmailVerification()
Trying to get property of non-objectNoticeopenid.test488OpenIDRegistrationTestCase->testRegisterUserWithEmailVerification()
Undefined index: errorNoticeopenid.module752openid_authentication()
Invalid argument supplied for foreach()Warningopenid.module752openid_authentication()
Raw "You must validate your email address for this account before logging in via OpenID." foundOtheropenid.test491OpenIDRegistrationTestCase->testRegisterUserWithEmailVerification()
Undefined index: errorNoticeopenid.module752openid_authentication()
Invalid argument supplied for foreach()Warningopenid.module752openid_authentication()
User was logged in.Otheropenid.test501OpenIDRegistrationTestCase->testRegisterUserWithEmailVerification()
Undefined index: errorNoticeopenid.module752openid_authentication()
Invalid argument supplied for foreach()Warningopenid.module752openid_authentication()
User was logged in.Otheropenid.test523OpenIDRegistrationTestCase->testRegisterUserWithoutEmailVerification()
User was registered with right username.Otheropenid.test526OpenIDRegistrationTestCase->testRegisterUserWithoutEmailVerification()
Trying to get property of non-objectNoticeopenid.test527OpenIDRegistrationTestCase->testRegisterUserWithoutEmailVerification()
User was registered with right email address.Otheropenid.test527OpenIDRegistrationTestCase->testRegisterUserWithoutEmailVerification()
Trying to get property of non-objectNoticeopenid.test528OpenIDRegistrationTestCase->testRegisterUserWithoutEmailVerification()
User was registered with right timezone.Otheropenid.test528OpenIDRegistrationTestCase->testRegisterUserWithoutEmailVerification()
Trying to get property of non-objectNoticeopenid.test529OpenIDRegistrationTestCase->testRegisterUserWithoutEmailVerification()
User was registered with right language.Otheropenid.test529OpenIDRegistrationTestCase->testRegisterUserWithoutEmailVerification()
Trying to get property of non-objectNoticeopenid.test530OpenIDRegistrationTestCase->testRegisterUserWithoutEmailVerification()
Undefined index: errorNoticeopenid.module752openid_authentication()
Invalid argument supplied for foreach()Warningopenid.module752openid_authentication()
User was logged in.Otheropenid.test535OpenIDRegistrationTestCase->testRegisterUserWithoutEmailVerification()
User was asked to verify e-mail address.Otheropenid.test569OpenIDRegistrationTestCase->testRegisterUserWithInvalidSreg()
OpenID identity was registered.Otheropenid.test586OpenIDRegistrationTestCase->testRegisterUserWithInvalidSreg()
User was asked to verify e-mail address.Otheropenid.test609OpenIDRegistrationTestCase->testRegisterUserWithoutSreg()
OpenID identity was registered.Otheropenid.test625OpenIDRegistrationTestCase->testRegisterUserWithoutSreg()
Undefined index: errorNoticeopenid.module752openid_authentication()
Invalid argument supplied for foreach()Warningopenid.module752openid_authentication()
User was logged in.Otheropenid.test653OpenIDRegistrationTestCase->testRegisterUserWithAXButNoSREG()
User was registered with right username.Otheropenid.test656OpenIDRegistrationTestCase->testRegisterUserWithAXButNoSREG()
Trying to get property of non-objectNoticeopenid.test657OpenIDRegistrationTestCase->testRegisterUserWithAXButNoSREG()
User was registered with right email address.Otheropenid.test657OpenIDRegistrationTestCase->testRegisterUserWithAXButNoSREG()
Trying to get property of non-objectNoticeopenid.test658OpenIDRegistrationTestCase->testRegisterUserWithAXButNoSREG()
User was registered with right timezone.Otheropenid.test658OpenIDRegistrationTestCase->testRegisterUserWithAXButNoSREG()
Trying to get property of non-objectNoticeopenid.test659OpenIDRegistrationTestCase->testRegisterUserWithAXButNoSREG()
User was registered with right language.Otheropenid.test659OpenIDRegistrationTestCase->testRegisterUserWithAXButNoSREG()
ExpandOpenID discovery and login (OpenIDFunctionalTestCase) [OpenID]31310
MessageGroupFilenameLineFunctionStatus
Username was supplied by provider.Browseropenid.test438OpenIDFunctionalTestCase->testSignatureValidation()
LeafOpenID helper functions (OpenIDUnitTest) [OpenID]4500
LeafOptions widgets (OptionsWidgetsTestCase) [Field types]26200
LeafOther Installation profiles (SimpleTestOtherInstallationProfileModuleTestsTestCase) [SimpleTest]2400
LeafOverriding server variables (BootstrapOverrideServerVariablesTestCase) [Bootstrap]600
LeafPage cache test (BootstrapPageCacheTestCase) [Bootstrap]7700
LeafPager query tests (DatabaseSelectPagerDefaultTestCase) [Database]4700
LeafParsing .info files (CommonDrupalParseInfoFileTestCase) [Common]300
LeafPassword hashing (PasswordHashingTest) [System]1000
LeafPath alias functionality (PathAliasTestCase) [Path]13200
LeafPath aliases with languages (PathLanguageUITestCase) [Path]7800
ExpandPath aliases with translated nodes (PathLanguageTestCase) [Path]6520
MessageGroupFilenameLineFunctionStatus
Failed to set field preferred_langcode to frOtherpath.test363PathLanguageTestCase->testAliasTranslation()
Found the requested form fields at user/2/editOtherpath.test363PathLanguageTestCase->testAliasTranslation()
LeafPath language settings (LocalePathFunctionalTest) [Locale]4700
LeafPath lookup (PathLookupTest) [Path API]1300
LeafPath save (PathSaveTest) [Path API]400
LeafPaths on non-English monolingual sites (PathMonolingualTestCase) [Path]3700
LeafPersonal contact form (ContactPersonalTestCase) [Contact]13600
LeafPHP filter access check (PHPAccessTestCase) [PHP]3900
LeafPHP filter functionality (PHPFilterTestCase) [PHP]4300
LeafPlural handling (LocalePluralFormatTest) [Locale]11500
LeafPoll add choice (PollJSAddChoice) [Poll]1600
LeafPoll choice deletion (PollDeleteChoiceTestCase) [Poll]5500
ExpandPoll create (PollCreateTestCase) [Poll]250214
MessageGroupFilenameLineFunctionStatus
Found choice 0 with weight 1.Browserpoll.test69PollWebTestCase->pollCreate()
Found choice 1 with weight 2.Browserpoll.test69PollWebTestCase->pollCreate()
Found choice 2 with weight 3.Browserpoll.test69PollWebTestCase->pollCreate()
Found choice 3 with weight 4.Browserpoll.test69PollWebTestCase->pollCreate()
Found choice 4 with weight 5.Browserpoll.test69PollWebTestCase->pollCreate()
Found choice 5 with weight 6.Browserpoll.test69PollWebTestCase->pollCreate()
Found choice 6 with weight 7.Browserpoll.test69PollWebTestCase->pollCreate()
Failed to set field choice[chid:0][chtext] to ljDEopRIOtherpoll.test73PollWebTestCase->pollCreate()
Failed to set field choice[chid:1][chtext] to k5LjAQ71Otherpoll.test73PollWebTestCase->pollCreate()
Failed to set field choice[chid:2][chtext] to cpsLl2ByOtherpoll.test73PollWebTestCase->pollCreate()
Failed to set field choice[chid:3][chtext] to qj6Vfa6hOtherpoll.test73PollWebTestCase->pollCreate()
Failed to set field choice[chid:4][chtext] to alLcVc9NOtherpoll.test73PollWebTestCase->pollCreate()
Failed to set field choice[chid:5][chtext] to jIHJRPTXOtherpoll.test73PollWebTestCase->pollCreate()
Failed to set field choice[chid:6][chtext] to uzqbVyzEOtherpoll.test73PollWebTestCase->pollCreate()
Found the requested form fields at Otherpoll.test73PollWebTestCase->pollCreate()
Poll has been created.Otherpoll.test75PollWebTestCase->pollCreate()
Trying to get property of non-objectNoticepoll.test76PollWebTestCase->pollCreate()
Poll has been found in the database.Otherpoll.test76PollWebTestCase->pollCreate()
Poll appears in poll list.Otherpoll.test209PollCreateTestCase->testPollCreate()
Poll is active.Otherpoll.test210PollCreateTestCase->testPollCreate()
Undefined variable: url_targetNoticedrupal_web_test_case.php2576DrupalWebTestCase->clickLink()
Clicked link iR8erhFz () from http://drupaltestbot664-mysql/checkout/?q=pollBrowserpoll.test213PollCreateTestCase->testPollCreate()
Link to poll correct.Otherpoll.test214PollCreateTestCase->testPollCreate()
array_flip(): Can only flip STRING and INTEGER values!Warningentity.controller.inc186DrupalDefaultEntityController->load()
EntityMalformedException: Missing bundle property on entity of type node. in entity_extract_ids() (line 151 of /var/lib/drupaltestbot/sites/default/files/checkout/core/modules/entity/entity.module).Uncaught exceptionentity.module151entity_extract_ids()
LeafPoll expiration (PollExpirationTestCase) [Poll]5300
LeafPoll token replacement (PollTokenReplaceTestCase) [Poll]13100
LeafPoll translation (PollTranslateTestCase) [Poll]7500
LeafPoll vote (PollVoteTestCase) [Poll]14900
LeafPrivate file test (FilePrivateTestCase) [File]2500
LeafProgrammatic form submissions (FormsProgrammaticTestCase) [Form API]2400
LeafQuery altering tests (DatabaseAlterTestCase) [Database]6200
LeafQuery logging (DatabaseLoggingTestCase) [Database]4300
LeafQuery tagging tests (DatabaseTaggingTestCase) [Database]3200
LeafQueue functionality (QueueTestCase) [Queue]1400
LeafRange query test (DatabaseRangeQueryTestCase) [Database]300
LeafRDF comment mapping (RdfCommentAttributesTestCase) [RDF]20700
LeafRDF mapping CRUD functions (RdfCrudTestCase) [RDF]1000
LeafRDF mapping definition functionality (RdfMappingDefinitionTestCase) [RDF]6100
LeafRDF mapping hook (RdfMappingHookTestCase) [RDF]600
LeafRDF namespaces (RdfGetRdfNamespacesTestCase) [RDF]500
LeafRDF namespaces serialization test (DrupalGetRdfNamespacesTestCase) [RDF]700
LeafRDF tracker page mapping (RdfTrackerAttributesTestCase) [RDF]3300
LeafRDFa markup (RdfRdfaMarkupTestCase) [RDF]2900
ExpandRebuild arbitrary forms (FormsArbitraryRebuildTestCase) [Form API]6100
MessageGroupFilenameLineFunctionStatus
Found the Rebuild buttonOtherform.test1574FormsArbitraryRebuildTestCase->testUserRegistrationRebuild()
Found the requested form fields at user/registerOtherform.test1574FormsArbitraryRebuildTestCase->testUserRegistrationRebuild()
"Form rebuilt." foundOtherform.test1575FormsArbitraryRebuildTestCase->testUserRegistrationRebuild()
Entered user name has been kept.Browserform.test1576FormsArbitraryRebuildTestCase->testUserRegistrationRebuild()
Entered mail address has been kept.Browserform.test1577FormsArbitraryRebuildTestCase->testUserRegistrationRebuild()
Found the Add another item buttonOtherform.test1588FormsArbitraryRebuildTestCase->testUserRegistrationMultipleField()
Found the requested form fields at user/registerOtherform.test1588FormsArbitraryRebuildTestCase->testUserRegistrationMultipleField()
Form has been rebuilt.Otherform.test1589FormsArbitraryRebuildTestCase->testUserRegistrationMultipleField()
Entered user name has been kept.Browserform.test1590FormsArbitraryRebuildTestCase->testUserRegistrationMultipleField()
Entered mail address has been kept.Browserform.test1591FormsArbitraryRebuildTestCase->testUserRegistrationMultipleField()
LeafRebuild content (NodeBuildContent) [Node]400
LeafRedirect functionality (CommonDrupalGotoTestCase) [Common]2100
LeafRegion content (CommonRegionContentTestCase) [Common]3400
LeafRegistry parse file test (RegistryParseFileTestCase) [System]200
LeafRegistry parse files test (RegistryParseFilesTestCase) [System]600
LeafRegression tests (DatabaseRegressionTestCase) [Database]3100
LeafRemove feed functionality (RemoveFeedTestCase) [Unknown]2500
LeafRemove feed item functionality (RemoveFeedItemTestCase) [Unknown]27000
LeafRequired modules (ModuleRequiredTestCase) [Module]1900
LeafRequirements hook failure (HookRequirementsTestCase) [Module]1600
LeafResettable static variables test (BootstrapResettableStaticTestCase) [Bootstrap]500
LeafRole assignment (UserRolesAssignmentTestCase) [User]5100
LeafRole permissions (UserPermissionsTestCase) [User]5000
LeafSchema API (SchemaTestCase) [Database]58800
LeafSearch and node access (SearchNodeAccessTest) [Search]1600
LeafSearch engine phrase queries (SearchExactTestCase) [Search]2500
LeafSearch engine queries (SearchMatchTestCase) [Search]14700
LeafSearch engine ranking (SearchRankingTestCase) [Search]6900
LeafSearch excerpt extraction (SearchExcerptTestCase) [Search]1600
LeafSearch expression insert/extract (SearchExpressionInsertExtractTestCase) [Search]2400
LeafSearch language selection (SearchLanguageTestCase) [Search]4800
LeafSearch number matching (SearchNumberMatchingTestCase) [Search]29500
LeafSearch numbers (SearchNumbersTestCase) [Search]17500
LeafSearch page override (SearchPageOverride) [Search]1500
LeafSearch page text (SearchPageText) [Search]3700
LeafSearch simplify (SearchSimplifyTestCase) [Search]65700
LeafSecurity (FilterSecurityTestCase) [Filter]2800
LeafSelect tests (DatabaseSelectTestCase) [Database]17400
LeafSelect tests, complex (DatabaseSelectComplexTestCase) [Database]14300
LeafSelect tests, complex 2 (DatabaseSelectComplexTestCase2) [Database]1300
LeafSelect tests, ordered (DatabaseSelectOrderedTestCase) [Database]2900
LeafSelect tests, subqueries (DatabaseSelectSubqueryTestCase) [Database]4300
LeafSequences API (DatabaseNextIdCase) [Database]200
LeafSerialize query (DatabaseSerializeQueryTestCase) [Database]700
LeafSession https handling (SessionHttpsTestCase) [Session]8300
LeafSession tests (SessionTestCase) [Session]24500
LeafShortcut link functionality (ShortcutLinksTestCase) [Shortcut]16300
LeafShortcut set functionality (ShortcutSetsTestCase) [Shortcut]21400
LeafShutdown functions (ShutdownFunctionsTest) [System]500
LeafSimpleTest browser (SimpleTestBrowserTestCase) [SimpleTest]1900
LeafSimpleTest e-mail capturing (SimpleTestMailCaptureTestCase) [SimpleTest]1300
LeafSimpleTest error collector (CommonSimpleTestErrorCollectorTestCase) [Common]1600
LeafSimpleTest functionality (SimpleTestFunctionalTest) [SimpleTest]15900
LeafSite maintenance mode functionality (SiteMaintenanceTestCase) [System]8100
LeafSite-wide contact form (ContactSitewideTestCase) [Contact]23900
LeafSize parsing test (CommonSizeUnitTestCase) [Common]3500
LeafStatistics logging tests (StatisticsLoggingTestCase) [Statistics]3500
LeafStatistics reports tests (StatisticsReportsTestCase) [Statistics]9200
LeafStatistics token replacement (StatisticsTokenReplaceTestCase) [Statistics]3100
LeafStream wrappers (StreamWrapperTest) [File API]1900
LeafString filtering tests (CommonXssUnitTestCase) [Common]1700
LeafString translate, search and validate (LocaleTranslationFunctionalTest) [Locale]41100
LeafString translation using st() (LocaleInstallTest) [Locale]200
LeafSummary length (SummaryLengthTestCase) [Node]1800
LeafSyslog functionality (SyslogTestCase) [Syslog]1700
LeafSystem info alter (SystemInfoAlterTestCase) [System]1000
LeafTableselect form element type test (FormsElementsTableSelectFunctionalTest) [Form API]6000
LeafTablesort (TableSortTest) [System]600
LeafTablesort query tests (DatabaseSelectTableSortDefaultTestCase) [Database]4400
LeafTaxonomy RSS Content. (TaxonomyRSSTestCase) [Taxonomy]2400
LeafTaxonomy term functions and forms (TaxonomyTermTestCase) [Taxonomy]23200
ExpandTaxonomy term hooks (TaxonomyHooksTestCase) [Taxonomy]1686
MessageGroupFilenameLineFunctionStatus
Failed to set field antonym to LongOthertaxonomy.test1412TaxonomyHooksTestCase->testTaxonomyTermHooks()
Found the requested form fields at admin/structure/taxonomy/immt4xls/addOthertaxonomy.test1412TaxonomyHooksTestCase->testTaxonomyTermHooks()
Trying to get property of non-objectNoticetaxonomy.test1415TaxonomyHooksTestCase->testTaxonomyTermHooks()
Antonym was loaded into the term objectOthertaxonomy.test1415TaxonomyHooksTestCase->testTaxonomyTermHooks()
Trying to get property of non-objectNoticetaxonomy.test1422TaxonomyHooksTestCase->testTaxonomyTermHooks()
Failed to set field name to plcjWbKUOthertaxonomy.test1422TaxonomyHooksTestCase->testTaxonomyTermHooks()
Failed to set field antonym to ShortOthertaxonomy.test1422TaxonomyHooksTestCase->testTaxonomyTermHooks()
Found the Save buttonOthertaxonomy.test1422TaxonomyHooksTestCase->testTaxonomyTermHooks()
Found the requested form fields at taxonomy/term//editOthertaxonomy.test1422TaxonomyHooksTestCase->testTaxonomyTermHooks()
Trying to get property of non-objectNoticetaxonomy.test1424TaxonomyHooksTestCase->testTaxonomyTermHooks()
Trying to get property of non-objectNoticetaxonomy.test1425TaxonomyHooksTestCase->testTaxonomyTermHooks()
Antonym was successfully editedOthertaxonomy.test1425TaxonomyHooksTestCase->testTaxonomyTermHooks()
Trying to get property of non-objectNoticetaxonomy.test1428TaxonomyHooksTestCase->testTaxonomyTermHooks()
Trying to get property of non-objectNoticetaxonomy.test1429TaxonomyHooksTestCase->testTaxonomyTermHooks()
LeafTaxonomy term index (TaxonomyTermIndexTestCase) [Taxonomy]4600
LeafTaxonomy term multiple loading (TaxonomyLoadMultipleUnitTest) [Taxonomy]1900
LeafTaxonomy term reference field (TaxonomyTermFieldTestCase) [Taxonomy]4500
LeafTaxonomy term unit tests (TaxonomyTermUnitTest) [Taxonomy]1100
ExpandTaxonomy term URL aliases (PathTaxonomyTermTestCase) [Path]30100
MessageGroupFilenameLineFunctionStatus
Failed to set field path[alias] to x6wPhroTOtherpath.test240PathTaxonomyTermTestCase->testTermAlias()
Found the requested form fields at admin/structure/taxonomy/tags/addOtherpath.test240PathTaxonomyTermTestCase->testTermAlias()
Term can be accessed on URL alias.Otherpath.test244PathTaxonomyTermTestCase->testTermAlias()
Failed to set field path[alias] to d90TWcfjOtherpath.test250PathTaxonomyTermTestCase->testTermAlias()
Found the Save buttonOtherpath.test250PathTaxonomyTermTestCase->testTermAlias()
Found the requested form fields at taxonomy/term//editOtherpath.test250PathTaxonomyTermTestCase->testTermAlias()
Term can be accessed on changed URL alias.Otherpath.test254PathTaxonomyTermTestCase->testTermAlias()
Failed to set field path[alias] to Otherpath.test264PathTaxonomyTermTestCase->testTermAlias()
Found the Save buttonOtherpath.test264PathTaxonomyTermTestCase->testTermAlias()
Found the requested form fields at taxonomy/term//editOtherpath.test264PathTaxonomyTermTestCase->testTermAlias()
LeafTaxonomy theme switching (TaxonomyThemeTestCase) [Taxonomy]1900
LeafTaxonomy token replacement (TaxonomyTokenReplaceTestCase) [Taxonomy]5500
LeafTaxonomy vocabularies (TaxonomyVocabularyUnitTest) [Taxonomy]8300
ExpandTaxonomy vocabulary interface (TaxonomyVocabularyFunctionalTest) [Taxonomy]10402
MessageGroupFilenameLineFunctionStatus
Trying to get property of non-objectNoticetaxonomy.admin.inc946taxonomy_vocabulary_confirm_delete()
Trying to get property of non-objectNoticetaxonomy.admin.inc950taxonomy_vocabulary_confirm_delete()
LeafTemporary query test (DatabaseTemporaryQueryTestCase) [Database]600
LeafTest for legacy node bug. (TaxonomyLegacyTestCase) [Taxonomy]1400
LeafTest statistics admin. (StatisticsAdminTestCase) [Statistics]14400
LeafTesting SimpleTest setUp (SimpleTestFolderTestCase) [SimpleTest]200
LeafText field (TextFieldTestCase) [Field types]19200
LeafText summary (TextSummaryTestCase) [Field types]13800
LeafText translation (TextTranslationTestCase) [Field types]10600
LeafTheme API (ThemeUnitTest) [Theme]4100
LeafTheme Datetime (ThemeDatetime) [Theme]500
LeafTheme fast initialization (ThemeFastTestCase) [Theme]1100
LeafTheme functions (ThemeFunctionsTestCase) [Theme]2500
LeafTheme HTML Tag (ThemeHtmlTag) [Theme]200
LeafTheme initialization in hook_init() (ThemeHookInitUnitTest) [Theme]500
LeafTheme interface functionality (SystemThemeFunctionalTest) [System]19100
LeafTheme Table (ThemeTableUnitTest) [Theme]600
LeafThemeRegistry (ThemeRegistryTestCase) [Theme]600
LeafTimer test (BootstrapTimerTestCase) [Bootstrap]500
LeafToken replacement (TokenReplaceTestCase) [System]3600
LeafTop visitor blocking (StatisticsBlockVisitorsTestCase) [Statistics]4800
LeafTracker (TrackerTest) [Tracker]23400
LeafTransaction tests (DatabaseTransactionTestCase) [Database]7400
LeafTranslation export (LocaleExportFunctionalTest) [Locale]3100
LeafTranslation functionality (TranslationTestCase) [Translation]54500
LeafTranslation import (LocaleImportFunctionalTest) [Locale]11500
LeafUI language negotiation (LocaleUILanguageNegotiationTest) [Locale]11900
LeafUnassigned text format functionality (FilterNoFormatTestCase) [Filter]100
LeafUnicode handling (UnicodeUnitTest) [System]18200
LeafUnmanaged file copying (FileUnmanagedCopyTest) [File API]3100
LeafUnmanaged file copying (RemoteFileUnmanagedCopyTest) [File API (remote)]3400
LeafUnmanaged file delete (FileUnmanagedDeleteTest) [File API]800
LeafUnmanaged file delete (RemoteFileUnmanagedDeleteTest) [File API (remote)]1100
LeafUnmanaged file moving (FileUnmanagedMoveTest) [File API]2200
LeafUnmanaged file moving (RemoteFileUnmanagedMoveTest) [File API (remote)]2500
LeafUnmanaged file save data (FileUnmanagedSaveDataTest) [File API]700
LeafUnmanaged file save data (RemoteFileUnmanagedSaveDataTest) [File API (remote)]800
LeafUnmanaged recursive file delete (FileUnmanagedDeleteRecursiveTest) [File API]1700
LeafUnmanaged recursive file delete (RemoteFileUnmanagedDeleteRecursiveTest) [File API (remote)]2100
LeafUpdate contrib functionality (UpdateTestContribCase) [Update]18800
LeafUpdate core functionality (UpdateCoreTestCase) [Update]20000
LeafUpdate dependency hook invocation (UpdateDependencyHookInvocationTestCase) [Update API]400
LeafUpdate dependency ordering (UpdateDependencyOrderingTestCase) [Update API]500
LeafUpdate feed functionality (UpdateFeedTestCase) [Unknown]7600
LeafUpdate feed item functionality (UpdateFeedItemTestCase) [Unknown]6500
LeafUpdate functionality (UpdateScriptFunctionalTest) [System]20500
LeafUpdate on cron functionality (AggregatorCronTestCase) [Unknown]5500
LeafUpdate tests (DatabaseUpdateTestCase) [Database]5600
LeafUpdate tests, Complex (DatabaseUpdateComplexTestCase) [Database]5900
LeafUpdate tests, LOB (DatabaseUpdateLOBTestCase) [Database]1500
LeafUpload and extract module functionality (UpdateTestUploadCase) [Update]6400
LeafUpload user picture (UserPictureTestCase) [User]10500
LeafURL altering (UrlAlterFunctionalTest) [Path API]3400
LeafURL generation tests (CommonURLUnitTestCase) [Common]5600
LeafURL rewriting (LocaleUrlRewritingTest) [Locale]3300
LeafURL validation (CommonValidUrlUnitTestCase) [Common]7900
LeafUser account links (UserAccountLinksUnitTests) [User]1900
LeafUser administration (UserAdminTestCase) [User]6200
LeafUser autocompletion (UserAutocompleteTestCase) [User]2600
LeafUser blocks (UserBlocksUnitTests) [User]3900
LeafUser create (UserCreateTestCase) [User]2700
ExpandUser creation (LocaleUserCreationTest) [Locale]6470
MessageGroupFilenameLineFunctionStatus
Global language set in the language selector.Browserlocale.test1852LocaleUserCreationTest->testLocalUserCreation()
New user has correct preferred language set.Otherlocale.test1867LocaleUserCreationTest->testLocalUserCreation()
New user has correct profile language set.Otherlocale.test1868LocaleUserCreationTest->testLocalUserCreation()
New user has correct preferred language set.Otherlocale.test1885LocaleUserCreationTest->testLocalUserCreation()
New user has correct profile language set.Otherlocale.test1886LocaleUserCreationTest->testLocalUserCreation()
Language selector is accessible and correct language is selected.Browserlocale.test1894LocaleUserCreationTest->testLocalUserCreation()
Language selector is accessible and correct language is selected.Browserlocale.test1907LocaleUserCreationTest->testLocalUserCreation()
LeafUser edit (UserEditTestCase) [User]6600
LeafUser edited own account (UserEditedOwnAccountTestCase) [User]2300
LeafUser entity callback tests (UserEntityCallbacksTestCase) [User]700
ExpandUser language settings (LocaleUserLanguageFunctionalTest) [Locale]86120
MessageGroupFilenameLineFunctionStatus
Language selector available.Otherlocale.test1787LocaleUserLanguageFunctionalTest->testUserLanguageConfiguration()
Language present on form.Otherlocale.test1789LocaleUserLanguageFunctionalTest->testUserLanguageConfiguration()
Failed to set field preferred_langcode to xxOtherlocale.test1796LocaleUserLanguageFunctionalTest->testUserLanguageConfiguration()
Found the requested form fields at user/3/editOtherlocale.test1796LocaleUserLanguageFunctionalTest->testUserLanguageConfiguration()
Changes were saved.Otherlocale.test1798LocaleUserLanguageFunctionalTest->testUserLanguageConfiguration()
Default language successfully updated.Otherlocale.test1801LocaleUserLanguageFunctionalTest->testUserLanguageConfiguration()
Language selector available.Otherlocale.test1787LocaleUserLanguageFunctionalTest->testUserLanguageConfiguration()
Language present on form.Otherlocale.test1789LocaleUserLanguageFunctionalTest->testUserLanguageConfiguration()
Failed to set field preferred_langcode to xxOtherlocale.test1796LocaleUserLanguageFunctionalTest->testUserLanguageConfiguration()
Found the requested form fields at user/3/editOtherlocale.test1796LocaleUserLanguageFunctionalTest->testUserLanguageConfiguration()
Changes were saved.Otherlocale.test1798LocaleUserLanguageFunctionalTest->testUserLanguageConfiguration()
Default language successfully updated.Otherlocale.test1801LocaleUserLanguageFunctionalTest->testUserLanguageConfiguration()
LeafUser login (UserLoginTestCase) [User]16300
LeafUser poll vote capability. (PollVoteCheckHostname) [Poll]14500
LeafUser registration (UserRegistrationTestCase) [User]13600
LeafUser role administration (UserRoleAdminTestCase) [User]5300
LeafUser save test (UserSaveTestCase) [User]300
LeafUser search (UserUserSearchTestCase) [User]3900
LeafUser signatures (UserSignatureTestCase) [User]4700
ExpandUser time zones (UserTimeZoneFunctionalTest) [User]2460
MessageGroupFilenameLineFunctionStatus
Failed to set field timezone to America/SantiagoOtheruser.test1363UserTimeZoneFunctionalTest->testUserTimeZone()
Found the requested form fields at user/2/editOtheruser.test1363UserTimeZoneFunctionalTest->testUserTimeZone()
Time zone changed to Santiago time.Otheruser.test1364UserTimeZoneFunctionalTest->testUserTimeZone()
Date should be Chile summer time; five hours ahead of PST.Otheruser.test1368UserTimeZoneFunctionalTest->testUserTimeZone()
Date should be Chile time; four hours ahead of PSTOtheruser.test1370UserTimeZoneFunctionalTest->testUserTimeZone()
Date should be Chile time; three hours ahead of PDT.Otheruser.test1372UserTimeZoneFunctionalTest->testUserTimeZone()
LeafUser token replacement (UserTokenReplaceTestCase) [User]3900
LeafUser validate current pass custom form (UserValidateCurrentPassCustomForm) [User]1700
LeafUsername/e-mail validation (UserValidationTestCase) [User]1600
LeafUUID handling (UuidUnitTestCase) [UUID]700
LeafVariable test (BootstrapVariableTestCase) [Bootstrap]900
LeafVertical tabs form element type test (FormsElementsVerticalTabsFunctionalTest) [Form API]400
LeafWidget customization (FieldUIAlterTestCase) [Field UI]2000
LeafXML-RPC basic (XMLRPCBasicTestCase) [XML-RPC]600
LeafXML-RPC message and alteration (XMLRPCMessagesTestCase) [XML-RPC]700
LeafXML-RPC validator (XMLRPCValidator1IncTestCase) [XML-RPC]1000