drupal8.testing.56.patch

Test status
StatusResult
Last receivedFri, 02/17/2012 - 22:43:37
Last requestedFri, 02/17/2012 - 22:50:11
Last testedFri, 02/17/2012 - 23:12:26
Test count1
Environment status
MySQLfail
File information
Filedrupal8.testing.56.patch
BranchDrupal core - 8.x
LinkIssue Link
SummaryFAILED: [[SimpleTest]]: [MySQL] 34,760 pass(es), 26 fail(s), and 2 exception(s).
Details

MySQL

  1. Setup environment
  2. Detect an invalid patch URL
  3. Detect invalid repository information
  4. Detect invalid patch format
  5. Detect a non-applicable patch
  6. Detect invalid PHP syntax
  7. Detect a Drupal installation failure
  8. Detect a test run failure
  9. Detect a failing test
    Review the test failures below then if necessary run them locally until the problem has been fixed.
  10. Complete test suite with all tests passing
34,760 pass(es), 26 fail(s), and 2 exception(s)

Non-pass

Test namePassFailException
ExpandEnable/disable modules (EnableDisableTestCase) [Module]142880
MessageGroupFilenameLineFunctionStatus
Module "node" is not enabled.Othersystem.test190EnableDisableTestCase->testEnableDisable()
None of the database tables defined by the node module exist.Othersystem.test191EnableDisableTestCase->testEnableDisable()
Found the Continue buttonOthersystem.test201EnableDisableTestCase->testEnableDisable()
Found the requested form fields at Othersystem.test201EnableDisableTestCase->testEnableDisable()
"hook_modules_installed fired for node" foundOthersystem.test210EnableDisableTestCase->testEnableDisable()
"hook_modules_enabled fired for node" foundOthersystem.test211EnableDisableTestCase->testEnableDisable()
watchdog table contains 0 rows for %module module installed.Othersystem.test214EnableDisableTestCase->testEnableDisable()
watchdog table contains 0 rows for %module module enabled.Othersystem.test215EnableDisableTestCase->testEnableDisable()
ExpandFront page (FrontPageTestCase) [System]7220
MessageGroupFilenameLineFunctionStatus
Path is the front page.Othersystem.test1419FrontPageTestCase->testDrupalIsFrontPage()
Path is the front page.Othersystem.test1419FrontPageTestCase->testDrupalIsFrontPage()
ExpandImage moving (ImageFileMoveTest) [Image]101
MessageGroupFilenameLineFunctionStatus
PDOException: SQLSTATE[42S02]: Base table or view not found: 1146 Table 'drupaltestbotmysql.simpletest726291image_styles' doesn't exist: SELECT image_styles.* FROM {image_styles} image_styles ORDER BY name ASC; Array ( ) in image_styles() (line 516 of /var/lib/drupaltestbot/sites/default/files/checkout/core/modules/image/image.module).Uncaught exceptiondatabase.inc2136PDOStatement->execute()
ExpandPage cache test (BootstrapPageCacheTestCase) [Bootstrap]7610
MessageGroupFilenameLineFunctionStatus
Site title matches.Otherbootstrap.test220BootstrapPageCacheTestCase->testPageCompression()
ExpandPath language settings (LocalePathFunctionalTest) [Locale]4430
MessageGroupFilenameLineFunctionStatus
The "xx" front page is readibly available.Otherlocale.test1770LocalePathFunctionalTest->testPathLanguageConfiguration()
First node links to the path alias.Otherlocale.test1843LocalePathFunctionalTest->testPathLanguageConfiguration()
Second node links to the path alias.Otherlocale.test1845LocalePathFunctionalTest->testPathLanguageConfiguration()
ExpandPoll create (PollCreateTestCase) [Poll]27220
MessageGroupFilenameLineFunctionStatus
Last item is equal to new option.Otherpoll.test232PollCreateTestCase->testPollCreate()
Votes saved.Otherpoll.test235PollCreateTestCase->testPollCreate()
ExpandSite maintenance mode functionality (SiteMaintenanceTestCase) [System]7820
MessageGroupFilenameLineFunctionStatus
"Drupal is currently under maintenance. We should be back shortly. Thank you for your patience." foundOthersystem.test1028SiteMaintenanceTestCase->testSiteMaintenance()
Found the site offline message.Othersystem.test1064SiteMaintenanceTestCase->testSiteMaintenance()
ExpandTaxonomy RSS Content. (TaxonomyRSSTestCase) [Taxonomy]1970
MessageGroupFilenameLineFunctionStatus
Failed to set field view_modes_custom[rss] to 1Othertaxonomy.test1016TaxonomyRSSTestCase->testTaxonomyRSS()
Found the Save buttonOthertaxonomy.test1016TaxonomyRSSTestCase->testTaxonomyRSS()
Found the requested form fields at Othertaxonomy.test1016TaxonomyRSSTestCase->testTaxonomyRSS()
Failed to set field fields[taxonomy_u4q3kggb][type] to taxonomy_term_reference_rss_categoryOthertaxonomy.test1023TaxonomyRSSTestCase->testTaxonomyRSS()
Found the Save buttonOthertaxonomy.test1023TaxonomyRSSTestCase->testTaxonomyRSS()
Found the requested form fields at Othertaxonomy.test1023TaxonomyRSSTestCase->testTaxonomyRSS()
Term is displayed when viewing the rss feed.Othertaxonomy.test1041TaxonomyRSSTestCase->testTaxonomyRSS()
ExpandUI language negotiation (LocaleUILanguageNegotiationTest) [Locale]10111
MessageGroupFilenameLineFunctionStatus
Undefined offset: 0Noticelocale.test2335LocaleUILanguageNegotiationTest->testUrlLanguageFallback()
The browser language is the URL active languageOtherlocale.test2335LocaleUILanguageNegotiationTest->testUrlLanguageFallback()

All

Test namePassFailException
Leaf403 functionality (AccessDeniedTestCase) [System]7100
Leaf404 functionality (PageNotFoundTestCase) [System]1800
LeafActionLoopTestCase2300
LeafActionsConfigurationTestCase3800
LeafActive trail (MenuTrailTestCase) [Menu]3300
LeafAddFeedTestCase3000
LeafAdmin theme block admin accessibility (BlockAdminThemeTestCase) [Block]1900
LeafAdministrative pages (SystemAdminTestCase) [System]18700
LeafAdvanced search form (SearchAdvancedSearchForm) [Search]3400
LeafAggregator configuration (AggregatorConfigurationTestCase) [Unknown]2000
LeafAJAX command form values (AJAXFormValuesTestCase) [AJAX]2900
LeafAJAX commands (AJAXCommandsTestCase) [AJAX]6900
LeafAJAX framework (AJAXFrameworkTestCase) [AJAX]2900
LeafAJAX multi form (AJAXMultiFormTestCase) [AJAX]3600
LeafAlter hook functionality (CommonDrupalAlterTestCase) [Common]700
LeafAnonymous comments (CommentAnonymous) [Comment]16600
LeafAuthmap assignment (UserAuthmapAssignmentTestCase) [User]600
LeafAuthorize API (SystemAuthorizeCase) [System]1600
LeafAutocomplete tags (CommonAutocompleteTagsTestCase) [Common]800
LeafBare upgrade test (BareUpgradePathTestCase) [Upgrade path]2400
LeafBasic SQL syntax tests (DatabaseBasicSyntaxTestCase) [Database]3000
LeafBatch percentages (BatchPercentagesUnitTestCase) [Batch API]1800
LeafBatch processing (BatchProcessingTestCase) [Batch API]16100
LeafBatch progress page (BatchPageTestCase) [Batch API]1600
LeafBlock availability (DashboardBlockAvailabilityTestCase) [Dashboard]2600
LeafBlock availability (NodeBlockTestCase) [Node]2100
LeafBlock availability (PollBlockTestCase) [Poll]17600
LeafBlock availability (SearchBlockTestCase) [Search]6400
LeafBlock caching (BlockCacheTestCase) [Block]21300
LeafBlock functionality (BlockTestCase) [Block]35400
LeafBlock functionality (SystemBlockTestCase) [System]4500
LeafBlock HTML id (BlockHTMLIdTestCase) [Block]1600
LeafBlock template suggestions (BlockTemplateSuggestionsUnitTest) [Block]300
LeafBlocks not in hidden region (BlockHiddenRegionTestCase) [Block]1800
LeafBook functionality (BookTestCase) [Book]52800
LeafBoot and exit hook invocation (HookBootExitTestCase) [Bootstrap]1900
LeafBreadcrumbs (MenuBreadcrumbTestCase) [Menu]51100
LeafBroken requirements test (SimpleTestMissingCheckedRequirements) [SimpleTest]1900
LeafBroken SimpleTest method (SimpleTestBrokenSetUp) [SimpleTest]2100
LeafBrowser language detection (LocaleBrowserDetectionTest) [Locale]4100
LeafCache clear test (CacheClearCase) [Cache]1700
LeafCache emptiness test (CacheIsEmptyCase) [Cache]500
LeafCache saving test (CacheSavingCase) [Cache]800
LeafCancel account (UserCancelTestCase) [User]23600
LeafCascading stylesheets (CommonCascadingStylesheetsTestCase) [Common]4000
LeafCategorize feed functionality (CategorizeFeedTestCase) [Unknown]2100
LeafCategorize feed item functionality (CategorizeFeedItemTestCase) [Unknown]5500
LeafChecks display of aggregator items (AggregatorRenderingTestCase) [Unknown]21400
LeafCJK tokenizer (SearchTokenizerTestCase) [Search]800
LeafClass loader (SymfonyClassLoaderTestCase) [Symfony]100
LeafColor functionality (ColorTestCase) [Color]8700
LeafComment actions (CommentActionsTestCase) [Comment]2900
LeafComment approval (CommentApprovalTest) [Comment]15600
LeafComment blocks (CommentBlockFunctionalTest) [Comment]11600
LeafComment count toggle (SearchCommentCountToggleTestCase) [Search]3100
LeafComment fields (CommentFieldsTest) [Comment]10700
ExpandComment interface (CommentInterfaceTest) [Comment]203700
MessageGroupFilenameLineFunctionStatus
Changed environment:array ( 'authenticated' => false, 'comment count' => false, 'form' => 'below', 'user_register' => 1, 'contact' => 'optional', 'comments' => 'open', 'access comments' => 0, 'post comments' => 0, 'skip comment approval' => 1, 'edit own comments' => 0, )Debugcomment.test839CommentInterfaceTest->setEnvironment()
Changed environment:array ( 'authenticated' => true, 'comment count' => false, 'form' => 'below', 'user_register' => 1, 'contact' => 'optional', 'comments' => 'open', 'access comments' => 0, 'post comments' => 0, 'skip comment approval' => 1, 'edit own comments' => 0, )Debugcomment.test839CommentInterfaceTest->setEnvironment()
Changed environment:array ( 'authenticated' => false, 'comment count' => true, 'form' => 'below', 'user_register' => 1, 'contact' => 'optional', 'comments' => 'open', 'access comments' => 0, 'post comments' => 0, 'skip comment approval' => 1, 'edit own comments' => 0, )Debugcomment.test839CommentInterfaceTest->setEnvironment()
Changed environment:array ( 'authenticated' => true, 'comment count' => true, 'form' => 'below', 'user_register' => 1, 'contact' => 'optional', 'comments' => 'open', 'access comments' => 0, 'post comments' => 0, 'skip comment approval' => 1, 'edit own comments' => 0, )Debugcomment.test839CommentInterfaceTest->setEnvironment()
Changed environment:array ( 'authenticated' => false, 'comment count' => false, 'form' => 'below', 'user_register' => 1, 'contact' => 'optional', 'comments' => 'open', 'access comments' => 1, 'post comments' => 0, 'skip comment approval' => 1, 'edit own comments' => 0, )Debugcomment.test839CommentInterfaceTest->setEnvironment()
Changed environment:array ( 'authenticated' => true, 'comment count' => false, 'form' => 'below', 'user_register' => 1, 'contact' => 'optional', 'comments' => 'open', 'access comments' => 1, 'post comments' => 0, 'skip comment approval' => 1, 'edit own comments' => 0, )Debugcomment.test839CommentInterfaceTest->setEnvironment()
Changed environment:array ( 'authenticated' => false, 'comment count' => true, 'form' => 'below', 'user_register' => 1, 'contact' => 'optional', 'comments' => 'open', 'access comments' => 1, 'post comments' => 0, 'skip comment approval' => 1, 'edit own comments' => 0, )Debugcomment.test839CommentInterfaceTest->setEnvironment()
Changed environment:array ( 'authenticated' => true, 'comment count' => true, 'form' => 'below', 'user_register' => 1, 'contact' => 'optional', 'comments' => 'open', 'access comments' => 1, 'post comments' => 0, 'skip comment approval' => 1, 'edit own comments' => 0, )Debugcomment.test839CommentInterfaceTest->setEnvironment()
Changed environment:array ( 'authenticated' => false, 'comment count' => false, 'form' => 'below', 'user_register' => 1, 'contact' => 'optional', 'comments' => 'open', 'access comments' => 0, 'post comments' => 1, 'skip comment approval' => 1, 'edit own comments' => 0, )Debugcomment.test839CommentInterfaceTest->setEnvironment()
Changed environment:array ( 'authenticated' => true, 'comment count' => false, 'form' => 'below', 'user_register' => 1, 'contact' => 'optional', 'comments' => 'open', 'access comments' => 0, 'post comments' => 1, 'skip comment approval' => 1, 'edit own comments' => 0, )Debugcomment.test839CommentInterfaceTest->setEnvironment()
Changed environment:array ( 'authenticated' => false, 'comment count' => true, 'form' => 'below', 'user_register' => 1, 'contact' => 'optional', 'comments' => 'open', 'access comments' => 0, 'post comments' => 1, 'skip comment approval' => 1, 'edit own comments' => 0, )Debugcomment.test839CommentInterfaceTest->setEnvironment()
Changed environment:array ( 'authenticated' => true, 'comment count' => true, 'form' => 'below', 'user_register' => 1, 'contact' => 'optional', 'comments' => 'open', 'access comments' => 0, 'post comments' => 1, 'skip comment approval' => 1, 'edit own comments' => 0, )Debugcomment.test839CommentInterfaceTest->setEnvironment()
Changed environment:array ( 'authenticated' => false, 'comment count' => false, 'form' => 'below', 'user_register' => 1, 'contact' => 'optional', 'comments' => 'open', 'access comments' => 1, 'post comments' => 1, 'skip comment approval' => 1, 'edit own comments' => 0, )Debugcomment.test839CommentInterfaceTest->setEnvironment()
Changed environment:array ( 'authenticated' => true, 'comment count' => false, 'form' => 'below', 'user_register' => 1, 'contact' => 'optional', 'comments' => 'open', 'access comments' => 1, 'post comments' => 1, 'skip comment approval' => 1, 'edit own comments' => 0, )Debugcomment.test839CommentInterfaceTest->setEnvironment()
Changed environment:array ( 'authenticated' => false, 'comment count' => true, 'form' => 'below', 'user_register' => 1, 'contact' => 'optional', 'comments' => 'open', 'access comments' => 1, 'post comments' => 1, 'skip comment approval' => 1, 'edit own comments' => 0, )Debugcomment.test839CommentInterfaceTest->setEnvironment()
Changed environment:array ( 'authenticated' => true, 'comment count' => true, 'form' => 'below', 'user_register' => 1, 'contact' => 'optional', 'comments' => 'open', 'access comments' => 1, 'post comments' => 1, 'skip comment approval' => 1, 'edit own comments' => 0, )Debugcomment.test839CommentInterfaceTest->setEnvironment()
Changed environment:array ( 'authenticated' => false, 'comment count' => false, 'form' => 'separate page', 'user_register' => 1, 'contact' => 'optional', 'comments' => 'open', 'access comments' => 0, 'post comments' => 0, 'skip comment approval' => 1, 'edit own comments' => 0, )Debugcomment.test839CommentInterfaceTest->setEnvironment()
Changed environment:array ( 'authenticated' => true, 'comment count' => false, 'form' => 'separate page', 'user_register' => 1, 'contact' => 'optional', 'comments' => 'open', 'access comments' => 0, 'post comments' => 0, 'skip comment approval' => 1, 'edit own comments' => 0, )Debugcomment.test839CommentInterfaceTest->setEnvironment()
Changed environment:array ( 'authenticated' => false, 'comment count' => true, 'form' => 'separate page', 'user_register' => 1, 'contact' => 'optional', 'comments' => 'open', 'access comments' => 0, 'post comments' => 0, 'skip comment approval' => 1, 'edit own comments' => 0, )Debugcomment.test839CommentInterfaceTest->setEnvironment()
Changed environment:array ( 'authenticated' => true, 'comment count' => true, 'form' => 'separate page', 'user_register' => 1, 'contact' => 'optional', 'comments' => 'open', 'access comments' => 0, 'post comments' => 0, 'skip comment approval' => 1, 'edit own comments' => 0, )Debugcomment.test839CommentInterfaceTest->setEnvironment()
Changed environment:array ( 'authenticated' => false, 'comment count' => false, 'form' => 'separate page', 'user_register' => 1, 'contact' => 'optional', 'comments' => 'open', 'access comments' => 1, 'post comments' => 0, 'skip comment approval' => 1, 'edit own comments' => 0, )Debugcomment.test839CommentInterfaceTest->setEnvironment()
Changed environment:array ( 'authenticated' => true, 'comment count' => false, 'form' => 'separate page', 'user_register' => 1, 'contact' => 'optional', 'comments' => 'open', 'access comments' => 1, 'post comments' => 0, 'skip comment approval' => 1, 'edit own comments' => 0, )Debugcomment.test839CommentInterfaceTest->setEnvironment()
Changed environment:array ( 'authenticated' => false, 'comment count' => true, 'form' => 'separate page', 'user_register' => 1, 'contact' => 'optional', 'comments' => 'open', 'access comments' => 1, 'post comments' => 0, 'skip comment approval' => 1, 'edit own comments' => 0, )Debugcomment.test839CommentInterfaceTest->setEnvironment()
Changed environment:array ( 'authenticated' => true, 'comment count' => true, 'form' => 'separate page', 'user_register' => 1, 'contact' => 'optional', 'comments' => 'open', 'access comments' => 1, 'post comments' => 0, 'skip comment approval' => 1, 'edit own comments' => 0, )Debugcomment.test839CommentInterfaceTest->setEnvironment()
Changed environment:array ( 'authenticated' => false, 'comment count' => false, 'form' => 'separate page', 'user_register' => 1, 'contact' => 'optional', 'comments' => 'open', 'access comments' => 0, 'post comments' => 1, 'skip comment approval' => 1, 'edit own comments' => 0, )Debugcomment.test839CommentInterfaceTest->setEnvironment()
Changed environment:array ( 'authenticated' => true, 'comment count' => false, 'form' => 'separate page', 'user_register' => 1, 'contact' => 'optional', 'comments' => 'open', 'access comments' => 0, 'post comments' => 1, 'skip comment approval' => 1, 'edit own comments' => 0, )Debugcomment.test839CommentInterfaceTest->setEnvironment()
Changed environment:array ( 'authenticated' => false, 'comment count' => true, 'form' => 'separate page', 'user_register' => 1, 'contact' => 'optional', 'comments' => 'open', 'access comments' => 0, 'post comments' => 1, 'skip comment approval' => 1, 'edit own comments' => 0, )Debugcomment.test839CommentInterfaceTest->setEnvironment()
Changed environment:array ( 'authenticated' => true, 'comment count' => true, 'form' => 'separate page', 'user_register' => 1, 'contact' => 'optional', 'comments' => 'open', 'access comments' => 0, 'post comments' => 1, 'skip comment approval' => 1, 'edit own comments' => 0, )Debugcomment.test839CommentInterfaceTest->setEnvironment()
Changed environment:array ( 'authenticated' => false, 'comment count' => false, 'form' => 'separate page', 'user_register' => 1, 'contact' => 'optional', 'comments' => 'open', 'access comments' => 1, 'post comments' => 1, 'skip comment approval' => 1, 'edit own comments' => 0, )Debugcomment.test839CommentInterfaceTest->setEnvironment()
Changed environment:array ( 'authenticated' => true, 'comment count' => false, 'form' => 'separate page', 'user_register' => 1, 'contact' => 'optional', 'comments' => 'open', 'access comments' => 1, 'post comments' => 1, 'skip comment approval' => 1, 'edit own comments' => 0, )Debugcomment.test839CommentInterfaceTest->setEnvironment()
Changed environment:array ( 'authenticated' => false, 'comment count' => true, 'form' => 'separate page', 'user_register' => 1, 'contact' => 'optional', 'comments' => 'open', 'access comments' => 1, 'post comments' => 1, 'skip comment approval' => 1, 'edit own comments' => 0, )Debugcomment.test839CommentInterfaceTest->setEnvironment()
Changed environment:array ( 'authenticated' => true, 'comment count' => true, 'form' => 'separate page', 'user_register' => 1, 'contact' => 'optional', 'comments' => 'open', 'access comments' => 1, 'post comments' => 1, 'skip comment approval' => 1, 'edit own comments' => 0, )Debugcomment.test839CommentInterfaceTest->setEnvironment()
Changed environment:array ( 'authenticated' => false, 'comment count' => false, 'form' => 'below', 'user_register' => 0, 'contact' => 'optional', 'comments' => 'open', 'access comments' => 0, 'post comments' => 0, 'skip comment approval' => 1, 'edit own comments' => 0, )Debugcomment.test839CommentInterfaceTest->setEnvironment()
Changed environment:array ( 'authenticated' => true, 'comment count' => false, 'form' => 'below', 'user_register' => 0, 'contact' => 'optional', 'comments' => 'open', 'access comments' => 0, 'post comments' => 0, 'skip comment approval' => 1, 'edit own comments' => 0, )Debugcomment.test839CommentInterfaceTest->setEnvironment()
Changed environment:array ( 'authenticated' => false, 'comment count' => true, 'form' => 'below', 'user_register' => 0, 'contact' => 'optional', 'comments' => 'open', 'access comments' => 0, 'post comments' => 0, 'skip comment approval' => 1, 'edit own comments' => 0, )Debugcomment.test839CommentInterfaceTest->setEnvironment()
Changed environment:array ( 'authenticated' => true, 'comment count' => true, 'form' => 'below', 'user_register' => 0, 'contact' => 'optional', 'comments' => 'open', 'access comments' => 0, 'post comments' => 0, 'skip comment approval' => 1, 'edit own comments' => 0, )Debugcomment.test839CommentInterfaceTest->setEnvironment()
Changed environment:array ( 'authenticated' => false, 'comment count' => false, 'form' => 'below', 'user_register' => 0, 'contact' => 'optional', 'comments' => 'open', 'access comments' => 1, 'post comments' => 0, 'skip comment approval' => 1, 'edit own comments' => 0, )Debugcomment.test839CommentInterfaceTest->setEnvironment()
Changed environment:array ( 'authenticated' => true, 'comment count' => false, 'form' => 'below', 'user_register' => 0, 'contact' => 'optional', 'comments' => 'open', 'access comments' => 1, 'post comments' => 0, 'skip comment approval' => 1, 'edit own comments' => 0, )Debugcomment.test839CommentInterfaceTest->setEnvironment()
Changed environment:array ( 'authenticated' => false, 'comment count' => true, 'form' => 'below', 'user_register' => 0, 'contact' => 'optional', 'comments' => 'open', 'access comments' => 1, 'post comments' => 0, 'skip comment approval' => 1, 'edit own comments' => 0, )Debugcomment.test839CommentInterfaceTest->setEnvironment()
Changed environment:array ( 'authenticated' => true, 'comment count' => true, 'form' => 'below', 'user_register' => 0, 'contact' => 'optional', 'comments' => 'open', 'access comments' => 1, 'post comments' => 0, 'skip comment approval' => 1, 'edit own comments' => 0, )Debugcomment.test839CommentInterfaceTest->setEnvironment()
Changed environment:array ( 'authenticated' => false, 'comment count' => false, 'form' => 'below', 'user_register' => 0, 'contact' => 'optional', 'comments' => 'open', 'access comments' => 0, 'post comments' => 1, 'skip comment approval' => 1, 'edit own comments' => 0, )Debugcomment.test839CommentInterfaceTest->setEnvironment()
Changed environment:array ( 'authenticated' => true, 'comment count' => false, 'form' => 'below', 'user_register' => 0, 'contact' => 'optional', 'comments' => 'open', 'access comments' => 0, 'post comments' => 1, 'skip comment approval' => 1, 'edit own comments' => 0, )Debugcomment.test839CommentInterfaceTest->setEnvironment()
Changed environment:array ( 'authenticated' => false, 'comment count' => true, 'form' => 'below', 'user_register' => 0, 'contact' => 'optional', 'comments' => 'open', 'access comments' => 0, 'post comments' => 1, 'skip comment approval' => 1, 'edit own comments' => 0, )Debugcomment.test839CommentInterfaceTest->setEnvironment()
Changed environment:array ( 'authenticated' => true, 'comment count' => true, 'form' => 'below', 'user_register' => 0, 'contact' => 'optional', 'comments' => 'open', 'access comments' => 0, 'post comments' => 1, 'skip comment approval' => 1, 'edit own comments' => 0, )Debugcomment.test839CommentInterfaceTest->setEnvironment()
Changed environment:array ( 'authenticated' => false, 'comment count' => false, 'form' => 'below', 'user_register' => 0, 'contact' => 'optional', 'comments' => 'open', 'access comments' => 1, 'post comments' => 1, 'skip comment approval' => 1, 'edit own comments' => 0, )Debugcomment.test839CommentInterfaceTest->setEnvironment()
Changed environment:array ( 'authenticated' => true, 'comment count' => false, 'form' => 'below', 'user_register' => 0, 'contact' => 'optional', 'comments' => 'open', 'access comments' => 1, 'post comments' => 1, 'skip comment approval' => 1, 'edit own comments' => 0, )Debugcomment.test839CommentInterfaceTest->setEnvironment()
Changed environment:array ( 'authenticated' => false, 'comment count' => true, 'form' => 'below', 'user_register' => 0, 'contact' => 'optional', 'comments' => 'open', 'access comments' => 1, 'post comments' => 1, 'skip comment approval' => 1, 'edit own comments' => 0, )Debugcomment.test839CommentInterfaceTest->setEnvironment()
Changed environment:array ( 'authenticated' => true, 'comment count' => true, 'form' => 'below', 'user_register' => 0, 'contact' => 'optional', 'comments' => 'open', 'access comments' => 1, 'post comments' => 1, 'skip comment approval' => 1, 'edit own comments' => 0, )Debugcomment.test839CommentInterfaceTest->setEnvironment()
Changed environment:array ( 'authenticated' => false, 'comment count' => false, 'form' => 'separate page', 'user_register' => 0, 'contact' => 'optional', 'comments' => 'open', 'access comments' => 0, 'post comments' => 0, 'skip comment approval' => 1, 'edit own comments' => 0, )Debugcomment.test839CommentInterfaceTest->setEnvironment()
Changed environment:array ( 'authenticated' => true, 'comment count' => false, 'form' => 'separate page', 'user_register' => 0, 'contact' => 'optional', 'comments' => 'open', 'access comments' => 0, 'post comments' => 0, 'skip comment approval' => 1, 'edit own comments' => 0, )Debugcomment.test839CommentInterfaceTest->setEnvironment()
Changed environment:array ( 'authenticated' => false, 'comment count' => true, 'form' => 'separate page', 'user_register' => 0, 'contact' => 'optional', 'comments' => 'open', 'access comments' => 0, 'post comments' => 0, 'skip comment approval' => 1, 'edit own comments' => 0, )Debugcomment.test839CommentInterfaceTest->setEnvironment()
Changed environment:array ( 'authenticated' => true, 'comment count' => true, 'form' => 'separate page', 'user_register' => 0, 'contact' => 'optional', 'comments' => 'open', 'access comments' => 0, 'post comments' => 0, 'skip comment approval' => 1, 'edit own comments' => 0, )Debugcomment.test839CommentInterfaceTest->setEnvironment()
Changed environment:array ( 'authenticated' => false, 'comment count' => false, 'form' => 'separate page', 'user_register' => 0, 'contact' => 'optional', 'comments' => 'open', 'access comments' => 1, 'post comments' => 0, 'skip comment approval' => 1, 'edit own comments' => 0, )Debugcomment.test839CommentInterfaceTest->setEnvironment()
Changed environment:array ( 'authenticated' => true, 'comment count' => false, 'form' => 'separate page', 'user_register' => 0, 'contact' => 'optional', 'comments' => 'open', 'access comments' => 1, 'post comments' => 0, 'skip comment approval' => 1, 'edit own comments' => 0, )Debugcomment.test839CommentInterfaceTest->setEnvironment()
Changed environment:array ( 'authenticated' => false, 'comment count' => true, 'form' => 'separate page', 'user_register' => 0, 'contact' => 'optional', 'comments' => 'open', 'access comments' => 1, 'post comments' => 0, 'skip comment approval' => 1, 'edit own comments' => 0, )Debugcomment.test839CommentInterfaceTest->setEnvironment()
Changed environment:array ( 'authenticated' => true, 'comment count' => true, 'form' => 'separate page', 'user_register' => 0, 'contact' => 'optional', 'comments' => 'open', 'access comments' => 1, 'post comments' => 0, 'skip comment approval' => 1, 'edit own comments' => 0, )Debugcomment.test839CommentInterfaceTest->setEnvironment()
Changed environment:array ( 'authenticated' => false, 'comment count' => false, 'form' => 'separate page', 'user_register' => 0, 'contact' => 'optional', 'comments' => 'open', 'access comments' => 0, 'post comments' => 1, 'skip comment approval' => 1, 'edit own comments' => 0, )Debugcomment.test839CommentInterfaceTest->setEnvironment()
Changed environment:array ( 'authenticated' => true, 'comment count' => false, 'form' => 'separate page', 'user_register' => 0, 'contact' => 'optional', 'comments' => 'open', 'access comments' => 0, 'post comments' => 1, 'skip comment approval' => 1, 'edit own comments' => 0, )Debugcomment.test839CommentInterfaceTest->setEnvironment()
Changed environment:array ( 'authenticated' => false, 'comment count' => true, 'form' => 'separate page', 'user_register' => 0, 'contact' => 'optional', 'comments' => 'open', 'access comments' => 0, 'post comments' => 1, 'skip comment approval' => 1, 'edit own comments' => 0, )Debugcomment.test839CommentInterfaceTest->setEnvironment()
Changed environment:array ( 'authenticated' => true, 'comment count' => true, 'form' => 'separate page', 'user_register' => 0, 'contact' => 'optional', 'comments' => 'open', 'access comments' => 0, 'post comments' => 1, 'skip comment approval' => 1, 'edit own comments' => 0, )Debugcomment.test839CommentInterfaceTest->setEnvironment()
Changed environment:array ( 'authenticated' => false, 'comment count' => false, 'form' => 'separate page', 'user_register' => 0, 'contact' => 'optional', 'comments' => 'open', 'access comments' => 1, 'post comments' => 1, 'skip comment approval' => 1, 'edit own comments' => 0, )Debugcomment.test839CommentInterfaceTest->setEnvironment()
Changed environment:array ( 'authenticated' => true, 'comment count' => false, 'form' => 'separate page', 'user_register' => 0, 'contact' => 'optional', 'comments' => 'open', 'access comments' => 1, 'post comments' => 1, 'skip comment approval' => 1, 'edit own comments' => 0, )Debugcomment.test839CommentInterfaceTest->setEnvironment()
Changed environment:array ( 'authenticated' => false, 'comment count' => true, 'form' => 'separate page', 'user_register' => 0, 'contact' => 'optional', 'comments' => 'open', 'access comments' => 1, 'post comments' => 1, 'skip comment approval' => 1, 'edit own comments' => 0, )Debugcomment.test839CommentInterfaceTest->setEnvironment()
Changed environment:array ( 'authenticated' => true, 'comment count' => true, 'form' => 'separate page', 'user_register' => 0, 'contact' => 'optional', 'comments' => 'open', 'access comments' => 1, 'post comments' => 1, 'skip comment approval' => 1, 'edit own comments' => 0, )Debugcomment.test839CommentInterfaceTest->setEnvironment()
LeafComment language (LocaleCommentLanguageFunctionalTest) [Locale]5300
LeafComment node access (CommentNodeAccessTest) [Comment]5400
LeafComment paging settings (CommentPagerTest) [Comment]21100
LeafComment preview (CommentPreviewTest) [Comment]9300
LeafComment Rebuild (CommentContentRebuild) [Comment]3300
LeafComment RSS (CommentRSSUnitTest) [Comment]2500
LeafComment Search tests (SearchCommentTestCase) [Search]19000
LeafComment token replacement (CommentTokenReplaceTestCase) [Comment]6500
LeafConfig settings form (SearchConfigSettingsForm) [Search]12200
LeafConnection tests (DatabaseConnectionTestCase) [Database]3800
LeafContent language settings (LocaleContentFunctionalTest) [Locale]14300
LeafContextual links on node lists (ContextualDynamicContextTestCase) [Contextual]1600
LeafCron run (CronRunTestCase) [System]6100
LeafCSS Unit Tests (CommonCascadingStylesheetsUnitTestCase) [Common]1200
LeafCustom query syntax tests (DatabaseQueryTestCase) [Database]700
LeafDashboard blocks (DashboardBlocksTestCase) [Dashboard]8500
LeafData record write functionality (CommonDrupalWriteRecordTestCase) [Common]3400
LeafDate and time (DateTimeFunctionalTest) [System]14600
LeafDBLog functionality (DBLogTestCase) [DBLog]39600
LeafDefault text format functionality (FilterDefaultFormatTestCase) [Filter]3300
LeafDelete/Truncate tests (DatabaseDeleteTruncateTestCase) [Database]2300
LeafDrupal error handlers (DrupalErrorHandlerUnitTest) [System]3000
LeafDrupal HTTP request (CommonDrupalHTTPRequestTestCase) [Common]3200
LeafDrupal match path (DrupalMatchPathTestCase) [Path API]4100
LeafDrupal system listing (CommonDrupalSystemListingTestCase) [Common]600
Leafdrupal_add_feed() tests (CommonDrupalAddFeedTestCase) [Common]600
Leafdrupal_array_*() tests (CommonDrupalArrayUnitTest) [System]1300
Leafdrupal_render() (CommonDrupalRenderTestCase) [Common]5200
LeafElement processing (FormElementTestCase) [Form API]3300
LeafEmbedded forms (SearchEmbedForm) [Search]3200
LeafEmpty statement (DatabaseEmptyStatementTestCase) [Database]400
ExpandEnable/disable modules (EnableDisableTestCase) [Module]142880
MessageGroupFilenameLineFunctionStatus
Module "node" is not enabled.Othersystem.test190EnableDisableTestCase->testEnableDisable()
None of the database tables defined by the node module exist.Othersystem.test191EnableDisableTestCase->testEnableDisable()
Found the Continue buttonOthersystem.test201EnableDisableTestCase->testEnableDisable()
Found the requested form fields at Othersystem.test201EnableDisableTestCase->testEnableDisable()
"hook_modules_installed fired for node" foundOthersystem.test210EnableDisableTestCase->testEnableDisable()
"hook_modules_enabled fired for node" foundOthersystem.test211EnableDisableTestCase->testEnableDisable()
watchdog table contains 0 rows for %module module installed.Othersystem.test214EnableDisableTestCase->testEnableDisable()
watchdog table contains 0 rows for %module module enabled.Othersystem.test215EnableDisableTestCase->testEnableDisable()
LeafEntity CRUD (EntityAPITestCase) [Entity API]800
LeafEntity CRUD hooks (EntityCrudHookTestCase) [Entity API]13200
LeafEntity info (EntityAPIInfoTestCase) [Entity API]500
LeafEntity properties (EntityPropertiesTestCase) [Entity API]400
LeafEntity query (EntityFieldQueryTestCase) [Entity API]12800
LeafFeed parser functionality (FeedParserTestCase) [Unknown]6500
LeafFetch tests (DatabaseFetchTestCase) [Database]3700
LeafFetch tests, part 2 (DatabaseFetch2TestCase) [Database]2900
LeafFetching multiple cache items (CacheGetMultipleUnitTest) [Cache]700
LeafField attach tests (other) (FieldAttachOtherTestCase) [Field API]5500
LeafField attach tests (storage-related) (FieldAttachStorageTestCase) [Field API]11600
LeafField bulk delete tests (FieldBulkDeleteTestCase) [Field API]7500
LeafField CRUD tests (FieldCrudTestCase) [Field API]8800
LeafField Display API tests (FieldDisplayAPITestCase) [Field API]6700
LeafField form tests (FieldFormTestCase) [Field API]33300
LeafField info tests (FieldInfoTestCase) [Field API]15400
LeafField instance CRUD tests (FieldInstanceCrudTestCase) [Field API]6800
LeafField SQL storage tests (FieldSqlStorageTestCase) [Field API]15400
LeafField translations tests (FieldTranslationsTestCase) [Field API]9200
LeafFile copying (FileCopyTest) [File API]11000
LeafFile delete (FileDeleteTest) [File API]2000
LeafFile download (FileDownloadTest) [File API]3900
LeafFile field display tests (FileFieldDisplayTestCase) [File]5000
LeafFile field file path tests (FileFieldPathTestCase) [File]2700
LeafFile field revision test (FileFieldRevisionTestCase) [File]6700
LeafFile field validation tests (FileFieldValidateTestCase) [File]11800
LeafFile field widget test (FileFieldWidgetTestCase) [File]30000
LeafFile loading (FileLoadTest) [File API]3400
LeafFile mimetypes (FileMimeTypeTest) [File API]4200
LeafFile moving (FileMoveTest) [File API]11000
LeafFile naming (FileNameMungingTest) [File API]500
LeafFile paths and directories (FileDirectoryTest) [File API]2000
LeafFile paths and directories (RemoteFileDirectoryTest) [File API (remote)]2400
LeafFile save data (FileSaveDataTest) [File API]9300
LeafFile saving (FileSaveTest) [File API]1500
LeafFile scan directory (FileScanDirectoryTest) [File API]2300
LeafFile scan directory (RemoteFileScanDirectoryTest) [File API (remote)]2300
LeafFile space used tests (FileSpaceUsedTest) [File API]1100
LeafFile token replacement (FileTokenReplaceTestCase) [File]3500
LeafFile uploading (FileSaveUploadTest) [File API]27100
LeafFile uploading (RemoteFileSaveUploadTest) [File API (remote)]27100
LeafFile URL rewriting (FileURLRewritingTest) [File]1700
LeafFile usage (FileUsageTest) [File]2100
LeafFile validate (FileValidateTest) [File API]1200
LeafFile validator tests (FileValidatorTest) [File API]2500
LeafFileTransfer unit tests (FileTranferTest) [System]400
LeafFilled upgrade test (FilledUpgradePathTestCase) [Upgrade path]2300
LeafFilter administration functionality (FilterAdminTestCase) [Filter]16400
LeafFilter CRUD operations (FilterCRUDTestCase) [Filter]21500
LeafFilter format access (FilterFormatAccessTestCase) [Filter]24700
LeafFilter format hooks (FilterHooksTestCase) [Filter]3300
LeafFilter module filters (FilterUnitTestCase) [Filter]21300
LeafFingerprinting meta tag (AdminMetaTagTestCase) [System]300
LeafFlood control mechanism (FloodFunctionalTest) [System]1200
LeafForm alter hooks (FormAlterTestCase) [Form API]400
LeafForm API checkbox (FormCheckboxTestCase) [Form API]9700
LeafForm API file inclusion (FormsFileInclusionTestCase) [Form API]1100
LeafForm element and label output test (FormsElementsLabelsTestCase) [Form API]1800
LeafForm element validation (FormsTestCase) [Form API]30300
LeafForm rebuilding (FormsRebuildTestCase) [Form API]5400
LeafForm state values clearance (advanced) (FormStateValuesCleanAdvancedTestCase) [Form API]700
LeafForm state values clearance (FormStateValuesCleanTestCase) [Form API]1400
LeafForm triggering element determination (FormsTriggeringElementTestCase) [Form API]5000
LeafForm validation handlers (FormValidationTestCase) [Form API]4900
LeafForm wrapper callback (FormsFormWrapperTestCase) [Form API]500
LeafFormat date (CommonFormatDateTestCase) [Common]7200
LeafForum functionality (ForumTestCase) [Forum]63400
ExpandFront page (FrontPageTestCase) [System]7220
MessageGroupFilenameLineFunctionStatus
Path is the front page.Othersystem.test1419FrontPageTestCase->testDrupalIsFrontPage()
Path is the front page.Othersystem.test1419FrontPageTestCase->testDrupalIsFrontPage()
LeafGet filename test (BootstrapGetFilenameTestCase) [Bootstrap]500
LeafGraph (GraphUnitTest) [System]5600
LeafHelp functionality (HelpTestCase) [Help]30700
LeafHTML Attributes (CommonDrupalAttributesUnitTestCase) [Common]600
LeafHTML identifiers (CommonHTMLIdentifierTestCase) [Common]1000
LeafHTML in page titles (PageTitleFiltering) [System]4400
LeafHTML to text conversion (DrupalHtmlToTextTestCase) [Mail]8600
Leafhtml.tpl.php html and body attributes (ThemeHtmlTplPhpAttributesTestCase) [Theme]500
LeafHTTP file retrieval (RetrieveFileTestCase) [System]700
LeafImage dimensions (ImageDimensionsUnitTest) [Image]5400
LeafImage effects (ImageEffectsUnitTest) [Image]3900
LeafImage field display tests (ImageFieldDisplayTestCase) [Image]16200
LeafImage field validation tests (ImageFieldValidateTestCase) [Image]2100
LeafImage GD manipulation tests (ImageToolkitGdTestCase) [Image]9600
ExpandImage moving (ImageFileMoveTest) [Image]101
MessageGroupFilenameLineFunctionStatus
PDOException: SQLSTATE[42S02]: Base table or view not found: 1146 Table 'drupaltestbotmysql.simpletest726291image_styles' doesn't exist: SELECT image_styles.* FROM {image_styles} image_styles ORDER BY name ASC; Array ( ) in image_styles() (line 516 of /var/lib/drupaltestbot/sites/default/files/checkout/core/modules/image/image.module).Uncaught exceptiondatabase.inc2136PDOStatement->execute()
LeafImage styles and effects UI configuration (ImageAdminStylesUnitTest) [Image]17600
LeafImage styles path and URL functions (ImageStylesPathAndUrlUnitTest) [Image]4700
LeafImage toolkit tests (ImageToolkitUnitTest) [Image]5300
Leafimage_dimensions_scale() (ImageDimensionsScaleTestCase) [Image]1500
LeafImport feeds from OPML functionality (ImportOPMLTestCase) [Unknown]5500
LeafIndex.php handling (SystemIndexPhpTest) [System]900
LeafInfo file format parser (InfoFileParserTestCase) [System]1800
LeafInsert tests (DatabaseInsertTestCase) [Database]5100
LeafInsert tests, default fields (DatabaseInsertDefaultsTestCase) [Database]2200
LeafInsert tests, LOB fields (DatabaseInsertLOBTestCase) [Database]1500
LeafInstallation profile module tests (SimpleTestInstallationProfileModuleTestsTestCase) [SimpleTest]1900
LeafInstaller language tests (InstallerLanguageTestCase) [Installer]800
LeafInvalid data (DatabaseInvalidDataTestCase) [Database]800
LeafIP address and HTTP_HOST test (BootstrapIPAddressTestCase) [Bootstrap]1100
LeafIP address blocking (IPAddressBlockingTestCase) [System]8400
LeafJavaScript (CommonJavaScriptTestCase) [Common]7500
LeafJavascript translation (LocaleJavascriptTranslationTest) [Locale]6600
LeafJSON (CommonJSONUnitTestCase) [Common]2100
LeafKeywords and conditions (SearchKeywordsConditions) [Search]2800
LeafLanguage list configuration (LanguageListTest) [Language]10700
LeafLanguage negotiation autoconfiguration (LocaleConfigurationTest) [Locale]3700
LeafLanguage negotiation info (LocaleLanguageNegotiationInfoFunctionalTest) [Locale]4900
LeafLanguage switching (LocaleLanguageSwitchingFunctionalTest) [Locale]2600
LeafLanguage upgrade test (LanguageUpgradePathTestCase) [Upgrade path]3300
LeafList field (ListFieldTestCase) [Field types]1600
LeafList field UI (ListFieldUITestCase) [Field types]20700
LeafLoad multiple nodes (NodeLoadMultipleUnitTest) [Node]3900
LeafLocale uninstall (EN) (LocaleUninstallFunctionalTest) [Locale]3200
LeafLocale uninstall (FR) (LocaleUninstallFrenchFunctionalTest) [Locale]3200
LeafLocalize date formats (LocaleDateFormatsFunctionalTest) [Locale]3700
LeafLocking framework tests (LockFunctionalTest) [System]2900
LeafMail system (MailTestCase) [System]400
LeafMain content rendering fallback (SystemMainContentFallback) [System]6200
LeafManage display (FieldUIManageDisplayTestCase) [Field UI]8300
LeafManage fields (FieldUIManageFieldsTestCase) [Field UI]18000
LeafManaged file element test (FileManagedFileElementTestCase) [File]26500
LeafMenu link creation/deletion (MenuTestCase) [Menu]80200
LeafMenu links (MenuLinksUnitTestCase) [Menu]5000
LeafMenu rebuild test (MenuRebuildTestCase) [Menu]500
LeafMenu router (MenuRouterTestCase) [Menu]23600
LeafMenu settings for nodes (MenuNodeTestCase) [Menu]6100
LeafMenu tree generation (MenuTreeDataTestCase) [Menu]400
LeafMenu tree output (MenuTreeOutputTestCase) [Menu]700
LeafMerge tests (DatabaseMergeTestCase) [Database]8300
LeafMiscellaneous AJAX tests (AJAXElementValidation) [AJAX]700
LeafMiscellaneous bootstrap unit tests (BootstrapMiscTestCase) [Bootstrap]100
LeafMissing update dependencies (UpdateDependencyMissingTestCase) [Update API]400
LeafModule API (ModuleUnitTest) [Module]6600
LeafModule dependencies (ModuleDependencyTestCase) [Module]18700
LeafModule installation (ModuleInstallTestCase) [Module]600
LeafModule uninstallation (ModuleUninstallTestCase) [Module]300
LeafModule versions (ModuleVersionTestCase) [Module]5100
LeafMultilingual fields (LocaleMultilingualFieldsFunctionalTest) [Locale]6400
LeafMultistep form using form storage (FormsFormStorageTestCase) [Form API]12000
LeafMultistep node form basic options (MultiStepNodeFormBasicOptionsTest) [Node]1600
LeafNew default theme blocks (NewDefaultThemeBlocks) [Block]2200
LeafNo help (NoHelpTestCase) [Help]1200
LeafNode access (NodeAccessUnitTest) [Node]3400
LeafNode Access on any table (NodeAccessBaseTableTestCase) [Node]16300
LeafNode access rebuild (NodeAccessRebuildTestCase) [Node]1900
LeafNode access records (NodeAccessRecordsUnitTest) [Node]2600
LeafNode administration (NodeAdminTestCase) [Node]14800
LeafNode blocks (NodeBlockFunctionalTest) [Node]8600
LeafNode creation (NodeCreationTestCase) [Node]3100
LeafNode edit (PageEditTestCase) [Node]9900
LeafNode edit permissions (PageViewTestCase) [Node]3500
LeafNode entity query alter (NodeEntityFieldQueryAlter) [Node]3300
LeafNode feed (NodeFeedTestCase) [Node]100
LeafNode load hooks (NodeLoadHooksTestCase) [Node]700
LeafNode post information display (NodePostSettingsTestCase) [Node]4000
LeafNode preview (PagePreviewTestCase) [Node]4100
LeafNode query alter (NodeQueryAlter) [Node]9400
LeafNode revisions (NodeRevisionsTestCase) [Node]5000
LeafNode RSS Content (NodeRSSContentTestCase) [Node]1900
LeafNode save (NodeSaveTestCase) [Node]4800
LeafNode title (NodeTitleTestCase) [Node]2300
LeafNode title XSS filtering (NodeTitleXSSTestCase) [Node]2300
LeafNode token replacement (NodeTokenReplaceTestCase) [Node]3700
LeafNode type persist (NodeTypePersistenceTestCase) [Node]6500
LeafNode types (NodeTypeTestCase) [Node]11700
LeafNon default theme admin (NonDefaultBlockAdmin) [Block]1100
LeafNumber field (NumberFieldTestCase) [Field types]8700
LeafOpenID account registration (OpenIDRegistrationTestCase) [OpenID]15500
LeafOpenID discovery and login (OpenIDFunctionalTestCase) [OpenID]29400
LeafOpenID helper functions (OpenIDUnitTest) [OpenID]3800
LeafOptions widgets (OptionsWidgetsTestCase) [Field types]26200
LeafOther Installation profiles (SimpleTestOtherInstallationProfileModuleTestsTestCase) [SimpleTest]1200
LeafOverriding server variables (BootstrapOverrideServerVariablesTestCase) [Bootstrap]600
ExpandPage cache test (BootstrapPageCacheTestCase) [Bootstrap]7610
MessageGroupFilenameLineFunctionStatus
Site title matches.Otherbootstrap.test220BootstrapPageCacheTestCase->testPageCompression()
LeafPager query tests (DatabaseSelectPagerDefaultTestCase) [Database]4700
LeafParsing .info files (CommonDrupalParseInfoFileTestCase) [Common]300
LeafPassword hashing (PasswordHashingTest) [System]1000
LeafPath alias functionality (PathAliasTestCase) [Path]11100
LeafPath aliases with languages (PathLanguageUITestCase) [Path]7800
LeafPath aliases with translated nodes (PathLanguageTestCase) [Path]6600
ExpandPath language settings (LocalePathFunctionalTest) [Locale]4430
MessageGroupFilenameLineFunctionStatus
The "xx" front page is readibly available.Otherlocale.test1770LocalePathFunctionalTest->testPathLanguageConfiguration()
First node links to the path alias.Otherlocale.test1843LocalePathFunctionalTest->testPathLanguageConfiguration()
Second node links to the path alias.Otherlocale.test1845LocalePathFunctionalTest->testPathLanguageConfiguration()
LeafPath lookup (PathLookupTest) [Path API]1300
LeafPath save (PathSaveTest) [Path API]400
LeafPaths on non-English monolingual sites (PathMonolingualTestCase) [Path]3700
LeafPersonal contact form (ContactPersonalTestCase) [Contact]13600
LeafPHP filter access check (PHPAccessTestCase) [PHP]3900
LeafPHP filter functionality (PHPFilterTestCase) [PHP]4300
LeafPlural formula evaluation (LocalePluralFormatTest) [Locale]3100
LeafPoll add choice (PollJSAddChoice) [Poll]1600
LeafPoll choice deletion (PollDeleteChoiceTestCase) [Poll]5500
ExpandPoll create (PollCreateTestCase) [Poll]27220
MessageGroupFilenameLineFunctionStatus
Last item is equal to new option.Otherpoll.test232PollCreateTestCase->testPollCreate()
Votes saved.Otherpoll.test235PollCreateTestCase->testPollCreate()
LeafPoll expiration (PollExpirationTestCase) [Poll]5300
LeafPoll token replacement (PollTokenReplaceTestCase) [Poll]13100
LeafPoll translation (PollTranslateTestCase) [Poll]7500
LeafPoll vote (PollVoteTestCase) [Poll]14900
LeafPrivate file test (FilePrivateTestCase) [File]2500
LeafProgrammatic form submissions (FormsProgrammaticTestCase) [Form API]2400
LeafQuery altering tests (DatabaseAlterTestCase) [Database]6200
LeafQuery logging (DatabaseLoggingTestCase) [Database]4300
LeafQuery tagging tests (DatabaseTaggingTestCase) [Database]3200
LeafQueue functionality (QueueTestCase) [System]700
LeafRange query test (DatabaseRangeQueryTestCase) [Database]300
LeafRDF comment mapping (RdfCommentAttributesTestCase) [RDF]20700
LeafRDF mapping CRUD functions (RdfCrudTestCase) [RDF]1000
LeafRDF mapping definition functionality (RdfMappingDefinitionTestCase) [RDF]6100
LeafRDF mapping hook (RdfMappingHookTestCase) [RDF]600
LeafRDF namespaces (RdfGetRdfNamespacesTestCase) [RDF]500
LeafRDF namespaces serialization test (DrupalGetRdfNamespacesTestCase) [RDF]700
LeafRDF tracker page mapping (RdfTrackerAttributesTestCase) [RDF]3300
LeafRDFa markup (RdfRdfaMarkupTestCase) [RDF]2900
LeafRebuild arbitrary forms (FormsArbitraryRebuildTestCase) [Form API]1600
LeafRebuild content (NodeBuildContent) [Node]400
LeafRedirect functionality (CommonDrupalGotoTestCase) [Common]2100
LeafRegion content (CommonRegionContentTestCase) [Common]3400
LeafRegistry parse file test (RegistryParseFileTestCase) [System]200
LeafRegistry parse files test (RegistryParseFilesTestCase) [System]600
LeafRegression tests (DatabaseRegressionTestCase) [Database]3100
LeafRemove feed functionality (RemoveFeedTestCase) [Unknown]2500
LeafRemove feed item functionality (RemoveFeedItemTestCase) [Unknown]19800
LeafRequired modules (ModuleRequiredTestCase) [Module]2800
LeafRequirements hook failure (HookRequirementsTestCase) [Module]2200
LeafResettable static variables test (BootstrapResettableStaticTestCase) [Bootstrap]500
LeafRole assignment (UserRolesAssignmentTestCase) [User]5100
LeafRole permissions (UserPermissionsTestCase) [User]5000
LeafSchema API (SchemaTestCase) [Database]58800
LeafSearch and node access (SearchNodeAccessTest) [Search]1600
LeafSearch engine phrase queries (SearchExactTestCase) [Search]2500
LeafSearch engine queries (SearchMatchTestCase) [Search]14700
LeafSearch engine ranking (SearchRankingTestCase) [Search]6900
LeafSearch excerpt extraction (SearchExcerptTestCase) [Search]1200
LeafSearch expression insert/extract (SearchExpressionInsertExtractTestCase) [Search]2400
LeafSearch language selection (SearchLanguageTestCase) [Search]4800
LeafSearch number matching (SearchNumberMatchingTestCase) [Search]29500
LeafSearch numbers (SearchNumbersTestCase) [Search]17500
LeafSearch page override (SearchPageOverride) [Search]1500
LeafSearch page text (SearchPageText) [Search]3700
LeafSearch simplify (SearchSimplifyTestCase) [Search]65700
LeafSecurity (FilterSecurityTestCase) [Filter]2800
LeafSelect tests (DatabaseSelectTestCase) [Database]14600
LeafSelect tests, complex (DatabaseSelectComplexTestCase) [Database]14300
LeafSelect tests, complex 2 (DatabaseSelectComplexTestCase2) [Database]1300
LeafSelect tests, ordered (DatabaseSelectOrderedTestCase) [Database]2900
LeafSelect tests, subqueries (DatabaseSelectSubqueryTestCase) [Database]4300
LeafSequences API (DatabaseNextIdCase) [Database]200
LeafSerialize query (DatabaseSerializeQueryTestCase) [Database]700
LeafSession https handling (SessionHttpsTestCase) [Session]8300
LeafSession tests (SessionTestCase) [Session]19200
LeafShortcut link functionality (ShortcutLinksTestCase) [Shortcut]14100
LeafShortcut set functionality (ShortcutSetsTestCase) [Shortcut]21400
LeafShutdown functions (ShutdownFunctionsTest) [System]500
LeafSimpleTest browser (SimpleTestBrowserTestCase) [SimpleTest]1600
LeafSimpleTest e-mail capturing (SimpleTestMailCaptureTestCase) [SimpleTest]1300
LeafSimpleTest error collector (CommonSimpleTestErrorCollectorTestCase) [Common]1600
LeafSimpleTest functionality (SimpleTestFunctionalTest) [SimpleTest]13200
ExpandSite maintenance mode functionality (SiteMaintenanceTestCase) [System]7820
MessageGroupFilenameLineFunctionStatus
"Drupal is currently under maintenance. We should be back shortly. Thank you for your patience." foundOthersystem.test1028SiteMaintenanceTestCase->testSiteMaintenance()
Found the site offline message.Othersystem.test1064SiteMaintenanceTestCase->testSiteMaintenance()
LeafSite-wide contact form (ContactSitewideTestCase) [Contact]23900
LeafSize parsing test (CommonSizeUnitTestCase) [Common]3500
LeafStatistics logging tests (StatisticsLoggingTestCase) [Statistics]3500
LeafStatistics reports tests (StatisticsReportsTestCase) [Statistics]10800
LeafStatistics token replacement (StatisticsTokenReplaceTestCase) [Statistics]3100
LeafStream wrappers (StreamWrapperTest) [File API]1900
LeafString filtering tests (CommonXssUnitTestCase) [Common]1700
LeafString translate, search and validate (LocaleTranslationFunctionalTest) [Locale]29200
LeafString translation using st() (LocaleInstallTest) [Locale]200
LeafSummary length (SummaryLengthTestCase) [Node]1800
LeafSyslog functionality (SyslogTestCase) [Syslog]1700
LeafSystem info alter (SystemInfoAlterTestCase) [System]1000
LeafTableselect form element type test (FormsElementsTableSelectFunctionalTest) [Form API]6000
LeafTablesort (TableSortTest) [System]600
LeafTablesort query tests (DatabaseSelectTableSortDefaultTestCase) [Database]4400
ExpandTaxonomy RSS Content. (TaxonomyRSSTestCase) [Taxonomy]1970
MessageGroupFilenameLineFunctionStatus
Failed to set field view_modes_custom[rss] to 1Othertaxonomy.test1016TaxonomyRSSTestCase->testTaxonomyRSS()
Found the Save buttonOthertaxonomy.test1016TaxonomyRSSTestCase->testTaxonomyRSS()
Found the requested form fields at Othertaxonomy.test1016TaxonomyRSSTestCase->testTaxonomyRSS()
Failed to set field fields[taxonomy_u4q3kggb][type] to taxonomy_term_reference_rss_categoryOthertaxonomy.test1023TaxonomyRSSTestCase->testTaxonomyRSS()
Found the Save buttonOthertaxonomy.test1023TaxonomyRSSTestCase->testTaxonomyRSS()
Found the requested form fields at Othertaxonomy.test1023TaxonomyRSSTestCase->testTaxonomyRSS()
Term is displayed when viewing the rss feed.Othertaxonomy.test1041TaxonomyRSSTestCase->testTaxonomyRSS()
LeafTaxonomy term functions and forms (TaxonomyTermTestCase) [Taxonomy]21700
LeafTaxonomy term hooks (TaxonomyHooksTestCase) [Taxonomy]2100
LeafTaxonomy term index (TaxonomyTermIndexTestCase) [Taxonomy]4600
LeafTaxonomy term multiple loading (TaxonomyLoadMultipleUnitTest) [Taxonomy]1900
LeafTaxonomy term reference field (TaxonomyTermFieldTestCase) [Taxonomy]4200
LeafTaxonomy term unit tests (TaxonomyTermUnitTest) [Taxonomy]1100
LeafTaxonomy term URL aliases (PathTaxonomyTermTestCase) [Path]3700
LeafTaxonomy theme switching (TaxonomyThemeTestCase) [Taxonomy]1900
LeafTaxonomy token replacement (TaxonomyTokenReplaceTestCase) [Taxonomy]5500
LeafTaxonomy vocabularies (TaxonomyVocabularyUnitTest) [Taxonomy]8300
LeafTaxonomy vocabulary interface (TaxonomyVocabularyFunctionalTest) [Taxonomy]10400
LeafTemporary query test (DatabaseTemporaryQueryTestCase) [Database]600
LeafTest for legacy node bug. (TaxonomyLegacyTestCase) [Taxonomy]1400
LeafTest statistics admin. (StatisticsAdminTestCase) [Statistics]11200
LeafTesting SimpleTest setUp (SimpleTestFolderTestCase) [SimpleTest]200
LeafText field (TextFieldTestCase) [Field types]19200
LeafText summary (TextSummaryTestCase) [Field types]13800
LeafText translation (TextTranslationTestCase) [Field types]10600
LeafTheme API (ThemeUnitTest) [Theme]3800
LeafTheme Datetime (ThemeDatetime) [Theme]500
LeafTheme fast initialization (ThemeFastTestCase) [Theme]1100
LeafTheme functions (ThemeFunctionsTestCase) [Theme]2500
LeafTheme HTML Tag (ThemeHtmlTag) [Theme]200
LeafTheme initialization in hook_init() (ThemeHookInitUnitTest) [Theme]500
LeafTheme interface functionality (SystemThemeFunctionalTest) [System]19100
LeafTheme Table (ThemeTableUnitTest) [Theme]600
LeafThemeRegistry (ThemeRegistryTestCase) [Theme]600
LeafTimer test (BootstrapTimerTestCase) [Bootstrap]500
LeafToken replacement (TokenReplaceTestCase) [System]3600
LeafTop visitor blocking (StatisticsBlockVisitorsTestCase) [Statistics]4700
LeafTracker (TrackerTest) [Tracker]23400
LeafTransaction tests (DatabaseTransactionTestCase) [Database]7400
LeafTranslation export (LocaleExportFunctionalTest) [Locale]3100
LeafTranslation functionality (TranslationTestCase) [Translation]54500
LeafTranslation import (LocaleImportFunctionalTest) [Locale]11500
ExpandUI language negotiation (LocaleUILanguageNegotiationTest) [Locale]10111
MessageGroupFilenameLineFunctionStatus
Undefined offset: 0Noticelocale.test2335LocaleUILanguageNegotiationTest->testUrlLanguageFallback()
The browser language is the URL active languageOtherlocale.test2335LocaleUILanguageNegotiationTest->testUrlLanguageFallback()
LeafUnassigned text format functionality (FilterNoFormatTestCase) [Filter]100
LeafUnicode handling (UnicodeUnitTest) [System]18200
LeafUnmanaged file copying (FileUnmanagedCopyTest) [File API]3100
LeafUnmanaged file copying (RemoteFileUnmanagedCopyTest) [File API (remote)]3400
LeafUnmanaged file delete (FileUnmanagedDeleteTest) [File API]800
LeafUnmanaged file delete (RemoteFileUnmanagedDeleteTest) [File API (remote)]1100
LeafUnmanaged file moving (FileUnmanagedMoveTest) [File API]2200
LeafUnmanaged file moving (RemoteFileUnmanagedMoveTest) [File API (remote)]2500
LeafUnmanaged file save data (FileUnmanagedSaveDataTest) [File API]700
LeafUnmanaged file save data (RemoteFileUnmanagedSaveDataTest) [File API (remote)]800
LeafUnmanaged recursive file delete (FileUnmanagedDeleteRecursiveTest) [File API]1700
LeafUnmanaged recursive file delete (RemoteFileUnmanagedDeleteRecursiveTest) [File API (remote)]2100
LeafUpdate contrib functionality (UpdateTestContribCase) [Update]18800
LeafUpdate core functionality (UpdateCoreTestCase) [Update]20000
LeafUpdate dependency hook invocation (UpdateDependencyHookInvocationTestCase) [Update API]400
LeafUpdate dependency ordering (UpdateDependencyOrderingTestCase) [Update API]500
LeafUpdate feed functionality (UpdateFeedTestCase) [Unknown]7600
LeafUpdate feed item functionality (UpdateFeedItemTestCase) [Unknown]6300
LeafUpdate functionality (UpdateScriptFunctionalTest) [System]20500
LeafUpdate on cron functionality (AggregatorCronTestCase) [Unknown]5500
LeafUpdate tests (DatabaseUpdateTestCase) [Database]5600
LeafUpdate tests, Complex (DatabaseUpdateComplexTestCase) [Database]5900
LeafUpdate tests, LOB (DatabaseUpdateLOBTestCase) [Database]1500
LeafUpload and extract module functionality (UpdateTestUploadCase) [Update]6400
LeafUpload user picture (UserPictureTestCase) [User]8200
LeafURL altering (UrlAlterFunctionalTest) [Path API]3400
LeafURL generation tests (CommonURLUnitTestCase) [Common]5600
LeafURL rewriting (LocaleUrlRewritingTest) [Locale]3300
LeafURL validation (CommonValidUrlUnitTestCase) [Common]7900
LeafUser account links (UserAccountLinksUnitTests) [User]1900
LeafUser administration (UserAdminTestCase) [User]6200
LeafUser autocompletion (UserAutocompleteTestCase) [User]2600
LeafUser blocks (UserBlocksUnitTests) [User]3900
LeafUser create (UserCreateTestCase) [User]2700
LeafUser creation (LocaleUserCreationTest) [Locale]6900
LeafUser edit (UserEditTestCase) [User]6600
LeafUser edited own account (UserEditedOwnAccountTestCase) [User]2300
LeafUser entity callback tests (UserEntityCallbacksTestCase) [User]700
LeafUser language settings (LocaleUserLanguageFunctionalTest) [Locale]5000
LeafUser login (UserLoginTestCase) [User]16300
LeafUser poll vote capability. (PollVoteCheckHostname) [Poll]14500
LeafUser registration (UserRegistrationTestCase) [User]13500
LeafUser role administration (UserRoleAdminTestCase) [User]5300
LeafUser save test (UserSaveTestCase) [User]300
LeafUser search (UserUserSearchTestCase) [User]3900
LeafUser signatures (UserSignatureTestCase) [User]4700
LeafUser time zones (UserTimeZoneFunctionalTest) [User]2900
LeafUser token replacement (UserTokenReplaceTestCase) [User]3900
LeafUser validate current pass custom form (UserValidateCurrentPassCustomForm) [User]1700
LeafUsername/e-mail validation (UserValidationTestCase) [User]1900
LeafUUID handling (UuidUnitTestCase) [System]700
LeafVariable test (BootstrapVariableTestCase) [Bootstrap]900
LeafVertical tabs form element type test (FormsElementsVerticalTabsFunctionalTest) [Form API]400
LeafWidget customization (FieldUIAlterTestCase) [Field UI]2000
LeafXML-RPC basic (XMLRPCBasicTestCase) [XML-RPC]600
LeafXML-RPC message and alteration (XMLRPCMessagesTestCase) [XML-RPC]700
LeafXML-RPC validator (XMLRPCValidator1IncTestCase) [XML-RPC]1000