drupal8.cmi_.11.patch

Test status
StatusResult
Last receivedSun, 01/08/2012 - 21:42:38
Last requestedSun, 01/08/2012 - 21:43:02
Last testedSun, 01/08/2012 - 22:21:26
Test count1
Environment status
MySQLfail
File information
Filedrupal8.cmi_.11.patch
BranchDrupal core - 8.x
LinkIssue Link
SummaryFAILED: [[SimpleTest]]: [MySQL] 34,469 pass(es), 52 fail(s), and 86 exception(s).
Details

MySQL

  1. Setup environment
  2. Detect an invalid patch URL
  3. Detect invalid repository information
  4. Detect invalid patch format
  5. Detect a non-applicable patch
  6. Detect invalid PHP syntax
  7. Detect a Drupal installation failure
  8. Detect a test run failure
  9. Detect a failing test
    Review the test failures below then if necessary run them locally until the problem has been fixed.
  10. Complete test suite with all tests passing
34,469 pass(es), 52 fail(s), and 86 exception(s)

Non-pass

Test namePassFailException
ExpandBreadcrumbs (MenuBreadcrumbTestCase) [Menu]41103
MessageGroupFilenameLineFunctionStatus
Invalid argument supplied for foreach()Warningimage.module454image_styles()
Invalid argument supplied for foreach()Warningimage.module454image_styles()
Invalid argument supplied for foreach()Warningimage.module454image_styles()
ExpandCron run (CronRunTestCase) [System]5103
MessageGroupFilenameLineFunctionStatus
Invalid argument supplied for foreach()Warningimage.module454image_styles()
Invalid argument supplied for foreach()Warningimage.module454image_styles()
Invalid argument supplied for foreach()Warningimage.module454image_styles()
ExpandFeed parser functionality (FeedParserTestCase) [Unknown]3670
MessageGroupFilenameLineFunctionStatus
"First example feed item title" foundOtheraggregator.test899FeedParserTestCase->testRSS091Sample()
Link containing href http://example.com/example-turns-one found.Otheraggregator.test900FeedParserTestCase->testRSS091Sample()
"First example feed item description." foundOtheraggregator.test901FeedParserTestCase->testRSS091Sample()
"Atom-Powered Robots Run Amok" foundOtheraggregator.test912FeedParserTestCase->testAtomSample()
Link containing href http://example.org/2003/12/13/atom03 found.Otheraggregator.test913FeedParserTestCase->testAtomSample()
"Some text." foundOtheraggregator.test914FeedParserTestCase->testAtomSample()
Atom entry id element is parsed correctly.Otheraggregator.test915FeedParserTestCase->testAtomSample()
ExpandImage dimensions (ImageDimensionsUnitTest) [Image]117
MessageGroupFilenameLineFunctionStatus
The test did not complete due to a fatal error.Completion checkimage.test954ImageDimensionsUnitTest->testImageDimensions()
Undefined index: effectsNoticeimage.module504image_style_save()
Undefined index: isidNoticeimage.test980ImageDimensionsUnitTest->testImageDimensions()
Missing argument 2 for image_effect_save(), called in /var/lib/drupaltestbot/sites/default/files/checkout/core/modules/image/image.test on line 983 and definedWarningimage.module973image_effect_save()
Undefined variable: effectNoticeimage.module987image_effect_save()
Undefined variable: effectNoticeimage.module989image_effect_save()
Invalid argument supplied for foreach()Warningimage.module989image_effect_save()
SimpleXMLElement::addChild(): Element name is requiredWarningconfig.inc233config_array_to_xml()
ExpandImage field display tests (ImageFieldDisplayTestCase) [Image]151311
MessageGroupFilenameLineFunctionStatus
Invalid argument supplied for foreach()Warningimage.module454image_styles()
Invalid argument supplied for foreach()Warningimage.module454image_styles()
Image style thumbnail formatter displaying correctly on full node view.Otherimage.test721ImageFieldDisplayTestCase->_testImageFieldFormatters()
Invalid argument supplied for foreach()Warningimage.module454image_styles()
Invalid argument supplied for foreach()Warningimage.module454image_styles()
Invalid argument supplied for foreach()Warningimage.module454image_styles()
Image style thumbnail formatter displaying correctly on full node view.Otherimage.test721ImageFieldDisplayTestCase->_testImageFieldFormatters()
Invalid argument supplied for foreach()Warningimage.module454image_styles()
Invalid argument supplied for foreach()Warningimage.module454image_styles()
Invalid argument supplied for foreach()Warningimage.module454image_styles()
Preview image is displayed using 'medium' style.Otherimage.test775ImageFieldDisplayTestCase->testImageFieldSettings()
Invalid argument supplied for foreach()Warningimage.module454image_styles()
Invalid argument supplied for foreach()Warningimage.module454image_styles()
Invalid argument supplied for foreach()Warningimage.module454image_styles()
ExpandImage field validation tests (ImageFieldValidateTestCase) [Image]1903
MessageGroupFilenameLineFunctionStatus
Invalid argument supplied for foreach()Warningimage.module454image_styles()
Invalid argument supplied for foreach()Warningimage.module454image_styles()
Invalid argument supplied for foreach()Warningimage.module454image_styles()
ExpandImage styles and effects UI configuration (ImageAdminStylesUnitTest) [Image]1071534
MessageGroupFilenameLineFunctionStatus
Undefined index: effectsNoticeimage.module504image_style_save()
DOMDocument::loadXML(): error parsing attribute name in Entity, line: 2Warningconfig.inc213config_encode()
DOMDocument::loadXML(): attributes construct error in Entity, line: 2Warningconfig.inc213config_encode()
DOMDocument::loadXML(): Couldn't find end of Start Tag image_rotate_5_ line 2 in Entity, line: 2Warningconfig.inc213config_encode()
DOMDocument::loadXML(): expected '>' in Entity, line: 2Warningconfig.inc213config_encode()
DOMDocument::loadXML(): Opening and ending tag mismatch: effects line 2 and image_rotate_5_ in Entity, line: 2Warningconfig.inc213config_encode()
DOMDocument::loadXML(): Opening and ending tag mismatch: config line 2 and effects in Entity, line: 2Warningconfig.inc213config_encode()
DOMDocument::loadXML(): Extra content at the end of the document in Entity, line: 2Warningconfig.inc213config_encode()
SimpleXMLElement::__construct(): Entity: line 2: parser error : Start tag expected, '<' not foundWarningconfig.inc154config_decode()
SimpleXMLElement::__construct(): Warningconfig.inc154config_decode()
SimpleXMLElement::__construct(): ^Warningconfig.inc154config_decode()
String could not be parsed as XMLExceptionconfig.inc154SimpleXMLElement->__construct()
SimpleXMLElement::__construct(): Entity: line 2: parser error : Start tag expected, '<' not foundWarningconfig.inc154config_decode()
SimpleXMLElement::__construct(): Warningconfig.inc154config_decode()
SimpleXMLElement::__construct(): ^Warningconfig.inc154config_decode()
Exception: String could not be parsed as XML in SimpleXMLElement->__construct() (line 154 of /var/lib/drupaltestbot/sites/default/files/checkout/core/includes/config.inc).Uncaught exceptionconfig.inc154SimpleXMLElement->__construct()
Invalid argument supplied for foreach()Warningimage.module454image_styles()
Invalid argument supplied for foreach()Warningimage.module454image_styles()
Default styles may not be deleted.Otherimage.test521ImageAdminStylesUnitTest->testDefaultStyle()
Default styles may not be renamed.Otherimage.test525ImageAdminStylesUnitTest->testDefaultStyle()
Default styles may not have new effects added.Otherimage.test527ImageAdminStylesUnitTest->testDefaultStyle()
The image_scale effect does not have an ieid.Otherimage.test537ImageAdminStylesUnitTest->testDefaultStyle()
Found the Override defaults buttonOtherimage.test541ImageAdminStylesUnitTest->testDefaultStyle()
Found the requested form fields at admin/config/media/image-styles/edit/thumbnailOtherimage.test541ImageAdminStylesUnitTest->testDefaultStyle()
Default image style may be overridden.Otherimage.test542ImageAdminStylesUnitTest->testDefaultStyle()
Invalid argument supplied for foreach()Warningimage.module454image_styles()
Invalid argument supplied for foreach()Warningimage.module454image_styles()
Invalid argument supplied for foreach()Warningimage.module454image_styles()
Invalid argument supplied for foreach()Warningimage.module454image_styles()
Invalid argument supplied for foreach()Warningimage.module454image_styles()
Invalid argument supplied for foreach()Warningimage.module454image_styles()
The image_scale effect has an ieid.Otherimage.test551ImageAdminStylesUnitTest->testDefaultStyle()
Overridden styles may not be renamed.Otherimage.test562ImageAdminStylesUnitTest->testDefaultStyle()
Found the Revert buttonOtherimage.test569ImageAdminStylesUnitTest->testDefaultStyle()
Found the requested form fields at admin/config/media/image-styles/revert/thumbnailOtherimage.test569ImageAdminStylesUnitTest->testDefaultStyle()
The added effect has been removed in the reverted style.Otherimage.test576ImageAdminStylesUnitTest->testDefaultStyle()
Undefined index: effectsNoticeimage.module504image_style_save()
Invalid argument supplied for foreach()Warningimage.module454image_styles()
Invalid argument supplied for foreach()Warningimage.module454image_styles()
Invalid argument supplied for foreach()Warningimage.module454image_styles()
Image displayed using style okagmgcqo7.Otherimage.test602ImageAdminStylesUnitTest->testStyleReplacement()
Invalid argument supplied for foreach()Warningimage.module454image_styles()
Invalid argument supplied for foreach()Warningimage.module454image_styles()
Invalid argument supplied for foreach()Warningimage.module454image_styles()
Image displayed using style replacement style.Otherimage.test612ImageAdminStylesUnitTest->testStyleReplacement()
Invalid argument supplied for foreach()Warningimage.module454image_styles()
Invalid argument supplied for foreach()Warningimage.module454image_styles()
Invalid argument supplied for foreach()Warningimage.module454image_styles()
Image displayed using style replacement style.Otherimage.test623ImageAdminStylesUnitTest->testStyleReplacement()
ExpandImage styles path and URL functions (ImageStylesPathAndUrlUnitTest) [Image]47013
MessageGroupFilenameLineFunctionStatus
Undefined index: effectsNoticeimage.module504image_style_save()
Undefined index: effectsNoticeimage.module504image_style_save()
Invalid argument supplied for foreach()Warningimage.module454image_styles()
Invalid argument supplied for foreach()Warningimage.module454image_styles()
Undefined index: effectsNoticeimage.module504image_style_save()
Invalid argument supplied for foreach()Warningimage.module454image_styles()
Invalid argument supplied for foreach()Warningimage.module454image_styles()
Undefined index: effectsNoticeimage.module504image_style_save()
Invalid argument supplied for foreach()Warningimage.module454image_styles()
Invalid argument supplied for foreach()Warningimage.module454image_styles()
Undefined index: effectsNoticeimage.module504image_style_save()
Invalid argument supplied for foreach()Warningimage.module454image_styles()
Invalid argument supplied for foreach()Warningimage.module454image_styles()
ExpandJavaScript (JavaScriptTestCase) [System]7610
MessageGroupFilenameLineFunctionStatus
JavaScript is aggregated in the expected groups and order.Othercommon.test1391JavaScriptTestCase->testAggregation()
ExpandPage cache test (BootstrapPageCacheTestCase) [Bootstrap]65150
MessageGroupFilenameLineFunctionStatus
Page was cached.Otherbootstrap.test125BootstrapPageCacheTestCase->testConditionalRequests()
Conditional request returned 304 Not Modified.Browserbootstrap.test130BootstrapPageCacheTestCase->testConditionalRequests()
Conditional request with obsolete If-Modified-Since date returned 304 Not Modified.Browserbootstrap.test133BootstrapPageCacheTestCase->testConditionalRequests()
Conditional request with obsolete If-Modified-Since date returned 304 Not Modified.Browserbootstrap.test136BootstrapPageCacheTestCase->testConditionalRequests()
Page was cached.Otherbootstrap.test140BootstrapPageCacheTestCase->testConditionalRequests()
Page was cached.Otherbootstrap.test144BootstrapPageCacheTestCase->testConditionalRequests()
Page was not cached.Otherbootstrap.test161BootstrapPageCacheTestCase->testPageCache()
Vary header was sent.Otherbootstrap.test162BootstrapPageCacheTestCase->testPageCache()
Cache-Control header was sent.Otherbootstrap.test163BootstrapPageCacheTestCase->testPageCache()
Page was cached.Otherbootstrap.test169BootstrapPageCacheTestCase->testPageCache()
Vary: Cookie header was sent.Otherbootstrap.test170BootstrapPageCacheTestCase->testPageCache()
Cache-Control header was sent.Otherbootstrap.test171BootstrapPageCacheTestCase->testPageCache()
Page was not cached.Otherbootstrap.test205BootstrapPageCacheTestCase->testPageCompression()
Page was cached.Otherbootstrap.test211BootstrapPageCacheTestCase->testPageCompression()
Page was cached.Otherbootstrap.test218BootstrapPageCacheTestCase->testPageCompression()
ExpandRDFa markup (RdfRdfaMarkupTestCase) [RDF]2903
MessageGroupFilenameLineFunctionStatus
Invalid argument supplied for foreach()Warningimage.module454image_styles()
Invalid argument supplied for foreach()Warningimage.module454image_styles()
Invalid argument supplied for foreach()Warningimage.module454image_styles()
ExpandRole permissions (UserPermissionsTestCase) [User]5003
MessageGroupFilenameLineFunctionStatus
Invalid argument supplied for foreach()Warningimage.module454image_styles()
Invalid argument supplied for foreach()Warningimage.module454image_styles()
Invalid argument supplied for foreach()Warningimage.module454image_styles()
ExpandSession tests (SessionTestCase) [Session]19020
MessageGroupFilenameLineFunctionStatus
Page was not cached.Othersession.test146SessionTestCase->testEmptyAnonymousSession()
Page was cached.Othersession.test167SessionTestCase->testEmptyAnonymousSession()
ExpandStatistics logging tests (StatisticsLoggingTestCase) [Statistics]3220
MessageGroupFilenameLineFunctionStatus
Testing an uncached page.Otherstatistics.test95StatisticsLoggingTestCase->testLogging()
Testing a cached page.Otherstatistics.test104StatisticsLoggingTestCase->testLogging()
ExpandUpdate feed item functionality (UpdateFeedItemTestCase) [Unknown]6110
MessageGroupFilenameLineFunctionStatus
URL http://drupaltestbot699-mysql/checkout/core/modules/aggregator/tests/aggregator_test_rss091.xml is accessibleBrowseraggregator.test494UpdateFeedItemTestCase->testUpdateFeedItem()
ExpandUpload user picture (UserPictureTestCase) [User]7416
MessageGroupFilenameLineFunctionStatus
Invalid argument supplied for foreach()Warningimage.module454image_styles()
Invalid argument supplied for foreach()Warningimage.module454image_styles()
Invalid argument supplied for foreach()Warningimage.module454image_styles()
Image is displayed in user's edit pageOtheruser.test919UserPictureTestCase->testWithGDinvalidDimension()
Invalid argument supplied for foreach()Warningimage.module454image_styles()
Invalid argument supplied for foreach()Warningimage.module454image_styles()
Invalid argument supplied for foreach()Warningimage.module454image_styles()
ExpandUser poll vote capability. (PollVoteCheckHostname) [Poll]14140
MessageGroupFilenameLineFunctionStatus
Page was cacheable but was not in the cache.Otherpoll.test542PollVoteCheckHostname->testHostnamePollVote()
Page was cached.Otherpoll.test544PollVoteCheckHostname->testHostnamePollVote()
Page was cacheable but was not in the cache.Otherpoll.test585PollVoteCheckHostname->testHostnamePollVote()
Page was cacheable but was not in the cache.Otherpoll.test596PollVoteCheckHostname->testHostnamePollVote()

All

Test namePassFailException
Leaf403 functionality (AccessDeniedTestCase) [System]7500
Leaf404 functionality (PageNotFoundTestCase) [System]1800
LeafActionLoopTestCase2300
LeafActionsConfigurationTestCase3800
LeafActive trail (MenuTrailTestCase) [Menu]3300
LeafAddFeedTestCase2900
LeafAdmin theme block admin accessibility (BlockAdminThemeTestCase) [Block]1800
LeafAdministrative pages (SystemAdminTestCase) [System]22300
LeafAdvanced search form (SearchAdvancedSearchForm) [Search]3200
LeafAggregator configuration (AggregatorConfigurationTestCase) [Unknown]1800
LeafAJAX command form values (AJAXFormValuesTestCase) [AJAX]2900
LeafAJAX commands (AJAXCommandsTestCase) [AJAX]6900
LeafAJAX framework (AJAXFrameworkTestCase) [AJAX]2900
LeafAJAX multi form (AJAXMultiFormTestCase) [AJAX]3600
LeafAnonymous comments (CommentAnonymous) [Comment]21100
LeafAuthmap assignment (UserAuthmapAssignmentTestCase) [User]600
LeafAuthorize API (SystemAuthorizeCase) [System]1600
LeafBare upgrade test (BareUpgradePathTestCase) [Upgrade path]2400
LeafBasic SQL syntax tests (DatabaseBasicSyntaxTestCase) [Database]3000
LeafBatch percentages (BatchPercentagesUnitTestCase) [Batch API]1800
LeafBatch processing (BatchProcessingTestCase) [Batch API]16100
LeafBatch progress page (BatchPageTestCase) [Batch API]1600
LeafBlock availability (NodeBlockTestCase) [Node]1800
LeafBlock availability (PollBlockTestCase) [Poll]18300
LeafBlock availability (SearchBlockTestCase) [Search]6000
LeafBlock caching (BlockCacheTestCase) [Block]21300
LeafBlock functionality (BlockTestCase) [Block]35400
LeafBlock functionality (SystemBlockTestCase) [System]4500
LeafBlock HTML id (BlockHTMLIdTestCase) [Block]1600
LeafBlock template suggestions (BlockTemplateSuggestionsUnitTest) [Block]300
LeafBlocks not in hidden region (BlockHiddenRegionTestCase) [Block]1500
LeafBook functionality (BookTestCase) [Book]45500
LeafBoot and exit hook invocation (HookBootExitTestCase) [Bootstrap]1900
ExpandBreadcrumbs (MenuBreadcrumbTestCase) [Menu]41103
MessageGroupFilenameLineFunctionStatus
Invalid argument supplied for foreach()Warningimage.module454image_styles()
Invalid argument supplied for foreach()Warningimage.module454image_styles()
Invalid argument supplied for foreach()Warningimage.module454image_styles()
LeafBroken requirements test (SimpleTestMissingCheckedRequirements) [SimpleTest]1900
LeafBroken SimpleTest method (SimpleTestBrokenSetUp) [SimpleTest]2100
LeafBrowser language detection (LocaleBrowserDetectionTest) [Locale]4100
LeafCache clear test (CacheClearCase) [Cache]1800
LeafCache emptiness test (CacheIsEmptyCase) [Cache]500
LeafCache saving test (CacheSavingCase) [Cache]800
LeafCancel account (UserCancelTestCase) [User]23600
LeafCascading stylesheets (CascadingStylesheetsTestCase) [System]4400
LeafCategorize feed functionality (CategorizeFeedTestCase) [Unknown]2000
LeafCategorize feed item functionality (CategorizeFeedItemTestCase) [Unknown]5400
LeafChecks display of aggregator items (AggregatorRenderingTestCase) [Unknown]21200
LeafCJK tokenizer (SearchTokenizerTestCase) [Search]400
LeafClass loader (SymfonyClassLoaderTestCase) [Symfony]100
LeafColor functionality (ColorTestCase) [Color]8700
LeafComment actions (CommentActionsTestCase) [Comment]7300
LeafComment approval (CommentApprovalTest) [Comment]20000
LeafComment blocks (CommentBlockFunctionalTest) [Comment]16000
LeafComment count toggle (SearchCommentCountToggleTestCase) [Search]3100
LeafComment fields (CommentFieldsTest) [Comment]15100
ExpandComment interface (CommentInterfaceTest) [Comment]145300
MessageGroupFilenameLineFunctionStatus
Changed environment:array ( 'authenticated' => false, 'comment count' => false, 'form' => 'below', 'user_register' => 1, 'contact' => 'optional', 'comments' => 'open', 'access comments' => 0, 'post comments' => 0, 'skip comment approval' => 1, 'edit own comments' => 0, )Debugcomment.test739CommentInterfaceTest->setEnvironment()
Changed environment:array ( 'authenticated' => true, 'comment count' => false, 'form' => 'below', 'user_register' => 1, 'contact' => 'optional', 'comments' => 'open', 'access comments' => 0, 'post comments' => 0, 'skip comment approval' => 1, 'edit own comments' => 0, )Debugcomment.test739CommentInterfaceTest->setEnvironment()
Changed environment:array ( 'authenticated' => false, 'comment count' => true, 'form' => 'below', 'user_register' => 1, 'contact' => 'optional', 'comments' => 'open', 'access comments' => 0, 'post comments' => 0, 'skip comment approval' => 1, 'edit own comments' => 0, )Debugcomment.test739CommentInterfaceTest->setEnvironment()
Changed environment:array ( 'authenticated' => true, 'comment count' => true, 'form' => 'below', 'user_register' => 1, 'contact' => 'optional', 'comments' => 'open', 'access comments' => 0, 'post comments' => 0, 'skip comment approval' => 1, 'edit own comments' => 0, )Debugcomment.test739CommentInterfaceTest->setEnvironment()
Changed environment:array ( 'authenticated' => false, 'comment count' => false, 'form' => 'below', 'user_register' => 1, 'contact' => 'optional', 'comments' => 'open', 'access comments' => 1, 'post comments' => 0, 'skip comment approval' => 1, 'edit own comments' => 0, )Debugcomment.test739CommentInterfaceTest->setEnvironment()
Changed environment:array ( 'authenticated' => true, 'comment count' => false, 'form' => 'below', 'user_register' => 1, 'contact' => 'optional', 'comments' => 'open', 'access comments' => 1, 'post comments' => 0, 'skip comment approval' => 1, 'edit own comments' => 0, )Debugcomment.test739CommentInterfaceTest->setEnvironment()
Changed environment:array ( 'authenticated' => false, 'comment count' => true, 'form' => 'below', 'user_register' => 1, 'contact' => 'optional', 'comments' => 'open', 'access comments' => 1, 'post comments' => 0, 'skip comment approval' => 1, 'edit own comments' => 0, )Debugcomment.test739CommentInterfaceTest->setEnvironment()
Changed environment:array ( 'authenticated' => true, 'comment count' => true, 'form' => 'below', 'user_register' => 1, 'contact' => 'optional', 'comments' => 'open', 'access comments' => 1, 'post comments' => 0, 'skip comment approval' => 1, 'edit own comments' => 0, )Debugcomment.test739CommentInterfaceTest->setEnvironment()
Changed environment:array ( 'authenticated' => false, 'comment count' => false, 'form' => 'below', 'user_register' => 1, 'contact' => 'optional', 'comments' => 'open', 'access comments' => 0, 'post comments' => 1, 'skip comment approval' => 1, 'edit own comments' => 0, )Debugcomment.test739CommentInterfaceTest->setEnvironment()
Changed environment:array ( 'authenticated' => true, 'comment count' => false, 'form' => 'below', 'user_register' => 1, 'contact' => 'optional', 'comments' => 'open', 'access comments' => 0, 'post comments' => 1, 'skip comment approval' => 1, 'edit own comments' => 0, )Debugcomment.test739CommentInterfaceTest->setEnvironment()
Changed environment:array ( 'authenticated' => false, 'comment count' => true, 'form' => 'below', 'user_register' => 1, 'contact' => 'optional', 'comments' => 'open', 'access comments' => 0, 'post comments' => 1, 'skip comment approval' => 1, 'edit own comments' => 0, )Debugcomment.test739CommentInterfaceTest->setEnvironment()
Changed environment:array ( 'authenticated' => true, 'comment count' => true, 'form' => 'below', 'user_register' => 1, 'contact' => 'optional', 'comments' => 'open', 'access comments' => 0, 'post comments' => 1, 'skip comment approval' => 1, 'edit own comments' => 0, )Debugcomment.test739CommentInterfaceTest->setEnvironment()
Changed environment:array ( 'authenticated' => false, 'comment count' => false, 'form' => 'below', 'user_register' => 1, 'contact' => 'optional', 'comments' => 'open', 'access comments' => 1, 'post comments' => 1, 'skip comment approval' => 1, 'edit own comments' => 0, )Debugcomment.test739CommentInterfaceTest->setEnvironment()
Changed environment:array ( 'authenticated' => true, 'comment count' => false, 'form' => 'below', 'user_register' => 1, 'contact' => 'optional', 'comments' => 'open', 'access comments' => 1, 'post comments' => 1, 'skip comment approval' => 1, 'edit own comments' => 0, )Debugcomment.test739CommentInterfaceTest->setEnvironment()
Changed environment:array ( 'authenticated' => false, 'comment count' => true, 'form' => 'below', 'user_register' => 1, 'contact' => 'optional', 'comments' => 'open', 'access comments' => 1, 'post comments' => 1, 'skip comment approval' => 1, 'edit own comments' => 0, )Debugcomment.test739CommentInterfaceTest->setEnvironment()
Changed environment:array ( 'authenticated' => true, 'comment count' => true, 'form' => 'below', 'user_register' => 1, 'contact' => 'optional', 'comments' => 'open', 'access comments' => 1, 'post comments' => 1, 'skip comment approval' => 1, 'edit own comments' => 0, )Debugcomment.test739CommentInterfaceTest->setEnvironment()
Changed environment:array ( 'authenticated' => false, 'comment count' => false, 'form' => 'separate page', 'user_register' => 1, 'contact' => 'optional', 'comments' => 'open', 'access comments' => 0, 'post comments' => 0, 'skip comment approval' => 1, 'edit own comments' => 0, )Debugcomment.test739CommentInterfaceTest->setEnvironment()
Changed environment:array ( 'authenticated' => true, 'comment count' => false, 'form' => 'separate page', 'user_register' => 1, 'contact' => 'optional', 'comments' => 'open', 'access comments' => 0, 'post comments' => 0, 'skip comment approval' => 1, 'edit own comments' => 0, )Debugcomment.test739CommentInterfaceTest->setEnvironment()
Changed environment:array ( 'authenticated' => false, 'comment count' => true, 'form' => 'separate page', 'user_register' => 1, 'contact' => 'optional', 'comments' => 'open', 'access comments' => 0, 'post comments' => 0, 'skip comment approval' => 1, 'edit own comments' => 0, )Debugcomment.test739CommentInterfaceTest->setEnvironment()
Changed environment:array ( 'authenticated' => true, 'comment count' => true, 'form' => 'separate page', 'user_register' => 1, 'contact' => 'optional', 'comments' => 'open', 'access comments' => 0, 'post comments' => 0, 'skip comment approval' => 1, 'edit own comments' => 0, )Debugcomment.test739CommentInterfaceTest->setEnvironment()
Changed environment:array ( 'authenticated' => false, 'comment count' => false, 'form' => 'separate page', 'user_register' => 1, 'contact' => 'optional', 'comments' => 'open', 'access comments' => 1, 'post comments' => 0, 'skip comment approval' => 1, 'edit own comments' => 0, )Debugcomment.test739CommentInterfaceTest->setEnvironment()
Changed environment:array ( 'authenticated' => true, 'comment count' => false, 'form' => 'separate page', 'user_register' => 1, 'contact' => 'optional', 'comments' => 'open', 'access comments' => 1, 'post comments' => 0, 'skip comment approval' => 1, 'edit own comments' => 0, )Debugcomment.test739CommentInterfaceTest->setEnvironment()
Changed environment:array ( 'authenticated' => false, 'comment count' => true, 'form' => 'separate page', 'user_register' => 1, 'contact' => 'optional', 'comments' => 'open', 'access comments' => 1, 'post comments' => 0, 'skip comment approval' => 1, 'edit own comments' => 0, )Debugcomment.test739CommentInterfaceTest->setEnvironment()
Changed environment:array ( 'authenticated' => true, 'comment count' => true, 'form' => 'separate page', 'user_register' => 1, 'contact' => 'optional', 'comments' => 'open', 'access comments' => 1, 'post comments' => 0, 'skip comment approval' => 1, 'edit own comments' => 0, )Debugcomment.test739CommentInterfaceTest->setEnvironment()
Changed environment:array ( 'authenticated' => false, 'comment count' => false, 'form' => 'separate page', 'user_register' => 1, 'contact' => 'optional', 'comments' => 'open', 'access comments' => 0, 'post comments' => 1, 'skip comment approval' => 1, 'edit own comments' => 0, )Debugcomment.test739CommentInterfaceTest->setEnvironment()
Changed environment:array ( 'authenticated' => true, 'comment count' => false, 'form' => 'separate page', 'user_register' => 1, 'contact' => 'optional', 'comments' => 'open', 'access comments' => 0, 'post comments' => 1, 'skip comment approval' => 1, 'edit own comments' => 0, )Debugcomment.test739CommentInterfaceTest->setEnvironment()
Changed environment:array ( 'authenticated' => false, 'comment count' => true, 'form' => 'separate page', 'user_register' => 1, 'contact' => 'optional', 'comments' => 'open', 'access comments' => 0, 'post comments' => 1, 'skip comment approval' => 1, 'edit own comments' => 0, )Debugcomment.test739CommentInterfaceTest->setEnvironment()
Changed environment:array ( 'authenticated' => true, 'comment count' => true, 'form' => 'separate page', 'user_register' => 1, 'contact' => 'optional', 'comments' => 'open', 'access comments' => 0, 'post comments' => 1, 'skip comment approval' => 1, 'edit own comments' => 0, )Debugcomment.test739CommentInterfaceTest->setEnvironment()
Changed environment:array ( 'authenticated' => false, 'comment count' => false, 'form' => 'separate page', 'user_register' => 1, 'contact' => 'optional', 'comments' => 'open', 'access comments' => 1, 'post comments' => 1, 'skip comment approval' => 1, 'edit own comments' => 0, )Debugcomment.test739CommentInterfaceTest->setEnvironment()
Changed environment:array ( 'authenticated' => true, 'comment count' => false, 'form' => 'separate page', 'user_register' => 1, 'contact' => 'optional', 'comments' => 'open', 'access comments' => 1, 'post comments' => 1, 'skip comment approval' => 1, 'edit own comments' => 0, )Debugcomment.test739CommentInterfaceTest->setEnvironment()
Changed environment:array ( 'authenticated' => false, 'comment count' => true, 'form' => 'separate page', 'user_register' => 1, 'contact' => 'optional', 'comments' => 'open', 'access comments' => 1, 'post comments' => 1, 'skip comment approval' => 1, 'edit own comments' => 0, )Debugcomment.test739CommentInterfaceTest->setEnvironment()
Changed environment:array ( 'authenticated' => true, 'comment count' => true, 'form' => 'separate page', 'user_register' => 1, 'contact' => 'optional', 'comments' => 'open', 'access comments' => 1, 'post comments' => 1, 'skip comment approval' => 1, 'edit own comments' => 0, )Debugcomment.test739CommentInterfaceTest->setEnvironment()
Changed environment:array ( 'authenticated' => false, 'comment count' => false, 'form' => 'below', 'user_register' => 0, 'contact' => 'optional', 'comments' => 'open', 'access comments' => 0, 'post comments' => 0, 'skip comment approval' => 1, 'edit own comments' => 0, )Debugcomment.test739CommentInterfaceTest->setEnvironment()
Changed environment:array ( 'authenticated' => true, 'comment count' => false, 'form' => 'below', 'user_register' => 0, 'contact' => 'optional', 'comments' => 'open', 'access comments' => 0, 'post comments' => 0, 'skip comment approval' => 1, 'edit own comments' => 0, )Debugcomment.test739CommentInterfaceTest->setEnvironment()
Changed environment:array ( 'authenticated' => false, 'comment count' => true, 'form' => 'below', 'user_register' => 0, 'contact' => 'optional', 'comments' => 'open', 'access comments' => 0, 'post comments' => 0, 'skip comment approval' => 1, 'edit own comments' => 0, )Debugcomment.test739CommentInterfaceTest->setEnvironment()
Changed environment:array ( 'authenticated' => true, 'comment count' => true, 'form' => 'below', 'user_register' => 0, 'contact' => 'optional', 'comments' => 'open', 'access comments' => 0, 'post comments' => 0, 'skip comment approval' => 1, 'edit own comments' => 0, )Debugcomment.test739CommentInterfaceTest->setEnvironment()
Changed environment:array ( 'authenticated' => false, 'comment count' => false, 'form' => 'below', 'user_register' => 0, 'contact' => 'optional', 'comments' => 'open', 'access comments' => 1, 'post comments' => 0, 'skip comment approval' => 1, 'edit own comments' => 0, )Debugcomment.test739CommentInterfaceTest->setEnvironment()
Changed environment:array ( 'authenticated' => true, 'comment count' => false, 'form' => 'below', 'user_register' => 0, 'contact' => 'optional', 'comments' => 'open', 'access comments' => 1, 'post comments' => 0, 'skip comment approval' => 1, 'edit own comments' => 0, )Debugcomment.test739CommentInterfaceTest->setEnvironment()
Changed environment:array ( 'authenticated' => false, 'comment count' => true, 'form' => 'below', 'user_register' => 0, 'contact' => 'optional', 'comments' => 'open', 'access comments' => 1, 'post comments' => 0, 'skip comment approval' => 1, 'edit own comments' => 0, )Debugcomment.test739CommentInterfaceTest->setEnvironment()
Changed environment:array ( 'authenticated' => true, 'comment count' => true, 'form' => 'below', 'user_register' => 0, 'contact' => 'optional', 'comments' => 'open', 'access comments' => 1, 'post comments' => 0, 'skip comment approval' => 1, 'edit own comments' => 0, )Debugcomment.test739CommentInterfaceTest->setEnvironment()
Changed environment:array ( 'authenticated' => false, 'comment count' => false, 'form' => 'below', 'user_register' => 0, 'contact' => 'optional', 'comments' => 'open', 'access comments' => 0, 'post comments' => 1, 'skip comment approval' => 1, 'edit own comments' => 0, )Debugcomment.test739CommentInterfaceTest->setEnvironment()
Changed environment:array ( 'authenticated' => true, 'comment count' => false, 'form' => 'below', 'user_register' => 0, 'contact' => 'optional', 'comments' => 'open', 'access comments' => 0, 'post comments' => 1, 'skip comment approval' => 1, 'edit own comments' => 0, )Debugcomment.test739CommentInterfaceTest->setEnvironment()
Changed environment:array ( 'authenticated' => false, 'comment count' => true, 'form' => 'below', 'user_register' => 0, 'contact' => 'optional', 'comments' => 'open', 'access comments' => 0, 'post comments' => 1, 'skip comment approval' => 1, 'edit own comments' => 0, )Debugcomment.test739CommentInterfaceTest->setEnvironment()
Changed environment:array ( 'authenticated' => true, 'comment count' => true, 'form' => 'below', 'user_register' => 0, 'contact' => 'optional', 'comments' => 'open', 'access comments' => 0, 'post comments' => 1, 'skip comment approval' => 1, 'edit own comments' => 0, )Debugcomment.test739CommentInterfaceTest->setEnvironment()
Changed environment:array ( 'authenticated' => false, 'comment count' => false, 'form' => 'below', 'user_register' => 0, 'contact' => 'optional', 'comments' => 'open', 'access comments' => 1, 'post comments' => 1, 'skip comment approval' => 1, 'edit own comments' => 0, )Debugcomment.test739CommentInterfaceTest->setEnvironment()
Changed environment:array ( 'authenticated' => true, 'comment count' => false, 'form' => 'below', 'user_register' => 0, 'contact' => 'optional', 'comments' => 'open', 'access comments' => 1, 'post comments' => 1, 'skip comment approval' => 1, 'edit own comments' => 0, )Debugcomment.test739CommentInterfaceTest->setEnvironment()
Changed environment:array ( 'authenticated' => false, 'comment count' => true, 'form' => 'below', 'user_register' => 0, 'contact' => 'optional', 'comments' => 'open', 'access comments' => 1, 'post comments' => 1, 'skip comment approval' => 1, 'edit own comments' => 0, )Debugcomment.test739CommentInterfaceTest->setEnvironment()
Changed environment:array ( 'authenticated' => true, 'comment count' => true, 'form' => 'below', 'user_register' => 0, 'contact' => 'optional', 'comments' => 'open', 'access comments' => 1, 'post comments' => 1, 'skip comment approval' => 1, 'edit own comments' => 0, )Debugcomment.test739CommentInterfaceTest->setEnvironment()
Changed environment:array ( 'authenticated' => false, 'comment count' => false, 'form' => 'separate page', 'user_register' => 0, 'contact' => 'optional', 'comments' => 'open', 'access comments' => 0, 'post comments' => 0, 'skip comment approval' => 1, 'edit own comments' => 0, )Debugcomment.test739CommentInterfaceTest->setEnvironment()
Changed environment:array ( 'authenticated' => true, 'comment count' => false, 'form' => 'separate page', 'user_register' => 0, 'contact' => 'optional', 'comments' => 'open', 'access comments' => 0, 'post comments' => 0, 'skip comment approval' => 1, 'edit own comments' => 0, )Debugcomment.test739CommentInterfaceTest->setEnvironment()
Changed environment:array ( 'authenticated' => false, 'comment count' => true, 'form' => 'separate page', 'user_register' => 0, 'contact' => 'optional', 'comments' => 'open', 'access comments' => 0, 'post comments' => 0, 'skip comment approval' => 1, 'edit own comments' => 0, )Debugcomment.test739CommentInterfaceTest->setEnvironment()
Changed environment:array ( 'authenticated' => true, 'comment count' => true, 'form' => 'separate page', 'user_register' => 0, 'contact' => 'optional', 'comments' => 'open', 'access comments' => 0, 'post comments' => 0, 'skip comment approval' => 1, 'edit own comments' => 0, )Debugcomment.test739CommentInterfaceTest->setEnvironment()
Changed environment:array ( 'authenticated' => false, 'comment count' => false, 'form' => 'separate page', 'user_register' => 0, 'contact' => 'optional', 'comments' => 'open', 'access comments' => 1, 'post comments' => 0, 'skip comment approval' => 1, 'edit own comments' => 0, )Debugcomment.test739CommentInterfaceTest->setEnvironment()
Changed environment:array ( 'authenticated' => true, 'comment count' => false, 'form' => 'separate page', 'user_register' => 0, 'contact' => 'optional', 'comments' => 'open', 'access comments' => 1, 'post comments' => 0, 'skip comment approval' => 1, 'edit own comments' => 0, )Debugcomment.test739CommentInterfaceTest->setEnvironment()
Changed environment:array ( 'authenticated' => false, 'comment count' => true, 'form' => 'separate page', 'user_register' => 0, 'contact' => 'optional', 'comments' => 'open', 'access comments' => 1, 'post comments' => 0, 'skip comment approval' => 1, 'edit own comments' => 0, )Debugcomment.test739CommentInterfaceTest->setEnvironment()
Changed environment:array ( 'authenticated' => true, 'comment count' => true, 'form' => 'separate page', 'user_register' => 0, 'contact' => 'optional', 'comments' => 'open', 'access comments' => 1, 'post comments' => 0, 'skip comment approval' => 1, 'edit own comments' => 0, )Debugcomment.test739CommentInterfaceTest->setEnvironment()
Changed environment:array ( 'authenticated' => false, 'comment count' => false, 'form' => 'separate page', 'user_register' => 0, 'contact' => 'optional', 'comments' => 'open', 'access comments' => 0, 'post comments' => 1, 'skip comment approval' => 1, 'edit own comments' => 0, )Debugcomment.test739CommentInterfaceTest->setEnvironment()
Changed environment:array ( 'authenticated' => true, 'comment count' => false, 'form' => 'separate page', 'user_register' => 0, 'contact' => 'optional', 'comments' => 'open', 'access comments' => 0, 'post comments' => 1, 'skip comment approval' => 1, 'edit own comments' => 0, )Debugcomment.test739CommentInterfaceTest->setEnvironment()
Changed environment:array ( 'authenticated' => false, 'comment count' => true, 'form' => 'separate page', 'user_register' => 0, 'contact' => 'optional', 'comments' => 'open', 'access comments' => 0, 'post comments' => 1, 'skip comment approval' => 1, 'edit own comments' => 0, )Debugcomment.test739CommentInterfaceTest->setEnvironment()
Changed environment:array ( 'authenticated' => true, 'comment count' => true, 'form' => 'separate page', 'user_register' => 0, 'contact' => 'optional', 'comments' => 'open', 'access comments' => 0, 'post comments' => 1, 'skip comment approval' => 1, 'edit own comments' => 0, )Debugcomment.test739CommentInterfaceTest->setEnvironment()
Changed environment:array ( 'authenticated' => false, 'comment count' => false, 'form' => 'separate page', 'user_register' => 0, 'contact' => 'optional', 'comments' => 'open', 'access comments' => 1, 'post comments' => 1, 'skip comment approval' => 1, 'edit own comments' => 0, )Debugcomment.test739CommentInterfaceTest->setEnvironment()
Changed environment:array ( 'authenticated' => true, 'comment count' => false, 'form' => 'separate page', 'user_register' => 0, 'contact' => 'optional', 'comments' => 'open', 'access comments' => 1, 'post comments' => 1, 'skip comment approval' => 1, 'edit own comments' => 0, )Debugcomment.test739CommentInterfaceTest->setEnvironment()
Changed environment:array ( 'authenticated' => false, 'comment count' => true, 'form' => 'separate page', 'user_register' => 0, 'contact' => 'optional', 'comments' => 'open', 'access comments' => 1, 'post comments' => 1, 'skip comment approval' => 1, 'edit own comments' => 0, )Debugcomment.test739CommentInterfaceTest->setEnvironment()
Changed environment:array ( 'authenticated' => true, 'comment count' => true, 'form' => 'separate page', 'user_register' => 0, 'contact' => 'optional', 'comments' => 'open', 'access comments' => 1, 'post comments' => 1, 'skip comment approval' => 1, 'edit own comments' => 0, )Debugcomment.test739CommentInterfaceTest->setEnvironment()
LeafComment language (LocaleCommentLanguageFunctionalTest) [Locale]5300
LeafComment node access (CommentNodeAccessTest) [Comment]9800
LeafComment paging settings (CommentPagerTest) [Comment]25500
LeafComment preview (CommentPreviewTest) [Comment]13700
LeafComment Rebuild (CommentContentRebuild) [Comment]7700
LeafComment RSS (CommentRSSUnitTest) [Comment]6900
LeafComment Search tests (SearchCommentTestCase) [Search]19000
LeafComment token replacement (CommentTokenReplaceTestCase) [Comment]10900
LeafConfig file content tests (FileContentsTestCase) [Configuration]100
LeafConfig settings form (SearchConfigSettingsForm) [Search]11800
LeafConnection tests (DatabaseConnectionTestCase) [Database]3800
LeafContent language settings (LocaleContentFunctionalTest) [Locale]14300
ExpandCron run (CronRunTestCase) [System]5103
MessageGroupFilenameLineFunctionStatus
Invalid argument supplied for foreach()Warningimage.module454image_styles()
Invalid argument supplied for foreach()Warningimage.module454image_styles()
Invalid argument supplied for foreach()Warningimage.module454image_styles()
LeafCSS Unit Tests (CascadingStylesheetsUnitTest) [System]1200
LeafCustom query syntax tests (DatabaseQueryTestCase) [Database]700
LeafDashboard blocks (DashboardBlocksTestCase) [Dashboard]10700
LeafData API functions (DrupalDataApiTest) [System]3400
LeafDate and time (DateTimeFunctionalTest) [System]11300
LeafDBLog functionality (DBLogTestCase) [DBLog]38100
LeafDefault text format functionality (FilterDefaultFormatTestCase) [Filter]3300
LeafDelete/Truncate tests (DatabaseDeleteTruncateTestCase) [Database]2300
LeafDrupal error handlers (DrupalErrorHandlerUnitTest) [System]3000
LeafDrupal goto (DrupalGotoTest) [System]2100
LeafDrupal HTTP request (DrupalHTTPRequestTestCase) [System]3200
LeafDrupal match path (DrupalMatchPathTestCase) [Path API]4100
LeafDrupal set/get regions (DrupalSetContentTestCase) [System]4000
LeafDrupal system listing (DrupalSystemListingTestCase) [System]600
LeafDrupal tags handling (DrupalTagsHandlingTestCase) [System]800
Leafdrupal_add_feed() tests (DrupalAddFeedTestCase) [System]600
Leafdrupal_alter() tests (DrupalAlterTestCase) [System]700
Leafdrupal_render() (DrupalRenderTestCase) [System]4900
LeafElement processing (FormElementTestCase) [Form API]3300
LeafEmbedded forms (SearchEmbedForm) [Search]3000
LeafEmpty statement (DatabaseEmptyStatementTestCase) [Database]400
LeafEnable/disable modules (EnableDisableTestCase) [Module]158900
LeafEntity CRUD (EntityAPITestCase) [Entity API]800
LeafEntity CRUD hooks (EntityCrudHookTestCase) [Entity API]11400
LeafEntity properties (EntityPropertiesTestCase) [Entity API]400
LeafEntity query (EntityFieldQueryTestCase) [Entity API]11800
ExpandFeed parser functionality (FeedParserTestCase) [Unknown]3670
MessageGroupFilenameLineFunctionStatus
"First example feed item title" foundOtheraggregator.test899FeedParserTestCase->testRSS091Sample()
Link containing href http://example.com/example-turns-one found.Otheraggregator.test900FeedParserTestCase->testRSS091Sample()
"First example feed item description." foundOtheraggregator.test901FeedParserTestCase->testRSS091Sample()
"Atom-Powered Robots Run Amok" foundOtheraggregator.test912FeedParserTestCase->testAtomSample()
Link containing href http://example.org/2003/12/13/atom03 found.Otheraggregator.test913FeedParserTestCase->testAtomSample()
"Some text." foundOtheraggregator.test914FeedParserTestCase->testAtomSample()
Atom entry id element is parsed correctly.Otheraggregator.test915FeedParserTestCase->testAtomSample()
LeafFetch tests (DatabaseFetchTestCase) [Database]3700
LeafFetch tests, part 2 (DatabaseFetch2TestCase) [Database]2900
LeafFetching multiple cache items (CacheGetMultipleUnitTest) [Cache]700
LeafField attach tests (other) (FieldAttachOtherTestCase) [Field API]5400
LeafField attach tests (storage-related) (FieldAttachStorageTestCase) [Field API]9200
LeafField bulk delete tests (FieldBulkDeleteTestCase) [Field API]4200
LeafField CRUD tests (FieldCrudTestCase) [Field API]8200
LeafField Display API tests (FieldDisplayAPITestCase) [Field API]4600
LeafField form tests (FieldFormTestCase) [Field API]26000
LeafField info tests (FieldInfoTestCase) [Field API]8400
LeafField instance CRUD tests (FieldInstanceCrudTestCase) [Field API]3700
LeafField SQL storage tests (FieldSqlStorageTestCase) [Field API]10400
LeafField translations tests (FieldTranslationsTestCase) [Field API]9100
LeafFile copying (FileCopyTest) [File API]11000
LeafFile delete (FileDeleteTest) [File API]2000
LeafFile download (FileDownloadTest) [File API]3800
LeafFile field display tests (FileFieldDisplayTestCase) [File]5000
LeafFile field file path tests (FileFieldPathTestCase) [File]2700
LeafFile field revision test (FileFieldRevisionTestCase) [File]6700
LeafFile field validation tests (FileFieldValidateTestCase) [File]11800
LeafFile field widget test (FileFieldWidgetTestCase) [File]30000
LeafFile loading (FileLoadTest) [File API]3400
LeafFile mimetypes (FileMimeTypeTest) [File API]4200
LeafFile moving (FileMoveTest) [File API]11000
LeafFile naming (FileNameMungingTest) [File API]500
LeafFile paths and directories (FileDirectoryTest) [File API]2000
LeafFile paths and directories (RemoteFileDirectoryTest) [File API (remote)]2400
LeafFile save data (FileSaveDataTest) [File API]9300
LeafFile saving (FileSaveTest) [File API]1500
LeafFile scan directory (FileScanDirectoryTest) [File API]2300
LeafFile scan directory (RemoteFileScanDirectoryTest) [File API (remote)]2300
LeafFile space used tests (FileSpaceUsedTest) [File API]1100
LeafFile token replacement (FileTokenReplaceTestCase) [File]3500
LeafFile uploading (FileSaveUploadTest) [File API]27100
LeafFile uploading (RemoteFileSaveUploadTest) [File API (remote)]27100
LeafFile URL rewriting (FileURLRewritingTest) [File]1700
LeafFile usage (FileUsageTest) [File]2100
LeafFile validate (FileValidateTest) [File API]1200
LeafFile validator tests (FileValidatorTest) [File API]2500
LeafFileTransfer unit tests (FileTranferTest) [System]200
LeafFilled upgrade test (FilledUpgradePathTestCase) [Upgrade path]2300
LeafFilter administration functionality (FilterAdminTestCase) [Filter]16400
LeafFilter CRUD operations (FilterCRUDTestCase) [Filter]21500
LeafFilter format access (FilterFormatAccessTestCase) [Filter]24400
LeafFilter format hooks (FilterHooksTestCase) [Filter]3300
LeafFilter module filters (FilterUnitTestCase) [Filter]21300
LeafFingerprinting meta tag (AdminMetaTagTestCase) [System]300
LeafFlood control mechanism (FloodFunctionalTest) [System]600
LeafForm alter hooks (FormAlterTestCase) [Form API]400
LeafForm API checkbox (FormCheckboxTestCase) [Form API]9700
LeafForm API file inclusion (FormsFileInclusionTestCase) [Form API]1100
LeafForm element and label output test (FormsElementsLabelsTestCase) [Form API]1800
LeafForm element validation (FormsTestCase) [Form API]27600
LeafForm rebuilding (FormsRebuildTestCase) [Form API]5200
LeafForm state values clearance (advanced) (FormStateValuesCleanAdvancedTestCase) [Form API]700
LeafForm state values clearance (FormStateValuesCleanTestCase) [Form API]1400
LeafForm triggering element determination (FormsTriggeringElementTestCase) [Form API]5000
LeafForm validation handlers (FormValidationTestCase) [Form API]4900
LeafForm wrapper callback (FormsFormWrapperTestCase) [Form API]500
LeafFormat date (FormatDateUnitTest) [System]6500
LeafForum functionality (ForumTestCase) [Forum]63400
LeafFront page (FrontPageTestCase) [System]3700
LeafGet filename test (BootstrapGetFilenameTestCase) [Bootstrap]500
LeafGraph (GraphUnitTest) [System]2800
LeafHelp functionality (HelpTestCase) [Help]30700
LeafHTML Attributes (DrupalAttributesUnitTest) [System]600
LeafHTML identifiers (DrupalHTMLIdentifierTestCase) [System]1000
LeafHTML in page titles (PageTitleFiltering) [System]4000
LeafHTML to text conversion (DrupalHtmlToTextTestCase) [Mail]8400
Leafhtml.tpl.php html and body attributes (ThemeHtmlTplPhpAttributesTestCase) [Theme]500
LeafHTTP file retrieval (RetrieveFileTestCase) [System]700
ExpandImage dimensions (ImageDimensionsUnitTest) [Image]117
MessageGroupFilenameLineFunctionStatus
The test did not complete due to a fatal error.Completion checkimage.test954ImageDimensionsUnitTest->testImageDimensions()
Undefined index: effectsNoticeimage.module504image_style_save()
Undefined index: isidNoticeimage.test980ImageDimensionsUnitTest->testImageDimensions()
Missing argument 2 for image_effect_save(), called in /var/lib/drupaltestbot/sites/default/files/checkout/core/modules/image/image.test on line 983 and definedWarningimage.module973image_effect_save()
Undefined variable: effectNoticeimage.module987image_effect_save()
Undefined variable: effectNoticeimage.module989image_effect_save()
Invalid argument supplied for foreach()Warningimage.module989image_effect_save()
SimpleXMLElement::addChild(): Element name is requiredWarningconfig.inc233config_array_to_xml()
LeafImage effects (ImageEffectsUnitTest) [Image]3900
ExpandImage field display tests (ImageFieldDisplayTestCase) [Image]151311
MessageGroupFilenameLineFunctionStatus
Invalid argument supplied for foreach()Warningimage.module454image_styles()
Invalid argument supplied for foreach()Warningimage.module454image_styles()
Image style thumbnail formatter displaying correctly on full node view.Otherimage.test721ImageFieldDisplayTestCase->_testImageFieldFormatters()
Invalid argument supplied for foreach()Warningimage.module454image_styles()
Invalid argument supplied for foreach()Warningimage.module454image_styles()
Invalid argument supplied for foreach()Warningimage.module454image_styles()
Image style thumbnail formatter displaying correctly on full node view.Otherimage.test721ImageFieldDisplayTestCase->_testImageFieldFormatters()
Invalid argument supplied for foreach()Warningimage.module454image_styles()
Invalid argument supplied for foreach()Warningimage.module454image_styles()
Invalid argument supplied for foreach()Warningimage.module454image_styles()
Preview image is displayed using 'medium' style.Otherimage.test775ImageFieldDisplayTestCase->testImageFieldSettings()
Invalid argument supplied for foreach()Warningimage.module454image_styles()
Invalid argument supplied for foreach()Warningimage.module454image_styles()
Invalid argument supplied for foreach()Warningimage.module454image_styles()
ExpandImage field validation tests (ImageFieldValidateTestCase) [Image]1903
MessageGroupFilenameLineFunctionStatus
Invalid argument supplied for foreach()Warningimage.module454image_styles()
Invalid argument supplied for foreach()Warningimage.module454image_styles()
Invalid argument supplied for foreach()Warningimage.module454image_styles()
LeafImage GD manipulation tests (ImageToolkitGdTestCase) [Image]9600
ExpandImage styles and effects UI configuration (ImageAdminStylesUnitTest) [Image]1071534
MessageGroupFilenameLineFunctionStatus
Undefined index: effectsNoticeimage.module504image_style_save()
DOMDocument::loadXML(): error parsing attribute name in Entity, line: 2Warningconfig.inc213config_encode()
DOMDocument::loadXML(): attributes construct error in Entity, line: 2Warningconfig.inc213config_encode()
DOMDocument::loadXML(): Couldn't find end of Start Tag image_rotate_5_ line 2 in Entity, line: 2Warningconfig.inc213config_encode()
DOMDocument::loadXML(): expected '>' in Entity, line: 2Warningconfig.inc213config_encode()
DOMDocument::loadXML(): Opening and ending tag mismatch: effects line 2 and image_rotate_5_ in Entity, line: 2Warningconfig.inc213config_encode()
DOMDocument::loadXML(): Opening and ending tag mismatch: config line 2 and effects in Entity, line: 2Warningconfig.inc213config_encode()
DOMDocument::loadXML(): Extra content at the end of the document in Entity, line: 2Warningconfig.inc213config_encode()
SimpleXMLElement::__construct(): Entity: line 2: parser error : Start tag expected, '<' not foundWarningconfig.inc154config_decode()
SimpleXMLElement::__construct(): Warningconfig.inc154config_decode()
SimpleXMLElement::__construct(): ^Warningconfig.inc154config_decode()
String could not be parsed as XMLExceptionconfig.inc154SimpleXMLElement->__construct()
SimpleXMLElement::__construct(): Entity: line 2: parser error : Start tag expected, '<' not foundWarningconfig.inc154config_decode()
SimpleXMLElement::__construct(): Warningconfig.inc154config_decode()
SimpleXMLElement::__construct(): ^Warningconfig.inc154config_decode()
Exception: String could not be parsed as XML in SimpleXMLElement->__construct() (line 154 of /var/lib/drupaltestbot/sites/default/files/checkout/core/includes/config.inc).Uncaught exceptionconfig.inc154SimpleXMLElement->__construct()
Invalid argument supplied for foreach()Warningimage.module454image_styles()
Invalid argument supplied for foreach()Warningimage.module454image_styles()
Default styles may not be deleted.Otherimage.test521ImageAdminStylesUnitTest->testDefaultStyle()
Default styles may not be renamed.Otherimage.test525ImageAdminStylesUnitTest->testDefaultStyle()
Default styles may not have new effects added.Otherimage.test527ImageAdminStylesUnitTest->testDefaultStyle()
The image_scale effect does not have an ieid.Otherimage.test537ImageAdminStylesUnitTest->testDefaultStyle()
Found the Override defaults buttonOtherimage.test541ImageAdminStylesUnitTest->testDefaultStyle()
Found the requested form fields at admin/config/media/image-styles/edit/thumbnailOtherimage.test541ImageAdminStylesUnitTest->testDefaultStyle()
Default image style may be overridden.Otherimage.test542ImageAdminStylesUnitTest->testDefaultStyle()
Invalid argument supplied for foreach()Warningimage.module454image_styles()
Invalid argument supplied for foreach()Warningimage.module454image_styles()
Invalid argument supplied for foreach()Warningimage.module454image_styles()
Invalid argument supplied for foreach()Warningimage.module454image_styles()
Invalid argument supplied for foreach()Warningimage.module454image_styles()
Invalid argument supplied for foreach()Warningimage.module454image_styles()
The image_scale effect has an ieid.Otherimage.test551ImageAdminStylesUnitTest->testDefaultStyle()
Overridden styles may not be renamed.Otherimage.test562ImageAdminStylesUnitTest->testDefaultStyle()
Found the Revert buttonOtherimage.test569ImageAdminStylesUnitTest->testDefaultStyle()
Found the requested form fields at admin/config/media/image-styles/revert/thumbnailOtherimage.test569ImageAdminStylesUnitTest->testDefaultStyle()
The added effect has been removed in the reverted style.Otherimage.test576ImageAdminStylesUnitTest->testDefaultStyle()
Undefined index: effectsNoticeimage.module504image_style_save()
Invalid argument supplied for foreach()Warningimage.module454image_styles()
Invalid argument supplied for foreach()Warningimage.module454image_styles()
Invalid argument supplied for foreach()Warningimage.module454image_styles()
Image displayed using style okagmgcqo7.Otherimage.test602ImageAdminStylesUnitTest->testStyleReplacement()
Invalid argument supplied for foreach()Warningimage.module454image_styles()
Invalid argument supplied for foreach()Warningimage.module454image_styles()
Invalid argument supplied for foreach()Warningimage.module454image_styles()
Image displayed using style replacement style.Otherimage.test612ImageAdminStylesUnitTest->testStyleReplacement()
Invalid argument supplied for foreach()Warningimage.module454image_styles()
Invalid argument supplied for foreach()Warningimage.module454image_styles()
Invalid argument supplied for foreach()Warningimage.module454image_styles()
Image displayed using style replacement style.Otherimage.test623ImageAdminStylesUnitTest->testStyleReplacement()
ExpandImage styles path and URL functions (ImageStylesPathAndUrlUnitTest) [Image]47013
MessageGroupFilenameLineFunctionStatus
Undefined index: effectsNoticeimage.module504image_style_save()
Undefined index: effectsNoticeimage.module504image_style_save()
Invalid argument supplied for foreach()Warningimage.module454image_styles()
Invalid argument supplied for foreach()Warningimage.module454image_styles()
Undefined index: effectsNoticeimage.module504image_style_save()
Invalid argument supplied for foreach()Warningimage.module454image_styles()
Invalid argument supplied for foreach()Warningimage.module454image_styles()
Undefined index: effectsNoticeimage.module504image_style_save()
Invalid argument supplied for foreach()Warningimage.module454image_styles()
Invalid argument supplied for foreach()Warningimage.module454image_styles()
Undefined index: effectsNoticeimage.module504image_style_save()
Invalid argument supplied for foreach()Warningimage.module454image_styles()
Invalid argument supplied for foreach()Warningimage.module454image_styles()
LeafImage toolkit tests (ImageToolkitUnitTest) [Image]5300
Leafimage_dimensions_scale() (ImageDimensionsScaleTestCase) [Image]1500
LeafImport feeds from OPML functionality (ImportOPMLTestCase) [Unknown]5400
LeafIndex.php handling (SystemIndexPhpTest) [System]1000
LeafInfo file format parser (InfoFileParserTestCase) [System]900
LeafInsert tests (DatabaseInsertTestCase) [Database]5100
LeafInsert tests, default fields (DatabaseInsertDefaultsTestCase) [Database]2200
LeafInsert tests, LOB fields (DatabaseInsertLOBTestCase) [Database]1500
LeafInvalid data (DatabaseInvalidDataTestCase) [Database]800
LeafIP address and HTTP_HOST test (BootstrapIPAddressTestCase) [Bootstrap]1100
LeafIP address blocking (IPAddressBlockingTestCase) [System]4200
ExpandJavaScript (JavaScriptTestCase) [System]7610
MessageGroupFilenameLineFunctionStatus
JavaScript is aggregated in the expected groups and order.Othercommon.test1391JavaScriptTestCase->testAggregation()
LeafJavascript translation (LocaleJavascriptTranslationTest) [Locale]6600
LeafJSON (DrupalJSONTest) [System]2100
LeafKeywords and conditions (SearchKeywordsConditions) [Search]2600
LeafLanguage list configuration (LanguageListTest) [Language]10700
LeafLanguage negotiation autoconfiguration (LocaleConfigurationTest) [Locale]3700
LeafLanguage negotiation info (LocaleLanguageNegotiationInfoFunctionalTest) [Locale]4900
LeafLanguage switching (LocaleLanguageSwitchingFunctionalTest) [Locale]2600
LeafList field (ListFieldTestCase) [Field types]1600
LeafList field UI (ListFieldUITestCase) [Field types]28800
LeafLoad multiple nodes (NodeLoadMultipleUnitTest) [Node]3600
LeafLocale uninstall (EN) (LocaleUninstallFunctionalTest) [Locale]3200
LeafLocale uninstall (FR) (LocaleUninstallFrenchFunctionalTest) [Locale]3200
LeafLocalize date formats (LocaleDateFormatsFunctionalTest) [Locale]3600
LeafLocking framework tests (LockFunctionalTest) [System]1800
LeafMail system (MailTestCase) [System]400
LeafMain content rendering fallback (SystemMainContentFallback) [System]13100
LeafManage display (FieldUIManageDisplayTestCase) [Field UI]8400
LeafManage fields (FieldUIManageFieldsTestCase) [Field UI]18300
LeafManaged file element test (FileManagedFileElementTestCase) [File]26500
LeafMenu link creation/deletion (MenuTestCase) [Menu]65700
LeafMenu links (MenuLinksUnitTestCase) [Menu]5000
LeafMenu rebuild test (MenuRebuildTestCase) [Menu]500
LeafMenu router (MenuRouterTestCase) [Menu]23000
LeafMenu settings for nodes (MenuNodeTestCase) [Menu]6100
LeafMenu tree generation (MenuTreeDataTestCase) [Menu]400
LeafMenu tree output (MenuTreeOutputTestCase) [Menu]700
LeafMerge tests (DatabaseMergeTestCase) [Database]8300
LeafMiscellaneous AJAX tests (AJAXElementValidation) [AJAX]700
LeafMiscellaneous bootstrap unit tests (BootstrapMiscTestCase) [Bootstrap]100
LeafMissing update dependencies (UpdateDependencyMissingTestCase) [Update API]400
LeafModule API (ModuleUnitTest) [Module]8100
LeafModule dependencies (ModuleDependencyTestCase) [Module]18100
LeafModule installation (ModuleInstallTestCase) [Module]300
LeafModule uninstallation (ModuleUninstallTestCase) [Module]200
LeafModule versions (ModuleVersionTestCase) [Module]10100
LeafMultilingual fields (LocaleMultilingualFieldsFunctionalTest) [Locale]6200
LeafMultistep form using form storage (FormsFormStorageTestCase) [Form API]12000
LeafMultistep node form basic options (MultiStepNodeFormBasicOptionsTest) [Node]3200
LeafNew default theme blocks (NewDefaultThemeBlocks) [Block]2400
LeafNo help (NoHelpTestCase) [Help]1200
LeafNode access (NodeAccessUnitTest) [Node]3100
LeafNode Access on any table (NodeAccessBaseTableTestCase) [Node]22300
LeafNode access rebuild (NodeAccessRebuildTestCase) [Node]1600
LeafNode access records (NodeAccessRecordsUnitTest) [Node]2400
LeafNode administration (NodeAdminTestCase) [Node]14200
LeafNode blocks (NodeBlockFunctionalTest) [Node]8400
LeafNode creation (NodeCreationTestCase) [Node]2700
LeafNode edit (PageEditTestCase) [Node]9300
LeafNode edit permissions (PageViewTestCase) [Node]3200
LeafNode entity query alter (NodeEntityFieldQueryAlter) [Node]3100
LeafNode feed (NodeFeedTestCase) [Node]100
LeafNode load hooks (NodeLoadHooksTestCase) [Node]500
LeafNode post information display (NodePostSettingsTestCase) [Node]3400
LeafNode preview (PagePreviewTestCase) [Node]3500
LeafNode query alter (NodeQueryAlter) [Node]8400
LeafNode revisions (NodeRevisionsTestCase) [Node]4400
LeafNode RSS Content (NodeRSSContentTestCase) [Node]1700
LeafNode save (NodeSaveTestCase) [Node]4200
LeafNode title (NodeTitleTestCase) [Node]2000
LeafNode title XSS filtering (NodeTitleXSSTestCase) [Node]2000
LeafNode token replacement (NodeTokenReplaceTestCase) [Node]3400
LeafNode type persist (NodeTypePersistenceTestCase) [Node]6200
LeafNode types (NodeTypeTestCase) [Node]10500
LeafNon default theme admin (NonDefaultBlockAdmin) [Block]1000
LeafNumber field (NumberFieldTestCase) [Field types]6200
LeafOpenID account registration (OpenIDRegistrationTestCase) [OpenID]14500
LeafOpenID discovery and login (OpenIDFunctionalTestCase) [OpenID]28200
LeafOpenID helper functions (OpenIDUnitTest) [OpenID]3800
LeafOptions widgets (OptionsWidgetsTestCase) [Field types]32100
LeafOverriding server variables (BootstrapOverrideServerVariablesTestCase) [Bootstrap]600
ExpandPage cache test (BootstrapPageCacheTestCase) [Bootstrap]65150
MessageGroupFilenameLineFunctionStatus
Page was cached.Otherbootstrap.test125BootstrapPageCacheTestCase->testConditionalRequests()
Conditional request returned 304 Not Modified.Browserbootstrap.test130BootstrapPageCacheTestCase->testConditionalRequests()
Conditional request with obsolete If-Modified-Since date returned 304 Not Modified.Browserbootstrap.test133BootstrapPageCacheTestCase->testConditionalRequests()
Conditional request with obsolete If-Modified-Since date returned 304 Not Modified.Browserbootstrap.test136BootstrapPageCacheTestCase->testConditionalRequests()
Page was cached.Otherbootstrap.test140BootstrapPageCacheTestCase->testConditionalRequests()
Page was cached.Otherbootstrap.test144BootstrapPageCacheTestCase->testConditionalRequests()
Page was not cached.Otherbootstrap.test161BootstrapPageCacheTestCase->testPageCache()
Vary header was sent.Otherbootstrap.test162BootstrapPageCacheTestCase->testPageCache()
Cache-Control header was sent.Otherbootstrap.test163BootstrapPageCacheTestCase->testPageCache()
Page was cached.Otherbootstrap.test169BootstrapPageCacheTestCase->testPageCache()
Vary: Cookie header was sent.Otherbootstrap.test170BootstrapPageCacheTestCase->testPageCache()
Cache-Control header was sent.Otherbootstrap.test171BootstrapPageCacheTestCase->testPageCache()
Page was not cached.Otherbootstrap.test205BootstrapPageCacheTestCase->testPageCompression()
Page was cached.Otherbootstrap.test211BootstrapPageCacheTestCase->testPageCompression()
Page was cached.Otherbootstrap.test218BootstrapPageCacheTestCase->testPageCompression()
LeafPager query tests (DatabaseSelectPagerDefaultTestCase) [Database]4700
LeafParsing .info files (ParseInfoFilesTestCase) [System]300
LeafPassword hashing (PasswordHashingTest) [System]1000
LeafPath alias functionality (PathTestCase) [Path]10500
LeafPath aliases with languages (PathLanguageUITestCase) [Path]7200
LeafPath aliases with translated nodes (PathLanguageTestCase) [Path]6400
LeafPath language settings (LocalePathFunctionalTest) [Locale]5400
LeafPath lookup (PathLookupTest) [Path API]1300
LeafPaths on non-English monolingual sites (PathMonolingualTestCase) [Path]3500
LeafPersonal contact form (ContactPersonalTestCase) [Contact]13600
LeafPHP filter access check (PHPAccessTestCase) [PHP]3800
LeafPHP filter functionality (PHPFilterTestCase) [PHP]4200
LeafPoll add choice (PollJSAddChoice) [Poll]1600
LeafPoll choice deletion (PollDeleteChoiceTestCase) [Poll]5500
LeafPoll create (PollCreateTestCase) [Poll]28100
LeafPoll expiration (PollExpirationTestCase) [Poll]5300
LeafPoll token replacement (PollTokenReplaceTestCase) [Poll]13100
LeafPoll vote (PollVoteTestCase) [Poll]14900
LeafPrivate file test (FilePrivateTestCase) [File]2500
LeafProgrammatic form submissions (FormsProgrammaticTestCase) [Form API]2400
LeafQuery altering tests (DatabaseAlterTestCase) [Database]6200
LeafQuery logging (DatabaseLoggingTestCase) [Database]4300
LeafQuery tagging tests (DatabaseTaggingTestCase) [Database]3200
LeafQueue functionality (QueueTestCase) [System]700
LeafRange query test (DatabaseRangeQueryTestCase) [Database]300
LeafRDF comment mapping (RdfCommentAttributesTestCase) [RDF]27300
LeafRDF mapping CRUD functions (RdfCrudTestCase) [RDF]1000
LeafRDF mapping definition functionality (RdfMappingDefinitionTestCase) [RDF]6100
LeafRDF mapping hook (RdfMappingHookTestCase) [RDF]600
LeafRDF namespaces (RdfGetRdfNamespacesTestCase) [RDF]500
LeafRDF namespaces serialization test (DrupalGetRdfNamespacesTestCase) [RDF]700
LeafRDF tracker page mapping (RdfTrackerAttributesTestCase) [RDF]3300
ExpandRDFa markup (RdfRdfaMarkupTestCase) [RDF]2903
MessageGroupFilenameLineFunctionStatus
Invalid argument supplied for foreach()Warningimage.module454image_styles()
Invalid argument supplied for foreach()Warningimage.module454image_styles()
Invalid argument supplied for foreach()Warningimage.module454image_styles()
LeafRebuild arbitrary forms (FormsArbitraryRebuildTestCase) [Form API]1600
LeafRebuild content (NodeBuildContent) [Node]100
LeafRegistry parse file test (RegistryParseFileTestCase) [System]200
LeafRegistry parse files test (RegistryParseFilesTestCase) [System]600
LeafRegression tests (DatabaseRegressionTestCase) [Database]3100
LeafRemove feed functionality (RemoveFeedTestCase) [Unknown]2400
LeafRemove feed item functionality (RemoveFeedItemTestCase) [Unknown]19700
LeafRequired modules (ModuleRequiredTestCase) [Module]2100
LeafRequirements hook failure (HookRequirementsTestCase) [Module]1600
LeafResettable static variables test (BootstrapResettableStaticTestCase) [Bootstrap]500
LeafRole assignment (UserRolesAssignmentTestCase) [User]5100
ExpandRole permissions (UserPermissionsTestCase) [User]5003
MessageGroupFilenameLineFunctionStatus
Invalid argument supplied for foreach()Warningimage.module454image_styles()
Invalid argument supplied for foreach()Warningimage.module454image_styles()
Invalid argument supplied for foreach()Warningimage.module454image_styles()
LeafSchema API (SchemaTestCase) [Database]58800
LeafSearch and node access (SearchNodeAccessTest) [Search]1400
LeafSearch engine phrase queries (SearchExactTestCase) [Search]2300
LeafSearch engine queries (SearchMatchTestCase) [Search]14500
LeafSearch engine ranking (SearchRankingTestCase) [Search]6300
LeafSearch excerpt extraction (SearchExcerptTestCase) [Search]1200
LeafSearch expression insert/extract (SearchExpressionInsertExtractTestCase) [Search]2400
LeafSearch language selection (SearchLanguageTestCase) [Search]4600
LeafSearch number matching (SearchNumberMatchingTestCase) [Search]29300
LeafSearch numbers (SearchNumbersTestCase) [Search]17300
LeafSearch page override (SearchPageOverride) [Search]1300
LeafSearch page text (SearchPageText) [Search]3500
LeafSearch simplify (SearchSimplifyTestCase) [Search]65100
LeafSecure file tests (SecureFileTestCase) [Configuration]400
LeafSecurity (FilterSecurityTestCase) [Filter]2700
LeafSelect tests (DatabaseSelectTestCase) [Database]14600
LeafSelect tests, complex (DatabaseSelectComplexTestCase) [Database]14300
LeafSelect tests, complex 2 (DatabaseSelectComplexTestCase2) [Database]1300
LeafSelect tests, ordered (DatabaseSelectOrderedTestCase) [Database]2900
LeafSelect tests, subqueries (DatabaseSelectSubqueryTestCase) [Database]4300
LeafSequences API (DatabaseNextIdCase) [Database]200
LeafSerialize query (DatabaseSerializeQueryTestCase) [Database]700
LeafSession https handling (SessionHttpsTestCase) [Session]8300
ExpandSession tests (SessionTestCase) [Session]19020
MessageGroupFilenameLineFunctionStatus
Page was not cached.Othersession.test146SessionTestCase->testEmptyAnonymousSession()
Page was cached.Othersession.test167SessionTestCase->testEmptyAnonymousSession()
LeafShortcut link functionality (ShortcutLinksTestCase) [Shortcut]12900
LeafShortcut set functionality (ShortcutSetsTestCase) [Shortcut]17600
LeafShutdown functions (ShutdownFunctionsTest) [System]500
LeafSimpleTest browser (SimpleTestBrowserTestCase) [SimpleTest]1600
LeafSimpleTest e-mail capturing (SimpleTestMailCaptureTestCase) [SimpleTest]1300
LeafSimpleTest error collector (DrupalErrorCollectionUnitTest) [SimpleTest]1600
LeafSimpleTest functionality (SimpleTestFunctionalTest) [SimpleTest]11700
LeafSite maintenance mode functionality (SiteMaintenanceTestCase) [System]8000
LeafSite-wide contact form (ContactSitewideTestCase) [Contact]23900
LeafSize parsing test (CommonSizeTestCase) [System]3500
ExpandStatistics logging tests (StatisticsLoggingTestCase) [Statistics]3220
MessageGroupFilenameLineFunctionStatus
Testing an uncached page.Otherstatistics.test95StatisticsLoggingTestCase->testLogging()
Testing a cached page.Otherstatistics.test104StatisticsLoggingTestCase->testLogging()
LeafStatistics reports tests (StatisticsReportsTestCase) [Statistics]8600
LeafStatistics token replacement (StatisticsTokenReplaceTestCase) [Statistics]3000
LeafStream wrappers (StreamWrapperTest) [File API]1900
LeafString filtering tests (CommonXssUnitTest) [System]1700
LeafString translate, search and validate (LocaleTranslationFunctionalTest) [Locale]29200
LeafString translation using st() (LocaleInstallTest) [Locale]200
LeafSummary length (SummaryLengthTestCase) [Node]1500
LeafSyslog functionality (SyslogTestCase) [Syslog]1700
LeafSystem info alter (SystemInfoAlterTestCase) [System]2000
LeafTableselect form element type test (FormsElementsTableSelectFunctionalTest) [Form API]6000
LeafTablesort (TableSortTest) [System]600
LeafTablesort query tests (DatabaseSelectTableSortDefaultTestCase) [Database]4400
LeafTaxonomy term functions and forms. (TaxonomyTermTestCase) [Taxonomy]20000
LeafTaxonomy term hooks (TaxonomyHooksTestCase) [Taxonomy]2000
LeafTaxonomy term index (TaxonomyTermIndexTestCase) [Taxonomy]3200
LeafTaxonomy term multiple loading (TaxonomyLoadMultipleUnitTest) [Taxonomy]1700
LeafTaxonomy term reference field (TaxonomyTermFieldTestCase) [Taxonomy]3900
LeafTaxonomy term unit tests (TaxonomyTermUnitTest) [Taxonomy]100
LeafTaxonomy term URL aliases (PathTaxonomyTermTestCase) [Path]3500
LeafTaxonomy theme switching (TaxonomyThemeTestCase) [Taxonomy]1700
LeafTaxonomy token replacement (TaxonomyTokenReplaceTestCase) [Taxonomy]5300
LeafTaxonomy vocabularies (TaxonomyVocabularyUnitTest) [Taxonomy]7700
LeafTaxonomy vocabulary interface (TaxonomyVocabularyFunctionalTest) [Taxonomy]9700
LeafTemporary query test (DatabaseTemporaryQueryTestCase) [Database]600
LeafTest for legacy node bug. (TaxonomyLegacyTestCase) [Taxonomy]1400
LeafTest statistics admin. (StatisticsAdminTestCase) [Statistics]10800
LeafTest user actions (TriggerUserActionTestCase) [Trigger]6600
LeafTest user triggers (TriggerUserTokenTestCase) [Trigger]18600
LeafTesting SimpleTest setUp (SimpleTestFolderTestCase) [SimpleTest]200
LeafText field (TextFieldTestCase) [Field types]26200
LeafText summary (TextSummaryTestCase) [Field types]14600
LeafText translation (TextTranslationTestCase) [Field types]15300
LeafTheme API (ThemeUnitTest) [Theme]2600
LeafTheme fast initialization (ThemeFastTestCase) [Theme]1100
LeafTheme functions (ThemeFunctionsTestCase) [Theme]2500
LeafTheme HTML Tag (ThemeHtmlTag) [Theme]200
LeafTheme initialization in hook_init() (ThemeHookInitUnitTest) [Theme]500
LeafTheme interface functionality (SystemThemeFunctionalTest) [System]11300
LeafTheme Table (ThemeTableUnitTest) [Theme]600
LeafTimer test (BootstrapTimerTestCase) [Bootstrap]500
LeafToken replacement (TokenReplaceTestCase) [System]4000
LeafTop visitor blocking (StatisticsBlockVisitorsTestCase) [Statistics]4600
LeafTracker (TrackerTest) [Tracker]22800
LeafTransaction tests (DatabaseTransactionTestCase) [Database]7400
LeafTranslation export (LocaleExportFunctionalTest) [Locale]3100
LeafTranslation functionality (TranslationTestCase) [Translation]56000
LeafTranslation import (LocaleImportFunctionalTest) [Locale]11500
LeafTrigger content (node) actions (TriggerContentTestCase) [Trigger]35500
LeafTrigger cron (system) actions (TriggerCronTestCase) [Trigger]3400
LeafTrigger orphaned actions (TriggerOrphanedActionsTestCase) [Trigger]3800
LeafTrigger other actions (TriggerOtherTestCase) [Trigger]11500
LeafUI language negotiation (LocaleUILanguageNegotiationTest) [Locale]8200
LeafUnassigned text format functionality (FilterNoFormatTestCase) [Filter]100
LeafUnicode handling (UnicodeUnitTest) [System]25500
LeafUnmanaged file copying (FileUnmanagedCopyTest) [File API]3100
LeafUnmanaged file copying (RemoteFileUnmanagedCopyTest) [File API (remote)]3400
LeafUnmanaged file delete (FileUnmanagedDeleteTest) [File API]800
LeafUnmanaged file delete (RemoteFileUnmanagedDeleteTest) [File API (remote)]1100
LeafUnmanaged file moving (FileUnmanagedMoveTest) [File API]2200
LeafUnmanaged file moving (RemoteFileUnmanagedMoveTest) [File API (remote)]2500
LeafUnmanaged file save data (FileUnmanagedSaveDataTest) [File API]700
LeafUnmanaged file save data (RemoteFileUnmanagedSaveDataTest) [File API (remote)]800
LeafUnmanaged recursive file delete (FileUnmanagedDeleteRecursiveTest) [File API]1700
LeafUnmanaged recursive file delete (RemoteFileUnmanagedDeleteRecursiveTest) [File API (remote)]2100
LeafUpdate contrib functionality (UpdateTestContribCase) [Update]18800
LeafUpdate core functionality (UpdateCoreTestCase) [Update]20000
LeafUpdate dependency hook invocation (UpdateDependencyHookInvocationTestCase) [Update API]400
LeafUpdate dependency ordering (UpdateDependencyOrderingTestCase) [Update API]500
LeafUpdate feed functionality (UpdateFeedTestCase) [Unknown]7500
ExpandUpdate feed item functionality (UpdateFeedItemTestCase) [Unknown]6110
MessageGroupFilenameLineFunctionStatus
URL http://drupaltestbot699-mysql/checkout/core/modules/aggregator/tests/aggregator_test_rss091.xml is accessibleBrowseraggregator.test494UpdateFeedItemTestCase->testUpdateFeedItem()
LeafUpdate functionality (UpdateScriptFunctionalTest) [System]10900
LeafUpdate on cron functionality (AggregatorCronTestCase) [Unknown]5400
LeafUpdate tests (DatabaseUpdateTestCase) [Database]5600
LeafUpdate tests, Complex (DatabaseUpdateComplexTestCase) [Database]5900
LeafUpdate tests, LOB (DatabaseUpdateLOBTestCase) [Database]1500
LeafUpload and extract module functionality (UpdateTestUploadCase) [Update]6400
ExpandUpload user picture (UserPictureTestCase) [User]7416
MessageGroupFilenameLineFunctionStatus
Invalid argument supplied for foreach()Warningimage.module454image_styles()
Invalid argument supplied for foreach()Warningimage.module454image_styles()
Invalid argument supplied for foreach()Warningimage.module454image_styles()
Image is displayed in user's edit pageOtheruser.test919UserPictureTestCase->testWithGDinvalidDimension()
Invalid argument supplied for foreach()Warningimage.module454image_styles()
Invalid argument supplied for foreach()Warningimage.module454image_styles()
Invalid argument supplied for foreach()Warningimage.module454image_styles()
LeafURL altering (UrlAlterFunctionalTest) [Path API]3400
LeafURL generation tests (CommonURLUnitTest) [System]5600
LeafURL rewriting (LocaleUrlRewritingTest) [Locale]3300
LeafUser account links (UserAccountLinksUnitTests) [User]1900
LeafUser administration (UserAdminTestCase) [User]6100
LeafUser autocompletion (UserAutocompleteTestCase) [User]2600
LeafUser blocks (UserBlocksUnitTests) [User]3700
LeafUser create (UserCreateTestCase) [User]2700
LeafUser creation (LocaleUserCreationTest) [Locale]6900
LeafUser edit (UserEditTestCase) [User]6600
LeafUser edited own account (UserEditedOwnAccountTestCase) [User]2300
LeafUser entity callback tests (UserEntityCallbacksTestCase) [User]700
LeafUser language settings (LocaleUserLanguageFunctionalTest) [Locale]5000
LeafUser login (UserLoginTestCase) [User]16300
ExpandUser poll vote capability. (PollVoteCheckHostname) [Poll]14140
MessageGroupFilenameLineFunctionStatus
Page was cacheable but was not in the cache.Otherpoll.test542PollVoteCheckHostname->testHostnamePollVote()
Page was cached.Otherpoll.test544PollVoteCheckHostname->testHostnamePollVote()
Page was cacheable but was not in the cache.Otherpoll.test585PollVoteCheckHostname->testHostnamePollVote()
Page was cacheable but was not in the cache.Otherpoll.test596PollVoteCheckHostname->testHostnamePollVote()
LeafUser registration (UserRegistrationTestCase) [User]13500
LeafUser role administration (UserRoleAdminTestCase) [User]5300
LeafUser save test (UserSaveTestCase) [User]300
LeafUser search (UserUserSearchTestCase) [User]3800
LeafUser signatures (UserSignatureTestCase) [User]4400
LeafUser time zones (UserTimeZoneFunctionalTest) [User]2900
LeafUser token replacement (UserTokenReplaceTestCase) [User]3900
LeafUser validate current pass custom form (UserValidateCurrentPassCustomForm) [User]1700
LeafUsername/e-mail validation (UserValidationTestCase) [User]1900
LeafUUID handling (UuidUnitTestCase) [System]1400
LeafValid Url (ValidUrlTestCase) [System]15800
LeafVariable test (BootstrapVariableTestCase) [Bootstrap]900
LeafVertical tabs form element type test (FormsElementsVerticalTabsFunctionalTest) [Form API]400
LeafWidget customization (FieldUIAlterTestCase) [Field UI]3600
LeafXML-RPC basic (XMLRPCBasicTestCase) [XML-RPC]600
LeafXML-RPC message and alteration (XMLRPCMessagesTestCase) [XML-RPC]700
LeafXML-RPC validator (XMLRPCValidator1IncTestCase) [XML-RPC]1000