drupal8.testing.24.patch

Test status
StatusResult
Last receivedSun, 12/18/2011 - 19:05:37
Last requestedSun, 12/18/2011 - 19:06:02
Last testedSun, 12/18/2011 - 19:28:23
Test count1
Environment status
MySQLfail
File information
Filedrupal8.testing.24.patch
BranchDrupal core - 8.x
LinkIssue Link
SummaryFAILED: [[SimpleTest]]: [MySQL] 34,181 pass(es), 243 fail(s), and 70 exception(s).
Details

MySQL

  1. Setup environment
  2. Detect an invalid patch URL
  3. Detect invalid repository information
  4. Detect invalid patch format
  5. Detect a non-applicable patch
  6. Detect invalid PHP syntax
  7. Detect a Drupal installation failure
  8. Detect a test run failure
  9. Detect a failing test
    Review the test failures below then if necessary run them locally until the problem has been fixed.
  10. Complete test suite with all tests passing
34,181 pass(es), 243 fail(s), and 70 exception(s)

Non-pass

Test namePassFailException
ExpandCascading stylesheets (CascadingStylesheetsTestCase) [System]3810
MessageGroupFilenameLineFunctionStatus
Inline stylesheets appear in the full page rendering.Othercommon.test723CascadingStylesheetsTestCase->testRenderInlineFullPage()
ExpandForm state values clearance (advanced) (FormStateValuesCleanAdvancedTestCase) [Form API]630
MessageGroupFilenameLineFunctionStatus
Failed to set field files[image] to /var/lib/drupaltestbot/sites/default/files/checkout/sites/default/files/simpletest/387703/image-test.pngOtherform.test1167FormStateValuesCleanAdvancedTestCase->testFormStateValuesCleanAdvanced()
Found the requested form fields at form_test/form-state-values-clean-advancedOtherform.test1167FormStateValuesCleanAdvancedTestCase->testFormStateValuesCleanAdvanced()
Found the success message.Otherform.test1171FormStateValuesCleanAdvancedTestCase->testFormStateValuesCleanAdvanced()
ExpandImage dimensions (ImageDimensionsUnitTest) [Image]102
MessageGroupFilenameLineFunctionStatus
Undefined index: isidNoticeimage.test985ImageDimensionsUnitTest->testImageDimensions()
PDOException: SQLSTATE[42S02]: Base table or view not found: 1146 Table 'drupaltestbotmysql.simpletest962578image_styles' doesn't exist: SELECT image_styles.* FROM {image_styles} image_styles ORDER BY name ASC; Array ( ) in image_styles() (line 516 of /var/lib/drupaltestbot/sites/default/files/checkout/core/modules/image/image.module).Uncaught exceptiondatabase.inc2132PDOStatement->execute()
ExpandImage field display tests (ImageFieldDisplayTestCase) [Image]151145
MessageGroupFilenameLineFunctionStatus
Failed to set field files[field_settings_default_image] to /var/lib/drupaltestbot/sites/default/files/checkout/sites/default/files/simpletest/386583/image-test.pngOtherimage.test836ImageFieldDisplayTestCase->testImageFieldDefaultImage()
Found the Save settings buttonOtherimage.test836ImageFieldDisplayTestCase->testImageFieldDefaultImage()
Found the requested form fields at admin/structure/types/manage/article/fields/wlcuxvirOtherimage.test836ImageFieldDisplayTestCase->testImageFieldDefaultImage()
Trying to get property of non-objectNoticeimage.test841ImageFieldDisplayTestCase->testImageFieldDefaultImage()
The default image status is permanent.Otherimage.test841ImageFieldDisplayTestCase->testImageFieldDefaultImage()
Trying to get property of non-objectNoticeimage.test842ImageFieldDisplayTestCase->testImageFieldDefaultImage()
Default image displayed when no user supplied image is present.Otherimage.test844ImageFieldDisplayTestCase->testImageFieldDefaultImage()
Failed to set field field[settings][default_image][fid] to 0Otherimage.test864ImageFieldDisplayTestCase->testImageFieldDefaultImage()
Found the Save settings buttonOtherimage.test864ImageFieldDisplayTestCase->testImageFieldDefaultImage()
Found the requested form fields at admin/structure/types/manage/article/fields/wlcuxvirOtherimage.test864ImageFieldDisplayTestCase->testImageFieldDefaultImage()
Failed to set field files[field_settings_default_image] to /var/lib/drupaltestbot/sites/default/files/checkout/sites/default/files/simpletest/386583/image-test.gifOtherimage.test877ImageFieldDisplayTestCase->testImageFieldDefaultImage()
Found the Save settings buttonOtherimage.test877ImageFieldDisplayTestCase->testImageFieldDefaultImage()
Found the requested form fields at admin/structure/types/manage/article/fields/obqkk5isOtherimage.test877ImageFieldDisplayTestCase->testImageFieldDefaultImage()
Trying to get property of non-objectNoticeimage.test880ImageFieldDisplayTestCase->testImageFieldDefaultImage()
Default image uses private:// scheme.Otherimage.test880ImageFieldDisplayTestCase->testImageFieldDefaultImage()
Trying to get property of non-objectNoticeimage.test881ImageFieldDisplayTestCase->testImageFieldDefaultImage()
The default image status is permanent.Otherimage.test881ImageFieldDisplayTestCase->testImageFieldDefaultImage()
Trying to get property of non-objectNoticeimage.test885ImageFieldDisplayTestCase->testImageFieldDefaultImage()
Default private image displayed when no user supplied image is present.Otherimage.test887ImageFieldDisplayTestCase->testImageFieldDefaultImage()
ExpandImport feeds from OPML functionality (ImportOPMLTestCase) [Unknown]5410
MessageGroupFilenameLineFunctionStatus
Found OPML help text.Otheraggregator.test648ImportOPMLTestCase->openImportForm()
ExpandLanguage configuration (LocaleConfigurationTest) [Locale]10910
MessageGroupFilenameLineFunctionStatus
Language added successfully.Otherlocale.test55LocaleConfigurationTest->testLanguageConfiguration()
ExpandLanguage switching (LocaleLanguageSwitchingFunctionalTest) [Locale]12178
MessageGroupFilenameLineFunctionStatus
Invalid permission administer blocks.Rolelocale.test1340LocaleLanguageSwitchingFunctionalTest->setUp()
Argument 1 passed to DrupalWebTestCase::drupalLogin() must be an instance of stdClass, boolean given, called in /var/lib/drupaltestbot/sites/default/files/checkout/core/modules/locale/locale.test on line 1341 and definedRecoverable errordrupal_web_test_case.php1230DrupalWebTestCase->drupalLogin()
Trying to get property of non-objectNoticedrupal_web_test_case.php1236DrupalWebTestCase->drupalLogin()
Trying to get property of non-objectNoticedrupal_web_test_case.php1237DrupalWebTestCase->drupalLogin()
Failed to set field name to Otherlocale.test1341LocaleLanguageSwitchingFunctionalTest->setUp()
Failed to set field pass to Otherlocale.test1341LocaleLanguageSwitchingFunctionalTest->setUp()
Found the requested form fields at userOtherlocale.test1341LocaleLanguageSwitchingFunctionalTest->setUp()
Trying to get property of non-objectNoticedrupal_web_test_case.php1243DrupalWebTestCase->drupalLogin()
User successfully logged in.User loginlocale.test1341LocaleLanguageSwitchingFunctionalTest->setUp()
Failed to set field blocks[locale_language][region] to sidebar_firstOtherlocale.test1353LocaleLanguageSwitchingFunctionalTest->testLanguageBlock()
Found the Save blocks buttonOtherlocale.test1353LocaleLanguageSwitchingFunctionalTest->testLanguageBlock()
Found the requested form fields at admin/structure/blockOtherlocale.test1353LocaleLanguageSwitchingFunctionalTest->testLanguageBlock()
Failed to set field predefined_langcode to frOtherlocale.test1359LocaleLanguageSwitchingFunctionalTest->testLanguageBlock()
Found the Add language buttonOtherlocale.test1359LocaleLanguageSwitchingFunctionalTest->testLanguageBlock()
Found the requested form fields at admin/config/regional/language/addOtherlocale.test1359LocaleLanguageSwitchingFunctionalTest->testLanguageBlock()
Failed to set field language[enabled][locale-url] to 1Otherlocale.test1363LocaleLanguageSwitchingFunctionalTest->testLanguageBlock()
Found the Save settings buttonOtherlocale.test1363LocaleLanguageSwitchingFunctionalTest->testLanguageBlock()
Found the requested form fields at admin/config/regional/language/configureOtherlocale.test1363LocaleLanguageSwitchingFunctionalTest->testLanguageBlock()
Language switcher block found.Otherlocale.test1367LocaleLanguageSwitchingFunctionalTest->testLanguageBlock()
Undefined offset: 0Noticelocale.test1370LocaleLanguageSwitchingFunctionalTest->testLanguageBlock()
Trying to get property of non-objectNoticelocale.test1379LocaleLanguageSwitchingFunctionalTest->testLanguageBlock()
Trying to get property of non-objectNoticelocale.test1379LocaleLanguageSwitchingFunctionalTest->testLanguageBlock()
Invalid argument supplied for foreach()Warninglocale.test1379LocaleLanguageSwitchingFunctionalTest->testLanguageBlock()
Only the current language list item is marked as active on the language switcher block.Otherlocale.test1396LocaleLanguageSwitchingFunctionalTest->testLanguageBlock()
Only the current language anchor is marked as active on the language switcher block.Otherlocale.test1397LocaleLanguageSwitchingFunctionalTest->testLanguageBlock()
ExpandLocale uninstall (EN) (LocaleUninstallFunctionalTest) [Locale]3110
MessageGroupFilenameLineFunctionStatus
Multilingual workflow option: enabledOtherlocale.test1287LocaleUninstallFunctionalTest->testUninstallProcess()
ExpandLocale uninstall (FR) (LocaleUninstallFrenchFunctionalTest) [Locale]3110
MessageGroupFilenameLineFunctionStatus
Multilingual workflow option: enabledOtherlocale.test1287LocaleUninstallFunctionalTest->testUninstallProcess()
ExpandLocalize date formats (LocaleDateFormatsFunctionalTest) [Locale]18264
MessageGroupFilenameLineFunctionStatus
Invalid permission create article content.Rolelocale.test2653LocaleDateFormatsFunctionalTest->setUp()
Argument 1 passed to DrupalWebTestCase::drupalLogin() must be an instance of stdClass, boolean given, called in /var/lib/drupaltestbot/sites/default/files/checkout/core/modules/locale/locale.test on line 2654 and definedRecoverable errordrupal_web_test_case.php1230DrupalWebTestCase->drupalLogin()
Trying to get property of non-objectNoticedrupal_web_test_case.php1236DrupalWebTestCase->drupalLogin()
Trying to get property of non-objectNoticedrupal_web_test_case.php1237DrupalWebTestCase->drupalLogin()
Failed to set field name to Otherlocale.test2654LocaleDateFormatsFunctionalTest->setUp()
Failed to set field pass to Otherlocale.test2654LocaleDateFormatsFunctionalTest->setUp()
Found the requested form fields at userOtherlocale.test2654LocaleDateFormatsFunctionalTest->setUp()
Trying to get property of non-objectNoticedrupal_web_test_case.php1243DrupalWebTestCase->drupalLogin()
User successfully logged in.User loginlocale.test2654LocaleDateFormatsFunctionalTest->setUp()
Failed to set field predefined_langcode to frOtherlocale.test2665LocaleDateFormatsFunctionalTest->testLocalizeDateFormats()
Found the Add language buttonOtherlocale.test2665LocaleDateFormatsFunctionalTest->testLocalizeDateFormats()
Found the requested form fields at admin/config/regional/language/addOtherlocale.test2665LocaleDateFormatsFunctionalTest->testLocalizeDateFormats()
Failed to set field language[enabled][locale-url] to 1Otherlocale.test2672LocaleDateFormatsFunctionalTest->testLocalizeDateFormats()
Found the Save settings buttonOtherlocale.test2672LocaleDateFormatsFunctionalTest->testLocalizeDateFormats()
Found the requested form fields at admin/config/regional/language/configureOtherlocale.test2672LocaleDateFormatsFunctionalTest->testLocalizeDateFormats()
Configured languages appear.Otherlocale.test2676LocaleDateFormatsFunctionalTest->testLocalizeDateFormats()
Failed to set field date_format_long to d.m.Y - H:iOtherlocale.test2682LocaleDateFormatsFunctionalTest->testLocalizeDateFormats()
Failed to set field date_format_medium to d.m.Y - H:iOtherlocale.test2682LocaleDateFormatsFunctionalTest->testLocalizeDateFormats()
Failed to set field date_format_short to d.m.Y - H:iOtherlocale.test2682LocaleDateFormatsFunctionalTest->testLocalizeDateFormats()
Found the Save configuration buttonOtherlocale.test2682LocaleDateFormatsFunctionalTest->testLocalizeDateFormats()
Found the requested form fields at admin/config/regional/date-time/locale/fr/editOtherlocale.test2682LocaleDateFormatsFunctionalTest->testLocalizeDateFormats()
French date formats updated.Otherlocale.test2683LocaleDateFormatsFunctionalTest->testLocalizeDateFormats()
Failed to set field date_format_long to j M Y - g:iaOtherlocale.test2689LocaleDateFormatsFunctionalTest->testLocalizeDateFormats()
Failed to set field date_format_medium to j M Y - g:iaOtherlocale.test2689LocaleDateFormatsFunctionalTest->testLocalizeDateFormats()
Failed to set field date_format_short to j M Y - g:iaOtherlocale.test2689LocaleDateFormatsFunctionalTest->testLocalizeDateFormats()
Found the Save configuration buttonOtherlocale.test2689LocaleDateFormatsFunctionalTest->testLocalizeDateFormats()
Found the requested form fields at admin/config/regional/date-time/locale/en/editOtherlocale.test2689LocaleDateFormatsFunctionalTest->testLocalizeDateFormats()
English date formats updated.Otherlocale.test2690LocaleDateFormatsFunctionalTest->testLocalizeDateFormats()
English date format appearsOtherlocale.test2698LocaleDateFormatsFunctionalTest->testLocalizeDateFormats()
French date format appearsOtherlocale.test2701LocaleDateFormatsFunctionalTest->testLocalizeDateFormats()
ExpandMain content rendering fallback (SystemMainContentFallback) [System]43248
MessageGroupFilenameLineFunctionStatus
Invalid permission administer blocks.Rolesystem.test1535SystemMainContentFallback->setUp()
Argument 1 passed to DrupalWebTestCase::drupalLogin() must be an instance of stdClass, boolean given, called in /var/lib/drupaltestbot/sites/default/files/checkout/core/modules/system/system.test on line 1536 and definedRecoverable errordrupal_web_test_case.php1230DrupalWebTestCase->drupalLogin()
Trying to get property of non-objectNoticedrupal_web_test_case.php1236DrupalWebTestCase->drupalLogin()
Trying to get property of non-objectNoticedrupal_web_test_case.php1237DrupalWebTestCase->drupalLogin()
Failed to set field name to Othersystem.test1536SystemMainContentFallback->setUp()
Failed to set field pass to Othersystem.test1536SystemMainContentFallback->setUp()
Found the requested form fields at userOthersystem.test1536SystemMainContentFallback->setUp()
Trying to get property of non-objectNoticedrupal_web_test_case.php1243DrupalWebTestCase->drupalLogin()
User successfully logged in.User loginsystem.test1536SystemMainContentFallback->setUp()
Failed to set field modules[Core][dashboard][enable] to Othersystem.test1549SystemMainContentFallback->testMainContentFallback()
Found the Save configuration buttonOthersystem.test1549SystemMainContentFallback->testMainContentFallback()
Found the requested form fields at admin/modulesOthersystem.test1549SystemMainContentFallback->testMainContentFallback()
Modules status has been updated.Othersystem.test1550SystemMainContentFallback->testMainContentFallback()
Failed to set field modules[Core][dashboard][enable] to Othersystem.test1553SystemMainContentFallback->testMainContentFallback()
Failed to set field modules[Core][block][enable] to Othersystem.test1553SystemMainContentFallback->testMainContentFallback()
Found the Save configuration buttonOthersystem.test1553SystemMainContentFallback->testMainContentFallback()
Found the requested form fields at admin/modulesOthersystem.test1553SystemMainContentFallback->testMainContentFallback()
Modules status has been updated.Othersystem.test1554SystemMainContentFallback->testMainContentFallback()
Admin interface still available.Othersystem.test1560SystemMainContentFallback->testMainContentFallback()
Argument 1 passed to DrupalWebTestCase::drupalLogin() must be an instance of stdClass, boolean given, called in /var/lib/drupaltestbot/sites/default/files/checkout/core/modules/system/system.test on line 1584 and definedRecoverable errordrupal_web_test_case.php1230DrupalWebTestCase->drupalLogin()
Trying to get property of non-objectNoticedrupal_web_test_case.php1236DrupalWebTestCase->drupalLogin()
Trying to get property of non-objectNoticedrupal_web_test_case.php1237DrupalWebTestCase->drupalLogin()
Failed to set field name to Othersystem.test1584SystemMainContentFallback->testMainContentFallback()
Failed to set field pass to Othersystem.test1584SystemMainContentFallback->testMainContentFallback()
Found the requested form fields at userOthersystem.test1584SystemMainContentFallback->testMainContentFallback()
Trying to get property of non-objectNoticedrupal_web_test_case.php1243DrupalWebTestCase->drupalLogin()
User successfully logged in.User loginsystem.test1584SystemMainContentFallback->testMainContentFallback()
Failed to set field modules[Core][block][enable] to blockOthersystem.test1587SystemMainContentFallback->testMainContentFallback()
Found the Save configuration buttonOthersystem.test1587SystemMainContentFallback->testMainContentFallback()
Found the requested form fields at admin/modulesOthersystem.test1587SystemMainContentFallback->testMainContentFallback()
Modules status has been updated.Othersystem.test1588SystemMainContentFallback->testMainContentFallback()
Block module re-enabled.Othersystem.test1590SystemMainContentFallback->testMainContentFallback()
ExpandManage fields (FieldUIManageFieldsTestCase) [Field UI]193143
MessageGroupFilenameLineFunctionStatus
"Add existing field" was found.Otherfield_ui.test190FieldUIManageFieldsTestCase->manageFieldsPage()
Trying to get property of non-objectNoticefield_ui.test212FieldUIManageFieldsTestCase->createField()
Existing field was found in account settings.Otherfield_ui.test213FieldUIManageFieldsTestCase->createField()
"Add existing field" was found.Otherfield_ui.test190FieldUIManageFieldsTestCase->manageFieldsPage()
Trying to get property of non-objectNoticefield_ui.test212FieldUIManageFieldsTestCase->createField()
Existing field was found in account settings.Otherfield_ui.test213FieldUIManageFieldsTestCase->createField()
"Add existing field" was found.Otherfield_ui.test245FieldUIManageFieldsTestCase->addExistingField()
Failed to set field fields[_add_existing_field][label] to mL9BE8mb_2Otherfield_ui.test99FieldUITestCase->fieldUIAddExistingField()
Failed to set field fields[_add_existing_field][field_name] to field_d0jqs6a1Otherfield_ui.test99FieldUITestCase->fieldUIAddExistingField()
Failed to set field fields[_add_existing_field][widget_type] to test_field_widgetOtherfield_ui.test99FieldUITestCase->fieldUIAddExistingField()
Found the Save buttonOtherfield_ui.test99FieldUITestCase->fieldUIAddExistingField()
Found the requested form fields at admin/structure/types/manage/page/fieldsOtherfield_ui.test99FieldUITestCase->fieldUIAddExistingField()
Found the Save settings buttonOtherfield_ui.test102FieldUITestCase->fieldUIAddExistingField()
Found the requested form fields at Otherfield_ui.test102FieldUITestCase->fieldUIAddExistingField()
Redirected to "Manage fields" page.Otherfield_ui.test103FieldUITestCase->fieldUIAddExistingField()
Field was created and appears in the overview page.Otherfield_ui.test106FieldUITestCase->fieldUIAddExistingField()
Undefined index: gnsoscjg_testNoticefield_ui.module329_field_ui_bundle_admin_path()
ExpandMenu router (MenuRouterTestCase) [Menu]23090
MessageGroupFilenameLineFunctionStatus
Raw text found on the pageOthermenu.test148MenuRouterTestCase->testTitleCallbackFalse()
The theme callback system falls back on the default theme when a theme that is not enabled is requested.Othermenu.test260MenuRouterTestCase->testThemeCallbackOptionalTheme()
The default theme's CSS appears on the page.Othermenu.test261MenuRouterTestCase->testThemeCallbackOptionalTheme()
Found menu link #1Othermenu.test343MenuRouterTestCase->testMenuLinkMaintain()
Found menu link #2Othermenu.test345MenuRouterTestCase->testMenuLinkMaintain()
Found menu link #2Othermenu.test354MenuRouterTestCase->testMenuLinkMaintain()
Found menu link #2Othermenu.test363MenuRouterTestCase->testMenuLinkMaintain()
Title attribute of a menu link renders.Othermenu.test550MenuRouterTestCase->testMenuLinkOptions()
Query parameter added to menu link.Othermenu.test551MenuRouterTestCase->testMenuLinkOptions()
ExpandModule API (ModuleUnitTest) [Module]92120
MessageGroupFilenameLineFunctionStatus
Standard profile: module_list() returns correct resultsOthermodule.test36ModuleUnitTest->testModuleList()
Standard profile: module_list() returns correctly sorted resultsOthermodule.test36ModuleUnitTest->testModuleList()
After adding a module: module_list() returns correct resultsOthermodule.test42ModuleUnitTest->testModuleList()
After adding a module: module_list() returns correctly sorted resultsOthermodule.test42ModuleUnitTest->testModuleList()
After changing weights: module_list() returns correct resultsOthermodule.test55ModuleUnitTest->testModuleList()
After changing weights: module_list() returns correctly sorted resultsOthermodule.test55ModuleUnitTest->testModuleList()
After reset: module_list() returns correct resultsOthermodule.test68ModuleUnitTest->testModuleList()
After reset: module_list() returns correctly sorted resultsOthermodule.test68ModuleUnitTest->testModuleList()
Modules were enabled in the correct order by module_enable().Othermodule.test165ModuleUnitTest->testDependencyResolution()
Comment module is listed as a dependency of the install profile.Othermodule.test179ModuleUnitTest->testDependencyResolution()
Modules were enabled in the correct order by module_enable().Othermodule.test165ModuleUnitTest->testDependencyResolution()
Comment module is listed as a dependency of the install profile.Othermodule.test179ModuleUnitTest->testDependencyResolution()
ExpandModule dependencies (ModuleDependencyTestCase) [Module]155232
MessageGroupFilenameLineFunctionStatus
Modules status has been updated.Othersystem.test465ModuleDependencyTestCase->testEnableRequirementsFailureDependency()
Module "comment" is enabled.Othersystem.test471ModuleDependencyTestCase->testEnableRequirementsFailureDependency()
Modules status has been updated.Othersystem.test465ModuleDependencyTestCase->testEnableRequirementsFailureDependency()
Module "comment" is enabled.Othersystem.test471ModuleDependencyTestCase->testEnableRequirementsFailureDependency()
Dependency chain created.Othersystem.test494ModuleDependencyTestCase->testModuleEnableOrder()
Module "forum" is enabled.Othersystem.test498ModuleDependencyTestCase->testModuleEnableOrder()
Module "poll" is enabled.Othersystem.test498ModuleDependencyTestCase->testModuleEnableOrder()
Module "php" is enabled.Othersystem.test498ModuleDependencyTestCase->testModuleEnableOrder()
Modules enabled in the correct order.Othersystem.test501ModuleDependencyTestCase->testModuleEnableOrder()
Module "forum" is enabled.Othersystem.test511ModuleDependencyTestCase->testUninstallDependents()
Checkbox for uninstalling the comment module is disabled.Othersystem.test524ModuleDependencyTestCase->testUninstallDependents()
Failed to set field uninstall[forum] to forumOthersystem.test529ModuleDependencyTestCase->testUninstallDependents()
Found the Uninstall buttonOthersystem.test529ModuleDependencyTestCase->testUninstallDependents()
Found the requested form fields at admin/modules/uninstallOthersystem.test529ModuleDependencyTestCase->testUninstallDependents()
Invalid argument supplied for foreach()Warningdrupal_web_test_case.php1952DrupalWebTestCase->drupalPost()
Found the Uninstall buttonOthersystem.test530ModuleDependencyTestCase->testUninstallDependents()
Found the requested form fields at Othersystem.test530ModuleDependencyTestCase->testUninstallDependents()
Modules status has been updated.Othersystem.test531ModuleDependencyTestCase->testUninstallDependents()
Failed to set field uninstall[comment] to commentOthersystem.test533ModuleDependencyTestCase->testUninstallDependents()
Found the Uninstall buttonOthersystem.test533ModuleDependencyTestCase->testUninstallDependents()
Found the requested form fields at admin/modules/uninstallOthersystem.test533ModuleDependencyTestCase->testUninstallDependents()
Invalid argument supplied for foreach()Warningdrupal_web_test_case.php1952DrupalWebTestCase->drupalPost()
Found the Uninstall buttonOthersystem.test534ModuleDependencyTestCase->testUninstallDependents()
Found the requested form fields at Othersystem.test534ModuleDependencyTestCase->testUninstallDependents()
Modules status has been updated.Othersystem.test535ModuleDependencyTestCase->testUninstallDependents()
ExpandMultilingual fields (LocaleMultilingualFieldsFunctionalTest) [Locale]8145
MessageGroupFilenameLineFunctionStatus
The test did not complete due to a fatal error.Completion checklocale.test2466LocaleMultilingualFieldsFunctionalTest->testMultilingualNodeForm()
Invalid permission create page content.Rolelocale.test2435LocaleMultilingualFieldsFunctionalTest->setUp()
Invalid permission edit own page content.Rolelocale.test2435LocaleMultilingualFieldsFunctionalTest->setUp()
Argument 1 passed to DrupalWebTestCase::drupalLogin() must be an instance of stdClass, boolean given, called in /var/lib/drupaltestbot/sites/default/files/checkout/core/modules/locale/locale.test on line 2436 and definedRecoverable errordrupal_web_test_case.php1230DrupalWebTestCase->drupalLogin()
Trying to get property of non-objectNoticedrupal_web_test_case.php1236DrupalWebTestCase->drupalLogin()
Trying to get property of non-objectNoticedrupal_web_test_case.php1237DrupalWebTestCase->drupalLogin()
Failed to set field name to Otherlocale.test2436LocaleMultilingualFieldsFunctionalTest->setUp()
Failed to set field pass to Otherlocale.test2436LocaleMultilingualFieldsFunctionalTest->setUp()
Found the requested form fields at userOtherlocale.test2436LocaleMultilingualFieldsFunctionalTest->setUp()
Trying to get property of non-objectNoticedrupal_web_test_case.php1243DrupalWebTestCase->drupalLogin()
User successfully logged in.User loginlocale.test2436LocaleMultilingualFieldsFunctionalTest->setUp()
Failed to set field language[enabled][locale-url] to 1Otherlocale.test2448LocaleMultilingualFieldsFunctionalTest->setUp()
Found the Save settings buttonOtherlocale.test2448LocaleMultilingualFieldsFunctionalTest->setUp()
Found the requested form fields at admin/config/regional/language/configureOtherlocale.test2448LocaleMultilingualFieldsFunctionalTest->setUp()
Failed to set field language_content_type to 1Otherlocale.test2454LocaleMultilingualFieldsFunctionalTest->setUp()
Found the Save content type buttonOtherlocale.test2454LocaleMultilingualFieldsFunctionalTest->setUp()
Found the requested form fields at admin/structure/types/manage/pageOtherlocale.test2454LocaleMultilingualFieldsFunctionalTest->setUp()
Basic page content type has been updated.Otherlocale.test2455LocaleMultilingualFieldsFunctionalTest->setUp()
Undefined index: field_nameNoticefield.crud.inc221field_update_field()
ExpandNumber field (NumberFieldTestCase) [Field types]22141
MessageGroupFilenameLineFunctionStatus
FieldException: Attempt to create a field of unknown type <em class="placeholder">number_decimal</em>. in field_create_field() (line 109 of /var/lib/drupaltestbot/sites/default/files/checkout/core/modules/field/field.crud.inc).Uncaught exceptionfield.crud.inc109field_create_field()
Found the Save and add fields buttonOthernumber.test108NumberFieldTestCase->testNumberIntegerField()
Found the requested form fields at Othernumber.test108NumberFieldTestCase->testNumberIntegerField()
Failed to set field fields[_add_new_field][label] to jneagRaMOthernumber.test119NumberFieldTestCase->testNumberIntegerField()
Failed to set field fields[_add_new_field][field_name] to jneagramOthernumber.test119NumberFieldTestCase->testNumberIntegerField()
Failed to set field fields[_add_new_field][type] to number_integerOthernumber.test119NumberFieldTestCase->testNumberIntegerField()
Failed to set field fields[_add_new_field][widget_type] to numberOthernumber.test119NumberFieldTestCase->testNumberIntegerField()
Found the Save buttonOthernumber.test119NumberFieldTestCase->testNumberIntegerField()
Found the requested form fields at Othernumber.test119NumberFieldTestCase->testNumberIntegerField()
Failed to set field fields[field_jneagram][type] to number_integerOthernumber.test127NumberFieldTestCase->testNumberIntegerField()
Found the Save buttonOthernumber.test127NumberFieldTestCase->testNumberIntegerField()
Found the requested form fields at Othernumber.test127NumberFieldTestCase->testNumberIntegerField()
Failed to set field fields[field_jneagram][type] to number_unformattedOthernumber.test131NumberFieldTestCase->testNumberIntegerField()
Found the Save buttonOthernumber.test131NumberFieldTestCase->testNumberIntegerField()
Found the requested form fields at Othernumber.test131NumberFieldTestCase->testNumberIntegerField()
ExpandOptions widgets (OptionsWidgetsTestCase) [Field types]32680
MessageGroupFilenameLineFunctionStatus
Display setting checkbox available.Otheroptions.test487OptionsWidgetsTestCase->testOnOffCheckbox()
Default case shows "On value"Otheroptions.test493OptionsWidgetsTestCase->testOnOffCheckbox()
Failed to set field instance[widget][settings][display_label] to 1Otheroptions.test498OptionsWidgetsTestCase->testOnOffCheckbox()
Found the Save settings buttonOtheroptions.test498OptionsWidgetsTestCase->testOnOffCheckbox()
Found the requested form fields at admin/structure/types/manage/page/fields/boolOtheroptions.test498OptionsWidgetsTestCase->testOnOffCheckbox()
Display setting checkbox is availableOtheroptions.test506OptionsWidgetsTestCase->testOnOffCheckbox()
Display settings checkbox checkedBrowseroptions.test510OptionsWidgetsTestCase->testOnOffCheckbox()
Display label changes label of the checkboxOtheroptions.test515OptionsWidgetsTestCase->testOnOffCheckbox()
ExpandPHP filter access check (PHPAccessTestCase) [PHP]3274
MessageGroupFilenameLineFunctionStatus
Invalid permission create page content.Rolephp.test108PHPAccessTestCase->testNoPrivileges()
Invalid permission edit own page content.Rolephp.test108PHPAccessTestCase->testNoPrivileges()
Argument 1 passed to DrupalWebTestCase::drupalLogin() must be an instance of stdClass, boolean given, called in /var/lib/drupaltestbot/sites/default/files/checkout/core/modules/php/php.test on line 109 and definedRecoverable errordrupal_web_test_case.php1230DrupalWebTestCase->drupalLogin()
Trying to get property of non-objectNoticedrupal_web_test_case.php1236DrupalWebTestCase->drupalLogin()
Trying to get property of non-objectNoticedrupal_web_test_case.php1237DrupalWebTestCase->drupalLogin()
Failed to set field name to Otherphp.test109PHPAccessTestCase->testNoPrivileges()
Failed to set field pass to Otherphp.test109PHPAccessTestCase->testNoPrivileges()
Found the requested form fields at userOtherphp.test109PHPAccessTestCase->testNoPrivileges()
Trying to get property of non-objectNoticedrupal_web_test_case.php1243DrupalWebTestCase->drupalLogin()
User successfully logged in.User loginphp.test109PHPAccessTestCase->testNoPrivileges()
PHP code was not evaluated.Otherphp.test114PHPAccessTestCase->testNoPrivileges()
ExpandPHP filter functionality (PHPFilterTestCase) [PHP]32124
MessageGroupFilenameLineFunctionStatus
Invalid permission create page content.Rolephp.test68PHPFilterTestCase->testPHPFilter()
Invalid permission edit own page content.Rolephp.test68PHPFilterTestCase->testPHPFilter()
Argument 1 passed to DrupalWebTestCase::drupalLogin() must be an instance of stdClass, boolean given, called in /var/lib/drupaltestbot/sites/default/files/checkout/core/modules/php/php.test on line 69 and definedRecoverable errordrupal_web_test_case.php1230DrupalWebTestCase->drupalLogin()
Trying to get property of non-objectNoticedrupal_web_test_case.php1236DrupalWebTestCase->drupalLogin()
Trying to get property of non-objectNoticedrupal_web_test_case.php1237DrupalWebTestCase->drupalLogin()
Failed to set field name to Otherphp.test69PHPFilterTestCase->testPHPFilter()
Failed to set field pass to Otherphp.test69PHPFilterTestCase->testPHPFilter()
Found the requested form fields at userOtherphp.test69PHPFilterTestCase->testPHPFilter()
Trying to get property of non-objectNoticedrupal_web_test_case.php1243DrupalWebTestCase->drupalLogin()
User successfully logged in.User loginphp.test69PHPFilterTestCase->testPHPFilter()
PHP code is displayed.Otherphp.test76PHPFilterTestCase->testPHPFilter()
Failed to set field body[und][0][format] to php_codeOtherphp.test82PHPFilterTestCase->testPHPFilter()
Found the Save buttonOtherphp.test82PHPFilterTestCase->testPHPFilter()
Found the requested form fields at node/1/editOtherphp.test82PHPFilterTestCase->testPHPFilter()
PHP code filter turned on.Otherphp.test83PHPFilterTestCase->testPHPFilter()
PHP code has been evaluated.Otherphp.test87PHPFilterTestCase->testPHPFilter()
ExpandSearch language selection (SearchLanguageTestCase) [Search]4710
MessageGroupFilenameLineFunctionStatus
Language added successfully.Othersearch.test1940SearchLanguageTestCase->testLanguages()
ExpandSecurity (FilterSecurityTestCase) [Filter]2340
MessageGroupFilenameLineFunctionStatus
Node body found.Otherfilter.test760FilterSecurityTestCase->testDisableFilterModule()
Testing filter output found.Otherfilter.test771FilterSecurityTestCase->testDisableFilterModule()
Found the Disable buttonOtherfilter.test774FilterSecurityTestCase->testDisableFilterModule()
Found the requested form fields at admin/config/content/formats/plain_text/disableOtherfilter.test774FilterSecurityTestCase->testDisableFilterModule()
ExpandShortcut link functionality (ShortcutLinksTestCase) [Shortcut]14010
MessageGroupFilenameLineFunctionStatus
"Add to shortcuts" link properly switched to "Remove from shortcuts".Othershortcut.test161ShortcutLinksTestCase->testShortcutQuickLink()
ExpandTaxonomy term functions and forms. (TaxonomyTermTestCase) [Taxonomy]1831922
MessageGroupFilenameLineFunctionStatus
Failed to set field taxonomy_pbo7yer7[und] to pN44nmsA, "evglZjWJ, xxdtaUQb", ohiB2DwxOthertaxonomy.test610TaxonomyTermTestCase->testNodeTermCreationAndDeletion()
Found the requested form fields at node/add/pageOthertaxonomy.test610TaxonomyTermTestCase->testNodeTermCreationAndDeletion()
The term appears on the node previewOthertaxonomy.test612TaxonomyTermTestCase->testNodeTermCreationAndDeletion()
The term appears on the node previewOthertaxonomy.test612TaxonomyTermTestCase->testNodeTermCreationAndDeletion()
The term appears on the node previewOthertaxonomy.test612TaxonomyTermTestCase->testNodeTermCreationAndDeletion()
Failed to set field taxonomy_pbo7yer7[und] to pN44nmsA, "evglZjWJ, xxdtaUQb", ohiB2DwxOthertaxonomy.test621TaxonomyTermTestCase->testNodeTermCreationAndDeletion()
Found the requested form fields at node/add/pageOthertaxonomy.test621TaxonomyTermTestCase->testNodeTermCreationAndDeletion()
The node was created successfullyOthertaxonomy.test622TaxonomyTermTestCase->testNodeTermCreationAndDeletion()
The term was saved and appears on the node pageOthertaxonomy.test624TaxonomyTermTestCase->testNodeTermCreationAndDeletion()
The term was saved and appears on the node pageOthertaxonomy.test624TaxonomyTermTestCase->testNodeTermCreationAndDeletion()
The term was saved and appears on the node pageOthertaxonomy.test624TaxonomyTermTestCase->testNodeTermCreationAndDeletion()
Undefined offset: 2Noticetaxonomy.test628TaxonomyTermTestCase->testNodeTermCreationAndDeletion()
Undefined offset: 1Noticetaxonomy.test628TaxonomyTermTestCase->testNodeTermCreationAndDeletion()
Undefined offset: 0Noticetaxonomy.test628TaxonomyTermTestCase->testNodeTermCreationAndDeletion()
Trying to get property of non-objectNoticetaxonomy.test631TaxonomyTermTestCase->testNodeTermCreationAndDeletion()
Found the Delete buttonOthertaxonomy.test631TaxonomyTermTestCase->testNodeTermCreationAndDeletion()
Found the requested form fields at taxonomy/term//editOthertaxonomy.test631TaxonomyTermTestCase->testNodeTermCreationAndDeletion()
Invalid argument supplied for foreach()Warningdrupal_web_test_case.php1952DrupalWebTestCase->drupalPost()
Found the Delete buttonOthertaxonomy.test632TaxonomyTermTestCase->testNodeTermCreationAndDeletion()
Found the requested form fields at Othertaxonomy.test632TaxonomyTermTestCase->testNodeTermCreationAndDeletion()
Trying to get property of non-objectNoticetaxonomy.test633TaxonomyTermTestCase->testNodeTermCreationAndDeletion()
Trying to get property of non-objectNoticetaxonomy.test633TaxonomyTermTestCase->testNodeTermCreationAndDeletion()
Trying to get property of non-objectNoticetaxonomy.test637TaxonomyTermTestCase->testNodeTermCreationAndDeletion()
Trying to get property of non-objectNoticetaxonomy.test640TaxonomyTermTestCase->testNodeTermCreationAndDeletion()
The term appears on the node page after one term was deletedOthertaxonomy.test640TaxonomyTermTestCase->testNodeTermCreationAndDeletion()
Trying to get property of non-objectNoticetaxonomy.test640TaxonomyTermTestCase->testNodeTermCreationAndDeletion()
The term appears on the node page after one term was deletedOthertaxonomy.test640TaxonomyTermTestCase->testNodeTermCreationAndDeletion()
Trying to get property of non-objectNoticetaxonomy.test642TaxonomyTermTestCase->testNodeTermCreationAndDeletion()
Trying to get property of non-objectNoticetaxonomy.test642TaxonomyTermTestCase->testNodeTermCreationAndDeletion()
Trying to get property of non-objectNoticetaxonomy.test646TaxonomyTermTestCase->testNodeTermCreationAndDeletion()
Undefined variable: term_matchesNoticetaxonomy.pages.inc157taxonomy_autocomplete()
Trying to get property of non-objectNoticetaxonomy.test648TaxonomyTermTestCase->testNodeTermCreationAndDeletion()
Trying to get property of non-objectNoticetaxonomy.test648TaxonomyTermTestCase->testNodeTermCreationAndDeletion()
Trying to get property of non-objectNoticetaxonomy.test648TaxonomyTermTestCase->testNodeTermCreationAndDeletion()
Autocomplete returns term after typing the first 3 letters.Othertaxonomy.test648TaxonomyTermTestCase->testNodeTermCreationAndDeletion()
Trying to get property of non-objectNoticetaxonomy.test652TaxonomyTermTestCase->testNodeTermCreationAndDeletion()
Undefined variable: term_matchesNoticetaxonomy.pages.inc157taxonomy_autocomplete()
Trying to get property of non-objectNoticetaxonomy.test654TaxonomyTermTestCase->testNodeTermCreationAndDeletion()
Trying to get property of non-objectNoticetaxonomy.test654TaxonomyTermTestCase->testNodeTermCreationAndDeletion()
Trying to get property of non-objectNoticetaxonomy.test654TaxonomyTermTestCase->testNodeTermCreationAndDeletion()
Autocomplete returns term after typing the first 3 letters.Othertaxonomy.test654TaxonomyTermTestCase->testNodeTermCreationAndDeletion()
ExpandTaxonomy term URL aliases (PathTaxonomyTermTestCase) [Path]29131
MessageGroupFilenameLineFunctionStatus
Trying to get property of non-objectNoticepath.test216PathTaxonomyTermTestCase->testTermAlias()
Failed to set field name to prMXtiaFOtherpath.test216PathTaxonomyTermTestCase->testTermAlias()
Failed to set field description[value] to mimwsAyYOtherpath.test216PathTaxonomyTermTestCase->testTermAlias()
Failed to set field path[alias] to nDh4FV9cOtherpath.test216PathTaxonomyTermTestCase->testTermAlias()
Found the Save buttonOtherpath.test216PathTaxonomyTermTestCase->testTermAlias()
Found the requested form fields at admin/structure/taxonomy//addOtherpath.test216PathTaxonomyTermTestCase->testTermAlias()
Term can be accessed on URL alias.Otherpath.test220PathTaxonomyTermTestCase->testTermAlias()
Failed to set field path[alias] to atKSzjdWOtherpath.test226PathTaxonomyTermTestCase->testTermAlias()
Found the Save buttonOtherpath.test226PathTaxonomyTermTestCase->testTermAlias()
Found the requested form fields at taxonomy/term//editOtherpath.test226PathTaxonomyTermTestCase->testTermAlias()
Term can be accessed on changed URL alias.Otherpath.test230PathTaxonomyTermTestCase->testTermAlias()
Failed to set field path[alias] to Otherpath.test240PathTaxonomyTermTestCase->testTermAlias()
Found the Save buttonOtherpath.test240PathTaxonomyTermTestCase->testTermAlias()
Found the requested form fields at taxonomy/term//editOtherpath.test240PathTaxonomyTermTestCase->testTermAlias()
ExpandTheme initialization in hook_init() (ThemeHookInitUnitTest) [Theme]410
MessageGroupFilenameLineFunctionStatus
The default theme's CSS appears on the page when the theme system is initialized in hook_init().Othertheme.test405ThemeHookInitUnitTest->testThemeInitializationHookInit()
ExpandUI language negotiation (LocaleUILanguageNegotiationTest) [Locale]8111
MessageGroupFilenameLineFunctionStatus
Undefined offset: 0Noticelocale.test2331LocaleUILanguageNegotiationTest->testUrlLanguageFallback()
URLs are rewritten using the browser language.Otherlocale.test2331LocaleUILanguageNegotiationTest->testUrlLanguageFallback()
ExpandUser creation (LocaleUserCreationTest) [Locale]6810
MessageGroupFilenameLineFunctionStatus
Language added successfully.Otherlocale.test1637LocaleUserCreationTest->testLocalUserCreation()

All

Test namePassFailException
Leaf403 functionality (AccessDeniedTestCase) [System]7100
Leaf404 functionality (PageNotFoundTestCase) [System]1800
LeafActionLoopTestCase2700
LeafActionsConfigurationTestCase3800
LeafActive trail (MenuTrailTestCase) [Menu]3300
LeafAddFeedTestCase3000
LeafAdmin theme block admin accessibility (BlockAdminThemeTestCase) [Block]1900
LeafAdministrative pages (SystemAdminTestCase) [System]21600
LeafAdvanced search form (SearchAdvancedSearchForm) [Search]3400
LeafAggregator configuration (AggregatorConfigurationTestCase) [Unknown]1900
LeafAJAX command form values (AJAXFormValuesTestCase) [AJAX]2900
LeafAJAX commands (AJAXCommandsTestCase) [AJAX]6900
LeafAJAX framework (AJAXFrameworkTestCase) [AJAX]2400
LeafAJAX multi form (AJAXMultiFormTestCase) [AJAX]3600
LeafAnonymous comments (CommentAnonymous) [Comment]21100
LeafAuthmap assignment (UserAuthmapAssignmentTestCase) [User]600
LeafAuthorize API (SystemAuthorizeCase) [System]1600
LeafBare upgrade test (BareUpgradePathTestCase) [Upgrade path]2400
LeafBasic SQL syntax tests (DatabaseBasicSyntaxTestCase) [Database]3000
LeafBatch percentages (BatchPercentagesUnitTestCase) [Batch API]1800
LeafBatch processing (BatchProcessingTestCase) [Batch API]16100
LeafBatch progress page (BatchPageTestCase) [Batch API]1600
LeafBlock availability (DashboardBlockAvailabilityTestCase) [Dashboard]2600
LeafBlock availability (NodeBlockTestCase) [Node]2100
LeafBlock availability (PollBlockTestCase) [Poll]15600
LeafBlock availability (SearchBlockTestCase) [Search]6400
LeafBlock caching (BlockCacheTestCase) [Block]21300
LeafBlock functionality (BlockTestCase) [Block]35400
LeafBlock functionality (SystemBlockTestCase) [System]4500
LeafBlock HTML id (BlockHTMLIdTestCase) [Block]1600
LeafBlock template suggestions (BlockTemplateSuggestionsUnitTest) [Block]300
LeafBlocks not in hidden region (BlockHiddenRegionTestCase) [Block]1800
LeafBook functionality (BookTestCase) [Book]45500
LeafBoot and exit hook invocation (HookBootExitTestCase) [Bootstrap]1900
LeafBreadcrumbs (MenuBreadcrumbTestCase) [Menu]41100
LeafBroken requirements test (SimpleTestMissingCheckedRequirements) [SimpleTest]1900
LeafBroken SimpleTest method (SimpleTestBrokenSetUp) [SimpleTest]2100
LeafBrowser language detection (LocaleBrowserDetectionTest) [Locale]4100
LeafCache clear test (CacheClearCase) [Cache]1700
LeafCache emptiness test (CacheIsEmptyCase) [Cache]500
LeafCache saving test (CacheSavingCase) [Cache]800
LeafCancel account (UserCancelTestCase) [User]23600
ExpandCascading stylesheets (CascadingStylesheetsTestCase) [System]3810
MessageGroupFilenameLineFunctionStatus
Inline stylesheets appear in the full page rendering.Othercommon.test723CascadingStylesheetsTestCase->testRenderInlineFullPage()
LeafCategorize feed functionality (CategorizeFeedTestCase) [Unknown]2100
LeafCategorize feed item functionality (CategorizeFeedItemTestCase) [Unknown]5500
LeafChecks display of aggregator items (AggregatorRenderingTestCase) [Unknown]21400
LeafCJK tokenizer (SearchTokenizerTestCase) [Search]800
LeafClass loader (SymfonyClassLoaderTestCase) [Symfony]100
LeafColor functionality (ColorTestCase) [Color]8700
LeafComment actions (CommentActionsTestCase) [Comment]7300
LeafComment approval (CommentApprovalTest) [Comment]20000
LeafComment blocks (CommentBlockFunctionalTest) [Comment]16000
LeafComment count toggle (SearchCommentCountToggleTestCase) [Search]3100
LeafComment fields (CommentFieldsTest) [Comment]15100
ExpandComment interface (CommentInterfaceTest) [Comment]145300
MessageGroupFilenameLineFunctionStatus
Changed environment:array ( 'authenticated' => false, 'comment count' => false, 'form' => 'below', 'user_register' => 1, 'contact' => 'optional', 'comments' => 'open', 'access comments' => 0, 'post comments' => 0, 'skip comment approval' => 1, 'edit own comments' => 0, )Debugcomment.test731CommentInterfaceTest->setEnvironment()
Changed environment:array ( 'authenticated' => true, 'comment count' => false, 'form' => 'below', 'user_register' => 1, 'contact' => 'optional', 'comments' => 'open', 'access comments' => 0, 'post comments' => 0, 'skip comment approval' => 1, 'edit own comments' => 0, )Debugcomment.test731CommentInterfaceTest->setEnvironment()
Changed environment:array ( 'authenticated' => false, 'comment count' => true, 'form' => 'below', 'user_register' => 1, 'contact' => 'optional', 'comments' => 'open', 'access comments' => 0, 'post comments' => 0, 'skip comment approval' => 1, 'edit own comments' => 0, )Debugcomment.test731CommentInterfaceTest->setEnvironment()
Changed environment:array ( 'authenticated' => true, 'comment count' => true, 'form' => 'below', 'user_register' => 1, 'contact' => 'optional', 'comments' => 'open', 'access comments' => 0, 'post comments' => 0, 'skip comment approval' => 1, 'edit own comments' => 0, )Debugcomment.test731CommentInterfaceTest->setEnvironment()
Changed environment:array ( 'authenticated' => false, 'comment count' => false, 'form' => 'below', 'user_register' => 1, 'contact' => 'optional', 'comments' => 'open', 'access comments' => 1, 'post comments' => 0, 'skip comment approval' => 1, 'edit own comments' => 0, )Debugcomment.test731CommentInterfaceTest->setEnvironment()
Changed environment:array ( 'authenticated' => true, 'comment count' => false, 'form' => 'below', 'user_register' => 1, 'contact' => 'optional', 'comments' => 'open', 'access comments' => 1, 'post comments' => 0, 'skip comment approval' => 1, 'edit own comments' => 0, )Debugcomment.test731CommentInterfaceTest->setEnvironment()
Changed environment:array ( 'authenticated' => false, 'comment count' => true, 'form' => 'below', 'user_register' => 1, 'contact' => 'optional', 'comments' => 'open', 'access comments' => 1, 'post comments' => 0, 'skip comment approval' => 1, 'edit own comments' => 0, )Debugcomment.test731CommentInterfaceTest->setEnvironment()
Changed environment:array ( 'authenticated' => true, 'comment count' => true, 'form' => 'below', 'user_register' => 1, 'contact' => 'optional', 'comments' => 'open', 'access comments' => 1, 'post comments' => 0, 'skip comment approval' => 1, 'edit own comments' => 0, )Debugcomment.test731CommentInterfaceTest->setEnvironment()
Changed environment:array ( 'authenticated' => false, 'comment count' => false, 'form' => 'below', 'user_register' => 1, 'contact' => 'optional', 'comments' => 'open', 'access comments' => 0, 'post comments' => 1, 'skip comment approval' => 1, 'edit own comments' => 0, )Debugcomment.test731CommentInterfaceTest->setEnvironment()
Changed environment:array ( 'authenticated' => true, 'comment count' => false, 'form' => 'below', 'user_register' => 1, 'contact' => 'optional', 'comments' => 'open', 'access comments' => 0, 'post comments' => 1, 'skip comment approval' => 1, 'edit own comments' => 0, )Debugcomment.test731CommentInterfaceTest->setEnvironment()
Changed environment:array ( 'authenticated' => false, 'comment count' => true, 'form' => 'below', 'user_register' => 1, 'contact' => 'optional', 'comments' => 'open', 'access comments' => 0, 'post comments' => 1, 'skip comment approval' => 1, 'edit own comments' => 0, )Debugcomment.test731CommentInterfaceTest->setEnvironment()
Changed environment:array ( 'authenticated' => true, 'comment count' => true, 'form' => 'below', 'user_register' => 1, 'contact' => 'optional', 'comments' => 'open', 'access comments' => 0, 'post comments' => 1, 'skip comment approval' => 1, 'edit own comments' => 0, )Debugcomment.test731CommentInterfaceTest->setEnvironment()
Changed environment:array ( 'authenticated' => false, 'comment count' => false, 'form' => 'below', 'user_register' => 1, 'contact' => 'optional', 'comments' => 'open', 'access comments' => 1, 'post comments' => 1, 'skip comment approval' => 1, 'edit own comments' => 0, )Debugcomment.test731CommentInterfaceTest->setEnvironment()
Changed environment:array ( 'authenticated' => true, 'comment count' => false, 'form' => 'below', 'user_register' => 1, 'contact' => 'optional', 'comments' => 'open', 'access comments' => 1, 'post comments' => 1, 'skip comment approval' => 1, 'edit own comments' => 0, )Debugcomment.test731CommentInterfaceTest->setEnvironment()
Changed environment:array ( 'authenticated' => false, 'comment count' => true, 'form' => 'below', 'user_register' => 1, 'contact' => 'optional', 'comments' => 'open', 'access comments' => 1, 'post comments' => 1, 'skip comment approval' => 1, 'edit own comments' => 0, )Debugcomment.test731CommentInterfaceTest->setEnvironment()
Changed environment:array ( 'authenticated' => true, 'comment count' => true, 'form' => 'below', 'user_register' => 1, 'contact' => 'optional', 'comments' => 'open', 'access comments' => 1, 'post comments' => 1, 'skip comment approval' => 1, 'edit own comments' => 0, )Debugcomment.test731CommentInterfaceTest->setEnvironment()
Changed environment:array ( 'authenticated' => false, 'comment count' => false, 'form' => 'separate page', 'user_register' => 1, 'contact' => 'optional', 'comments' => 'open', 'access comments' => 0, 'post comments' => 0, 'skip comment approval' => 1, 'edit own comments' => 0, )Debugcomment.test731CommentInterfaceTest->setEnvironment()
Changed environment:array ( 'authenticated' => true, 'comment count' => false, 'form' => 'separate page', 'user_register' => 1, 'contact' => 'optional', 'comments' => 'open', 'access comments' => 0, 'post comments' => 0, 'skip comment approval' => 1, 'edit own comments' => 0, )Debugcomment.test731CommentInterfaceTest->setEnvironment()
Changed environment:array ( 'authenticated' => false, 'comment count' => true, 'form' => 'separate page', 'user_register' => 1, 'contact' => 'optional', 'comments' => 'open', 'access comments' => 0, 'post comments' => 0, 'skip comment approval' => 1, 'edit own comments' => 0, )Debugcomment.test731CommentInterfaceTest->setEnvironment()
Changed environment:array ( 'authenticated' => true, 'comment count' => true, 'form' => 'separate page', 'user_register' => 1, 'contact' => 'optional', 'comments' => 'open', 'access comments' => 0, 'post comments' => 0, 'skip comment approval' => 1, 'edit own comments' => 0, )Debugcomment.test731CommentInterfaceTest->setEnvironment()
Changed environment:array ( 'authenticated' => false, 'comment count' => false, 'form' => 'separate page', 'user_register' => 1, 'contact' => 'optional', 'comments' => 'open', 'access comments' => 1, 'post comments' => 0, 'skip comment approval' => 1, 'edit own comments' => 0, )Debugcomment.test731CommentInterfaceTest->setEnvironment()
Changed environment:array ( 'authenticated' => true, 'comment count' => false, 'form' => 'separate page', 'user_register' => 1, 'contact' => 'optional', 'comments' => 'open', 'access comments' => 1, 'post comments' => 0, 'skip comment approval' => 1, 'edit own comments' => 0, )Debugcomment.test731CommentInterfaceTest->setEnvironment()
Changed environment:array ( 'authenticated' => false, 'comment count' => true, 'form' => 'separate page', 'user_register' => 1, 'contact' => 'optional', 'comments' => 'open', 'access comments' => 1, 'post comments' => 0, 'skip comment approval' => 1, 'edit own comments' => 0, )Debugcomment.test731CommentInterfaceTest->setEnvironment()
Changed environment:array ( 'authenticated' => true, 'comment count' => true, 'form' => 'separate page', 'user_register' => 1, 'contact' => 'optional', 'comments' => 'open', 'access comments' => 1, 'post comments' => 0, 'skip comment approval' => 1, 'edit own comments' => 0, )Debugcomment.test731CommentInterfaceTest->setEnvironment()
Changed environment:array ( 'authenticated' => false, 'comment count' => false, 'form' => 'separate page', 'user_register' => 1, 'contact' => 'optional', 'comments' => 'open', 'access comments' => 0, 'post comments' => 1, 'skip comment approval' => 1, 'edit own comments' => 0, )Debugcomment.test731CommentInterfaceTest->setEnvironment()
Changed environment:array ( 'authenticated' => true, 'comment count' => false, 'form' => 'separate page', 'user_register' => 1, 'contact' => 'optional', 'comments' => 'open', 'access comments' => 0, 'post comments' => 1, 'skip comment approval' => 1, 'edit own comments' => 0, )Debugcomment.test731CommentInterfaceTest->setEnvironment()
Changed environment:array ( 'authenticated' => false, 'comment count' => true, 'form' => 'separate page', 'user_register' => 1, 'contact' => 'optional', 'comments' => 'open', 'access comments' => 0, 'post comments' => 1, 'skip comment approval' => 1, 'edit own comments' => 0, )Debugcomment.test731CommentInterfaceTest->setEnvironment()
Changed environment:array ( 'authenticated' => true, 'comment count' => true, 'form' => 'separate page', 'user_register' => 1, 'contact' => 'optional', 'comments' => 'open', 'access comments' => 0, 'post comments' => 1, 'skip comment approval' => 1, 'edit own comments' => 0, )Debugcomment.test731CommentInterfaceTest->setEnvironment()
Changed environment:array ( 'authenticated' => false, 'comment count' => false, 'form' => 'separate page', 'user_register' => 1, 'contact' => 'optional', 'comments' => 'open', 'access comments' => 1, 'post comments' => 1, 'skip comment approval' => 1, 'edit own comments' => 0, )Debugcomment.test731CommentInterfaceTest->setEnvironment()
Changed environment:array ( 'authenticated' => true, 'comment count' => false, 'form' => 'separate page', 'user_register' => 1, 'contact' => 'optional', 'comments' => 'open', 'access comments' => 1, 'post comments' => 1, 'skip comment approval' => 1, 'edit own comments' => 0, )Debugcomment.test731CommentInterfaceTest->setEnvironment()
Changed environment:array ( 'authenticated' => false, 'comment count' => true, 'form' => 'separate page', 'user_register' => 1, 'contact' => 'optional', 'comments' => 'open', 'access comments' => 1, 'post comments' => 1, 'skip comment approval' => 1, 'edit own comments' => 0, )Debugcomment.test731CommentInterfaceTest->setEnvironment()
Changed environment:array ( 'authenticated' => true, 'comment count' => true, 'form' => 'separate page', 'user_register' => 1, 'contact' => 'optional', 'comments' => 'open', 'access comments' => 1, 'post comments' => 1, 'skip comment approval' => 1, 'edit own comments' => 0, )Debugcomment.test731CommentInterfaceTest->setEnvironment()
Changed environment:array ( 'authenticated' => false, 'comment count' => false, 'form' => 'below', 'user_register' => 0, 'contact' => 'optional', 'comments' => 'open', 'access comments' => 0, 'post comments' => 0, 'skip comment approval' => 1, 'edit own comments' => 0, )Debugcomment.test731CommentInterfaceTest->setEnvironment()
Changed environment:array ( 'authenticated' => true, 'comment count' => false, 'form' => 'below', 'user_register' => 0, 'contact' => 'optional', 'comments' => 'open', 'access comments' => 0, 'post comments' => 0, 'skip comment approval' => 1, 'edit own comments' => 0, )Debugcomment.test731CommentInterfaceTest->setEnvironment()
Changed environment:array ( 'authenticated' => false, 'comment count' => true, 'form' => 'below', 'user_register' => 0, 'contact' => 'optional', 'comments' => 'open', 'access comments' => 0, 'post comments' => 0, 'skip comment approval' => 1, 'edit own comments' => 0, )Debugcomment.test731CommentInterfaceTest->setEnvironment()
Changed environment:array ( 'authenticated' => true, 'comment count' => true, 'form' => 'below', 'user_register' => 0, 'contact' => 'optional', 'comments' => 'open', 'access comments' => 0, 'post comments' => 0, 'skip comment approval' => 1, 'edit own comments' => 0, )Debugcomment.test731CommentInterfaceTest->setEnvironment()
Changed environment:array ( 'authenticated' => false, 'comment count' => false, 'form' => 'below', 'user_register' => 0, 'contact' => 'optional', 'comments' => 'open', 'access comments' => 1, 'post comments' => 0, 'skip comment approval' => 1, 'edit own comments' => 0, )Debugcomment.test731CommentInterfaceTest->setEnvironment()
Changed environment:array ( 'authenticated' => true, 'comment count' => false, 'form' => 'below', 'user_register' => 0, 'contact' => 'optional', 'comments' => 'open', 'access comments' => 1, 'post comments' => 0, 'skip comment approval' => 1, 'edit own comments' => 0, )Debugcomment.test731CommentInterfaceTest->setEnvironment()
Changed environment:array ( 'authenticated' => false, 'comment count' => true, 'form' => 'below', 'user_register' => 0, 'contact' => 'optional', 'comments' => 'open', 'access comments' => 1, 'post comments' => 0, 'skip comment approval' => 1, 'edit own comments' => 0, )Debugcomment.test731CommentInterfaceTest->setEnvironment()
Changed environment:array ( 'authenticated' => true, 'comment count' => true, 'form' => 'below', 'user_register' => 0, 'contact' => 'optional', 'comments' => 'open', 'access comments' => 1, 'post comments' => 0, 'skip comment approval' => 1, 'edit own comments' => 0, )Debugcomment.test731CommentInterfaceTest->setEnvironment()
Changed environment:array ( 'authenticated' => false, 'comment count' => false, 'form' => 'below', 'user_register' => 0, 'contact' => 'optional', 'comments' => 'open', 'access comments' => 0, 'post comments' => 1, 'skip comment approval' => 1, 'edit own comments' => 0, )Debugcomment.test731CommentInterfaceTest->setEnvironment()
Changed environment:array ( 'authenticated' => true, 'comment count' => false, 'form' => 'below', 'user_register' => 0, 'contact' => 'optional', 'comments' => 'open', 'access comments' => 0, 'post comments' => 1, 'skip comment approval' => 1, 'edit own comments' => 0, )Debugcomment.test731CommentInterfaceTest->setEnvironment()
Changed environment:array ( 'authenticated' => false, 'comment count' => true, 'form' => 'below', 'user_register' => 0, 'contact' => 'optional', 'comments' => 'open', 'access comments' => 0, 'post comments' => 1, 'skip comment approval' => 1, 'edit own comments' => 0, )Debugcomment.test731CommentInterfaceTest->setEnvironment()
Changed environment:array ( 'authenticated' => true, 'comment count' => true, 'form' => 'below', 'user_register' => 0, 'contact' => 'optional', 'comments' => 'open', 'access comments' => 0, 'post comments' => 1, 'skip comment approval' => 1, 'edit own comments' => 0, )Debugcomment.test731CommentInterfaceTest->setEnvironment()
Changed environment:array ( 'authenticated' => false, 'comment count' => false, 'form' => 'below', 'user_register' => 0, 'contact' => 'optional', 'comments' => 'open', 'access comments' => 1, 'post comments' => 1, 'skip comment approval' => 1, 'edit own comments' => 0, )Debugcomment.test731CommentInterfaceTest->setEnvironment()
Changed environment:array ( 'authenticated' => true, 'comment count' => false, 'form' => 'below', 'user_register' => 0, 'contact' => 'optional', 'comments' => 'open', 'access comments' => 1, 'post comments' => 1, 'skip comment approval' => 1, 'edit own comments' => 0, )Debugcomment.test731CommentInterfaceTest->setEnvironment()
Changed environment:array ( 'authenticated' => false, 'comment count' => true, 'form' => 'below', 'user_register' => 0, 'contact' => 'optional', 'comments' => 'open', 'access comments' => 1, 'post comments' => 1, 'skip comment approval' => 1, 'edit own comments' => 0, )Debugcomment.test731CommentInterfaceTest->setEnvironment()
Changed environment:array ( 'authenticated' => true, 'comment count' => true, 'form' => 'below', 'user_register' => 0, 'contact' => 'optional', 'comments' => 'open', 'access comments' => 1, 'post comments' => 1, 'skip comment approval' => 1, 'edit own comments' => 0, )Debugcomment.test731CommentInterfaceTest->setEnvironment()
Changed environment:array ( 'authenticated' => false, 'comment count' => false, 'form' => 'separate page', 'user_register' => 0, 'contact' => 'optional', 'comments' => 'open', 'access comments' => 0, 'post comments' => 0, 'skip comment approval' => 1, 'edit own comments' => 0, )Debugcomment.test731CommentInterfaceTest->setEnvironment()
Changed environment:array ( 'authenticated' => true, 'comment count' => false, 'form' => 'separate page', 'user_register' => 0, 'contact' => 'optional', 'comments' => 'open', 'access comments' => 0, 'post comments' => 0, 'skip comment approval' => 1, 'edit own comments' => 0, )Debugcomment.test731CommentInterfaceTest->setEnvironment()
Changed environment:array ( 'authenticated' => false, 'comment count' => true, 'form' => 'separate page', 'user_register' => 0, 'contact' => 'optional', 'comments' => 'open', 'access comments' => 0, 'post comments' => 0, 'skip comment approval' => 1, 'edit own comments' => 0, )Debugcomment.test731CommentInterfaceTest->setEnvironment()
Changed environment:array ( 'authenticated' => true, 'comment count' => true, 'form' => 'separate page', 'user_register' => 0, 'contact' => 'optional', 'comments' => 'open', 'access comments' => 0, 'post comments' => 0, 'skip comment approval' => 1, 'edit own comments' => 0, )Debugcomment.test731CommentInterfaceTest->setEnvironment()
Changed environment:array ( 'authenticated' => false, 'comment count' => false, 'form' => 'separate page', 'user_register' => 0, 'contact' => 'optional', 'comments' => 'open', 'access comments' => 1, 'post comments' => 0, 'skip comment approval' => 1, 'edit own comments' => 0, )Debugcomment.test731CommentInterfaceTest->setEnvironment()
Changed environment:array ( 'authenticated' => true, 'comment count' => false, 'form' => 'separate page', 'user_register' => 0, 'contact' => 'optional', 'comments' => 'open', 'access comments' => 1, 'post comments' => 0, 'skip comment approval' => 1, 'edit own comments' => 0, )Debugcomment.test731CommentInterfaceTest->setEnvironment()
Changed environment:array ( 'authenticated' => false, 'comment count' => true, 'form' => 'separate page', 'user_register' => 0, 'contact' => 'optional', 'comments' => 'open', 'access comments' => 1, 'post comments' => 0, 'skip comment approval' => 1, 'edit own comments' => 0, )Debugcomment.test731CommentInterfaceTest->setEnvironment()
Changed environment:array ( 'authenticated' => true, 'comment count' => true, 'form' => 'separate page', 'user_register' => 0, 'contact' => 'optional', 'comments' => 'open', 'access comments' => 1, 'post comments' => 0, 'skip comment approval' => 1, 'edit own comments' => 0, )Debugcomment.test731CommentInterfaceTest->setEnvironment()
Changed environment:array ( 'authenticated' => false, 'comment count' => false, 'form' => 'separate page', 'user_register' => 0, 'contact' => 'optional', 'comments' => 'open', 'access comments' => 0, 'post comments' => 1, 'skip comment approval' => 1, 'edit own comments' => 0, )Debugcomment.test731CommentInterfaceTest->setEnvironment()
Changed environment:array ( 'authenticated' => true, 'comment count' => false, 'form' => 'separate page', 'user_register' => 0, 'contact' => 'optional', 'comments' => 'open', 'access comments' => 0, 'post comments' => 1, 'skip comment approval' => 1, 'edit own comments' => 0, )Debugcomment.test731CommentInterfaceTest->setEnvironment()
Changed environment:array ( 'authenticated' => false, 'comment count' => true, 'form' => 'separate page', 'user_register' => 0, 'contact' => 'optional', 'comments' => 'open', 'access comments' => 0, 'post comments' => 1, 'skip comment approval' => 1, 'edit own comments' => 0, )Debugcomment.test731CommentInterfaceTest->setEnvironment()
Changed environment:array ( 'authenticated' => true, 'comment count' => true, 'form' => 'separate page', 'user_register' => 0, 'contact' => 'optional', 'comments' => 'open', 'access comments' => 0, 'post comments' => 1, 'skip comment approval' => 1, 'edit own comments' => 0, )Debugcomment.test731CommentInterfaceTest->setEnvironment()
Changed environment:array ( 'authenticated' => false, 'comment count' => false, 'form' => 'separate page', 'user_register' => 0, 'contact' => 'optional', 'comments' => 'open', 'access comments' => 1, 'post comments' => 1, 'skip comment approval' => 1, 'edit own comments' => 0, )Debugcomment.test731CommentInterfaceTest->setEnvironment()
Changed environment:array ( 'authenticated' => true, 'comment count' => false, 'form' => 'separate page', 'user_register' => 0, 'contact' => 'optional', 'comments' => 'open', 'access comments' => 1, 'post comments' => 1, 'skip comment approval' => 1, 'edit own comments' => 0, )Debugcomment.test731CommentInterfaceTest->setEnvironment()
Changed environment:array ( 'authenticated' => false, 'comment count' => true, 'form' => 'separate page', 'user_register' => 0, 'contact' => 'optional', 'comments' => 'open', 'access comments' => 1, 'post comments' => 1, 'skip comment approval' => 1, 'edit own comments' => 0, )Debugcomment.test731CommentInterfaceTest->setEnvironment()
Changed environment:array ( 'authenticated' => true, 'comment count' => true, 'form' => 'separate page', 'user_register' => 0, 'contact' => 'optional', 'comments' => 'open', 'access comments' => 1, 'post comments' => 1, 'skip comment approval' => 1, 'edit own comments' => 0, )Debugcomment.test731CommentInterfaceTest->setEnvironment()
LeafComment language (LocaleCommentLanguageFunctionalTest) [Locale]5300
LeafComment node access (CommentNodeAccessTest) [Comment]9800
LeafComment paging settings (CommentPagerTest) [Comment]25500
LeafComment preview (CommentPreviewTest) [Comment]13700
LeafComment Rebuild (CommentContentRebuild) [Comment]7700
LeafComment RSS (CommentRSSUnitTest) [Comment]6900
LeafComment Search tests (SearchCommentTestCase) [Search]19000
LeafComment token replacement (CommentTokenReplaceTestCase) [Comment]10900
LeafConfig settings form (SearchConfigSettingsForm) [Search]12200
LeafConnection tests (DatabaseConnectionTestCase) [Database]3800
LeafContent language settings (LocaleContentFunctionalTest) [Locale]14300
LeafCron run (CronRunTestCase) [System]5100
LeafCSS Unit Tests (CascadingStylesheetsUnitTest) [System]1200
LeafCustom query syntax tests (DatabaseQueryTestCase) [Database]700
LeafDashboard blocks (DashboardBlocksTestCase) [Dashboard]8500
LeafData API functions (DrupalDataApiTest) [System]3400
LeafDate and time (DateTimeFunctionalTest) [System]11300
LeafDBLog functionality (DBLogTestCase) [DBLog]38100
LeafDefault text format functionality (FilterDefaultFormatTestCase) [Filter]3300
LeafDelete/Truncate tests (DatabaseDeleteTruncateTestCase) [Database]2300
LeafDrupal error handlers (DrupalErrorHandlerUnitTest) [System]3000
LeafDrupal goto (DrupalGotoTest) [System]2100
LeafDrupal HTTP request (DrupalHTTPRequestTestCase) [System]3200
LeafDrupal match path (DrupalMatchPathTestCase) [Path API]4100
LeafDrupal set/get regions (DrupalSetContentTestCase) [System]3400
LeafDrupal system listing (DrupalSystemListingTestCase) [System]600
LeafDrupal tags handling (DrupalTagsHandlingTestCase) [System]800
Leafdrupal_add_feed() tests (DrupalAddFeedTestCase) [System]600
Leafdrupal_alter() tests (DrupalAlterTestCase) [System]700
Leafdrupal_render() (DrupalRenderTestCase) [System]4900
LeafElement processing (FormElementTestCase) [Form API]3300
LeafEmbedded forms (SearchEmbedForm) [Search]3200
LeafEmpty statement (DatabaseEmptyStatementTestCase) [Database]400
LeafEnable/disable modules (EnableDisableTestCase) [Module]139500
LeafEntity CRUD (EntityAPITestCase) [Entity API]800
LeafEntity CRUD hooks (EntityCrudHookTestCase) [Entity API]11400
LeafEntity properties (EntityPropertiesTestCase) [Entity API]400
LeafEntity query (EntityFieldQueryTestCase) [Entity API]11800
LeafFeed parser functionality (FeedParserTestCase) [Unknown]4500
LeafFetch tests (DatabaseFetchTestCase) [Database]3700
LeafFetch tests, part 2 (DatabaseFetch2TestCase) [Database]2900
LeafFetching multiple cache items (CacheGetMultipleUnitTest) [Cache]700
LeafField attach tests (other) (FieldAttachOtherTestCase) [Field API]5400
LeafField attach tests (storage-related) (FieldAttachStorageTestCase) [Field API]9200
LeafField bulk delete tests (FieldBulkDeleteTestCase) [Field API]4200
LeafField CRUD tests (FieldCrudTestCase) [Field API]6900
LeafField Display API tests (FieldDisplayAPITestCase) [Field API]4600
LeafField form tests (FieldFormTestCase) [Field API]24400
LeafField info tests (FieldInfoTestCase) [Field API]8400
LeafField instance CRUD tests (FieldInstanceCrudTestCase) [Field API]3700
LeafField SQL storage tests (FieldSqlStorageTestCase) [Field API]9700
LeafField translations tests (FieldTranslationsTestCase) [Field API]6400
LeafFile copying (FileCopyTest) [File API]11000
LeafFile delete (FileDeleteTest) [File API]2000
LeafFile download (FileDownloadTest) [File API]3800
LeafFile field display tests (FileFieldDisplayTestCase) [File]2200
LeafFile field file path tests (FileFieldPathTestCase) [File]2700
LeafFile field revision test (FileFieldRevisionTestCase) [File]6700
LeafFile field validation tests (FileFieldValidateTestCase) [File]11800
LeafFile field widget test (FileFieldWidgetTestCase) [File]30000
LeafFile loading (FileLoadTest) [File API]3400
LeafFile mimetypes (FileMimeTypeTest) [File API]4200
LeafFile moving (FileMoveTest) [File API]11000
LeafFile naming (FileNameMungingTest) [File API]500
LeafFile paths and directories (FileDirectoryTest) [File API]2000
LeafFile paths and directories (RemoteFileDirectoryTest) [File API (remote)]2400
LeafFile save data (FileSaveDataTest) [File API]9300
LeafFile saving (FileSaveTest) [File API]1500
LeafFile scan directory (FileScanDirectoryTest) [File API]2300
LeafFile scan directory (RemoteFileScanDirectoryTest) [File API (remote)]2300
LeafFile space used tests (FileSpaceUsedTest) [File API]1100
LeafFile token replacement (FileTokenReplaceTestCase) [File]3500
LeafFile uploading (FileSaveUploadTest) [File API]27100
LeafFile uploading (RemoteFileSaveUploadTest) [File API (remote)]27100
LeafFile URL rewriting (FileURLRewritingTest) [File]1700
LeafFile usage (FileUsageTest) [File]2100
LeafFile validate (FileValidateTest) [File API]1200
LeafFile validator tests (FileValidatorTest) [File API]2500
LeafFileTransfer unit tests (FileTranferTest) [System]200
LeafFilled upgrade test (FilledUpgradePathTestCase) [Upgrade path]2300
LeafFilter administration functionality (FilterAdminTestCase) [Filter]16400
LeafFilter CRUD operations (FilterCRUDTestCase) [Filter]21500
LeafFilter format access (FilterFormatAccessTestCase) [Filter]24700
LeafFilter format hooks (FilterHooksTestCase) [Filter]3300
LeafFilter module filters (FilterUnitTestCase) [Filter]21300
LeafFingerprinting meta tag (AdminMetaTagTestCase) [System]300
LeafFlood control mechanism (FloodFunctionalTest) [System]600
LeafForm alter hooks (FormAlterTestCase) [Form API]400
LeafForm API checkbox (FormCheckboxTestCase) [Form API]9700
LeafForm API file inclusion (FormsFileInclusionTestCase) [Form API]1100
LeafForm element and label output test (FormsElementsLabelsTestCase) [Form API]1800
LeafForm element validation (FormsTestCase) [Form API]27600
LeafForm rebuilding (FormsRebuildTestCase) [Form API]5400
ExpandForm state values clearance (advanced) (FormStateValuesCleanAdvancedTestCase) [Form API]630
MessageGroupFilenameLineFunctionStatus
Failed to set field files[image] to /var/lib/drupaltestbot/sites/default/files/checkout/sites/default/files/simpletest/387703/image-test.pngOtherform.test1167FormStateValuesCleanAdvancedTestCase->testFormStateValuesCleanAdvanced()
Found the requested form fields at form_test/form-state-values-clean-advancedOtherform.test1167FormStateValuesCleanAdvancedTestCase->testFormStateValuesCleanAdvanced()
Found the success message.Otherform.test1171FormStateValuesCleanAdvancedTestCase->testFormStateValuesCleanAdvanced()
LeafForm state values clearance (FormStateValuesCleanTestCase) [Form API]1400
LeafForm triggering element determination (FormsTriggeringElementTestCase) [Form API]5000
LeafForm validation handlers (FormValidationTestCase) [Form API]4900
LeafForm wrapper callback (FormsFormWrapperTestCase) [Form API]500
LeafFormat date (FormatDateUnitTest) [System]6500
LeafForum functionality (ForumTestCase) [Forum]63400
LeafFront page (FrontPageTestCase) [System]3700
LeafGet filename test (BootstrapGetFilenameTestCase) [Bootstrap]500
LeafGraph (GraphUnitTest) [System]2800
LeafHelp functionality (HelpTestCase) [Help]30700
LeafHTML Attributes (DrupalAttributesUnitTest) [System]600
LeafHTML identifiers (DrupalHTMLIdentifierTestCase) [System]1000
LeafHTML in page titles (PageTitleFiltering) [System]4400
LeafHTML to text conversion (DrupalHtmlToTextTestCase) [Mail]8100
Leafhtml.tpl.php html and body attributes (ThemeHtmlTplPhpAttributesTestCase) [Theme]500
LeafHTTP file retrieval (RetrieveFileTestCase) [System]700
ExpandImage dimensions (ImageDimensionsUnitTest) [Image]102
MessageGroupFilenameLineFunctionStatus
Undefined index: isidNoticeimage.test985ImageDimensionsUnitTest->testImageDimensions()
PDOException: SQLSTATE[42S02]: Base table or view not found: 1146 Table 'drupaltestbotmysql.simpletest962578image_styles' doesn't exist: SELECT image_styles.* FROM {image_styles} image_styles ORDER BY name ASC; Array ( ) in image_styles() (line 516 of /var/lib/drupaltestbot/sites/default/files/checkout/core/modules/image/image.module).Uncaught exceptiondatabase.inc2132PDOStatement->execute()
LeafImage effects (ImageEffectsUnitTest) [Image]3900
ExpandImage field display tests (ImageFieldDisplayTestCase) [Image]151145
MessageGroupFilenameLineFunctionStatus
Failed to set field files[field_settings_default_image] to /var/lib/drupaltestbot/sites/default/files/checkout/sites/default/files/simpletest/386583/image-test.pngOtherimage.test836ImageFieldDisplayTestCase->testImageFieldDefaultImage()
Found the Save settings buttonOtherimage.test836ImageFieldDisplayTestCase->testImageFieldDefaultImage()
Found the requested form fields at admin/structure/types/manage/article/fields/wlcuxvirOtherimage.test836ImageFieldDisplayTestCase->testImageFieldDefaultImage()
Trying to get property of non-objectNoticeimage.test841ImageFieldDisplayTestCase->testImageFieldDefaultImage()
The default image status is permanent.Otherimage.test841ImageFieldDisplayTestCase->testImageFieldDefaultImage()
Trying to get property of non-objectNoticeimage.test842ImageFieldDisplayTestCase->testImageFieldDefaultImage()
Default image displayed when no user supplied image is present.Otherimage.test844ImageFieldDisplayTestCase->testImageFieldDefaultImage()
Failed to set field field[settings][default_image][fid] to 0Otherimage.test864ImageFieldDisplayTestCase->testImageFieldDefaultImage()
Found the Save settings buttonOtherimage.test864ImageFieldDisplayTestCase->testImageFieldDefaultImage()
Found the requested form fields at admin/structure/types/manage/article/fields/wlcuxvirOtherimage.test864ImageFieldDisplayTestCase->testImageFieldDefaultImage()
Failed to set field files[field_settings_default_image] to /var/lib/drupaltestbot/sites/default/files/checkout/sites/default/files/simpletest/386583/image-test.gifOtherimage.test877ImageFieldDisplayTestCase->testImageFieldDefaultImage()
Found the Save settings buttonOtherimage.test877ImageFieldDisplayTestCase->testImageFieldDefaultImage()
Found the requested form fields at admin/structure/types/manage/article/fields/obqkk5isOtherimage.test877ImageFieldDisplayTestCase->testImageFieldDefaultImage()
Trying to get property of non-objectNoticeimage.test880ImageFieldDisplayTestCase->testImageFieldDefaultImage()
Default image uses private:// scheme.Otherimage.test880ImageFieldDisplayTestCase->testImageFieldDefaultImage()
Trying to get property of non-objectNoticeimage.test881ImageFieldDisplayTestCase->testImageFieldDefaultImage()
The default image status is permanent.Otherimage.test881ImageFieldDisplayTestCase->testImageFieldDefaultImage()
Trying to get property of non-objectNoticeimage.test885ImageFieldDisplayTestCase->testImageFieldDefaultImage()
Default private image displayed when no user supplied image is present.Otherimage.test887ImageFieldDisplayTestCase->testImageFieldDefaultImage()
LeafImage field validation tests (ImageFieldValidateTestCase) [Image]2100
LeafImage GD manipulation tests (ImageToolkitGdTestCase) [Image]9600
LeafImage styles and effects UI configuration (ImageAdminStylesUnitTest) [Image]17600
LeafImage styles path and URL functions (ImageStylesPathAndUrlUnitTest) [Image]4700
LeafImage toolkit tests (ImageToolkitUnitTest) [Image]5300
Leafimage_dimensions_scale() (ImageDimensionsScaleTestCase) [Image]1500
ExpandImport feeds from OPML functionality (ImportOPMLTestCase) [Unknown]5410
MessageGroupFilenameLineFunctionStatus
Found OPML help text.Otheraggregator.test648ImportOPMLTestCase->openImportForm()
LeafIndex.php handling (SystemIndexPhpTest) [System]900
LeafInfo file format parser (InfoFileParserTestCase) [System]900
LeafInsert tests (DatabaseInsertTestCase) [Database]5100
LeafInsert tests, default fields (DatabaseInsertDefaultsTestCase) [Database]2200
LeafInsert tests, LOB fields (DatabaseInsertLOBTestCase) [Database]1500
LeafInvalid data (DatabaseInvalidDataTestCase) [Database]800
LeafIP address and HTTP_HOST test (BootstrapIPAddressTestCase) [Bootstrap]1100
LeafIP address blocking (IPAddressBlockingTestCase) [System]4200
LeafJavaScript (JavaScriptTestCase) [System]8400
LeafJavascript translation (LocaleJavascriptTranslationTest) [Locale]6600
LeafJSON (DrupalJSONTest) [System]2100
LeafKeywords and conditions (SearchKeywordsConditions) [Search]2800
ExpandLanguage configuration (LocaleConfigurationTest) [Locale]10910
MessageGroupFilenameLineFunctionStatus
Language added successfully.Otherlocale.test55LocaleConfigurationTest->testLanguageConfiguration()
LeafLanguage negotiation info (LocaleLanguageNegotiationInfoFunctionalTest) [Locale]4900
ExpandLanguage switching (LocaleLanguageSwitchingFunctionalTest) [Locale]12178
MessageGroupFilenameLineFunctionStatus
Invalid permission administer blocks.Rolelocale.test1340LocaleLanguageSwitchingFunctionalTest->setUp()
Argument 1 passed to DrupalWebTestCase::drupalLogin() must be an instance of stdClass, boolean given, called in /var/lib/drupaltestbot/sites/default/files/checkout/core/modules/locale/locale.test on line 1341 and definedRecoverable errordrupal_web_test_case.php1230DrupalWebTestCase->drupalLogin()
Trying to get property of non-objectNoticedrupal_web_test_case.php1236DrupalWebTestCase->drupalLogin()
Trying to get property of non-objectNoticedrupal_web_test_case.php1237DrupalWebTestCase->drupalLogin()
Failed to set field name to Otherlocale.test1341LocaleLanguageSwitchingFunctionalTest->setUp()
Failed to set field pass to Otherlocale.test1341LocaleLanguageSwitchingFunctionalTest->setUp()
Found the requested form fields at userOtherlocale.test1341LocaleLanguageSwitchingFunctionalTest->setUp()
Trying to get property of non-objectNoticedrupal_web_test_case.php1243DrupalWebTestCase->drupalLogin()
User successfully logged in.User loginlocale.test1341LocaleLanguageSwitchingFunctionalTest->setUp()
Failed to set field blocks[locale_language][region] to sidebar_firstOtherlocale.test1353LocaleLanguageSwitchingFunctionalTest->testLanguageBlock()
Found the Save blocks buttonOtherlocale.test1353LocaleLanguageSwitchingFunctionalTest->testLanguageBlock()
Found the requested form fields at admin/structure/blockOtherlocale.test1353LocaleLanguageSwitchingFunctionalTest->testLanguageBlock()
Failed to set field predefined_langcode to frOtherlocale.test1359LocaleLanguageSwitchingFunctionalTest->testLanguageBlock()
Found the Add language buttonOtherlocale.test1359LocaleLanguageSwitchingFunctionalTest->testLanguageBlock()
Found the requested form fields at admin/config/regional/language/addOtherlocale.test1359LocaleLanguageSwitchingFunctionalTest->testLanguageBlock()
Failed to set field language[enabled][locale-url] to 1Otherlocale.test1363LocaleLanguageSwitchingFunctionalTest->testLanguageBlock()
Found the Save settings buttonOtherlocale.test1363LocaleLanguageSwitchingFunctionalTest->testLanguageBlock()
Found the requested form fields at admin/config/regional/language/configureOtherlocale.test1363LocaleLanguageSwitchingFunctionalTest->testLanguageBlock()
Language switcher block found.Otherlocale.test1367LocaleLanguageSwitchingFunctionalTest->testLanguageBlock()
Undefined offset: 0Noticelocale.test1370LocaleLanguageSwitchingFunctionalTest->testLanguageBlock()
Trying to get property of non-objectNoticelocale.test1379LocaleLanguageSwitchingFunctionalTest->testLanguageBlock()
Trying to get property of non-objectNoticelocale.test1379LocaleLanguageSwitchingFunctionalTest->testLanguageBlock()
Invalid argument supplied for foreach()Warninglocale.test1379LocaleLanguageSwitchingFunctionalTest->testLanguageBlock()
Only the current language list item is marked as active on the language switcher block.Otherlocale.test1396LocaleLanguageSwitchingFunctionalTest->testLanguageBlock()
Only the current language anchor is marked as active on the language switcher block.Otherlocale.test1397LocaleLanguageSwitchingFunctionalTest->testLanguageBlock()
LeafLinks (ThemeLinksTest) [Theme]1700
LeafList field (ListFieldTestCase) [Field types]1600
LeafList field UI (ListFieldUITestCase) [Field types]26400
LeafLoad multiple nodes (NodeLoadMultipleUnitTest) [Node]3900
ExpandLocale uninstall (EN) (LocaleUninstallFunctionalTest) [Locale]3110
MessageGroupFilenameLineFunctionStatus
Multilingual workflow option: enabledOtherlocale.test1287LocaleUninstallFunctionalTest->testUninstallProcess()
ExpandLocale uninstall (FR) (LocaleUninstallFrenchFunctionalTest) [Locale]3110
MessageGroupFilenameLineFunctionStatus
Multilingual workflow option: enabledOtherlocale.test1287LocaleUninstallFunctionalTest->testUninstallProcess()
ExpandLocalize date formats (LocaleDateFormatsFunctionalTest) [Locale]18264
MessageGroupFilenameLineFunctionStatus
Invalid permission create article content.Rolelocale.test2653LocaleDateFormatsFunctionalTest->setUp()
Argument 1 passed to DrupalWebTestCase::drupalLogin() must be an instance of stdClass, boolean given, called in /var/lib/drupaltestbot/sites/default/files/checkout/core/modules/locale/locale.test on line 2654 and definedRecoverable errordrupal_web_test_case.php1230DrupalWebTestCase->drupalLogin()
Trying to get property of non-objectNoticedrupal_web_test_case.php1236DrupalWebTestCase->drupalLogin()
Trying to get property of non-objectNoticedrupal_web_test_case.php1237DrupalWebTestCase->drupalLogin()
Failed to set field name to Otherlocale.test2654LocaleDateFormatsFunctionalTest->setUp()
Failed to set field pass to Otherlocale.test2654LocaleDateFormatsFunctionalTest->setUp()
Found the requested form fields at userOtherlocale.test2654LocaleDateFormatsFunctionalTest->setUp()
Trying to get property of non-objectNoticedrupal_web_test_case.php1243DrupalWebTestCase->drupalLogin()
User successfully logged in.User loginlocale.test2654LocaleDateFormatsFunctionalTest->setUp()
Failed to set field predefined_langcode to frOtherlocale.test2665LocaleDateFormatsFunctionalTest->testLocalizeDateFormats()
Found the Add language buttonOtherlocale.test2665LocaleDateFormatsFunctionalTest->testLocalizeDateFormats()
Found the requested form fields at admin/config/regional/language/addOtherlocale.test2665LocaleDateFormatsFunctionalTest->testLocalizeDateFormats()
Failed to set field language[enabled][locale-url] to 1Otherlocale.test2672LocaleDateFormatsFunctionalTest->testLocalizeDateFormats()
Found the Save settings buttonOtherlocale.test2672LocaleDateFormatsFunctionalTest->testLocalizeDateFormats()
Found the requested form fields at admin/config/regional/language/configureOtherlocale.test2672LocaleDateFormatsFunctionalTest->testLocalizeDateFormats()
Configured languages appear.Otherlocale.test2676LocaleDateFormatsFunctionalTest->testLocalizeDateFormats()
Failed to set field date_format_long to d.m.Y - H:iOtherlocale.test2682LocaleDateFormatsFunctionalTest->testLocalizeDateFormats()
Failed to set field date_format_medium to d.m.Y - H:iOtherlocale.test2682LocaleDateFormatsFunctionalTest->testLocalizeDateFormats()
Failed to set field date_format_short to d.m.Y - H:iOtherlocale.test2682LocaleDateFormatsFunctionalTest->testLocalizeDateFormats()
Found the Save configuration buttonOtherlocale.test2682LocaleDateFormatsFunctionalTest->testLocalizeDateFormats()
Found the requested form fields at admin/config/regional/date-time/locale/fr/editOtherlocale.test2682LocaleDateFormatsFunctionalTest->testLocalizeDateFormats()
French date formats updated.Otherlocale.test2683LocaleDateFormatsFunctionalTest->testLocalizeDateFormats()
Failed to set field date_format_long to j M Y - g:iaOtherlocale.test2689LocaleDateFormatsFunctionalTest->testLocalizeDateFormats()
Failed to set field date_format_medium to j M Y - g:iaOtherlocale.test2689LocaleDateFormatsFunctionalTest->testLocalizeDateFormats()
Failed to set field date_format_short to j M Y - g:iaOtherlocale.test2689LocaleDateFormatsFunctionalTest->testLocalizeDateFormats()
Found the Save configuration buttonOtherlocale.test2689LocaleDateFormatsFunctionalTest->testLocalizeDateFormats()
Found the requested form fields at admin/config/regional/date-time/locale/en/editOtherlocale.test2689LocaleDateFormatsFunctionalTest->testLocalizeDateFormats()
English date formats updated.Otherlocale.test2690LocaleDateFormatsFunctionalTest->testLocalizeDateFormats()
English date format appearsOtherlocale.test2698LocaleDateFormatsFunctionalTest->testLocalizeDateFormats()
French date format appearsOtherlocale.test2701LocaleDateFormatsFunctionalTest->testLocalizeDateFormats()
LeafLocking framework tests (LockFunctionalTest) [System]1800
LeafMail system (MailTestCase) [System]400
ExpandMain content rendering fallback (SystemMainContentFallback) [System]43248
MessageGroupFilenameLineFunctionStatus
Invalid permission administer blocks.Rolesystem.test1535SystemMainContentFallback->setUp()
Argument 1 passed to DrupalWebTestCase::drupalLogin() must be an instance of stdClass, boolean given, called in /var/lib/drupaltestbot/sites/default/files/checkout/core/modules/system/system.test on line 1536 and definedRecoverable errordrupal_web_test_case.php1230DrupalWebTestCase->drupalLogin()
Trying to get property of non-objectNoticedrupal_web_test_case.php1236DrupalWebTestCase->drupalLogin()
Trying to get property of non-objectNoticedrupal_web_test_case.php1237DrupalWebTestCase->drupalLogin()
Failed to set field name to Othersystem.test1536SystemMainContentFallback->setUp()
Failed to set field pass to Othersystem.test1536SystemMainContentFallback->setUp()
Found the requested form fields at userOthersystem.test1536SystemMainContentFallback->setUp()
Trying to get property of non-objectNoticedrupal_web_test_case.php1243DrupalWebTestCase->drupalLogin()
User successfully logged in.User loginsystem.test1536SystemMainContentFallback->setUp()
Failed to set field modules[Core][dashboard][enable] to Othersystem.test1549SystemMainContentFallback->testMainContentFallback()
Found the Save configuration buttonOthersystem.test1549SystemMainContentFallback->testMainContentFallback()
Found the requested form fields at admin/modulesOthersystem.test1549SystemMainContentFallback->testMainContentFallback()
Modules status has been updated.Othersystem.test1550SystemMainContentFallback->testMainContentFallback()
Failed to set field modules[Core][dashboard][enable] to Othersystem.test1553SystemMainContentFallback->testMainContentFallback()
Failed to set field modules[Core][block][enable] to Othersystem.test1553SystemMainContentFallback->testMainContentFallback()
Found the Save configuration buttonOthersystem.test1553SystemMainContentFallback->testMainContentFallback()
Found the requested form fields at admin/modulesOthersystem.test1553SystemMainContentFallback->testMainContentFallback()
Modules status has been updated.Othersystem.test1554SystemMainContentFallback->testMainContentFallback()
Admin interface still available.Othersystem.test1560SystemMainContentFallback->testMainContentFallback()
Argument 1 passed to DrupalWebTestCase::drupalLogin() must be an instance of stdClass, boolean given, called in /var/lib/drupaltestbot/sites/default/files/checkout/core/modules/system/system.test on line 1584 and definedRecoverable errordrupal_web_test_case.php1230DrupalWebTestCase->drupalLogin()
Trying to get property of non-objectNoticedrupal_web_test_case.php1236DrupalWebTestCase->drupalLogin()
Trying to get property of non-objectNoticedrupal_web_test_case.php1237DrupalWebTestCase->drupalLogin()
Failed to set field name to Othersystem.test1584SystemMainContentFallback->testMainContentFallback()
Failed to set field pass to Othersystem.test1584SystemMainContentFallback->testMainContentFallback()
Found the requested form fields at userOthersystem.test1584SystemMainContentFallback->testMainContentFallback()
Trying to get property of non-objectNoticedrupal_web_test_case.php1243DrupalWebTestCase->drupalLogin()
User successfully logged in.User loginsystem.test1584SystemMainContentFallback->testMainContentFallback()
Failed to set field modules[Core][block][enable] to blockOthersystem.test1587SystemMainContentFallback->testMainContentFallback()
Found the Save configuration buttonOthersystem.test1587SystemMainContentFallback->testMainContentFallback()
Found the requested form fields at admin/modulesOthersystem.test1587SystemMainContentFallback->testMainContentFallback()
Modules status has been updated.Othersystem.test1588SystemMainContentFallback->testMainContentFallback()
Block module re-enabled.Othersystem.test1590SystemMainContentFallback->testMainContentFallback()
LeafManage display (FieldUIManageDisplayTestCase) [Field UI]11700
ExpandManage fields (FieldUIManageFieldsTestCase) [Field UI]193143
MessageGroupFilenameLineFunctionStatus
"Add existing field" was found.Otherfield_ui.test190FieldUIManageFieldsTestCase->manageFieldsPage()
Trying to get property of non-objectNoticefield_ui.test212FieldUIManageFieldsTestCase->createField()
Existing field was found in account settings.Otherfield_ui.test213FieldUIManageFieldsTestCase->createField()
"Add existing field" was found.Otherfield_ui.test190FieldUIManageFieldsTestCase->manageFieldsPage()
Trying to get property of non-objectNoticefield_ui.test212FieldUIManageFieldsTestCase->createField()
Existing field was found in account settings.Otherfield_ui.test213FieldUIManageFieldsTestCase->createField()
"Add existing field" was found.Otherfield_ui.test245FieldUIManageFieldsTestCase->addExistingField()
Failed to set field fields[_add_existing_field][label] to mL9BE8mb_2Otherfield_ui.test99FieldUITestCase->fieldUIAddExistingField()
Failed to set field fields[_add_existing_field][field_name] to field_d0jqs6a1Otherfield_ui.test99FieldUITestCase->fieldUIAddExistingField()
Failed to set field fields[_add_existing_field][widget_type] to test_field_widgetOtherfield_ui.test99FieldUITestCase->fieldUIAddExistingField()
Found the Save buttonOtherfield_ui.test99FieldUITestCase->fieldUIAddExistingField()
Found the requested form fields at admin/structure/types/manage/page/fieldsOtherfield_ui.test99FieldUITestCase->fieldUIAddExistingField()
Found the Save settings buttonOtherfield_ui.test102FieldUITestCase->fieldUIAddExistingField()
Found the requested form fields at Otherfield_ui.test102FieldUITestCase->fieldUIAddExistingField()
Redirected to "Manage fields" page.Otherfield_ui.test103FieldUITestCase->fieldUIAddExistingField()
Field was created and appears in the overview page.Otherfield_ui.test106FieldUITestCase->fieldUIAddExistingField()
Undefined index: gnsoscjg_testNoticefield_ui.module329_field_ui_bundle_admin_path()
LeafManaged file element test (FileManagedFileElementTestCase) [File]26500
LeafMenu link creation/deletion (MenuTestCase) [Menu]69000
LeafMenu links (MenuLinksUnitTestCase) [Menu]5000
LeafMenu rebuild test (MenuRebuildTestCase) [Menu]500
ExpandMenu router (MenuRouterTestCase) [Menu]23090
MessageGroupFilenameLineFunctionStatus
Raw text found on the pageOthermenu.test148MenuRouterTestCase->testTitleCallbackFalse()
The theme callback system falls back on the default theme when a theme that is not enabled is requested.Othermenu.test260MenuRouterTestCase->testThemeCallbackOptionalTheme()
The default theme's CSS appears on the page.Othermenu.test261MenuRouterTestCase->testThemeCallbackOptionalTheme()
Found menu link #1Othermenu.test343MenuRouterTestCase->testMenuLinkMaintain()
Found menu link #2Othermenu.test345MenuRouterTestCase->testMenuLinkMaintain()
Found menu link #2Othermenu.test354MenuRouterTestCase->testMenuLinkMaintain()
Found menu link #2Othermenu.test363MenuRouterTestCase->testMenuLinkMaintain()
Title attribute of a menu link renders.Othermenu.test550MenuRouterTestCase->testMenuLinkOptions()
Query parameter added to menu link.Othermenu.test551MenuRouterTestCase->testMenuLinkOptions()
LeafMenu settings for nodes (MenuNodeTestCase) [Menu]6000
LeafMenu tree generation (MenuTreeDataTestCase) [Menu]400
LeafMenu tree output (MenuTreeOutputTestCase) [Menu]700
LeafMerge tests (DatabaseMergeTestCase) [Database]8300
LeafMiscellaneous AJAX tests (AJAXElementValidation) [AJAX]700
LeafMiscellaneous bootstrap unit tests (BootstrapMiscTestCase) [Bootstrap]100
LeafMissing update dependencies (UpdateDependencyMissingTestCase) [Update API]400
ExpandModule API (ModuleUnitTest) [Module]92120
MessageGroupFilenameLineFunctionStatus
Standard profile: module_list() returns correct resultsOthermodule.test36ModuleUnitTest->testModuleList()
Standard profile: module_list() returns correctly sorted resultsOthermodule.test36ModuleUnitTest->testModuleList()
After adding a module: module_list() returns correct resultsOthermodule.test42ModuleUnitTest->testModuleList()
After adding a module: module_list() returns correctly sorted resultsOthermodule.test42ModuleUnitTest->testModuleList()
After changing weights: module_list() returns correct resultsOthermodule.test55ModuleUnitTest->testModuleList()
After changing weights: module_list() returns correctly sorted resultsOthermodule.test55ModuleUnitTest->testModuleList()
After reset: module_list() returns correct resultsOthermodule.test68ModuleUnitTest->testModuleList()
After reset: module_list() returns correctly sorted resultsOthermodule.test68ModuleUnitTest->testModuleList()
Modules were enabled in the correct order by module_enable().Othermodule.test165ModuleUnitTest->testDependencyResolution()
Comment module is listed as a dependency of the install profile.Othermodule.test179ModuleUnitTest->testDependencyResolution()
Modules were enabled in the correct order by module_enable().Othermodule.test165ModuleUnitTest->testDependencyResolution()
Comment module is listed as a dependency of the install profile.Othermodule.test179ModuleUnitTest->testDependencyResolution()
ExpandModule dependencies (ModuleDependencyTestCase) [Module]155232
MessageGroupFilenameLineFunctionStatus
Modules status has been updated.Othersystem.test465ModuleDependencyTestCase->testEnableRequirementsFailureDependency()
Module "comment" is enabled.Othersystem.test471ModuleDependencyTestCase->testEnableRequirementsFailureDependency()
Modules status has been updated.Othersystem.test465ModuleDependencyTestCase->testEnableRequirementsFailureDependency()
Module "comment" is enabled.Othersystem.test471ModuleDependencyTestCase->testEnableRequirementsFailureDependency()
Dependency chain created.Othersystem.test494ModuleDependencyTestCase->testModuleEnableOrder()
Module "forum" is enabled.Othersystem.test498ModuleDependencyTestCase->testModuleEnableOrder()
Module "poll" is enabled.Othersystem.test498ModuleDependencyTestCase->testModuleEnableOrder()
Module "php" is enabled.Othersystem.test498ModuleDependencyTestCase->testModuleEnableOrder()
Modules enabled in the correct order.Othersystem.test501ModuleDependencyTestCase->testModuleEnableOrder()
Module "forum" is enabled.Othersystem.test511ModuleDependencyTestCase->testUninstallDependents()
Checkbox for uninstalling the comment module is disabled.Othersystem.test524ModuleDependencyTestCase->testUninstallDependents()
Failed to set field uninstall[forum] to forumOthersystem.test529ModuleDependencyTestCase->testUninstallDependents()
Found the Uninstall buttonOthersystem.test529ModuleDependencyTestCase->testUninstallDependents()
Found the requested form fields at admin/modules/uninstallOthersystem.test529ModuleDependencyTestCase->testUninstallDependents()
Invalid argument supplied for foreach()Warningdrupal_web_test_case.php1952DrupalWebTestCase->drupalPost()
Found the Uninstall buttonOthersystem.test530ModuleDependencyTestCase->testUninstallDependents()
Found the requested form fields at Othersystem.test530ModuleDependencyTestCase->testUninstallDependents()
Modules status has been updated.Othersystem.test531ModuleDependencyTestCase->testUninstallDependents()
Failed to set field uninstall[comment] to commentOthersystem.test533ModuleDependencyTestCase->testUninstallDependents()
Found the Uninstall buttonOthersystem.test533ModuleDependencyTestCase->testUninstallDependents()
Found the requested form fields at admin/modules/uninstallOthersystem.test533ModuleDependencyTestCase->testUninstallDependents()
Invalid argument supplied for foreach()Warningdrupal_web_test_case.php1952DrupalWebTestCase->drupalPost()
Found the Uninstall buttonOthersystem.test534ModuleDependencyTestCase->testUninstallDependents()
Found the requested form fields at Othersystem.test534ModuleDependencyTestCase->testUninstallDependents()
Modules status has been updated.Othersystem.test535ModuleDependencyTestCase->testUninstallDependents()
LeafModule installation (ModuleInstallTestCase) [Module]300
LeafModule uninstallation (ModuleUninstallTestCase) [Module]200
LeafModule versions (ModuleVersionTestCase) [Module]5100
ExpandMultilingual fields (LocaleMultilingualFieldsFunctionalTest) [Locale]8145
MessageGroupFilenameLineFunctionStatus
The test did not complete due to a fatal error.Completion checklocale.test2466LocaleMultilingualFieldsFunctionalTest->testMultilingualNodeForm()
Invalid permission create page content.Rolelocale.test2435LocaleMultilingualFieldsFunctionalTest->setUp()
Invalid permission edit own page content.Rolelocale.test2435LocaleMultilingualFieldsFunctionalTest->setUp()
Argument 1 passed to DrupalWebTestCase::drupalLogin() must be an instance of stdClass, boolean given, called in /var/lib/drupaltestbot/sites/default/files/checkout/core/modules/locale/locale.test on line 2436 and definedRecoverable errordrupal_web_test_case.php1230DrupalWebTestCase->drupalLogin()
Trying to get property of non-objectNoticedrupal_web_test_case.php1236DrupalWebTestCase->drupalLogin()
Trying to get property of non-objectNoticedrupal_web_test_case.php1237DrupalWebTestCase->drupalLogin()
Failed to set field name to Otherlocale.test2436LocaleMultilingualFieldsFunctionalTest->setUp()
Failed to set field pass to Otherlocale.test2436LocaleMultilingualFieldsFunctionalTest->setUp()
Found the requested form fields at userOtherlocale.test2436LocaleMultilingualFieldsFunctionalTest->setUp()
Trying to get property of non-objectNoticedrupal_web_test_case.php1243DrupalWebTestCase->drupalLogin()
User successfully logged in.User loginlocale.test2436LocaleMultilingualFieldsFunctionalTest->setUp()
Failed to set field language[enabled][locale-url] to 1Otherlocale.test2448LocaleMultilingualFieldsFunctionalTest->setUp()
Found the Save settings buttonOtherlocale.test2448LocaleMultilingualFieldsFunctionalTest->setUp()
Found the requested form fields at admin/config/regional/language/configureOtherlocale.test2448LocaleMultilingualFieldsFunctionalTest->setUp()
Failed to set field language_content_type to 1Otherlocale.test2454LocaleMultilingualFieldsFunctionalTest->setUp()
Found the Save content type buttonOtherlocale.test2454LocaleMultilingualFieldsFunctionalTest->setUp()
Found the requested form fields at admin/structure/types/manage/pageOtherlocale.test2454LocaleMultilingualFieldsFunctionalTest->setUp()
Basic page content type has been updated.Otherlocale.test2455LocaleMultilingualFieldsFunctionalTest->setUp()
Undefined index: field_nameNoticefield.crud.inc221field_update_field()
LeafMultistep form using form storage (FormsFormStorageTestCase) [Form API]12000
LeafMultistep node form basic options (MultiStepNodeFormBasicOptionsTest) [Node]1600
LeafNew default theme blocks (NewDefaultThemeBlocks) [Block]2200
LeafNo help (NoHelpTestCase) [Help]1200
LeafNode access (NodeAccessUnitTest) [Node]6700
LeafNode Access on any table (NodeAccessBaseTableTestCase) [Node]23300
LeafNode access rebuild (NodeAccessRebuildTestCase) [Node]1900
LeafNode access records (NodeAccessRecordsUnitTest) [Node]2600
LeafNode administration (NodeAdminTestCase) [Node]17500
LeafNode blocks (NodeBlockFunctionalTest) [Node]9400
LeafNode creation (NodeCreationTestCase) [Node]3100
LeafNode edit (PageEditTestCase) [Node]9900
LeafNode edit permissions (PageViewTestCase) [Node]3500
LeafNode entity query alter (NodeEntityFieldQueryAlter) [Node]3300
LeafNode feed (NodeFeedTestCase) [Node]100
LeafNode load hooks (NodeLoadHooksTestCase) [Node]700
LeafNode post information display (NodePostSettingsTestCase) [Node]4000
LeafNode preview (PagePreviewTestCase) [Node]4100
LeafNode query alter (NodeQueryAlter) [Node]9400
LeafNode revisions (NodeRevisionsTestCase) [Node]5000
LeafNode RSS Content (NodeRSSContentTestCase) [Node]1900
LeafNode save (NodeSaveTestCase) [Node]4800
LeafNode title (NodeTitleTestCase) [Node]2300
LeafNode title XSS filtering (NodeTitleXSSTestCase) [Node]2300
LeafNode token replacement (NodeTokenReplaceTestCase) [Node]3700
LeafNode type persist (NodeTypePersistenceTestCase) [Node]6500
LeafNode types (NodeTypeTestCase) [Node]11700
LeafNon default theme admin (NonDefaultBlockAdmin) [Block]1100
ExpandNumber field (NumberFieldTestCase) [Field types]22141
MessageGroupFilenameLineFunctionStatus
FieldException: Attempt to create a field of unknown type <em class="placeholder">number_decimal</em>. in field_create_field() (line 109 of /var/lib/drupaltestbot/sites/default/files/checkout/core/modules/field/field.crud.inc).Uncaught exceptionfield.crud.inc109field_create_field()
Found the Save and add fields buttonOthernumber.test108NumberFieldTestCase->testNumberIntegerField()
Found the requested form fields at Othernumber.test108NumberFieldTestCase->testNumberIntegerField()
Failed to set field fields[_add_new_field][label] to jneagRaMOthernumber.test119NumberFieldTestCase->testNumberIntegerField()
Failed to set field fields[_add_new_field][field_name] to jneagramOthernumber.test119NumberFieldTestCase->testNumberIntegerField()
Failed to set field fields[_add_new_field][type] to number_integerOthernumber.test119NumberFieldTestCase->testNumberIntegerField()
Failed to set field fields[_add_new_field][widget_type] to numberOthernumber.test119NumberFieldTestCase->testNumberIntegerField()
Found the Save buttonOthernumber.test119NumberFieldTestCase->testNumberIntegerField()
Found the requested form fields at Othernumber.test119NumberFieldTestCase->testNumberIntegerField()
Failed to set field fields[field_jneagram][type] to number_integerOthernumber.test127NumberFieldTestCase->testNumberIntegerField()
Found the Save buttonOthernumber.test127NumberFieldTestCase->testNumberIntegerField()
Found the requested form fields at Othernumber.test127NumberFieldTestCase->testNumberIntegerField()
Failed to set field fields[field_jneagram][type] to number_unformattedOthernumber.test131NumberFieldTestCase->testNumberIntegerField()
Found the Save buttonOthernumber.test131NumberFieldTestCase->testNumberIntegerField()
Found the requested form fields at Othernumber.test131NumberFieldTestCase->testNumberIntegerField()
LeafOpenID account registration (OpenIDRegistrationTestCase) [OpenID]14400
LeafOpenID discovery and login (OpenIDFunctionalTestCase) [OpenID]27500
LeafOpenID helper functions (OpenIDUnitTest) [OpenID]3800
ExpandOptions widgets (OptionsWidgetsTestCase) [Field types]32680
MessageGroupFilenameLineFunctionStatus
Display setting checkbox available.Otheroptions.test487OptionsWidgetsTestCase->testOnOffCheckbox()
Default case shows "On value"Otheroptions.test493OptionsWidgetsTestCase->testOnOffCheckbox()
Failed to set field instance[widget][settings][display_label] to 1Otheroptions.test498OptionsWidgetsTestCase->testOnOffCheckbox()
Found the Save settings buttonOtheroptions.test498OptionsWidgetsTestCase->testOnOffCheckbox()
Found the requested form fields at admin/structure/types/manage/page/fields/boolOtheroptions.test498OptionsWidgetsTestCase->testOnOffCheckbox()
Display setting checkbox is availableOtheroptions.test506OptionsWidgetsTestCase->testOnOffCheckbox()
Display settings checkbox checkedBrowseroptions.test510OptionsWidgetsTestCase->testOnOffCheckbox()
Display label changes label of the checkboxOtheroptions.test515OptionsWidgetsTestCase->testOnOffCheckbox()
LeafOverriding server variables (BootstrapOverrideServerVariablesTestCase) [Bootstrap]600
LeafPage cache test (BootstrapPageCacheTestCase) [Bootstrap]7700
LeafPager query tests (DatabaseSelectPagerDefaultTestCase) [Database]4700
LeafParsing .info files (ParseInfoFilesTestCase) [System]300
LeafPassword hashing (PasswordHashingTest) [System]1000
LeafPath alias functionality (PathAliasTestCase) [Path]11100
LeafPath aliases with languages (PathLanguageUITestCase) [Path]7800
LeafPath aliases with translated nodes (PathLanguageTestCase) [Path]6600
LeafPath language settings (LocalePathFunctionalTest) [Locale]5500
LeafPath lookup (PathLookupTest) [Path API]1300
LeafPaths on non-English monolingual sites (PathMonolingualTestCase) [Path]3700
LeafPersonal contact form (ContactPersonalTestCase) [Contact]13600
ExpandPHP filter access check (PHPAccessTestCase) [PHP]3274
MessageGroupFilenameLineFunctionStatus
Invalid permission create page content.Rolephp.test108PHPAccessTestCase->testNoPrivileges()
Invalid permission edit own page content.Rolephp.test108PHPAccessTestCase->testNoPrivileges()
Argument 1 passed to DrupalWebTestCase::drupalLogin() must be an instance of stdClass, boolean given, called in /var/lib/drupaltestbot/sites/default/files/checkout/core/modules/php/php.test on line 109 and definedRecoverable errordrupal_web_test_case.php1230DrupalWebTestCase->drupalLogin()
Trying to get property of non-objectNoticedrupal_web_test_case.php1236DrupalWebTestCase->drupalLogin()
Trying to get property of non-objectNoticedrupal_web_test_case.php1237DrupalWebTestCase->drupalLogin()
Failed to set field name to Otherphp.test109PHPAccessTestCase->testNoPrivileges()
Failed to set field pass to Otherphp.test109PHPAccessTestCase->testNoPrivileges()
Found the requested form fields at userOtherphp.test109PHPAccessTestCase->testNoPrivileges()
Trying to get property of non-objectNoticedrupal_web_test_case.php1243DrupalWebTestCase->drupalLogin()
User successfully logged in.User loginphp.test109PHPAccessTestCase->testNoPrivileges()
PHP code was not evaluated.Otherphp.test114PHPAccessTestCase->testNoPrivileges()
ExpandPHP filter functionality (PHPFilterTestCase) [PHP]32124
MessageGroupFilenameLineFunctionStatus
Invalid permission create page content.Rolephp.test68PHPFilterTestCase->testPHPFilter()
Invalid permission edit own page content.Rolephp.test68PHPFilterTestCase->testPHPFilter()
Argument 1 passed to DrupalWebTestCase::drupalLogin() must be an instance of stdClass, boolean given, called in /var/lib/drupaltestbot/sites/default/files/checkout/core/modules/php/php.test on line 69 and definedRecoverable errordrupal_web_test_case.php1230DrupalWebTestCase->drupalLogin()
Trying to get property of non-objectNoticedrupal_web_test_case.php1236DrupalWebTestCase->drupalLogin()
Trying to get property of non-objectNoticedrupal_web_test_case.php1237DrupalWebTestCase->drupalLogin()
Failed to set field name to Otherphp.test69PHPFilterTestCase->testPHPFilter()
Failed to set field pass to Otherphp.test69PHPFilterTestCase->testPHPFilter()
Found the requested form fields at userOtherphp.test69PHPFilterTestCase->testPHPFilter()
Trying to get property of non-objectNoticedrupal_web_test_case.php1243DrupalWebTestCase->drupalLogin()
User successfully logged in.User loginphp.test69PHPFilterTestCase->testPHPFilter()
PHP code is displayed.Otherphp.test76PHPFilterTestCase->testPHPFilter()
Failed to set field body[und][0][format] to php_codeOtherphp.test82PHPFilterTestCase->testPHPFilter()
Found the Save buttonOtherphp.test82PHPFilterTestCase->testPHPFilter()
Found the requested form fields at node/1/editOtherphp.test82PHPFilterTestCase->testPHPFilter()
PHP code filter turned on.Otherphp.test83PHPFilterTestCase->testPHPFilter()
PHP code has been evaluated.Otherphp.test87PHPFilterTestCase->testPHPFilter()
LeafPoll add choice (PollJSAddChoice) [Poll]1600
LeafPoll choice deletion (PollDeleteChoiceTestCase) [Poll]3500
LeafPoll create (PollCreateTestCase) [Poll]23200
LeafPoll expiration (PollExpirationTestCase) [Poll]3300
LeafPoll token replacement (PollTokenReplaceTestCase) [Poll]11100
LeafPoll vote (PollVoteTestCase) [Poll]12900
LeafPrivate file test (FilePrivateTestCase) [File]2500
LeafProgrammatic form submissions (FormsProgrammaticTestCase) [Form API]2400
LeafQuery altering tests (DatabaseAlterTestCase) [Database]6200
LeafQuery logging (DatabaseLoggingTestCase) [Database]4300
LeafQuery tagging tests (DatabaseTaggingTestCase) [Database]3200
LeafQueue functionality (QueueTestCase) [System]700
LeafRange query test (DatabaseRangeQueryTestCase) [Database]300
LeafRDF comment mapping (RdfCommentAttributesTestCase) [RDF]27300
LeafRDF mapping CRUD functions (RdfCrudTestCase) [RDF]1000
LeafRDF mapping definition functionality (RdfMappingDefinitionTestCase) [RDF]6100
LeafRDF mapping hook (RdfMappingHookTestCase) [RDF]600
LeafRDF namespaces (RdfGetRdfNamespacesTestCase) [RDF]500
LeafRDF namespaces serialization test (DrupalGetRdfNamespacesTestCase) [RDF]700
LeafRDF tracker page mapping (RdfTrackerAttributesTestCase) [RDF]3300
LeafRDFa markup (RdfRdfaMarkupTestCase) [RDF]2900
LeafRebuild arbitrary forms (FormsArbitraryRebuildTestCase) [Form API]1600
LeafRebuild content (NodeBuildContent) [Node]400
LeafRegistry parse file test (RegistryParseFileTestCase) [System]200
LeafRegistry parse files test (RegistryParseFilesTestCase) [System]600
LeafRegression tests (DatabaseRegressionTestCase) [Database]3100
LeafRemove feed functionality (RemoveFeedTestCase) [Unknown]2500
LeafRemove feed item functionality (RemoveFeedItemTestCase) [Unknown]19800
LeafRequired modules (ModuleRequiredTestCase) [Module]2000
LeafRequirements hook failure (HookRequirementsTestCase) [Module]1600
LeafResettable static variables test (BootstrapResettableStaticTestCase) [Bootstrap]500
LeafRole assignment (UserRolesAssignmentTestCase) [User]5100
LeafRole permissions (UserPermissionsTestCase) [User]5000
LeafSchema API (SchemaTestCase) [Database]58800
LeafSearch and node access (SearchNodeAccessTest) [Search]1600
LeafSearch engine phrase queries (SearchExactTestCase) [Search]2500
LeafSearch engine queries (SearchMatchTestCase) [Search]14700
LeafSearch engine ranking (SearchRankingTestCase) [Search]6900
LeafSearch excerpt extraction (SearchExcerptTestCase) [Search]1100
LeafSearch expression insert/extract (SearchExpressionInsertExtractTestCase) [Search]2400
ExpandSearch language selection (SearchLanguageTestCase) [Search]4710
MessageGroupFilenameLineFunctionStatus
Language added successfully.Othersearch.test1940SearchLanguageTestCase->testLanguages()
LeafSearch number matching (SearchNumberMatchingTestCase) [Search]29500
LeafSearch numbers (SearchNumbersTestCase) [Search]17500
LeafSearch page override (SearchPageOverride) [Search]1500
LeafSearch page text (SearchPageText) [Search]3700
LeafSearch simplify (SearchSimplifyTestCase) [Search]65700
ExpandSecurity (FilterSecurityTestCase) [Filter]2340
MessageGroupFilenameLineFunctionStatus
Node body found.Otherfilter.test760FilterSecurityTestCase->testDisableFilterModule()
Testing filter output found.Otherfilter.test771FilterSecurityTestCase->testDisableFilterModule()
Found the Disable buttonOtherfilter.test774FilterSecurityTestCase->testDisableFilterModule()
Found the requested form fields at admin/config/content/formats/plain_text/disableOtherfilter.test774FilterSecurityTestCase->testDisableFilterModule()
LeafSelect tests (DatabaseSelectTestCase) [Database]14600
LeafSelect tests, complex (DatabaseSelectComplexTestCase) [Database]14300
LeafSelect tests, complex 2 (DatabaseSelectComplexTestCase2) [Database]1500
LeafSelect tests, ordered (DatabaseSelectOrderedTestCase) [Database]2900
LeafSelect tests, subqueries (DatabaseSelectSubqueryTestCase) [Database]4300
LeafSequences API (DatabaseNextIdCase) [Database]200
LeafSerialize query (DatabaseSerializeQueryTestCase) [Database]700
LeafSession https handling (SessionHttpsTestCase) [Session]8300
LeafSession tests (SessionTestCase) [Session]19200
ExpandShortcut link functionality (ShortcutLinksTestCase) [Shortcut]14010
MessageGroupFilenameLineFunctionStatus
"Add to shortcuts" link properly switched to "Remove from shortcuts".Othershortcut.test161ShortcutLinksTestCase->testShortcutQuickLink()
LeafShortcut set functionality (ShortcutSetsTestCase) [Shortcut]19800
LeafShutdown functions (ShutdownFunctionsTest) [System]500
LeafSimpleTest browser (SimpleTestBrowserTestCase) [SimpleTest]1600
LeafSimpleTest e-mail capturing (SimpleTestMailCaptureTestCase) [SimpleTest]1300
LeafSimpleTest error collector (DrupalErrorCollectionUnitTest) [SimpleTest]1600
LeafSimpleTest functionality (SimpleTestFunctionalTest) [SimpleTest]11600
LeafSite maintenance mode functionality (SiteMaintenanceTestCase) [System]8000
LeafSite-wide contact form (ContactSitewideTestCase) [Contact]23900
LeafSize parsing test (CommonSizeTestCase) [System]3500
LeafStatistics logging tests (StatisticsLoggingTestCase) [Statistics]3500
LeafStatistics reports tests (StatisticsReportsTestCase) [Statistics]9200
LeafStatistics token replacement (StatisticsTokenReplaceTestCase) [Statistics]3100
LeafStream wrappers (StreamWrapperTest) [File API]1900
LeafString filtering tests (CommonXssUnitTest) [System]1700
LeafString translate, search and validate (LocaleTranslationFunctionalTest) [Locale]29200
LeafString translation using st() (LocaleInstallTest) [Locale]200
LeafSummary length (SummaryLengthTestCase) [Node]1800
LeafSyslog functionality (SyslogTestCase) [Syslog]1700
LeafSystem info alter (SystemInfoAlterTestCase) [System]1000
LeafTableselect form element type test (FormsElementsTableSelectFunctionalTest) [Form API]6000
LeafTablesort (TableSortTest) [System]600
LeafTablesort query tests (DatabaseSelectTableSortDefaultTestCase) [Database]4400
ExpandTaxonomy term functions and forms. (TaxonomyTermTestCase) [Taxonomy]1831922
MessageGroupFilenameLineFunctionStatus
Failed to set field taxonomy_pbo7yer7[und] to pN44nmsA, "evglZjWJ, xxdtaUQb", ohiB2DwxOthertaxonomy.test610TaxonomyTermTestCase->testNodeTermCreationAndDeletion()
Found the requested form fields at node/add/pageOthertaxonomy.test610TaxonomyTermTestCase->testNodeTermCreationAndDeletion()
The term appears on the node previewOthertaxonomy.test612TaxonomyTermTestCase->testNodeTermCreationAndDeletion()
The term appears on the node previewOthertaxonomy.test612TaxonomyTermTestCase->testNodeTermCreationAndDeletion()
The term appears on the node previewOthertaxonomy.test612TaxonomyTermTestCase->testNodeTermCreationAndDeletion()
Failed to set field taxonomy_pbo7yer7[und] to pN44nmsA, "evglZjWJ, xxdtaUQb", ohiB2DwxOthertaxonomy.test621TaxonomyTermTestCase->testNodeTermCreationAndDeletion()
Found the requested form fields at node/add/pageOthertaxonomy.test621TaxonomyTermTestCase->testNodeTermCreationAndDeletion()
The node was created successfullyOthertaxonomy.test622TaxonomyTermTestCase->testNodeTermCreationAndDeletion()
The term was saved and appears on the node pageOthertaxonomy.test624TaxonomyTermTestCase->testNodeTermCreationAndDeletion()
The term was saved and appears on the node pageOthertaxonomy.test624TaxonomyTermTestCase->testNodeTermCreationAndDeletion()
The term was saved and appears on the node pageOthertaxonomy.test624TaxonomyTermTestCase->testNodeTermCreationAndDeletion()
Undefined offset: 2Noticetaxonomy.test628TaxonomyTermTestCase->testNodeTermCreationAndDeletion()
Undefined offset: 1Noticetaxonomy.test628TaxonomyTermTestCase->testNodeTermCreationAndDeletion()
Undefined offset: 0Noticetaxonomy.test628TaxonomyTermTestCase->testNodeTermCreationAndDeletion()
Trying to get property of non-objectNoticetaxonomy.test631TaxonomyTermTestCase->testNodeTermCreationAndDeletion()
Found the Delete buttonOthertaxonomy.test631TaxonomyTermTestCase->testNodeTermCreationAndDeletion()
Found the requested form fields at taxonomy/term//editOthertaxonomy.test631TaxonomyTermTestCase->testNodeTermCreationAndDeletion()
Invalid argument supplied for foreach()Warningdrupal_web_test_case.php1952DrupalWebTestCase->drupalPost()
Found the Delete buttonOthertaxonomy.test632TaxonomyTermTestCase->testNodeTermCreationAndDeletion()
Found the requested form fields at Othertaxonomy.test632TaxonomyTermTestCase->testNodeTermCreationAndDeletion()
Trying to get property of non-objectNoticetaxonomy.test633TaxonomyTermTestCase->testNodeTermCreationAndDeletion()
Trying to get property of non-objectNoticetaxonomy.test633TaxonomyTermTestCase->testNodeTermCreationAndDeletion()
Trying to get property of non-objectNoticetaxonomy.test637TaxonomyTermTestCase->testNodeTermCreationAndDeletion()
Trying to get property of non-objectNoticetaxonomy.test640TaxonomyTermTestCase->testNodeTermCreationAndDeletion()
The term appears on the node page after one term was deletedOthertaxonomy.test640TaxonomyTermTestCase->testNodeTermCreationAndDeletion()
Trying to get property of non-objectNoticetaxonomy.test640TaxonomyTermTestCase->testNodeTermCreationAndDeletion()
The term appears on the node page after one term was deletedOthertaxonomy.test640TaxonomyTermTestCase->testNodeTermCreationAndDeletion()
Trying to get property of non-objectNoticetaxonomy.test642TaxonomyTermTestCase->testNodeTermCreationAndDeletion()
Trying to get property of non-objectNoticetaxonomy.test642TaxonomyTermTestCase->testNodeTermCreationAndDeletion()
Trying to get property of non-objectNoticetaxonomy.test646TaxonomyTermTestCase->testNodeTermCreationAndDeletion()
Undefined variable: term_matchesNoticetaxonomy.pages.inc157taxonomy_autocomplete()
Trying to get property of non-objectNoticetaxonomy.test648TaxonomyTermTestCase->testNodeTermCreationAndDeletion()
Trying to get property of non-objectNoticetaxonomy.test648TaxonomyTermTestCase->testNodeTermCreationAndDeletion()
Trying to get property of non-objectNoticetaxonomy.test648TaxonomyTermTestCase->testNodeTermCreationAndDeletion()
Autocomplete returns term after typing the first 3 letters.Othertaxonomy.test648TaxonomyTermTestCase->testNodeTermCreationAndDeletion()
Trying to get property of non-objectNoticetaxonomy.test652TaxonomyTermTestCase->testNodeTermCreationAndDeletion()
Undefined variable: term_matchesNoticetaxonomy.pages.inc157taxonomy_autocomplete()
Trying to get property of non-objectNoticetaxonomy.test654TaxonomyTermTestCase->testNodeTermCreationAndDeletion()
Trying to get property of non-objectNoticetaxonomy.test654TaxonomyTermTestCase->testNodeTermCreationAndDeletion()
Trying to get property of non-objectNoticetaxonomy.test654TaxonomyTermTestCase->testNodeTermCreationAndDeletion()
Autocomplete returns term after typing the first 3 letters.Othertaxonomy.test654TaxonomyTermTestCase->testNodeTermCreationAndDeletion()
LeafTaxonomy term hooks (TaxonomyHooksTestCase) [Taxonomy]4200
LeafTaxonomy term index (TaxonomyTermIndexTestCase) [Taxonomy]3300
LeafTaxonomy term multiple loading (TaxonomyLoadMultipleUnitTest) [Taxonomy]2000
LeafTaxonomy term reference field (TaxonomyTermFieldTestCase) [Taxonomy]4200
LeafTaxonomy term unit tests (TaxonomyTermUnitTest) [Taxonomy]300
ExpandTaxonomy term URL aliases (PathTaxonomyTermTestCase) [Path]29131
MessageGroupFilenameLineFunctionStatus
Trying to get property of non-objectNoticepath.test216PathTaxonomyTermTestCase->testTermAlias()
Failed to set field name to prMXtiaFOtherpath.test216PathTaxonomyTermTestCase->testTermAlias()
Failed to set field description[value] to mimwsAyYOtherpath.test216PathTaxonomyTermTestCase->testTermAlias()
Failed to set field path[alias] to nDh4FV9cOtherpath.test216PathTaxonomyTermTestCase->testTermAlias()
Found the Save buttonOtherpath.test216PathTaxonomyTermTestCase->testTermAlias()
Found the requested form fields at admin/structure/taxonomy//addOtherpath.test216PathTaxonomyTermTestCase->testTermAlias()
Term can be accessed on URL alias.Otherpath.test220PathTaxonomyTermTestCase->testTermAlias()
Failed to set field path[alias] to atKSzjdWOtherpath.test226PathTaxonomyTermTestCase->testTermAlias()
Found the Save buttonOtherpath.test226PathTaxonomyTermTestCase->testTermAlias()
Found the requested form fields at taxonomy/term//editOtherpath.test226PathTaxonomyTermTestCase->testTermAlias()
Term can be accessed on changed URL alias.Otherpath.test230PathTaxonomyTermTestCase->testTermAlias()
Failed to set field path[alias] to Otherpath.test240PathTaxonomyTermTestCase->testTermAlias()
Found the Save buttonOtherpath.test240PathTaxonomyTermTestCase->testTermAlias()
Found the requested form fields at taxonomy/term//editOtherpath.test240PathTaxonomyTermTestCase->testTermAlias()
LeafTaxonomy theme switching (TaxonomyThemeTestCase) [Taxonomy]1900
LeafTaxonomy token replacement (TaxonomyTokenReplaceTestCase) [Taxonomy]5500
LeafTaxonomy vocabularies (TaxonomyVocabularyUnitTest) [Taxonomy]8100
LeafTaxonomy vocabulary interface (TaxonomyVocabularyFunctionalTest) [Taxonomy]10400
LeafTemporary query test (DatabaseTemporaryQueryTestCase) [Database]600
LeafTest for legacy node bug. (TaxonomyLegacyTestCase) [Taxonomy]1400
LeafTest statistics admin. (StatisticsAdminTestCase) [Statistics]11200
LeafTest user actions (TriggerUserActionTestCase) [Trigger]6800
LeafTest user triggers (TriggerUserTokenTestCase) [Trigger]18800
LeafTesting SimpleTest setUp (SimpleTestFolderTestCase) [SimpleTest]200
LeafText field (TextFieldTestCase) [Field types]31700
LeafText summary (TextSummaryTestCase) [Field types]13800
LeafText translation (TextTranslationTestCase) [Field types]10700
LeafTheme API (ThemeUnitTest) [Theme]2600
LeafTheme fast initialization (ThemeFastTestCase) [Theme]1100
LeafTheme functions (ThemeFunctionsTestCase) [Theme]300
LeafTheme HTML Tag (ThemeHtmlTag) [Theme]200
ExpandTheme initialization in hook_init() (ThemeHookInitUnitTest) [Theme]410
MessageGroupFilenameLineFunctionStatus
The default theme's CSS appears on the page when the theme system is initialized in hook_init().Othertheme.test405ThemeHookInitUnitTest->testThemeInitializationHookInit()
LeafTheme interface functionality (SystemThemeFunctionalTest) [System]11700
LeafTheme Table (ThemeTableUnitTest) [Theme]600
LeafTimer test (BootstrapTimerTestCase) [Bootstrap]500
LeafToken replacement (TokenReplaceTestCase) [System]5800
LeafTop visitor blocking (StatisticsBlockVisitorsTestCase) [Statistics]4700
LeafTracker (TrackerTest) [Tracker]23400
LeafTransaction tests (DatabaseTransactionTestCase) [Database]5600
LeafTranslation export (LocaleExportFunctionalTest) [Locale]3100
LeafTranslation functionality (TranslationTestCase) [Translation]56000
LeafTranslation import (LocaleImportFunctionalTest) [Locale]11500
LeafTrigger content (node) actions (TriggerContentTestCase) [Trigger]35900
LeafTrigger cron (system) actions (TriggerCronTestCase) [Trigger]3600
LeafTrigger orphaned actions (TriggerOrphanedActionsTestCase) [Trigger]4000
LeafTrigger other actions (TriggerOtherTestCase) [Trigger]12100
ExpandUI language negotiation (LocaleUILanguageNegotiationTest) [Locale]8111
MessageGroupFilenameLineFunctionStatus
Undefined offset: 0Noticelocale.test2331LocaleUILanguageNegotiationTest->testUrlLanguageFallback()
URLs are rewritten using the browser language.Otherlocale.test2331LocaleUILanguageNegotiationTest->testUrlLanguageFallback()
LeafUnassigned text format functionality (FilterNoFormatTestCase) [Filter]100
LeafUnicode handling (UnicodeUnitTest) [System]33100
LeafUnmanaged file copying (FileUnmanagedCopyTest) [File API]3100
LeafUnmanaged file copying (RemoteFileUnmanagedCopyTest) [File API (remote)]3400
LeafUnmanaged file delete (FileUnmanagedDeleteTest) [File API]800
LeafUnmanaged file delete (RemoteFileUnmanagedDeleteTest) [File API (remote)]1100
LeafUnmanaged file moving (FileUnmanagedMoveTest) [File API]2200
LeafUnmanaged file moving (RemoteFileUnmanagedMoveTest) [File API (remote)]2500
LeafUnmanaged file save data (FileUnmanagedSaveDataTest) [File API]700
LeafUnmanaged file save data (RemoteFileUnmanagedSaveDataTest) [File API (remote)]800
LeafUnmanaged recursive file delete (FileUnmanagedDeleteRecursiveTest) [File API]1700
LeafUnmanaged recursive file delete (RemoteFileUnmanagedDeleteRecursiveTest) [File API (remote)]2100
LeafUpdate contrib functionality (UpdateTestContribCase) [Update]18800
LeafUpdate core functionality (UpdateCoreTestCase) [Update]20000
LeafUpdate dependency hook invocation (UpdateDependencyHookInvocationTestCase) [Update API]400
LeafUpdate dependency ordering (UpdateDependencyOrderingTestCase) [Update API]500
LeafUpdate feed functionality (UpdateFeedTestCase) [Unknown]7600
LeafUpdate feed item functionality (UpdateFeedItemTestCase) [Unknown]6300
LeafUpdate functionality (UpdateScriptFunctionalTest) [System]15300
LeafUpdate on cron functionality (AggregatorCronTestCase) [Unknown]5500
LeafUpdate tests (DatabaseUpdateTestCase) [Database]5600
LeafUpdate tests, Complex (DatabaseUpdateComplexTestCase) [Database]5900
LeafUpdate tests, LOB (DatabaseUpdateLOBTestCase) [Database]1500
LeafUpload and extract module functionality (UpdateTestUploadCase) [Update]6400
LeafUpload user picture (UserPictureTestCase) [User]8200
LeafURL altering (UrlAlterFunctionalTest) [Path API]3400
LeafURL generation tests (CommonURLUnitTest) [System]5600
LeafURL rewriting (LocaleUrlRewritingTest) [Locale]3300
LeafUser account links (UserAccountLinksUnitTests) [User]1900
LeafUser administration (UserAdminTestCase) [User]6200
LeafUser autocompletion (UserAutocompleteTestCase) [User]2600
LeafUser blocks (UserBlocksUnitTests) [User]3900
LeafUser create (UserCreateTestCase) [User]2700
ExpandUser creation (LocaleUserCreationTest) [Locale]6810
MessageGroupFilenameLineFunctionStatus
Language added successfully.Otherlocale.test1637LocaleUserCreationTest->testLocalUserCreation()
LeafUser edit (UserEditTestCase) [User]6600
LeafUser edited own account (UserEditedOwnAccountTestCase) [User]2300
LeafUser entity callback tests (UserEntityCallbacksTestCase) [User]700
LeafUser language settings (LocaleUserLanguageFunctionalTest) [Locale]5000
LeafUser login (UserLoginTestCase) [User]16300
LeafUser poll vote capability. (PollVoteCheckHostname) [Poll]12500
LeafUser registration (UserRegistrationTestCase) [User]13500
LeafUser role administration (UserRoleAdminTestCase) [User]5300
LeafUser save test (UserSaveTestCase) [User]300
LeafUser search (UserUserSearchTestCase) [User]3900
LeafUser signatures (UserSignatureTestCase) [User]4700
LeafUser time zones (UserTimeZoneFunctionalTest) [User]2900
LeafUser token replacement (UserTokenReplaceTestCase) [User]3900
LeafUser validate current pass custom form (UserValidateCurrentPassCustomForm) [User]1700
LeafUsername/e-mail validation (UserValidationTestCase) [User]1900
LeafUUID handling (UuidUnitTestCase) [System]700
LeafValid Url (ValidUrlTestCase) [System]7900
LeafVariable test (BootstrapVariableTestCase) [Bootstrap]900
LeafVertical tabs form element type test (FormsElementsVerticalTabsFunctionalTest) [Form API]400
LeafWidget customization (FieldUIAlterTestCase) [Field UI]3900
LeafXML-RPC basic (XMLRPCBasicTestCase) [XML-RPC]600
LeafXML-RPC message and alteration (XMLRPCMessagesTestCase) [XML-RPC]700
LeafXML-RPC validator (XMLRPCValidator1IncTestCase) [XML-RPC]1000