drupal.system-update-module-enable.104.patch

Test status
StatusResult
Last receivedThu, 08/04/2011 - 01:32:03
Last requestedThu, 08/04/2011 - 01:32:04
Last testedThu, 08/04/2011 - 02:14:50
Test count1
Environment status
MySQLfail
File information
Filedrupal.system-update-module-enable.104.patch
BranchDrupal core - 7.x
LinkIssue Link
SummaryFAILED: [[SimpleTest]]: [MySQL] 34,050 pass(es), 249 fail(s), and 186 exception(s).
Details

MySQL

  1. Setup environment
  2. Detect an invalid patch URL
  3. Detect invalid repository information
  4. Detect invalid patch format
  5. Detect a non-applicable patch
  6. Detect invalid PHP syntax
  7. Detect a Drupal installation failure
  8. Detect a test run failure
  9. Detect a failing test
    Review the test failures below then if necessary run them locally until the problem has been fixed.
  10. Complete test suite with all tests passing
34,050 pass(es), 249 fail(s), and 186 exception(s)

Non-pass

Test namePassFailException
ExpandBasicUpgradePath542521
MessageGroupFilenameLineFunctionStatus
No pending updates at the end of the update process.Otherupgrade.test272UpgradePathTestCase->performUpgrade()
The upgrade was completed successfully.Otherupgrade.test361BasicUpgradePath->testBasicUpgrade()
Undefined index: include_fileNoticemenu.inc500menu_execute_active_handler()
SQLSTATE[42S02]: Base table or view not found: 1146 Table 'drupaltestbotmysql.simpletest191600block_node_type' doesn't exist: SELECT module, delta, type FROM {block_node_type}; Array ( ) PDOExceptionnode.module2373node_block_list_alter()
HTTP response expected 200, actual 500Browserupgrade.test365BasicUpgradePath->testBasicUpgrade()
Undefined index: include_fileNoticemenu.inc500menu_execute_active_handler()
call_user_func_array() expects parameter 1 to be a valid callback, function 'user_page' not found or invalid function nameWarningmenu.inc503menu_execute_active_handler()
SQLSTATE[42S22]: Column not found: 1054 Unknown column 'expiration' in 'where clause': DELETE FROM {flood} WHERE (expiration < :db_condition_placeholder_0) ; Array ( [:db_condition_placeholder_0] => 1312423882 ) PDOExceptionsystem.module2984system_cron()
Undefined variable: url_targetNoticedrupal_web_test_case.php2460DrupalWebTestCase->clickLink()
Clicked link Edit () from http://drupaltestbot664-mysql/checkout/?q=userBrowserupgrade.test369BasicUpgradePath->testBasicUpgrade()
We are still logged in as admin at the end of the upgrade.Otherupgrade.test370BasicUpgradePath->testBasicUpgrade()
Undefined index: include_fileNoticemenu.inc500menu_execute_active_handler()
call_user_func_array() expects parameter 1 to be a valid callback, function 'user_page' not found or invalid function nameWarningmenu.inc503menu_execute_active_handler()
SQLSTATE[42S22]: Column not found: 1054 Unknown column 'expiration' in 'where clause': DELETE FROM {flood} WHERE (expiration < :db_condition_placeholder_0) ; Array ( [:db_condition_placeholder_0] => 1312423882 ) PDOExceptionsystem.module2984system_cron()
Username field found.Logoutupgrade.test373BasicUpgradePath->testBasicUpgrade()
Undefined index: include_fileNoticemenu.inc500menu_execute_active_handler()
call_user_func_array() expects parameter 1 to be a valid callback, function 'user_page' not found or invalid function nameWarningmenu.inc503menu_execute_active_handler()
SQLSTATE[42S22]: Column not found: 1054 Unknown column 'expiration' in 'where clause': DELETE FROM {flood} WHERE (expiration < :db_condition_placeholder_0) ; Array ( [:db_condition_placeholder_0] => 1312423883 ) PDOExceptionsystem.module2984system_cron()
Failed to set field name to adminOtherupgrade.test378BasicUpgradePath->testBasicUpgrade()
Failed to set field pass to adminOtherupgrade.test378BasicUpgradePath->testBasicUpgrade()
Found the Log in buttonOtherupgrade.test378BasicUpgradePath->testBasicUpgrade()
Found the requested form fields at userOtherupgrade.test378BasicUpgradePath->testBasicUpgrade()
User admin successfully logged in.User loginupgrade.test378BasicUpgradePath->testBasicUpgrade()
Undefined index: include_fileNoticemenu.inc500menu_execute_active_handler()
call_user_func_array() expects parameter 1 to be a valid callback, function 'user_page' not found or invalid function nameWarningmenu.inc503menu_execute_active_handler()
SQLSTATE[42S22]: Column not found: 1054 Unknown column 'expiration' in 'where clause': DELETE FROM {flood} WHERE (expiration < :db_condition_placeholder_0) ; Array ( [:db_condition_placeholder_0] => 1312423883 ) PDOExceptionsystem.module2984system_cron()
Username field found.Logoutupgrade.test382BasicUpgradePath->testBasicUpgrade()
Undefined index: include_fileNoticemenu.inc500menu_execute_active_handler()
call_user_func_array() expects parameter 1 to be a valid callback, function 'user_page' not found or invalid function nameWarningmenu.inc503menu_execute_active_handler()
SQLSTATE[42S22]: Column not found: 1054 Unknown column 'expiration' in 'where clause': DELETE FROM {flood} WHERE (expiration < :db_condition_placeholder_0) ; Array ( [:db_condition_placeholder_0] => 1312423883 ) PDOExceptionsystem.module2984system_cron()
Failed to set field name to adminOtherupgrade.test387BasicUpgradePath->testBasicUpgrade()
Failed to set field pass to adminOtherupgrade.test387BasicUpgradePath->testBasicUpgrade()
Found the Log in buttonOtherupgrade.test387BasicUpgradePath->testBasicUpgrade()
Found the requested form fields at userOtherupgrade.test387BasicUpgradePath->testBasicUpgrade()
User admin successfully logged in.User loginupgrade.test387BasicUpgradePath->testBasicUpgrade()
Undefined index: include_fileNoticemenu.inc500menu_execute_active_handler()
call_user_func_array() expects parameter 1 to be a valid callback, function 'system_main_admin_page' not found or invalid function nameWarningmenu.inc503menu_execute_active_handler()
SQLSTATE[42S22]: Column not found: 1054 Unknown column 'expiration' in 'where clause': DELETE FROM {flood} WHERE (expiration < :db_condition_placeholder_0) ; Array ( [:db_condition_placeholder_0] => 1312423884 ) PDOExceptionsystem.module2984system_cron()
"Content" foundOtherupgrade.test394BasicUpgradePath->testBasicUpgrade()
"Appearance" foundOtherupgrade.test395BasicUpgradePath->testBasicUpgrade()
"People" foundOtherupgrade.test396BasicUpgradePath->testBasicUpgrade()
"Configuration" foundOtherupgrade.test397BasicUpgradePath->testBasicUpgrade()
"Reports" foundOtherupgrade.test398BasicUpgradePath->testBasicUpgrade()
"Structure" foundOtherupgrade.test399BasicUpgradePath->testBasicUpgrade()
"Modules" foundOtherupgrade.test400BasicUpgradePath->testBasicUpgrade()
No {menu_links} entry exists for user/autocompleteOtherupgrade.test404BasicUpgradePath->testBasicUpgrade()
ExpandCommentUpgradePathTestCase2020
MessageGroupFilenameLineFunctionStatus
No pending updates at the end of the update process.Otherupgrade.test272UpgradePathTestCase->performUpgrade()
The upgrade was completed successfully.Otherupgrade.comment.test30CommentUpgradePathTestCase->testCommentUpgrade()
ExpandFilterFormatUpgradePathTestCase1921
MessageGroupFilenameLineFunctionStatus
No pending updates at the end of the update process.Otherupgrade.test272UpgradePathTestCase->performUpgrade()
The upgrade was completed successfully.Otherupgrade.filter.test31FilterFormatUpgradePathTestCase->testFilterFormatUpgrade()
PDOException: SQLSTATE[HY000]: General error: 1366 Incorrect integer value: 'test_filter' for column 'format' at row 1: INSERT INTO {filter_format} (format, name, cache, status, weight) VALUES (:db_insert_placeholder_0, :db_insert_placeholder_1, :db_insert_placeholder_2, :db_insert_placeholder_3, :db_insert_placeholder_4); Array ( [:db_insert_placeholder_0] => test_filter [:db_insert_placeholder_1] => Test filter [:db_insert_placeholder_2] => 1 [:db_insert_placeholder_3] => 1 [:db_insert_placeholder_4] => 0 ) in filter_format_save() (line 210 of /var/lib/drupaltestbot/sites/default/files/checkout/modules/filter/filter.module).Uncaught exceptiondatabase.inc2137PDOStatement->execute()
ExpandForumUpgradePathTestCase241110
MessageGroupFilenameLineFunctionStatus
No pending updates at the end of the update process.Otherupgrade.test272UpgradePathTestCase->performUpgrade()
The upgrade was completed successfully.Otherupgrade.forum.test30ForumUpgradePathTestCase->testForumUpgrade()
Undefined index: include_fileNoticemenu.inc500menu_execute_active_handler()
call_user_func_array() expects parameter 1 to be a valid callback, function 'system_main_admin_page' not found or invalid function nameWarningmenu.inc503menu_execute_active_handler()
SQLSTATE[42S22]: Column not found: 1054 Unknown column 'expiration' in 'where clause': DELETE FROM {flood} WHERE (expiration < :db_condition_placeholder_0) ; Array ( [:db_condition_placeholder_0] => 1312423893 ) PDOExceptionsystem.module2984system_cron()
Found the Save buttonOtherupgrade.forum.test33ForumUpgradePathTestCase->testForumUpgrade()
Found the requested form fields at admin/structure/types/manage/forum/fieldsOtherupgrade.forum.test33ForumUpgradePathTestCase->testForumUpgrade()
SQLSTATE[42S02]: Base table or view not found: 1146 Table 'drupaltestbotmysql.simpletest100194block_node_type' doesn't exist: SELECT module, delta, type FROM {block_node_type}; Array ( ) PDOExceptionnode.module2373node_block_list_alter()
Undefined variable: url_targetNoticedrupal_web_test_case.php2460DrupalWebTestCase->clickLink()
Clicked link Apples () from http://drupaltestbot664-mysql/checkout/?q=forum/81Browserupgrade.forum.test40ForumUpgradePathTestCase->testForumUpgrade()
Undefined variable: url_targetNoticedrupal_web_test_case.php2460DrupalWebTestCase->clickLink()
Clicked link Edit () from http://drupaltestbot664-mysql/checkout/?q=forum/81Browserupgrade.forum.test41ForumUpgradePathTestCase->testForumUpgrade()
Undefined index: include_fileNoticemenu.inc500menu_execute_active_handler()
call_user_func_array() expects parameter 1 to be a valid callback, function 'node_add_page' not found or invalid function nameWarningmenu.inc503menu_execute_active_handler()
SQLSTATE[42S22]: Column not found: 1054 Unknown column 'expiration' in 'where clause': DELETE FROM {flood} WHERE (expiration < :db_condition_placeholder_0) ; Array ( [:db_condition_placeholder_0] => 1312423894 ) PDOExceptionsystem.module2984system_cron()
Failed to set field title to BananasOtherupgrade.forum.test48ForumUpgradePathTestCase->testForumUpgrade()
Failed to set field body[und][0][value] to It is another fruit.Otherupgrade.forum.test48ForumUpgradePathTestCase->testForumUpgrade()
Found the Save buttonOtherupgrade.forum.test48ForumUpgradePathTestCase->testForumUpgrade()
Found the requested form fields at node/add/forum/81Otherupgrade.forum.test48ForumUpgradePathTestCase->testForumUpgrade()
Forum topic was createdOtherupgrade.forum.test50ForumUpgradePathTestCase->testForumUpgrade()
PDOException: SQLSTATE[42S22]: Column not found: 1054 Unknown column 'machine_name' in 'field list': SELECT name, machine_name, vid FROM {taxonomy_vocabulary}; Array ( ) in taxonomy_vocabulary_get_names() (line 839 of /var/lib/drupaltestbot/sites/default/files/checkout/modules/taxonomy/taxonomy.module).Uncaught exceptiondatabase.inc2137PDOStatement->execute()
ExpandLocaleUpgradePathTestCase1092514
MessageGroupFilenameLineFunctionStatus
No pending updates at the end of the update process.Otherupgrade.test272UpgradePathTestCase->performUpgrade()
The upgrade was completed successfully.Otherupgrade.locale.test30LocaleUpgradePathTestCase->testLocaleUpgrade()
Undefined index: include_fileNoticemenu.inc500menu_execute_active_handler()
HTTP response expected 200, actual 500Browserupgrade.locale.test33LocaleUpgradePathTestCase->testLocaleUpgrade()
SQLSTATE[42S02]: Base table or view not found: 1146 Table 'drupaltestbotmysql.simpletest938461block_node_type' doesn't exist: SELECT module, delta, type FROM {block_node_type}; Array ( ) PDOExceptionnode.module2373node_block_list_alter()
HTTP response expected 404, actual 500Browserupgrade.locale.test37LocaleUpgradePathTestCase->testLocaleUpgrade()
SQLSTATE[42S02]: Base table or view not found: 1146 Table 'drupaltestbotmysql.simpletest938461block_node_type' doesn't exist: SELECT module, delta, type FROM {block_node_type}; Array ( ) PDOExceptionnode.module2373node_block_list_alter()
HTTP response expected 404, actual 500Browserupgrade.locale.test39LocaleUpgradePathTestCase->testLocaleUpgrade()
No pending updates at the end of the update process.Otherupgrade.test272UpgradePathTestCase->performUpgrade()
The upgrade was completed successfully.Otherupgrade.locale.test49LocaleUpgradePathTestCase->testLocaleUpgradePathDefault()
Undefined index: include_fileNoticemenu.inc500menu_execute_active_handler()
HTTP response expected 200, actual 500Browserupgrade.locale.test52LocaleUpgradePathTestCase->testLocaleUpgradePathDefault()
The language switcher block is displayed.Otherupgrade.locale.test55LocaleUpgradePathTestCase->testLocaleUpgradePathDefault()
SQLSTATE[42S02]: Base table or view not found: 1146 Table 'drupaltestbotmysql.simpletest33266block_node_type' doesn't exist: SELECT module, delta, type FROM {block_node_type}; Array ( ) PDOExceptionnode.module2373node_block_list_alter()
HTTP response expected 404, actual 500Browserupgrade.locale.test59LocaleUpgradePathTestCase->testLocaleUpgradePathDefault()
SQLSTATE[42S02]: Base table or view not found: 1146 Table 'drupaltestbotmysql.simpletest33266block_node_type' doesn't exist: SELECT module, delta, type FROM {block_node_type}; Array ( ) PDOExceptionnode.module2373node_block_list_alter()
HTTP response expected 200, actual 500Browserupgrade.locale.test62LocaleUpgradePathTestCase->testLocaleUpgradePathDefault()
No pending updates at the end of the update process.Otherupgrade.test272UpgradePathTestCase->performUpgrade()
The upgrade was completed successfully.Otherupgrade.locale.test78LocaleUpgradePathTestCase->testLocaleUpgradePathFallback()
SQLSTATE[42S02]: Base table or view not found: 1146 Table 'drupaltestbotmysql.simpletest682465block_node_type' doesn't exist: SELECT module, delta, type FROM {block_node_type}; Array ( ) PDOExceptionnode.module2373node_block_list_alter()
HTTP response expected 200, actual 500Browserupgrade.locale.test81LocaleUpgradePathTestCase->testLocaleUpgradePathFallback()
SQLSTATE[42S02]: Base table or view not found: 1146 Table 'drupaltestbotmysql.simpletest682465block_node_type' doesn't exist: SELECT module, delta, type FROM {block_node_type}; Array ( ) PDOExceptionnode.module2373node_block_list_alter()
HTTP response expected 200, actual 500Browserupgrade.locale.test82LocaleUpgradePathTestCase->testLocaleUpgradePathFallback()
Undefined index: include_fileNoticemenu.inc500menu_execute_active_handler()
HTTP response expected 200, actual 500Browserupgrade.locale.test85LocaleUpgradePathTestCase->testLocaleUpgradePathFallback()
The language switcher block is displayed.Otherupgrade.locale.test88LocaleUpgradePathTestCase->testLocaleUpgradePathFallback()
No pending updates at the end of the update process.Otherupgrade.test272UpgradePathTestCase->performUpgrade()
The upgrade was completed successfully.Otherupgrade.locale.test98LocaleUpgradePathTestCase->testLocaleUpgradeDomain()
Undefined index: include_fileNoticemenu.inc500menu_execute_active_handler()
HTTP response expected 200, actual 500Browserupgrade.locale.test101LocaleUpgradePathTestCase->testLocaleUpgradeDomain()
The language switcher block is displayed.Otherupgrade.locale.test104LocaleUpgradePathTestCase->testLocaleUpgradeDomain()
simplexml_import_dom(): Invalid Nodetype to importWarningdrupal_web_test_case.php1690DrupalWebTestCase->parse()
Parsed page successfully.Browserupgrade.locale.test107LocaleUpgradePathTestCase->testLocaleUpgradeDomain()
Invalid argument supplied for foreach()Warningupgrade.locale.test109LocaleUpgradePathTestCase->testLocaleUpgradeDomain()
The English link points to the correct domain.Otherupgrade.locale.test114LocaleUpgradePathTestCase->testLocaleUpgradeDomain()
SQLSTATE[42S02]: Base table or view not found: 1146 Table 'drupaltestbotmysql.simpletest766511block_node_type' doesn't exist: SELECT module, delta, type FROM {block_node_type}; Array ( ) PDOExceptionnode.module2373node_block_list_alter()
HTTP response expected 404, actual 500Browserupgrade.locale.test118LocaleUpgradePathTestCase->testLocaleUpgradeDomain()
SQLSTATE[42S02]: Base table or view not found: 1146 Table 'drupaltestbotmysql.simpletest766511block_node_type' doesn't exist: SELECT module, delta, type FROM {block_node_type}; Array ( ) PDOExceptionnode.module2373node_block_list_alter()
HTTP response expected 404, actual 500Browserupgrade.locale.test120LocaleUpgradePathTestCase->testLocaleUpgradeDomain()
ExpandMenuUpgradePathTestCase363024
MessageGroupFilenameLineFunctionStatus
No pending updates at the end of the update process.Otherupgrade.test272UpgradePathTestCase->performUpgrade()
The upgrade was completed successfully.Otherupgrade.menu.test30MenuUpgradePathTestCase->testMenuUpgrade()
Undefined index: include_fileNoticemenu.inc500menu_execute_active_handler()
call_user_func_array() expects parameter 1 to be a valid callback, function 'system_main_admin_page' not found or invalid function nameWarningmenu.inc503menu_execute_active_handler()
SQLSTATE[42S22]: Column not found: 1054 Unknown column 'expiration' in 'where clause': DELETE FROM {flood} WHERE (expiration < :db_condition_placeholder_0) ; Array ( [:db_condition_placeholder_0] => 1312423899 ) PDOExceptionsystem.module2984system_cron()
Management menu is not selected as available menuBrowserupgrade.menu.test35MenuUpgradePathTestCase->testMenuUpgrade()
Navigation menu is not selected as available menuBrowserupgrade.menu.test36MenuUpgradePathTestCase->testMenuUpgrade()
Main menu is not selected as available menuBrowserupgrade.menu.test37MenuUpgradePathTestCase->testMenuUpgrade()
Secondary menu is selected as available menuBrowserupgrade.menu.test38MenuUpgradePathTestCase->testMenuUpgrade()
User menu is not selected as available menuBrowserupgrade.menu.test39MenuUpgradePathTestCase->testMenuUpgrade()
Secondary menu is selected as default parent itemBrowserupgrade.menu.test40MenuUpgradePathTestCase->testMenuUpgrade()
Redundant variable menu_default_node_menu has been removedOtherupgrade.menu.test42MenuUpgradePathTestCase->testMenuUpgrade()
Undefined index: include_fileNoticemenu.inc500menu_execute_active_handler()
call_user_func_array() expects parameter 1 to be a valid callback, function 'system_main_admin_page' not found or invalid function nameWarningmenu.inc503menu_execute_active_handler()
SQLSTATE[42S22]: Column not found: 1054 Unknown column 'expiration' in 'where clause': DELETE FROM {flood} WHERE (expiration < :db_condition_placeholder_0) ; Array ( [:db_condition_placeholder_0] => 1312423899 ) PDOExceptionsystem.module2984system_cron()
Link containing href admin/structure/menu/manage/main-menu found.Otherupgrade.menu.test47MenuUpgradePathTestCase->testMenuUpgrade()
Link containing href admin/structure/menu/manage/secondary-menu found.Otherupgrade.menu.test49MenuUpgradePathTestCase->testMenuUpgrade()
Found default menu: NavigationOtherupgrade.menu.test53MenuUpgradePathTestCase->testMenuUpgrade()
Found default menu: ManagementOtherupgrade.menu.test53MenuUpgradePathTestCase->testMenuUpgrade()
Found default menu: User menuOtherupgrade.menu.test53MenuUpgradePathTestCase->testMenuUpgrade()
Found default menu: Main menuOtherupgrade.menu.test53MenuUpgradePathTestCase->testMenuUpgrade()
Undefined index: include_fileNoticemenu.inc500menu_execute_active_handler()
call_user_func_array() expects parameter 1 to be a valid callback, function 'system_main_admin_page' not found or invalid function nameWarningmenu.inc503menu_execute_active_handler()
SQLSTATE[42S22]: Column not found: 1054 Unknown column 'expiration' in 'where clause': DELETE FROM {flood} WHERE (expiration < :db_condition_placeholder_0) ; Array ( [:db_condition_placeholder_0] => 1312423899 ) PDOExceptionsystem.module2984system_cron()
Access menu management for navigationBrowserupgrade.menu.test67MenuUpgradePathTestCase->testMenuUpgrade()
Link with label Add content found.Otherupgrade.menu.test69MenuUpgradePathTestCase->testMenuUpgrade()
Link with label nodeadd-navigation found.Otherupgrade.menu.test69MenuUpgradePathTestCase->testMenuUpgrade()
Undefined index: include_fileNoticemenu.inc500menu_execute_active_handler()
call_user_func_array() expects parameter 1 to be a valid callback, function 'system_main_admin_page' not found or invalid function nameWarningmenu.inc503menu_execute_active_handler()
SQLSTATE[42S22]: Column not found: 1054 Unknown column 'expiration' in 'where clause': DELETE FROM {flood} WHERE (expiration < :db_condition_placeholder_0) ; Array ( [:db_condition_placeholder_0] => 1312423899 ) PDOExceptionsystem.module2984system_cron()
Access menu management for managementBrowserupgrade.menu.test67MenuUpgradePathTestCase->testMenuUpgrade()
Link with label Administration found.Otherupgrade.menu.test69MenuUpgradePathTestCase->testMenuUpgrade()
Link with label Account settings found.Otherupgrade.menu.test69MenuUpgradePathTestCase->testMenuUpgrade()
Undefined index: include_fileNoticemenu.inc500menu_execute_active_handler()
call_user_func_array() expects parameter 1 to be a valid callback, function 'system_main_admin_page' not found or invalid function nameWarningmenu.inc503menu_execute_active_handler()
SQLSTATE[42S22]: Column not found: 1054 Unknown column 'expiration' in 'where clause': DELETE FROM {flood} WHERE (expiration < :db_condition_placeholder_0) ; Array ( [:db_condition_placeholder_0] => 1312423900 ) PDOExceptionsystem.module2984system_cron()
Access menu management for user-menuBrowserupgrade.menu.test67MenuUpgradePathTestCase->testMenuUpgrade()
Link with label My account found.Otherupgrade.menu.test69MenuUpgradePathTestCase->testMenuUpgrade()
Link with label Log out found.Otherupgrade.menu.test69MenuUpgradePathTestCase->testMenuUpgrade()
Undefined index: include_fileNoticemenu.inc500menu_execute_active_handler()
call_user_func_array() expects parameter 1 to be a valid callback, function 'system_main_admin_page' not found or invalid function nameWarningmenu.inc503menu_execute_active_handler()
SQLSTATE[42S22]: Column not found: 1054 Unknown column 'expiration' in 'where clause': DELETE FROM {flood} WHERE (expiration < :db_condition_placeholder_0) ; Array ( [:db_condition_placeholder_0] => 1312423900 ) PDOExceptionsystem.module2984system_cron()
Access menu management for main-menuBrowserupgrade.menu.test67MenuUpgradePathTestCase->testMenuUpgrade()
Link with label nodeadd-primary found.Otherupgrade.menu.test69MenuUpgradePathTestCase->testMenuUpgrade()
Undefined index: include_fileNoticemenu.inc500menu_execute_active_handler()
call_user_func_array() expects parameter 1 to be a valid callback, function 'system_main_admin_page' not found or invalid function nameWarningmenu.inc503menu_execute_active_handler()
SQLSTATE[42S22]: Column not found: 1054 Unknown column 'expiration' in 'where clause': DELETE FROM {flood} WHERE (expiration < :db_condition_placeholder_0) ; Array ( [:db_condition_placeholder_0] => 1312423900 ) PDOExceptionsystem.module2984system_cron()
Access menu management for secondary-menuBrowserupgrade.menu.test67MenuUpgradePathTestCase->testMenuUpgrade()
Link with label nodeadd-secondary found.Otherupgrade.menu.test69MenuUpgradePathTestCase->testMenuUpgrade()
Undefined index: include_fileNoticemenu.inc500menu_execute_active_handler()
call_user_func_array() expects parameter 1 to be a valid callback, function 'system_main_admin_page' not found or invalid function nameWarningmenu.inc503menu_execute_active_handler()
SQLSTATE[42S22]: Column not found: 1054 Unknown column 'expiration' in 'where clause': DELETE FROM {flood} WHERE (expiration < :db_condition_placeholder_0) ; Array ( [:db_condition_placeholder_0] => 1312423900 ) PDOExceptionsystem.module2984system_cron()
Option secondary-menu for field edit-menu-main-links-source is selected.Browserupgrade.menu.test75MenuUpgradePathTestCase->testMenuUpgrade()
Option main-menu for field edit-menu-secondary-links-source is selected.Browserupgrade.menu.test76MenuUpgradePathTestCase->testMenuUpgrade()
ExpandNodeBodyUpgradePathTestCase2021
MessageGroupFilenameLineFunctionStatus
No pending updates at the end of the update process.Otherupgrade.test272UpgradePathTestCase->performUpgrade()
The upgrade was completed successfully.Otherupgrade.node.test29NodeBodyUpgradePathTestCase->testNodeBodyUpgrade()
PDOException: SQLSTATE[42S22]: Column not found: 1054 Unknown column 'machine_name' in 'field list': SELECT name, machine_name, vid FROM {taxonomy_vocabulary}; Array ( ) in taxonomy_vocabulary_get_names() (line 839 of /var/lib/drupaltestbot/sites/default/files/checkout/modules/taxonomy/taxonomy.module).Uncaught exceptiondatabase.inc2137PDOStatement->execute()
ExpandPollUpgradePathTestCase44140111
MessageGroupFilenameLineFunctionStatus
No pending updates at the end of the update process.Otherupgrade.test272UpgradePathTestCase->performUpgrade()
The upgrade was completed successfully.Otherupgrade.node.test85PollUpgradePathTestCase->testPollUpgrade()
Undefined index: include_fileNoticemenu.inc500menu_execute_active_handler()
call_user_func_array() expects parameter 1 to be a valid callback, function 'system_main_admin_page' not found or invalid function nameWarningmenu.inc503menu_execute_active_handler()
SQLSTATE[42S22]: Column not found: 1054 Unknown column 'expiration' in 'where clause': DELETE FROM {flood} WHERE (expiration < :db_condition_placeholder_0) ; Array ( [:db_condition_placeholder_0] => 1312423905 ) PDOExceptionsystem.module2984system_cron()
SQLSTATE[42S02]: Base table or view not found: 1146 Table 'drupaltestbotmysql.simpletest631049block_node_type' doesn't exist: SELECT module, delta, type FROM {block_node_type}; Array ( ) PDOExceptionnode.module2373node_block_list_alter()
Choice text is displayed correctly on poll viewOtherupgrade.node.test97PollUpgradePathTestCase->testPollUpgrade()
Choice text is displayed correctly on poll viewOtherupgrade.node.test97PollUpgradePathTestCase->testPollUpgrade()
Undefined variable: url_targetNoticedrupal_web_test_case.php2460DrupalWebTestCase->clickLink()
Clicked link Results () from http://drupaltestbot664-mysql/checkout/?q=content/poll/0Browserupgrade.node.test101PollUpgradePathTestCase->testPollUpgrade()
Choice text is displayed correctly on result viewOtherupgrade.node.test104PollUpgradePathTestCase->testPollUpgrade()
Choice text is displayed correctly on result viewOtherupgrade.node.test104PollUpgradePathTestCase->testPollUpgrade()
Undefined offset: 0Noticeupgrade.node.test112PollUpgradePathTestCase->testPollUpgrade()
Undefined offset: 0Noticeupgrade.node.test112PollUpgradePathTestCase->testPollUpgrade()
The number of votes is displayed correctly: expected 3, got Otherupgrade.node.test112PollUpgradePathTestCase->testPollUpgrade()
Undefined offset: 1Noticeupgrade.node.test112PollUpgradePathTestCase->testPollUpgrade()
Undefined offset: 1Noticeupgrade.node.test112PollUpgradePathTestCase->testPollUpgrade()
The number of votes is displayed correctly: expected 2, got Otherupgrade.node.test112PollUpgradePathTestCase->testPollUpgrade()
SQLSTATE[42S02]: Base table or view not found: 1146 Table 'drupaltestbotmysql.simpletest631049block_node_type' doesn't exist: SELECT module, delta, type FROM {block_node_type}; Array ( ) PDOExceptionnode.module2373node_block_list_alter()
Choice text is displayed correctly on poll viewOtherupgrade.node.test97PollUpgradePathTestCase->testPollUpgrade()
Choice text is displayed correctly on poll viewOtherupgrade.node.test97PollUpgradePathTestCase->testPollUpgrade()
Choice text is displayed correctly on poll viewOtherupgrade.node.test97PollUpgradePathTestCase->testPollUpgrade()
Undefined variable: url_targetNoticedrupal_web_test_case.php2460DrupalWebTestCase->clickLink()
Clicked link Results () from http://drupaltestbot664-mysql/checkout/?q=content/poll/1Browserupgrade.node.test101PollUpgradePathTestCase->testPollUpgrade()
Choice text is displayed correctly on result viewOtherupgrade.node.test104PollUpgradePathTestCase->testPollUpgrade()
Choice text is displayed correctly on result viewOtherupgrade.node.test104PollUpgradePathTestCase->testPollUpgrade()
Choice text is displayed correctly on result viewOtherupgrade.node.test104PollUpgradePathTestCase->testPollUpgrade()
Undefined offset: 0Noticeupgrade.node.test112PollUpgradePathTestCase->testPollUpgrade()
Undefined offset: 0Noticeupgrade.node.test112PollUpgradePathTestCase->testPollUpgrade()
The number of votes is displayed correctly: expected 2, got Otherupgrade.node.test112PollUpgradePathTestCase->testPollUpgrade()
Undefined offset: 1Noticeupgrade.node.test112PollUpgradePathTestCase->testPollUpgrade()
Undefined offset: 1Noticeupgrade.node.test112PollUpgradePathTestCase->testPollUpgrade()
The number of votes is displayed correctly: expected 2, got Otherupgrade.node.test112PollUpgradePathTestCase->testPollUpgrade()
Undefined offset: 2Noticeupgrade.node.test112PollUpgradePathTestCase->testPollUpgrade()
Undefined offset: 2Noticeupgrade.node.test112PollUpgradePathTestCase->testPollUpgrade()
The number of votes is displayed correctly: expected 2, got Otherupgrade.node.test112PollUpgradePathTestCase->testPollUpgrade()
SQLSTATE[42S02]: Base table or view not found: 1146 Table 'drupaltestbotmysql.simpletest631049block_node_type' doesn't exist: SELECT module, delta, type FROM {block_node_type}; Array ( ) PDOExceptionnode.module2373node_block_list_alter()
Choice text is displayed correctly on poll viewOtherupgrade.node.test97PollUpgradePathTestCase->testPollUpgrade()
Choice text is displayed correctly on poll viewOtherupgrade.node.test97PollUpgradePathTestCase->testPollUpgrade()
Choice text is displayed correctly on poll viewOtherupgrade.node.test97PollUpgradePathTestCase->testPollUpgrade()
Choice text is displayed correctly on poll viewOtherupgrade.node.test97PollUpgradePathTestCase->testPollUpgrade()
Undefined variable: url_targetNoticedrupal_web_test_case.php2460DrupalWebTestCase->clickLink()
Clicked link Results () from http://drupaltestbot664-mysql/checkout/?q=content/poll/2Browserupgrade.node.test101PollUpgradePathTestCase->testPollUpgrade()
Choice text is displayed correctly on result viewOtherupgrade.node.test104PollUpgradePathTestCase->testPollUpgrade()
Choice text is displayed correctly on result viewOtherupgrade.node.test104PollUpgradePathTestCase->testPollUpgrade()
Choice text is displayed correctly on result viewOtherupgrade.node.test104PollUpgradePathTestCase->testPollUpgrade()
Choice text is displayed correctly on result viewOtherupgrade.node.test104PollUpgradePathTestCase->testPollUpgrade()
Undefined offset: 0Noticeupgrade.node.test112PollUpgradePathTestCase->testPollUpgrade()
Undefined offset: 0Noticeupgrade.node.test112PollUpgradePathTestCase->testPollUpgrade()
The number of votes is displayed correctly: expected 2, got Otherupgrade.node.test112PollUpgradePathTestCase->testPollUpgrade()
Undefined offset: 1Noticeupgrade.node.test112PollUpgradePathTestCase->testPollUpgrade()
Undefined offset: 1Noticeupgrade.node.test112PollUpgradePathTestCase->testPollUpgrade()
The number of votes is displayed correctly: expected 2, got Otherupgrade.node.test112PollUpgradePathTestCase->testPollUpgrade()
Undefined offset: 2Noticeupgrade.node.test112PollUpgradePathTestCase->testPollUpgrade()
Undefined offset: 2Noticeupgrade.node.test112PollUpgradePathTestCase->testPollUpgrade()
The number of votes is displayed correctly: expected 2, got Otherupgrade.node.test112PollUpgradePathTestCase->testPollUpgrade()
Undefined offset: 3Noticeupgrade.node.test112PollUpgradePathTestCase->testPollUpgrade()
Undefined offset: 3Noticeupgrade.node.test112PollUpgradePathTestCase->testPollUpgrade()
The number of votes is displayed correctly: expected 1, got Otherupgrade.node.test112PollUpgradePathTestCase->testPollUpgrade()
SQLSTATE[42S02]: Base table or view not found: 1146 Table 'drupaltestbotmysql.simpletest631049block_node_type' doesn't exist: SELECT module, delta, type FROM {block_node_type}; Array ( ) PDOExceptionnode.module2373node_block_list_alter()
Choice text is displayed correctly on poll viewOtherupgrade.node.test97PollUpgradePathTestCase->testPollUpgrade()
Choice text is displayed correctly on poll viewOtherupgrade.node.test97PollUpgradePathTestCase->testPollUpgrade()
Choice text is displayed correctly on poll viewOtherupgrade.node.test97PollUpgradePathTestCase->testPollUpgrade()
Choice text is displayed correctly on poll viewOtherupgrade.node.test97PollUpgradePathTestCase->testPollUpgrade()
Choice text is displayed correctly on poll viewOtherupgrade.node.test97PollUpgradePathTestCase->testPollUpgrade()
Undefined variable: url_targetNoticedrupal_web_test_case.php2460DrupalWebTestCase->clickLink()
Clicked link Results () from http://drupaltestbot664-mysql/checkout/?q=content/poll/3Browserupgrade.node.test101PollUpgradePathTestCase->testPollUpgrade()
Choice text is displayed correctly on result viewOtherupgrade.node.test104PollUpgradePathTestCase->testPollUpgrade()
Choice text is displayed correctly on result viewOtherupgrade.node.test104PollUpgradePathTestCase->testPollUpgrade()
Choice text is displayed correctly on result viewOtherupgrade.node.test104PollUpgradePathTestCase->testPollUpgrade()
Choice text is displayed correctly on result viewOtherupgrade.node.test104PollUpgradePathTestCase->testPollUpgrade()
Choice text is displayed correctly on result viewOtherupgrade.node.test104PollUpgradePathTestCase->testPollUpgrade()
Undefined offset: 0Noticeupgrade.node.test112PollUpgradePathTestCase->testPollUpgrade()
Undefined offset: 0Noticeupgrade.node.test112PollUpgradePathTestCase->testPollUpgrade()
The number of votes is displayed correctly: expected 2, got Otherupgrade.node.test112PollUpgradePathTestCase->testPollUpgrade()
Undefined offset: 1Noticeupgrade.node.test112PollUpgradePathTestCase->testPollUpgrade()
Undefined offset: 1Noticeupgrade.node.test112PollUpgradePathTestCase->testPollUpgrade()
The number of votes is displayed correctly: expected 2, got Otherupgrade.node.test112PollUpgradePathTestCase->testPollUpgrade()
Undefined offset: 2Noticeupgrade.node.test112PollUpgradePathTestCase->testPollUpgrade()
Undefined offset: 2Noticeupgrade.node.test112PollUpgradePathTestCase->testPollUpgrade()
The number of votes is displayed correctly: expected 2, got Otherupgrade.node.test112PollUpgradePathTestCase->testPollUpgrade()
Undefined offset: 3Noticeupgrade.node.test112PollUpgradePathTestCase->testPollUpgrade()
Undefined offset: 3Noticeupgrade.node.test112PollUpgradePathTestCase->testPollUpgrade()
The number of votes is displayed correctly: expected 1, got Otherupgrade.node.test112PollUpgradePathTestCase->testPollUpgrade()
Undefined offset: 4Noticeupgrade.node.test112PollUpgradePathTestCase->testPollUpgrade()
Undefined offset: 4Noticeupgrade.node.test112PollUpgradePathTestCase->testPollUpgrade()
The number of votes is displayed correctly: expected 1, got Otherupgrade.node.test112PollUpgradePathTestCase->testPollUpgrade()
SQLSTATE[42S02]: Base table or view not found: 1146 Table 'drupaltestbotmysql.simpletest631049block_node_type' doesn't exist: SELECT module, delta, type FROM {block_node_type}; Array ( ) PDOExceptionnode.module2373node_block_list_alter()
Choice text is displayed correctly on poll viewOtherupgrade.node.test97PollUpgradePathTestCase->testPollUpgrade()
Choice text is displayed correctly on poll viewOtherupgrade.node.test97PollUpgradePathTestCase->testPollUpgrade()
Undefined variable: url_targetNoticedrupal_web_test_case.php2460DrupalWebTestCase->clickLink()
Clicked link Results () from http://drupaltestbot664-mysql/checkout/?q=content/poll/4Browserupgrade.node.test101PollUpgradePathTestCase->testPollUpgrade()
Choice text is displayed correctly on result viewOtherupgrade.node.test104PollUpgradePathTestCase->testPollUpgrade()
Choice text is displayed correctly on result viewOtherupgrade.node.test104PollUpgradePathTestCase->testPollUpgrade()
Undefined offset: 0Noticeupgrade.node.test112PollUpgradePathTestCase->testPollUpgrade()
Undefined offset: 0Noticeupgrade.node.test112PollUpgradePathTestCase->testPollUpgrade()
The number of votes is displayed correctly: expected 3, got Otherupgrade.node.test112PollUpgradePathTestCase->testPollUpgrade()
Undefined offset: 1Noticeupgrade.node.test112PollUpgradePathTestCase->testPollUpgrade()
Undefined offset: 1Noticeupgrade.node.test112PollUpgradePathTestCase->testPollUpgrade()
The number of votes is displayed correctly: expected 2, got Otherupgrade.node.test112PollUpgradePathTestCase->testPollUpgrade()
SQLSTATE[42S02]: Base table or view not found: 1146 Table 'drupaltestbotmysql.simpletest631049block_node_type' doesn't exist: SELECT module, delta, type FROM {block_node_type}; Array ( ) PDOExceptionnode.module2373node_block_list_alter()
Choice text is displayed correctly on poll viewOtherupgrade.node.test97PollUpgradePathTestCase->testPollUpgrade()
Choice text is displayed correctly on poll viewOtherupgrade.node.test97PollUpgradePathTestCase->testPollUpgrade()
Choice text is displayed correctly on poll viewOtherupgrade.node.test97PollUpgradePathTestCase->testPollUpgrade()
Undefined variable: url_targetNoticedrupal_web_test_case.php2460DrupalWebTestCase->clickLink()
Clicked link Results () from http://drupaltestbot664-mysql/checkout/?q=content/poll/5Browserupgrade.node.test101PollUpgradePathTestCase->testPollUpgrade()
Choice text is displayed correctly on result viewOtherupgrade.node.test104PollUpgradePathTestCase->testPollUpgrade()
Choice text is displayed correctly on result viewOtherupgrade.node.test104PollUpgradePathTestCase->testPollUpgrade()
Choice text is displayed correctly on result viewOtherupgrade.node.test104PollUpgradePathTestCase->testPollUpgrade()
Undefined offset: 0Noticeupgrade.node.test112PollUpgradePathTestCase->testPollUpgrade()
Undefined offset: 0Noticeupgrade.node.test112PollUpgradePathTestCase->testPollUpgrade()
The number of votes is displayed correctly: expected 2, got Otherupgrade.node.test112PollUpgradePathTestCase->testPollUpgrade()
Undefined offset: 1Noticeupgrade.node.test112PollUpgradePathTestCase->testPollUpgrade()
Undefined offset: 1Noticeupgrade.node.test112PollUpgradePathTestCase->testPollUpgrade()
The number of votes is displayed correctly: expected 2, got Otherupgrade.node.test112PollUpgradePathTestCase->testPollUpgrade()
Undefined offset: 2Noticeupgrade.node.test112PollUpgradePathTestCase->testPollUpgrade()
Undefined offset: 2Noticeupgrade.node.test112PollUpgradePathTestCase->testPollUpgrade()
The number of votes is displayed correctly: expected 2, got Otherupgrade.node.test112PollUpgradePathTestCase->testPollUpgrade()
SQLSTATE[42S02]: Base table or view not found: 1146 Table 'drupaltestbotmysql.simpletest631049block_node_type' doesn't exist: SELECT module, delta, type FROM {block_node_type}; Array ( ) PDOExceptionnode.module2373node_block_list_alter()
Choice text is displayed correctly on poll viewOtherupgrade.node.test97PollUpgradePathTestCase->testPollUpgrade()
Choice text is displayed correctly on poll viewOtherupgrade.node.test97PollUpgradePathTestCase->testPollUpgrade()
Choice text is displayed correctly on poll viewOtherupgrade.node.test97PollUpgradePathTestCase->testPollUpgrade()
Choice text is displayed correctly on poll viewOtherupgrade.node.test97PollUpgradePathTestCase->testPollUpgrade()
Undefined variable: url_targetNoticedrupal_web_test_case.php2460DrupalWebTestCase->clickLink()
Clicked link Results () from http://drupaltestbot664-mysql/checkout/?q=content/poll/6Browserupgrade.node.test101PollUpgradePathTestCase->testPollUpgrade()
Choice text is displayed correctly on result viewOtherupgrade.node.test104PollUpgradePathTestCase->testPollUpgrade()
Choice text is displayed correctly on result viewOtherupgrade.node.test104PollUpgradePathTestCase->testPollUpgrade()
Choice text is displayed correctly on result viewOtherupgrade.node.test104PollUpgradePathTestCase->testPollUpgrade()
Choice text is displayed correctly on result viewOtherupgrade.node.test104PollUpgradePathTestCase->testPollUpgrade()
Undefined offset: 0Noticeupgrade.node.test112PollUpgradePathTestCase->testPollUpgrade()
Undefined offset: 0Noticeupgrade.node.test112PollUpgradePathTestCase->testPollUpgrade()
The number of votes is displayed correctly: expected 2, got Otherupgrade.node.test112PollUpgradePathTestCase->testPollUpgrade()
Undefined offset: 1Noticeupgrade.node.test112PollUpgradePathTestCase->testPollUpgrade()
Undefined offset: 1Noticeupgrade.node.test112PollUpgradePathTestCase->testPollUpgrade()
The number of votes is displayed correctly: expected 2, got Otherupgrade.node.test112PollUpgradePathTestCase->testPollUpgrade()
Undefined offset: 2Noticeupgrade.node.test112PollUpgradePathTestCase->testPollUpgrade()
Undefined offset: 2Noticeupgrade.node.test112PollUpgradePathTestCase->testPollUpgrade()
The number of votes is displayed correctly: expected 2, got Otherupgrade.node.test112PollUpgradePathTestCase->testPollUpgrade()
Undefined offset: 3Noticeupgrade.node.test112PollUpgradePathTestCase->testPollUpgrade()
Undefined offset: 3Noticeupgrade.node.test112PollUpgradePathTestCase->testPollUpgrade()
The number of votes is displayed correctly: expected 1, got Otherupgrade.node.test112PollUpgradePathTestCase->testPollUpgrade()
SQLSTATE[42S02]: Base table or view not found: 1146 Table 'drupaltestbotmysql.simpletest631049block_node_type' doesn't exist: SELECT module, delta, type FROM {block_node_type}; Array ( ) PDOExceptionnode.module2373node_block_list_alter()
Choice text is displayed correctly on poll viewOtherupgrade.node.test97PollUpgradePathTestCase->testPollUpgrade()
Choice text is displayed correctly on poll viewOtherupgrade.node.test97PollUpgradePathTestCase->testPollUpgrade()
Choice text is displayed correctly on poll viewOtherupgrade.node.test97PollUpgradePathTestCase->testPollUpgrade()
Choice text is displayed correctly on poll viewOtherupgrade.node.test97PollUpgradePathTestCase->testPollUpgrade()
Choice text is displayed correctly on poll viewOtherupgrade.node.test97PollUpgradePathTestCase->testPollUpgrade()
Undefined variable: url_targetNoticedrupal_web_test_case.php2460DrupalWebTestCase->clickLink()
Clicked link Results () from http://drupaltestbot664-mysql/checkout/?q=content/poll/7Browserupgrade.node.test101PollUpgradePathTestCase->testPollUpgrade()
Choice text is displayed correctly on result viewOtherupgrade.node.test104PollUpgradePathTestCase->testPollUpgrade()
Choice text is displayed correctly on result viewOtherupgrade.node.test104PollUpgradePathTestCase->testPollUpgrade()
Choice text is displayed correctly on result viewOtherupgrade.node.test104PollUpgradePathTestCase->testPollUpgrade()
Choice text is displayed correctly on result viewOtherupgrade.node.test104PollUpgradePathTestCase->testPollUpgrade()
Choice text is displayed correctly on result viewOtherupgrade.node.test104PollUpgradePathTestCase->testPollUpgrade()
Undefined offset: 0Noticeupgrade.node.test112PollUpgradePathTestCase->testPollUpgrade()
Undefined offset: 0Noticeupgrade.node.test112PollUpgradePathTestCase->testPollUpgrade()
The number of votes is displayed correctly: expected 2, got Otherupgrade.node.test112PollUpgradePathTestCase->testPollUpgrade()
Undefined offset: 1Noticeupgrade.node.test112PollUpgradePathTestCase->testPollUpgrade()
Undefined offset: 1Noticeupgrade.node.test112PollUpgradePathTestCase->testPollUpgrade()
The number of votes is displayed correctly: expected 2, got Otherupgrade.node.test112PollUpgradePathTestCase->testPollUpgrade()
Undefined offset: 2Noticeupgrade.node.test112PollUpgradePathTestCase->testPollUpgrade()
Undefined offset: 2Noticeupgrade.node.test112PollUpgradePathTestCase->testPollUpgrade()
The number of votes is displayed correctly: expected 2, got Otherupgrade.node.test112PollUpgradePathTestCase->testPollUpgrade()
Undefined offset: 3Noticeupgrade.node.test112PollUpgradePathTestCase->testPollUpgrade()
Undefined offset: 3Noticeupgrade.node.test112PollUpgradePathTestCase->testPollUpgrade()
The number of votes is displayed correctly: expected 1, got Otherupgrade.node.test112PollUpgradePathTestCase->testPollUpgrade()
Undefined offset: 4Noticeupgrade.node.test112PollUpgradePathTestCase->testPollUpgrade()
Undefined offset: 4Noticeupgrade.node.test112PollUpgradePathTestCase->testPollUpgrade()
The number of votes is displayed correctly: expected 1, got Otherupgrade.node.test112PollUpgradePathTestCase->testPollUpgrade()
SQLSTATE[42S02]: Base table or view not found: 1146 Table 'drupaltestbotmysql.simpletest631049block_node_type' doesn't exist: SELECT module, delta, type FROM {block_node_type}; Array ( ) PDOExceptionnode.module2373node_block_list_alter()
Choice text is displayed correctly on poll viewOtherupgrade.node.test97PollUpgradePathTestCase->testPollUpgrade()
Choice text is displayed correctly on poll viewOtherupgrade.node.test97PollUpgradePathTestCase->testPollUpgrade()
Undefined variable: url_targetNoticedrupal_web_test_case.php2460DrupalWebTestCase->clickLink()
Clicked link Results () from http://drupaltestbot664-mysql/checkout/?q=content/poll/8Browserupgrade.node.test101PollUpgradePathTestCase->testPollUpgrade()
Choice text is displayed correctly on result viewOtherupgrade.node.test104PollUpgradePathTestCase->testPollUpgrade()
Choice text is displayed correctly on result viewOtherupgrade.node.test104PollUpgradePathTestCase->testPollUpgrade()
Undefined offset: 0Noticeupgrade.node.test112PollUpgradePathTestCase->testPollUpgrade()
Undefined offset: 0Noticeupgrade.node.test112PollUpgradePathTestCase->testPollUpgrade()
The number of votes is displayed correctly: expected 3, got Otherupgrade.node.test112PollUpgradePathTestCase->testPollUpgrade()
Undefined offset: 1Noticeupgrade.node.test112PollUpgradePathTestCase->testPollUpgrade()
Undefined offset: 1Noticeupgrade.node.test112PollUpgradePathTestCase->testPollUpgrade()
The number of votes is displayed correctly: expected 2, got Otherupgrade.node.test112PollUpgradePathTestCase->testPollUpgrade()
SQLSTATE[42S02]: Base table or view not found: 1146 Table 'drupaltestbotmysql.simpletest631049block_node_type' doesn't exist: SELECT module, delta, type FROM {block_node_type}; Array ( ) PDOExceptionnode.module2373node_block_list_alter()
Choice text is displayed correctly on poll viewOtherupgrade.node.test97PollUpgradePathTestCase->testPollUpgrade()
Choice text is displayed correctly on poll viewOtherupgrade.node.test97PollUpgradePathTestCase->testPollUpgrade()
Choice text is displayed correctly on poll viewOtherupgrade.node.test97PollUpgradePathTestCase->testPollUpgrade()
Undefined variable: url_targetNoticedrupal_web_test_case.php2460DrupalWebTestCase->clickLink()
Clicked link Results () from http://drupaltestbot664-mysql/checkout/?q=content/poll/9Browserupgrade.node.test101PollUpgradePathTestCase->testPollUpgrade()
Choice text is displayed correctly on result viewOtherupgrade.node.test104PollUpgradePathTestCase->testPollUpgrade()
Choice text is displayed correctly on result viewOtherupgrade.node.test104PollUpgradePathTestCase->testPollUpgrade()
Choice text is displayed correctly on result viewOtherupgrade.node.test104PollUpgradePathTestCase->testPollUpgrade()
Undefined offset: 0Noticeupgrade.node.test112PollUpgradePathTestCase->testPollUpgrade()
Undefined offset: 0Noticeupgrade.node.test112PollUpgradePathTestCase->testPollUpgrade()
The number of votes is displayed correctly: expected 2, got Otherupgrade.node.test112PollUpgradePathTestCase->testPollUpgrade()
Undefined offset: 1Noticeupgrade.node.test112PollUpgradePathTestCase->testPollUpgrade()
Undefined offset: 1Noticeupgrade.node.test112PollUpgradePathTestCase->testPollUpgrade()
The number of votes is displayed correctly: expected 2, got Otherupgrade.node.test112PollUpgradePathTestCase->testPollUpgrade()
Undefined offset: 2Noticeupgrade.node.test112PollUpgradePathTestCase->testPollUpgrade()
Undefined offset: 2Noticeupgrade.node.test112PollUpgradePathTestCase->testPollUpgrade()
The number of votes is displayed correctly: expected 2, got Otherupgrade.node.test112PollUpgradePathTestCase->testPollUpgrade()
SQLSTATE[42S02]: Base table or view not found: 1146 Table 'drupaltestbotmysql.simpletest631049block_node_type' doesn't exist: SELECT module, delta, type FROM {block_node_type}; Array ( ) PDOExceptionnode.module2373node_block_list_alter()
Choice text is displayed correctly on poll viewOtherupgrade.node.test97PollUpgradePathTestCase->testPollUpgrade()
Choice text is displayed correctly on poll viewOtherupgrade.node.test97PollUpgradePathTestCase->testPollUpgrade()
Choice text is displayed correctly on poll viewOtherupgrade.node.test97PollUpgradePathTestCase->testPollUpgrade()
Choice text is displayed correctly on poll viewOtherupgrade.node.test97PollUpgradePathTestCase->testPollUpgrade()
Undefined variable: url_targetNoticedrupal_web_test_case.php2460DrupalWebTestCase->clickLink()
Clicked link Results () from http://drupaltestbot664-mysql/checkout/?q=content/poll/10Browserupgrade.node.test101PollUpgradePathTestCase->testPollUpgrade()
Choice text is displayed correctly on result viewOtherupgrade.node.test104PollUpgradePathTestCase->testPollUpgrade()
Choice text is displayed correctly on result viewOtherupgrade.node.test104PollUpgradePathTestCase->testPollUpgrade()
Choice text is displayed correctly on result viewOtherupgrade.node.test104PollUpgradePathTestCase->testPollUpgrade()
Choice text is displayed correctly on result viewOtherupgrade.node.test104PollUpgradePathTestCase->testPollUpgrade()
Undefined offset: 0Noticeupgrade.node.test112PollUpgradePathTestCase->testPollUpgrade()
Undefined offset: 0Noticeupgrade.node.test112PollUpgradePathTestCase->testPollUpgrade()
The number of votes is displayed correctly: expected 2, got Otherupgrade.node.test112PollUpgradePathTestCase->testPollUpgrade()
Undefined offset: 1Noticeupgrade.node.test112PollUpgradePathTestCase->testPollUpgrade()
Undefined offset: 1Noticeupgrade.node.test112PollUpgradePathTestCase->testPollUpgrade()
The number of votes is displayed correctly: expected 2, got Otherupgrade.node.test112PollUpgradePathTestCase->testPollUpgrade()
Undefined offset: 2Noticeupgrade.node.test112PollUpgradePathTestCase->testPollUpgrade()
Undefined offset: 2Noticeupgrade.node.test112PollUpgradePathTestCase->testPollUpgrade()
The number of votes is displayed correctly: expected 2, got Otherupgrade.node.test112PollUpgradePathTestCase->testPollUpgrade()
Undefined offset: 3Noticeupgrade.node.test112PollUpgradePathTestCase->testPollUpgrade()
Undefined offset: 3Noticeupgrade.node.test112PollUpgradePathTestCase->testPollUpgrade()
The number of votes is displayed correctly: expected 1, got Otherupgrade.node.test112PollUpgradePathTestCase->testPollUpgrade()
SQLSTATE[42S02]: Base table or view not found: 1146 Table 'drupaltestbotmysql.simpletest631049block_node_type' doesn't exist: SELECT module, delta, type FROM {block_node_type}; Array ( ) PDOExceptionnode.module2373node_block_list_alter()
Choice text is displayed correctly on poll viewOtherupgrade.node.test97PollUpgradePathTestCase->testPollUpgrade()
Choice text is displayed correctly on poll viewOtherupgrade.node.test97PollUpgradePathTestCase->testPollUpgrade()
Choice text is displayed correctly on poll viewOtherupgrade.node.test97PollUpgradePathTestCase->testPollUpgrade()
Choice text is displayed correctly on poll viewOtherupgrade.node.test97PollUpgradePathTestCase->testPollUpgrade()
Choice text is displayed correctly on poll viewOtherupgrade.node.test97PollUpgradePathTestCase->testPollUpgrade()
Undefined variable: url_targetNoticedrupal_web_test_case.php2460DrupalWebTestCase->clickLink()
Clicked link Results () from http://drupaltestbot664-mysql/checkout/?q=content/poll/11Browserupgrade.node.test101PollUpgradePathTestCase->testPollUpgrade()
Choice text is displayed correctly on result viewOtherupgrade.node.test104PollUpgradePathTestCase->testPollUpgrade()
Choice text is displayed correctly on result viewOtherupgrade.node.test104PollUpgradePathTestCase->testPollUpgrade()
Choice text is displayed correctly on result viewOtherupgrade.node.test104PollUpgradePathTestCase->testPollUpgrade()
Choice text is displayed correctly on result viewOtherupgrade.node.test104PollUpgradePathTestCase->testPollUpgrade()
Choice text is displayed correctly on result viewOtherupgrade.node.test104PollUpgradePathTestCase->testPollUpgrade()
Undefined offset: 0Noticeupgrade.node.test112PollUpgradePathTestCase->testPollUpgrade()
Undefined offset: 0Noticeupgrade.node.test112PollUpgradePathTestCase->testPollUpgrade()
The number of votes is displayed correctly: expected 2, got Otherupgrade.node.test112PollUpgradePathTestCase->testPollUpgrade()
Undefined offset: 1Noticeupgrade.node.test112PollUpgradePathTestCase->testPollUpgrade()
Undefined offset: 1Noticeupgrade.node.test112PollUpgradePathTestCase->testPollUpgrade()
The number of votes is displayed correctly: expected 2, got Otherupgrade.node.test112PollUpgradePathTestCase->testPollUpgrade()
Undefined offset: 2Noticeupgrade.node.test112PollUpgradePathTestCase->testPollUpgrade()
Undefined offset: 2Noticeupgrade.node.test112PollUpgradePathTestCase->testPollUpgrade()
The number of votes is displayed correctly: expected 2, got Otherupgrade.node.test112PollUpgradePathTestCase->testPollUpgrade()
Undefined offset: 3Noticeupgrade.node.test112PollUpgradePathTestCase->testPollUpgrade()
Undefined offset: 3Noticeupgrade.node.test112PollUpgradePathTestCase->testPollUpgrade()
The number of votes is displayed correctly: expected 1, got Otherupgrade.node.test112PollUpgradePathTestCase->testPollUpgrade()
Undefined offset: 4Noticeupgrade.node.test112PollUpgradePathTestCase->testPollUpgrade()
Undefined offset: 4Noticeupgrade.node.test112PollUpgradePathTestCase->testPollUpgrade()
The number of votes is displayed correctly: expected 1, got Otherupgrade.node.test112PollUpgradePathTestCase->testPollUpgrade()
ExpandUpgradePathTaxonomyTestCase2243
MessageGroupFilenameLineFunctionStatus
No pending updates at the end of the update process.Otherupgrade.test272UpgradePathTestCase->performUpgrade()
The upgrade was completed successfully.Otherupgrade.taxonomy.test49UpgradePathTaxonomyTestCase->testTaxonomyUpgrade()
Undefined index: include_fileNoticemenu.inc500menu_execute_active_handler()
SQLSTATE[42S22]: Column not found: 1054 Unknown column 'machine_name' in 'field list': SELECT name, machine_name, vid FROM {taxonomy_vocabulary}; Array ( ) PDOExceptiontaxonomy.module839taxonomy_vocabulary_get_names()
taxonomy_vocabulary_node_type has been removed.Otherupgrade.taxonomy.test56UpgradePathTaxonomyTestCase->testTaxonomyUpgrade()
taxonomy_term_node has been removed.Otherupgrade.taxonomy.test57UpgradePathTaxonomyTestCase->testTaxonomyUpgrade()
PDOException: SQLSTATE[42S22]: Column not found: 1054 Unknown column 'machine_name' in 'field list': SELECT name, machine_name, vid FROM {taxonomy_vocabulary}; Array ( ) in taxonomy_vocabulary_get_names() (line 839 of /var/lib/drupaltestbot/sites/default/files/checkout/modules/taxonomy/taxonomy.module).Uncaught exceptiondatabase.inc2137PDOStatement->execute()
ExpandUploadUpgradePathTestCase1821
MessageGroupFilenameLineFunctionStatus
No pending updates at the end of the update process.Otherupgrade.test272UpgradePathTestCase->performUpgrade()
The upgrade was completed successfully.Otherupgrade.upload.test32UploadUpgradePathTestCase->testUploadUpgrade()
PDOException: SQLSTATE[42S02]: Base table or view not found: 1146 Table 'drupaltestbotmysql.simpletest92223taxonomy_vocabulary' doesn't exist: SELECT name, machine_name, vid FROM {taxonomy_vocabulary}; Array ( ) in taxonomy_vocabulary_get_names() (line 839 of /var/lib/drupaltestbot/sites/default/files/checkout/modules/taxonomy/taxonomy.module).Uncaught exceptiondatabase.inc2137PDOStatement->execute()
ExpandUserUpgradePathNoPasswordTokenTestCase1830
MessageGroupFilenameLineFunctionStatus
No pending updates at the end of the update process.Otherupgrade.test272UpgradePathTestCase->performUpgrade()
The upgrade was completed successfully.Otherupgrade.user.test57UserUpgradePathNoPasswordTokenTestCase->testUserUpgrade()
Existing email templates have been modified (password token not involved).Otherupgrade.user.test58UserUpgradePathNoPasswordTokenTestCase->testUserUpgrade()
ExpandUserUpgradePathPasswordTokenTestCase1830
MessageGroupFilenameLineFunctionStatus
No pending updates at the end of the update process.Otherupgrade.test272UpgradePathTestCase->performUpgrade()
The upgrade was completed successfully.Otherupgrade.user.test27UserUpgradePathPasswordTokenTestCase->testUserUpgrade()
Existing email templates have been modified (password token involved).Otherupgrade.user.test28UserUpgradePathPasswordTokenTestCase->testUserUpgrade()

All

Test namePassFailException
LeafAccessDeniedTestCase7500
LeafActionLoopTestCase2900
LeafActionsConfigurationTestCase3800
LeafAddFeedTestCase2900
LeafAdminMetaTagTestCase300
LeafAggregatorCronTestCase5400
LeafAggregatorRenderingTestCase6900
LeafAJAXCommandsTestCase6900
LeafAJAXElementValidation900
LeafAJAXFormValuesTestCase2900
LeafAJAXFrameworkTestCase1200
LeafAJAXMultiFormTestCase3600
ExpandBasicUpgradePath542521
MessageGroupFilenameLineFunctionStatus
No pending updates at the end of the update process.Otherupgrade.test272UpgradePathTestCase->performUpgrade()
The upgrade was completed successfully.Otherupgrade.test361BasicUpgradePath->testBasicUpgrade()
Undefined index: include_fileNoticemenu.inc500menu_execute_active_handler()
SQLSTATE[42S02]: Base table or view not found: 1146 Table 'drupaltestbotmysql.simpletest191600block_node_type' doesn't exist: SELECT module, delta, type FROM {block_node_type}; Array ( ) PDOExceptionnode.module2373node_block_list_alter()
HTTP response expected 200, actual 500Browserupgrade.test365BasicUpgradePath->testBasicUpgrade()
Undefined index: include_fileNoticemenu.inc500menu_execute_active_handler()
call_user_func_array() expects parameter 1 to be a valid callback, function 'user_page' not found or invalid function nameWarningmenu.inc503menu_execute_active_handler()
SQLSTATE[42S22]: Column not found: 1054 Unknown column 'expiration' in 'where clause': DELETE FROM {flood} WHERE (expiration < :db_condition_placeholder_0) ; Array ( [:db_condition_placeholder_0] => 1312423882 ) PDOExceptionsystem.module2984system_cron()
Undefined variable: url_targetNoticedrupal_web_test_case.php2460DrupalWebTestCase->clickLink()
Clicked link Edit () from http://drupaltestbot664-mysql/checkout/?q=userBrowserupgrade.test369BasicUpgradePath->testBasicUpgrade()
We are still logged in as admin at the end of the upgrade.Otherupgrade.test370BasicUpgradePath->testBasicUpgrade()
Undefined index: include_fileNoticemenu.inc500menu_execute_active_handler()
call_user_func_array() expects parameter 1 to be a valid callback, function 'user_page' not found or invalid function nameWarningmenu.inc503menu_execute_active_handler()
SQLSTATE[42S22]: Column not found: 1054 Unknown column 'expiration' in 'where clause': DELETE FROM {flood} WHERE (expiration < :db_condition_placeholder_0) ; Array ( [:db_condition_placeholder_0] => 1312423882 ) PDOExceptionsystem.module2984system_cron()
Username field found.Logoutupgrade.test373BasicUpgradePath->testBasicUpgrade()
Undefined index: include_fileNoticemenu.inc500menu_execute_active_handler()
call_user_func_array() expects parameter 1 to be a valid callback, function 'user_page' not found or invalid function nameWarningmenu.inc503menu_execute_active_handler()
SQLSTATE[42S22]: Column not found: 1054 Unknown column 'expiration' in 'where clause': DELETE FROM {flood} WHERE (expiration < :db_condition_placeholder_0) ; Array ( [:db_condition_placeholder_0] => 1312423883 ) PDOExceptionsystem.module2984system_cron()
Failed to set field name to adminOtherupgrade.test378BasicUpgradePath->testBasicUpgrade()
Failed to set field pass to adminOtherupgrade.test378BasicUpgradePath->testBasicUpgrade()
Found the Log in buttonOtherupgrade.test378BasicUpgradePath->testBasicUpgrade()
Found the requested form fields at userOtherupgrade.test378BasicUpgradePath->testBasicUpgrade()
User admin successfully logged in.User loginupgrade.test378BasicUpgradePath->testBasicUpgrade()
Undefined index: include_fileNoticemenu.inc500menu_execute_active_handler()
call_user_func_array() expects parameter 1 to be a valid callback, function 'user_page' not found or invalid function nameWarningmenu.inc503menu_execute_active_handler()
SQLSTATE[42S22]: Column not found: 1054 Unknown column 'expiration' in 'where clause': DELETE FROM {flood} WHERE (expiration < :db_condition_placeholder_0) ; Array ( [:db_condition_placeholder_0] => 1312423883 ) PDOExceptionsystem.module2984system_cron()
Username field found.Logoutupgrade.test382BasicUpgradePath->testBasicUpgrade()
Undefined index: include_fileNoticemenu.inc500menu_execute_active_handler()
call_user_func_array() expects parameter 1 to be a valid callback, function 'user_page' not found or invalid function nameWarningmenu.inc503menu_execute_active_handler()
SQLSTATE[42S22]: Column not found: 1054 Unknown column 'expiration' in 'where clause': DELETE FROM {flood} WHERE (expiration < :db_condition_placeholder_0) ; Array ( [:db_condition_placeholder_0] => 1312423883 ) PDOExceptionsystem.module2984system_cron()
Failed to set field name to adminOtherupgrade.test387BasicUpgradePath->testBasicUpgrade()
Failed to set field pass to adminOtherupgrade.test387BasicUpgradePath->testBasicUpgrade()
Found the Log in buttonOtherupgrade.test387BasicUpgradePath->testBasicUpgrade()
Found the requested form fields at userOtherupgrade.test387BasicUpgradePath->testBasicUpgrade()
User admin successfully logged in.User loginupgrade.test387BasicUpgradePath->testBasicUpgrade()
Undefined index: include_fileNoticemenu.inc500menu_execute_active_handler()
call_user_func_array() expects parameter 1 to be a valid callback, function 'system_main_admin_page' not found or invalid function nameWarningmenu.inc503menu_execute_active_handler()
SQLSTATE[42S22]: Column not found: 1054 Unknown column 'expiration' in 'where clause': DELETE FROM {flood} WHERE (expiration < :db_condition_placeholder_0) ; Array ( [:db_condition_placeholder_0] => 1312423884 ) PDOExceptionsystem.module2984system_cron()
"Content" foundOtherupgrade.test394BasicUpgradePath->testBasicUpgrade()
"Appearance" foundOtherupgrade.test395BasicUpgradePath->testBasicUpgrade()
"People" foundOtherupgrade.test396BasicUpgradePath->testBasicUpgrade()
"Configuration" foundOtherupgrade.test397BasicUpgradePath->testBasicUpgrade()
"Reports" foundOtherupgrade.test398BasicUpgradePath->testBasicUpgrade()
"Structure" foundOtherupgrade.test399BasicUpgradePath->testBasicUpgrade()
"Modules" foundOtherupgrade.test400BasicUpgradePath->testBasicUpgrade()
No {menu_links} entry exists for user/autocompleteOtherupgrade.test404BasicUpgradePath->testBasicUpgrade()
LeafBatchPageTestCase1600
LeafBatchPercentagesUnitTestCase1800
LeafBatchProcessingTestCase16100
LeafBlockAdminThemeTestCase1800
LeafBlockCacheTestCase23300
LeafBlockHTMLIdTestCase1600
LeafBlockTemplateSuggestionsUnitTest200
LeafBlockTestCase31300
LeafBlogTestCase24400
LeafBookTestCase35200
LeafBootstrapGetFilenameTestCase400
LeafBootstrapIPAddressTestCase1100
LeafBootstrapMiscTestCase100
LeafBootstrapOverrideServerVariablesTestCase600
LeafBootstrapPageCacheTestCase8100
LeafBootstrapResettableStaticTestCase500
LeafBootstrapTimerTestCase500
LeafBootstrapVariableTestCase900
LeafCacheClearCase1300
LeafCacheGetMultipleUnitTest700
LeafCacheIsEmptyCase500
LeafCacheSavingCase500
LeafCascadingStylesheetsTestCase3900
LeafCascadingStylesheetsUnitTest1200
LeafCategorizeFeedItemTestCase5400
LeafCategorizeFeedTestCase2000
LeafColorTestCase12200
LeafCommentActionsTestCase7300
LeafCommentAnonymous21000
LeafCommentApprovalTest20000
LeafCommentBlockFunctionalTest16000
LeafCommentContentRebuild7700
LeafCommentFieldsTest16000
ExpandCommentInterfaceTest144200
MessageGroupFilenameLineFunctionStatus
Changed environment:array ( 'authenticated' => false, 'comment count' => false, 'form' => 'below', 'user_register' => 1, 'contact' => 'optional', 'comments' => 'open', 'access comments' => 0, 'post comments' => 0, 'skip comment approval' => 1, 'edit own comments' => 0, )Debugcomment.test722CommentInterfaceTest->setEnvironment()
Changed environment:array ( 'authenticated' => true, 'comment count' => false, 'form' => 'below', 'user_register' => 1, 'contact' => 'optional', 'comments' => 'open', 'access comments' => 0, 'post comments' => 0, 'skip comment approval' => 1, 'edit own comments' => 0, )Debugcomment.test722CommentInterfaceTest->setEnvironment()
Changed environment:array ( 'authenticated' => false, 'comment count' => true, 'form' => 'below', 'user_register' => 1, 'contact' => 'optional', 'comments' => 'open', 'access comments' => 0, 'post comments' => 0, 'skip comment approval' => 1, 'edit own comments' => 0, )Debugcomment.test722CommentInterfaceTest->setEnvironment()
Changed environment:array ( 'authenticated' => true, 'comment count' => true, 'form' => 'below', 'user_register' => 1, 'contact' => 'optional', 'comments' => 'open', 'access comments' => 0, 'post comments' => 0, 'skip comment approval' => 1, 'edit own comments' => 0, )Debugcomment.test722CommentInterfaceTest->setEnvironment()
Changed environment:array ( 'authenticated' => false, 'comment count' => false, 'form' => 'below', 'user_register' => 1, 'contact' => 'optional', 'comments' => 'open', 'access comments' => 1, 'post comments' => 0, 'skip comment approval' => 1, 'edit own comments' => 0, )Debugcomment.test722CommentInterfaceTest->setEnvironment()
Changed environment:array ( 'authenticated' => true, 'comment count' => false, 'form' => 'below', 'user_register' => 1, 'contact' => 'optional', 'comments' => 'open', 'access comments' => 1, 'post comments' => 0, 'skip comment approval' => 1, 'edit own comments' => 0, )Debugcomment.test722CommentInterfaceTest->setEnvironment()
Changed environment:array ( 'authenticated' => false, 'comment count' => true, 'form' => 'below', 'user_register' => 1, 'contact' => 'optional', 'comments' => 'open', 'access comments' => 1, 'post comments' => 0, 'skip comment approval' => 1, 'edit own comments' => 0, )Debugcomment.test722CommentInterfaceTest->setEnvironment()
Changed environment:array ( 'authenticated' => true, 'comment count' => true, 'form' => 'below', 'user_register' => 1, 'contact' => 'optional', 'comments' => 'open', 'access comments' => 1, 'post comments' => 0, 'skip comment approval' => 1, 'edit own comments' => 0, )Debugcomment.test722CommentInterfaceTest->setEnvironment()
Changed environment:array ( 'authenticated' => false, 'comment count' => false, 'form' => 'below', 'user_register' => 1, 'contact' => 'optional', 'comments' => 'open', 'access comments' => 0, 'post comments' => 1, 'skip comment approval' => 1, 'edit own comments' => 0, )Debugcomment.test722CommentInterfaceTest->setEnvironment()
Changed environment:array ( 'authenticated' => true, 'comment count' => false, 'form' => 'below', 'user_register' => 1, 'contact' => 'optional', 'comments' => 'open', 'access comments' => 0, 'post comments' => 1, 'skip comment approval' => 1, 'edit own comments' => 0, )Debugcomment.test722CommentInterfaceTest->setEnvironment()
Changed environment:array ( 'authenticated' => false, 'comment count' => true, 'form' => 'below', 'user_register' => 1, 'contact' => 'optional', 'comments' => 'open', 'access comments' => 0, 'post comments' => 1, 'skip comment approval' => 1, 'edit own comments' => 0, )Debugcomment.test722CommentInterfaceTest->setEnvironment()
Changed environment:array ( 'authenticated' => true, 'comment count' => true, 'form' => 'below', 'user_register' => 1, 'contact' => 'optional', 'comments' => 'open', 'access comments' => 0, 'post comments' => 1, 'skip comment approval' => 1, 'edit own comments' => 0, )Debugcomment.test722CommentInterfaceTest->setEnvironment()
Changed environment:array ( 'authenticated' => false, 'comment count' => false, 'form' => 'below', 'user_register' => 1, 'contact' => 'optional', 'comments' => 'open', 'access comments' => 1, 'post comments' => 1, 'skip comment approval' => 1, 'edit own comments' => 0, )Debugcomment.test722CommentInterfaceTest->setEnvironment()
Changed environment:array ( 'authenticated' => true, 'comment count' => false, 'form' => 'below', 'user_register' => 1, 'contact' => 'optional', 'comments' => 'open', 'access comments' => 1, 'post comments' => 1, 'skip comment approval' => 1, 'edit own comments' => 0, )Debugcomment.test722CommentInterfaceTest->setEnvironment()
Changed environment:array ( 'authenticated' => false, 'comment count' => true, 'form' => 'below', 'user_register' => 1, 'contact' => 'optional', 'comments' => 'open', 'access comments' => 1, 'post comments' => 1, 'skip comment approval' => 1, 'edit own comments' => 0, )Debugcomment.test722CommentInterfaceTest->setEnvironment()
Changed environment:array ( 'authenticated' => true, 'comment count' => true, 'form' => 'below', 'user_register' => 1, 'contact' => 'optional', 'comments' => 'open', 'access comments' => 1, 'post comments' => 1, 'skip comment approval' => 1, 'edit own comments' => 0, )Debugcomment.test722CommentInterfaceTest->setEnvironment()
Changed environment:array ( 'authenticated' => false, 'comment count' => false, 'form' => 'separate page', 'user_register' => 1, 'contact' => 'optional', 'comments' => 'open', 'access comments' => 0, 'post comments' => 0, 'skip comment approval' => 1, 'edit own comments' => 0, )Debugcomment.test722CommentInterfaceTest->setEnvironment()
Changed environment:array ( 'authenticated' => true, 'comment count' => false, 'form' => 'separate page', 'user_register' => 1, 'contact' => 'optional', 'comments' => 'open', 'access comments' => 0, 'post comments' => 0, 'skip comment approval' => 1, 'edit own comments' => 0, )Debugcomment.test722CommentInterfaceTest->setEnvironment()
Changed environment:array ( 'authenticated' => false, 'comment count' => true, 'form' => 'separate page', 'user_register' => 1, 'contact' => 'optional', 'comments' => 'open', 'access comments' => 0, 'post comments' => 0, 'skip comment approval' => 1, 'edit own comments' => 0, )Debugcomment.test722CommentInterfaceTest->setEnvironment()
Changed environment:array ( 'authenticated' => true, 'comment count' => true, 'form' => 'separate page', 'user_register' => 1, 'contact' => 'optional', 'comments' => 'open', 'access comments' => 0, 'post comments' => 0, 'skip comment approval' => 1, 'edit own comments' => 0, )Debugcomment.test722CommentInterfaceTest->setEnvironment()
Changed environment:array ( 'authenticated' => false, 'comment count' => false, 'form' => 'separate page', 'user_register' => 1, 'contact' => 'optional', 'comments' => 'open', 'access comments' => 1, 'post comments' => 0, 'skip comment approval' => 1, 'edit own comments' => 0, )Debugcomment.test722CommentInterfaceTest->setEnvironment()
Changed environment:array ( 'authenticated' => true, 'comment count' => false, 'form' => 'separate page', 'user_register' => 1, 'contact' => 'optional', 'comments' => 'open', 'access comments' => 1, 'post comments' => 0, 'skip comment approval' => 1, 'edit own comments' => 0, )Debugcomment.test722CommentInterfaceTest->setEnvironment()
Changed environment:array ( 'authenticated' => false, 'comment count' => true, 'form' => 'separate page', 'user_register' => 1, 'contact' => 'optional', 'comments' => 'open', 'access comments' => 1, 'post comments' => 0, 'skip comment approval' => 1, 'edit own comments' => 0, )Debugcomment.test722CommentInterfaceTest->setEnvironment()
Changed environment:array ( 'authenticated' => true, 'comment count' => true, 'form' => 'separate page', 'user_register' => 1, 'contact' => 'optional', 'comments' => 'open', 'access comments' => 1, 'post comments' => 0, 'skip comment approval' => 1, 'edit own comments' => 0, )Debugcomment.test722CommentInterfaceTest->setEnvironment()
Changed environment:array ( 'authenticated' => false, 'comment count' => false, 'form' => 'separate page', 'user_register' => 1, 'contact' => 'optional', 'comments' => 'open', 'access comments' => 0, 'post comments' => 1, 'skip comment approval' => 1, 'edit own comments' => 0, )Debugcomment.test722CommentInterfaceTest->setEnvironment()
Changed environment:array ( 'authenticated' => true, 'comment count' => false, 'form' => 'separate page', 'user_register' => 1, 'contact' => 'optional', 'comments' => 'open', 'access comments' => 0, 'post comments' => 1, 'skip comment approval' => 1, 'edit own comments' => 0, )Debugcomment.test722CommentInterfaceTest->setEnvironment()
Changed environment:array ( 'authenticated' => false, 'comment count' => true, 'form' => 'separate page', 'user_register' => 1, 'contact' => 'optional', 'comments' => 'open', 'access comments' => 0, 'post comments' => 1, 'skip comment approval' => 1, 'edit own comments' => 0, )Debugcomment.test722CommentInterfaceTest->setEnvironment()
Changed environment:array ( 'authenticated' => true, 'comment count' => true, 'form' => 'separate page', 'user_register' => 1, 'contact' => 'optional', 'comments' => 'open', 'access comments' => 0, 'post comments' => 1, 'skip comment approval' => 1, 'edit own comments' => 0, )Debugcomment.test722CommentInterfaceTest->setEnvironment()
Changed environment:array ( 'authenticated' => false, 'comment count' => false, 'form' => 'separate page', 'user_register' => 1, 'contact' => 'optional', 'comments' => 'open', 'access comments' => 1, 'post comments' => 1, 'skip comment approval' => 1, 'edit own comments' => 0, )Debugcomment.test722CommentInterfaceTest->setEnvironment()
Changed environment:array ( 'authenticated' => true, 'comment count' => false, 'form' => 'separate page', 'user_register' => 1, 'contact' => 'optional', 'comments' => 'open', 'access comments' => 1, 'post comments' => 1, 'skip comment approval' => 1, 'edit own comments' => 0, )Debugcomment.test722CommentInterfaceTest->setEnvironment()
Changed environment:array ( 'authenticated' => false, 'comment count' => true, 'form' => 'separate page', 'user_register' => 1, 'contact' => 'optional', 'comments' => 'open', 'access comments' => 1, 'post comments' => 1, 'skip comment approval' => 1, 'edit own comments' => 0, )Debugcomment.test722CommentInterfaceTest->setEnvironment()
Changed environment:array ( 'authenticated' => true, 'comment count' => true, 'form' => 'separate page', 'user_register' => 1, 'contact' => 'optional', 'comments' => 'open', 'access comments' => 1, 'post comments' => 1, 'skip comment approval' => 1, 'edit own comments' => 0, )Debugcomment.test722CommentInterfaceTest->setEnvironment()
Changed environment:array ( 'authenticated' => false, 'comment count' => false, 'form' => 'below', 'user_register' => 0, 'contact' => 'optional', 'comments' => 'open', 'access comments' => 0, 'post comments' => 0, 'skip comment approval' => 1, 'edit own comments' => 0, )Debugcomment.test722CommentInterfaceTest->setEnvironment()
Changed environment:array ( 'authenticated' => true, 'comment count' => false, 'form' => 'below', 'user_register' => 0, 'contact' => 'optional', 'comments' => 'open', 'access comments' => 0, 'post comments' => 0, 'skip comment approval' => 1, 'edit own comments' => 0, )Debugcomment.test722CommentInterfaceTest->setEnvironment()
Changed environment:array ( 'authenticated' => false, 'comment count' => true, 'form' => 'below', 'user_register' => 0, 'contact' => 'optional', 'comments' => 'open', 'access comments' => 0, 'post comments' => 0, 'skip comment approval' => 1, 'edit own comments' => 0, )Debugcomment.test722CommentInterfaceTest->setEnvironment()
Changed environment:array ( 'authenticated' => true, 'comment count' => true, 'form' => 'below', 'user_register' => 0, 'contact' => 'optional', 'comments' => 'open', 'access comments' => 0, 'post comments' => 0, 'skip comment approval' => 1, 'edit own comments' => 0, )Debugcomment.test722CommentInterfaceTest->setEnvironment()
Changed environment:array ( 'authenticated' => false, 'comment count' => false, 'form' => 'below', 'user_register' => 0, 'contact' => 'optional', 'comments' => 'open', 'access comments' => 1, 'post comments' => 0, 'skip comment approval' => 1, 'edit own comments' => 0, )Debugcomment.test722CommentInterfaceTest->setEnvironment()
Changed environment:array ( 'authenticated' => true, 'comment count' => false, 'form' => 'below', 'user_register' => 0, 'contact' => 'optional', 'comments' => 'open', 'access comments' => 1, 'post comments' => 0, 'skip comment approval' => 1, 'edit own comments' => 0, )Debugcomment.test722CommentInterfaceTest->setEnvironment()
Changed environment:array ( 'authenticated' => false, 'comment count' => true, 'form' => 'below', 'user_register' => 0, 'contact' => 'optional', 'comments' => 'open', 'access comments' => 1, 'post comments' => 0, 'skip comment approval' => 1, 'edit own comments' => 0, )Debugcomment.test722CommentInterfaceTest->setEnvironment()
Changed environment:array ( 'authenticated' => true, 'comment count' => true, 'form' => 'below', 'user_register' => 0, 'contact' => 'optional', 'comments' => 'open', 'access comments' => 1, 'post comments' => 0, 'skip comment approval' => 1, 'edit own comments' => 0, )Debugcomment.test722CommentInterfaceTest->setEnvironment()
Changed environment:array ( 'authenticated' => false, 'comment count' => false, 'form' => 'below', 'user_register' => 0, 'contact' => 'optional', 'comments' => 'open', 'access comments' => 0, 'post comments' => 1, 'skip comment approval' => 1, 'edit own comments' => 0, )Debugcomment.test722CommentInterfaceTest->setEnvironment()
Changed environment:array ( 'authenticated' => true, 'comment count' => false, 'form' => 'below', 'user_register' => 0, 'contact' => 'optional', 'comments' => 'open', 'access comments' => 0, 'post comments' => 1, 'skip comment approval' => 1, 'edit own comments' => 0, )Debugcomment.test722CommentInterfaceTest->setEnvironment()
Changed environment:array ( 'authenticated' => false, 'comment count' => true, 'form' => 'below', 'user_register' => 0, 'contact' => 'optional', 'comments' => 'open', 'access comments' => 0, 'post comments' => 1, 'skip comment approval' => 1, 'edit own comments' => 0, )Debugcomment.test722CommentInterfaceTest->setEnvironment()
Changed environment:array ( 'authenticated' => true, 'comment count' => true, 'form' => 'below', 'user_register' => 0, 'contact' => 'optional', 'comments' => 'open', 'access comments' => 0, 'post comments' => 1, 'skip comment approval' => 1, 'edit own comments' => 0, )Debugcomment.test722CommentInterfaceTest->setEnvironment()
Changed environment:array ( 'authenticated' => false, 'comment count' => false, 'form' => 'below', 'user_register' => 0, 'contact' => 'optional', 'comments' => 'open', 'access comments' => 1, 'post comments' => 1, 'skip comment approval' => 1, 'edit own comments' => 0, )Debugcomment.test722CommentInterfaceTest->setEnvironment()
Changed environment:array ( 'authenticated' => true, 'comment count' => false, 'form' => 'below', 'user_register' => 0, 'contact' => 'optional', 'comments' => 'open', 'access comments' => 1, 'post comments' => 1, 'skip comment approval' => 1, 'edit own comments' => 0, )Debugcomment.test722CommentInterfaceTest->setEnvironment()
Changed environment:array ( 'authenticated' => false, 'comment count' => true, 'form' => 'below', 'user_register' => 0, 'contact' => 'optional', 'comments' => 'open', 'access comments' => 1, 'post comments' => 1, 'skip comment approval' => 1, 'edit own comments' => 0, )Debugcomment.test722CommentInterfaceTest->setEnvironment()
Changed environment:array ( 'authenticated' => true, 'comment count' => true, 'form' => 'below', 'user_register' => 0, 'contact' => 'optional', 'comments' => 'open', 'access comments' => 1, 'post comments' => 1, 'skip comment approval' => 1, 'edit own comments' => 0, )Debugcomment.test722CommentInterfaceTest->setEnvironment()
Changed environment:array ( 'authenticated' => false, 'comment count' => false, 'form' => 'separate page', 'user_register' => 0, 'contact' => 'optional', 'comments' => 'open', 'access comments' => 0, 'post comments' => 0, 'skip comment approval' => 1, 'edit own comments' => 0, )Debugcomment.test722CommentInterfaceTest->setEnvironment()
Changed environment:array ( 'authenticated' => true, 'comment count' => false, 'form' => 'separate page', 'user_register' => 0, 'contact' => 'optional', 'comments' => 'open', 'access comments' => 0, 'post comments' => 0, 'skip comment approval' => 1, 'edit own comments' => 0, )Debugcomment.test722CommentInterfaceTest->setEnvironment()
Changed environment:array ( 'authenticated' => false, 'comment count' => true, 'form' => 'separate page', 'user_register' => 0, 'contact' => 'optional', 'comments' => 'open', 'access comments' => 0, 'post comments' => 0, 'skip comment approval' => 1, 'edit own comments' => 0, )Debugcomment.test722CommentInterfaceTest->setEnvironment()
Changed environment:array ( 'authenticated' => true, 'comment count' => true, 'form' => 'separate page', 'user_register' => 0, 'contact' => 'optional', 'comments' => 'open', 'access comments' => 0, 'post comments' => 0, 'skip comment approval' => 1, 'edit own comments' => 0, )Debugcomment.test722CommentInterfaceTest->setEnvironment()
Changed environment:array ( 'authenticated' => false, 'comment count' => false, 'form' => 'separate page', 'user_register' => 0, 'contact' => 'optional', 'comments' => 'open', 'access comments' => 1, 'post comments' => 0, 'skip comment approval' => 1, 'edit own comments' => 0, )Debugcomment.test722CommentInterfaceTest->setEnvironment()
Changed environment:array ( 'authenticated' => true, 'comment count' => false, 'form' => 'separate page', 'user_register' => 0, 'contact' => 'optional', 'comments' => 'open', 'access comments' => 1, 'post comments' => 0, 'skip comment approval' => 1, 'edit own comments' => 0, )Debugcomment.test722CommentInterfaceTest->setEnvironment()
Changed environment:array ( 'authenticated' => false, 'comment count' => true, 'form' => 'separate page', 'user_register' => 0, 'contact' => 'optional', 'comments' => 'open', 'access comments' => 1, 'post comments' => 0, 'skip comment approval' => 1, 'edit own comments' => 0, )Debugcomment.test722CommentInterfaceTest->setEnvironment()
Changed environment:array ( 'authenticated' => true, 'comment count' => true, 'form' => 'separate page', 'user_register' => 0, 'contact' => 'optional', 'comments' => 'open', 'access comments' => 1, 'post comments' => 0, 'skip comment approval' => 1, 'edit own comments' => 0, )Debugcomment.test722CommentInterfaceTest->setEnvironment()
Changed environment:array ( 'authenticated' => false, 'comment count' => false, 'form' => 'separate page', 'user_register' => 0, 'contact' => 'optional', 'comments' => 'open', 'access comments' => 0, 'post comments' => 1, 'skip comment approval' => 1, 'edit own comments' => 0, )Debugcomment.test722CommentInterfaceTest->setEnvironment()
Changed environment:array ( 'authenticated' => true, 'comment count' => false, 'form' => 'separate page', 'user_register' => 0, 'contact' => 'optional', 'comments' => 'open', 'access comments' => 0, 'post comments' => 1, 'skip comment approval' => 1, 'edit own comments' => 0, )Debugcomment.test722CommentInterfaceTest->setEnvironment()
Changed environment:array ( 'authenticated' => false, 'comment count' => true, 'form' => 'separate page', 'user_register' => 0, 'contact' => 'optional', 'comments' => 'open', 'access comments' => 0, 'post comments' => 1, 'skip comment approval' => 1, 'edit own comments' => 0, )Debugcomment.test722CommentInterfaceTest->setEnvironment()
Changed environment:array ( 'authenticated' => true, 'comment count' => true, 'form' => 'separate page', 'user_register' => 0, 'contact' => 'optional', 'comments' => 'open', 'access comments' => 0, 'post comments' => 1, 'skip comment approval' => 1, 'edit own comments' => 0, )Debugcomment.test722CommentInterfaceTest->setEnvironment()
Changed environment:array ( 'authenticated' => false, 'comment count' => false, 'form' => 'separate page', 'user_register' => 0, 'contact' => 'optional', 'comments' => 'open', 'access comments' => 1, 'post comments' => 1, 'skip comment approval' => 1, 'edit own comments' => 0, )Debugcomment.test722CommentInterfaceTest->setEnvironment()
Changed environment:array ( 'authenticated' => true, 'comment count' => false, 'form' => 'separate page', 'user_register' => 0, 'contact' => 'optional', 'comments' => 'open', 'access comments' => 1, 'post comments' => 1, 'skip comment approval' => 1, 'edit own comments' => 0, )Debugcomment.test722CommentInterfaceTest->setEnvironment()
Changed environment:array ( 'authenticated' => false, 'comment count' => true, 'form' => 'separate page', 'user_register' => 0, 'contact' => 'optional', 'comments' => 'open', 'access comments' => 1, 'post comments' => 1, 'skip comment approval' => 1, 'edit own comments' => 0, )Debugcomment.test722CommentInterfaceTest->setEnvironment()
Changed environment:array ( 'authenticated' => true, 'comment count' => true, 'form' => 'separate page', 'user_register' => 0, 'contact' => 'optional', 'comments' => 'open', 'access comments' => 1, 'post comments' => 1, 'skip comment approval' => 1, 'edit own comments' => 0, )Debugcomment.test722CommentInterfaceTest->setEnvironment()
LeafCommentNodeAccessTest9800
LeafCommentPagerTest25500
LeafCommentPreviewTest13700
LeafCommentRSSUnitTest6900
LeafCommentTokenReplaceTestCase10900
ExpandCommentUpgradePathTestCase2020
MessageGroupFilenameLineFunctionStatus
No pending updates at the end of the update process.Otherupgrade.test272UpgradePathTestCase->performUpgrade()
The upgrade was completed successfully.Otherupgrade.comment.test30CommentUpgradePathTestCase->testCommentUpgrade()
LeafCommonSizeTestCase3500
LeafCommonURLUnitTest5600
LeafCommonXssUnitTest900
LeafContactPersonalTestCase14400
LeafContactSitewideTestCase23900
LeafCronRunTestCase4500
LeafDashboardBlocksTestCase10900
LeafDatabaseAlterTestCase6200
LeafDatabaseBasicSyntaxTestCase3000
LeafDatabaseConnectionTestCase3800
LeafDatabaseDeleteTruncateTestCase2300
LeafDatabaseEmptyStatementTestCase400
LeafDatabaseFetch2TestCase2900
LeafDatabaseFetchTestCase3700
LeafDatabaseInsertDefaultsTestCase2200
LeafDatabaseInsertLOBTestCase1500
LeafDatabaseInsertTestCase5100
LeafDatabaseInvalidDataTestCase800
LeafDatabaseLoggingTestCase4300
LeafDatabaseMergeTestCase8300
LeafDatabaseNextIdCase200
LeafDatabaseQueryTestCase700
LeafDatabaseRangeQueryTestCase300
LeafDatabaseRegressionTestCase3100
LeafDatabaseSelectComplexTestCase13600
LeafDatabaseSelectComplexTestCase21500
LeafDatabaseSelectOrderedTestCase2900
LeafDatabaseSelectPagerDefaultTestCase4700
LeafDatabaseSelectSubqueryTestCase4200
LeafDatabaseSelectTableSortDefaultTestCase4400
LeafDatabaseSelectTestCase13800
LeafDatabaseSerializeQueryTestCase700
LeafDatabaseTaggingTestCase3200
LeafDatabaseTemporaryQueryTestCase600
LeafDatabaseTransactionTestCase5600
LeafDatabaseUpdateComplexTestCase5900
LeafDatabaseUpdateLOBTestCase1500
LeafDatabaseUpdateTestCase5600
LeafDateTimeFunctionalTest11300
LeafDBLogTestCase44800
LeafDrupalAddFeedTestCase600
LeafDrupalAlterTestCase600
LeafDrupalAttributesUnitTest600
LeafDrupalDataApiTest3300
LeafDrupalErrorCollectionUnitTest1600
LeafDrupalErrorHandlerUnitTest3000
LeafDrupalGetRdfNamespacesTestCase700
LeafDrupalGotoTest2100
LeafDrupalHTMLIdentifierTestCase1000
LeafDrupalHtmlToTextTestCase8100
LeafDrupalHTTPRequestTestCase3200
LeafDrupalJSONTest1400
LeafDrupalMatchPathTestCase4100
LeafDrupalRenderTestCase4400
LeafDrupalSetContentTestCase4000
LeafDrupalSystemListingTestCase600
LeafDrupalTagsHandlingTestCase800
LeafEnableDisableTestCase145500
LeafEntityCrudHookTestCase7800
LeafEntityFieldQueryTestCase11600
LeafEntityPropertiesTestCase400
LeafFeedParserTestCase4300
LeafFieldAttachOtherTestCase5400
LeafFieldAttachStorageTestCase9200
LeafFieldBulkDeleteTestCase4200
LeafFieldCrudTestCase6900
LeafFieldDisplayAPITestCase4600
LeafFieldFormTestCase27700
LeafFieldInfoTestCase8400
LeafFieldInstanceCrudTestCase3700
LeafFieldSqlStorageTestCase9300
LeafFieldTranslationsTestCase7000
LeafFieldUIManageDisplayTestCase11300
LeafFieldUIManageFieldsTestCase16000
LeafFileCopyTest11000
LeafFileDeleteTest2000
LeafFileDirectoryTest2000
LeafFileDownloadTest3800
LeafFileFieldDisplayTestCase2600
LeafFileFieldPathTestCase2700
LeafFileFieldRevisionTestCase6900
LeafFileFieldValidateTestCase11800
LeafFileFieldWidgetTestCase22200
LeafFileLoadTest3400
LeafFileManagedFileElementTestCase26500
LeafFileMimeTypeTest3900
LeafFileMoveTest11000
LeafFileNameMungingTest500
LeafFilePrivateTestCase2500
LeafFileSaveDataTest9300
LeafFileSaveTest1500
LeafFileSaveUploadTest27100
LeafFileScanDirectoryTest2300
LeafFileSpaceUsedTest1100
LeafFileTokenReplaceTestCase3500
LeafFileTranferTest200
LeafFileUnmanagedCopyTest3100
LeafFileUnmanagedDeleteRecursiveTest1700
LeafFileUnmanagedDeleteTest800
LeafFileUnmanagedMoveTest2200
LeafFileUnmanagedSaveDataTest700
LeafFileURLRewritingTest1700
LeafFileUsageTest2100
LeafFileValidateTest1200
LeafFileValidatorTest2700
LeafFilterAdminTestCase16400
LeafFilterCRUDTestCase21500
LeafFilterDefaultFormatTestCase3300
LeafFilterFormatAccessTestCase24400
ExpandFilterFormatUpgradePathTestCase1921
MessageGroupFilenameLineFunctionStatus
No pending updates at the end of the update process.Otherupgrade.test272UpgradePathTestCase->performUpgrade()
The upgrade was completed successfully.Otherupgrade.filter.test31FilterFormatUpgradePathTestCase->testFilterFormatUpgrade()
PDOException: SQLSTATE[HY000]: General error: 1366 Incorrect integer value: 'test_filter' for column 'format' at row 1: INSERT INTO {filter_format} (format, name, cache, status, weight) VALUES (:db_insert_placeholder_0, :db_insert_placeholder_1, :db_insert_placeholder_2, :db_insert_placeholder_3, :db_insert_placeholder_4); Array ( [:db_insert_placeholder_0] => test_filter [:db_insert_placeholder_1] => Test filter [:db_insert_placeholder_2] => 1 [:db_insert_placeholder_3] => 1 [:db_insert_placeholder_4] => 0 ) in filter_format_save() (line 210 of /var/lib/drupaltestbot/sites/default/files/checkout/modules/filter/filter.module).Uncaught exceptiondatabase.inc2137PDOStatement->execute()
LeafFilterHooksTestCase3300
LeafFilterNoFormatTestCase100
LeafFilterSecurityTestCase2700
LeafFilterUnitTestCase20900
LeafFloodFunctionalTest600
LeafFormAlterTestCase400
LeafFormatDateUnitTest6300
LeafFormCheckboxTestCase9700
LeafFormElementTestCase2700
LeafFormsArbitraryRebuildTestCase1600
LeafFormsElementsLabelsTestCase1600
LeafFormsElementsTableSelectFunctionalTest6000
LeafFormsElementsVerticalTabsFunctionalTest400
LeafFormsFileInclusionTestCase1100
LeafFormsFormStorageTestCase12000
LeafFormsFormWrapperTestCase500
LeafFormsProgrammaticTestCase2400
LeafFormsRebuildTestCase5200
LeafFormStateValuesCleanTestCase1400
LeafFormsTestCase27600
LeafFormsTriggeringElementTestCase5000
LeafFormValidationTestCase4900
LeafForumTestCase61000
ExpandForumUpgradePathTestCase241110
MessageGroupFilenameLineFunctionStatus
No pending updates at the end of the update process.Otherupgrade.test272UpgradePathTestCase->performUpgrade()
The upgrade was completed successfully.Otherupgrade.forum.test30ForumUpgradePathTestCase->testForumUpgrade()
Undefined index: include_fileNoticemenu.inc500menu_execute_active_handler()
call_user_func_array() expects parameter 1 to be a valid callback, function 'system_main_admin_page' not found or invalid function nameWarningmenu.inc503menu_execute_active_handler()
SQLSTATE[42S22]: Column not found: 1054 Unknown column 'expiration' in 'where clause': DELETE FROM {flood} WHERE (expiration < :db_condition_placeholder_0) ; Array ( [:db_condition_placeholder_0] => 1312423893 ) PDOExceptionsystem.module2984system_cron()
Found the Save buttonOtherupgrade.forum.test33ForumUpgradePathTestCase->testForumUpgrade()
Found the requested form fields at admin/structure/types/manage/forum/fieldsOtherupgrade.forum.test33ForumUpgradePathTestCase->testForumUpgrade()
SQLSTATE[42S02]: Base table or view not found: 1146 Table 'drupaltestbotmysql.simpletest100194block_node_type' doesn't exist: SELECT module, delta, type FROM {block_node_type}; Array ( ) PDOExceptionnode.module2373node_block_list_alter()
Undefined variable: url_targetNoticedrupal_web_test_case.php2460DrupalWebTestCase->clickLink()
Clicked link Apples () from http://drupaltestbot664-mysql/checkout/?q=forum/81Browserupgrade.forum.test40ForumUpgradePathTestCase->testForumUpgrade()
Undefined variable: url_targetNoticedrupal_web_test_case.php2460DrupalWebTestCase->clickLink()
Clicked link Edit () from http://drupaltestbot664-mysql/checkout/?q=forum/81Browserupgrade.forum.test41ForumUpgradePathTestCase->testForumUpgrade()
Undefined index: include_fileNoticemenu.inc500menu_execute_active_handler()
call_user_func_array() expects parameter 1 to be a valid callback, function 'node_add_page' not found or invalid function nameWarningmenu.inc503menu_execute_active_handler()
SQLSTATE[42S22]: Column not found: 1054 Unknown column 'expiration' in 'where clause': DELETE FROM {flood} WHERE (expiration < :db_condition_placeholder_0) ; Array ( [:db_condition_placeholder_0] => 1312423894 ) PDOExceptionsystem.module2984system_cron()
Failed to set field title to BananasOtherupgrade.forum.test48ForumUpgradePathTestCase->testForumUpgrade()
Failed to set field body[und][0][value] to It is another fruit.Otherupgrade.forum.test48ForumUpgradePathTestCase->testForumUpgrade()
Found the Save buttonOtherupgrade.forum.test48ForumUpgradePathTestCase->testForumUpgrade()
Found the requested form fields at node/add/forum/81Otherupgrade.forum.test48ForumUpgradePathTestCase->testForumUpgrade()
Forum topic was createdOtherupgrade.forum.test50ForumUpgradePathTestCase->testForumUpgrade()
PDOException: SQLSTATE[42S22]: Column not found: 1054 Unknown column 'machine_name' in 'field list': SELECT name, machine_name, vid FROM {taxonomy_vocabulary}; Array ( ) in taxonomy_vocabulary_get_names() (line 839 of /var/lib/drupaltestbot/sites/default/files/checkout/modules/taxonomy/taxonomy.module).Uncaught exceptiondatabase.inc2137PDOStatement->execute()
LeafFrontPageTestCase3700
LeafGraphUnitTest2800
LeafHelpTestCase30900
LeafHookBootExitTestCase1900
LeafHookRequirementsTestCase1600
LeafImageAdminStylesUnitTest17000
LeafImageEffectsUnitTest3900
LeafImageFieldDisplayTestCase14800
LeafImageFieldValidateTestCase1900
LeafImageStylesPathAndUrlUnitTest4700
LeafImageToolkitGdTestCase100
LeafImageToolkitUnitTest5300
LeafImportOPMLTestCase5400
LeafInfoFileParserTestCase900
LeafIPAddressBlockingTestCase4200
LeafJavaScriptTestCase7100
LeafListFieldTestCase1600
LeafListFieldUITestCase25000
LeafLocaleCommentLanguageFunctionalTest5300
LeafLocaleConfigurationTest9800
LeafLocaleContentFunctionalTest6500
LeafLocaleDateFormatsFunctionalTest3600
LeafLocaleExportFunctionalTest3100
LeafLocaleImportFunctionalTest12000
LeafLocaleInstallTest200
LeafLocaleLanguageNegotiationInfoFunctionalTest4900
LeafLocaleLanguageSwitchingFunctionalTest2600
LeafLocaleMultilingualFieldsFunctionalTest6200
LeafLocalePathFunctionalTest5000
LeafLocaleTranslationFunctionalTest25400
LeafLocaleUILanguageNegotiationTest7500
LeafLocaleUninstallFrenchFunctionalTest3200
LeafLocaleUninstallFunctionalTest3200
ExpandLocaleUpgradePathTestCase1092514
MessageGroupFilenameLineFunctionStatus
No pending updates at the end of the update process.Otherupgrade.test272UpgradePathTestCase->performUpgrade()
The upgrade was completed successfully.Otherupgrade.locale.test30LocaleUpgradePathTestCase->testLocaleUpgrade()
Undefined index: include_fileNoticemenu.inc500menu_execute_active_handler()
HTTP response expected 200, actual 500Browserupgrade.locale.test33LocaleUpgradePathTestCase->testLocaleUpgrade()
SQLSTATE[42S02]: Base table or view not found: 1146 Table 'drupaltestbotmysql.simpletest938461block_node_type' doesn't exist: SELECT module, delta, type FROM {block_node_type}; Array ( ) PDOExceptionnode.module2373node_block_list_alter()
HTTP response expected 404, actual 500Browserupgrade.locale.test37LocaleUpgradePathTestCase->testLocaleUpgrade()
SQLSTATE[42S02]: Base table or view not found: 1146 Table 'drupaltestbotmysql.simpletest938461block_node_type' doesn't exist: SELECT module, delta, type FROM {block_node_type}; Array ( ) PDOExceptionnode.module2373node_block_list_alter()
HTTP response expected 404, actual 500Browserupgrade.locale.test39LocaleUpgradePathTestCase->testLocaleUpgrade()
No pending updates at the end of the update process.Otherupgrade.test272UpgradePathTestCase->performUpgrade()
The upgrade was completed successfully.Otherupgrade.locale.test49LocaleUpgradePathTestCase->testLocaleUpgradePathDefault()
Undefined index: include_fileNoticemenu.inc500menu_execute_active_handler()
HTTP response expected 200, actual 500Browserupgrade.locale.test52LocaleUpgradePathTestCase->testLocaleUpgradePathDefault()
The language switcher block is displayed.Otherupgrade.locale.test55LocaleUpgradePathTestCase->testLocaleUpgradePathDefault()
SQLSTATE[42S02]: Base table or view not found: 1146 Table 'drupaltestbotmysql.simpletest33266block_node_type' doesn't exist: SELECT module, delta, type FROM {block_node_type}; Array ( ) PDOExceptionnode.module2373node_block_list_alter()
HTTP response expected 404, actual 500Browserupgrade.locale.test59LocaleUpgradePathTestCase->testLocaleUpgradePathDefault()
SQLSTATE[42S02]: Base table or view not found: 1146 Table 'drupaltestbotmysql.simpletest33266block_node_type' doesn't exist: SELECT module, delta, type FROM {block_node_type}; Array ( ) PDOExceptionnode.module2373node_block_list_alter()
HTTP response expected 200, actual 500Browserupgrade.locale.test62LocaleUpgradePathTestCase->testLocaleUpgradePathDefault()
No pending updates at the end of the update process.Otherupgrade.test272UpgradePathTestCase->performUpgrade()
The upgrade was completed successfully.Otherupgrade.locale.test78LocaleUpgradePathTestCase->testLocaleUpgradePathFallback()
SQLSTATE[42S02]: Base table or view not found: 1146 Table 'drupaltestbotmysql.simpletest682465block_node_type' doesn't exist: SELECT module, delta, type FROM {block_node_type}; Array ( ) PDOExceptionnode.module2373node_block_list_alter()
HTTP response expected 200, actual 500Browserupgrade.locale.test81LocaleUpgradePathTestCase->testLocaleUpgradePathFallback()
SQLSTATE[42S02]: Base table or view not found: 1146 Table 'drupaltestbotmysql.simpletest682465block_node_type' doesn't exist: SELECT module, delta, type FROM {block_node_type}; Array ( ) PDOExceptionnode.module2373node_block_list_alter()
HTTP response expected 200, actual 500Browserupgrade.locale.test82LocaleUpgradePathTestCase->testLocaleUpgradePathFallback()
Undefined index: include_fileNoticemenu.inc500menu_execute_active_handler()
HTTP response expected 200, actual 500Browserupgrade.locale.test85LocaleUpgradePathTestCase->testLocaleUpgradePathFallback()
The language switcher block is displayed.Otherupgrade.locale.test88LocaleUpgradePathTestCase->testLocaleUpgradePathFallback()
No pending updates at the end of the update process.Otherupgrade.test272UpgradePathTestCase->performUpgrade()
The upgrade was completed successfully.Otherupgrade.locale.test98LocaleUpgradePathTestCase->testLocaleUpgradeDomain()
Undefined index: include_fileNoticemenu.inc500menu_execute_active_handler()
HTTP response expected 200, actual 500Browserupgrade.locale.test101LocaleUpgradePathTestCase->testLocaleUpgradeDomain()
The language switcher block is displayed.Otherupgrade.locale.test104LocaleUpgradePathTestCase->testLocaleUpgradeDomain()
simplexml_import_dom(): Invalid Nodetype to importWarningdrupal_web_test_case.php1690DrupalWebTestCase->parse()
Parsed page successfully.Browserupgrade.locale.test107LocaleUpgradePathTestCase->testLocaleUpgradeDomain()
Invalid argument supplied for foreach()Warningupgrade.locale.test109LocaleUpgradePathTestCase->testLocaleUpgradeDomain()
The English link points to the correct domain.Otherupgrade.locale.test114LocaleUpgradePathTestCase->testLocaleUpgradeDomain()
SQLSTATE[42S02]: Base table or view not found: 1146 Table 'drupaltestbotmysql.simpletest766511block_node_type' doesn't exist: SELECT module, delta, type FROM {block_node_type}; Array ( ) PDOExceptionnode.module2373node_block_list_alter()
HTTP response expected 404, actual 500Browserupgrade.locale.test118LocaleUpgradePathTestCase->testLocaleUpgradeDomain()
SQLSTATE[42S02]: Base table or view not found: 1146 Table 'drupaltestbotmysql.simpletest766511block_node_type' doesn't exist: SELECT module, delta, type FROM {block_node_type}; Array ( ) PDOExceptionnode.module2373node_block_list_alter()
HTTP response expected 404, actual 500Browserupgrade.locale.test120LocaleUpgradePathTestCase->testLocaleUpgradeDomain()
LeafLocaleUrlRewritingTest3300
LeafLocaleUserCreationTest6900
LeafLocaleUserLanguageFunctionalTest5200
LeafLockFunctionalTest1800
LeafMailTestCase100
LeafMenuBreadcrumbTestCase41100
LeafMenuLinksUnitTestCase5000
LeafMenuNodeTestCase5600
LeafMenuRebuildTestCase500
LeafMenuRouterTestCase23900
LeafMenuTestCase64600
LeafMenuTreeDataTestCase400
LeafMenuTreeOutputTestCase700
ExpandMenuUpgradePathTestCase363024
MessageGroupFilenameLineFunctionStatus
No pending updates at the end of the update process.Otherupgrade.test272UpgradePathTestCase->performUpgrade()
The upgrade was completed successfully.Otherupgrade.menu.test30MenuUpgradePathTestCase->testMenuUpgrade()
Undefined index: include_fileNoticemenu.inc500menu_execute_active_handler()
call_user_func_array() expects parameter 1 to be a valid callback, function 'system_main_admin_page' not found or invalid function nameWarningmenu.inc503menu_execute_active_handler()
SQLSTATE[42S22]: Column not found: 1054 Unknown column 'expiration' in 'where clause': DELETE FROM {flood} WHERE (expiration < :db_condition_placeholder_0) ; Array ( [:db_condition_placeholder_0] => 1312423899 ) PDOExceptionsystem.module2984system_cron()
Management menu is not selected as available menuBrowserupgrade.menu.test35MenuUpgradePathTestCase->testMenuUpgrade()
Navigation menu is not selected as available menuBrowserupgrade.menu.test36MenuUpgradePathTestCase->testMenuUpgrade()
Main menu is not selected as available menuBrowserupgrade.menu.test37MenuUpgradePathTestCase->testMenuUpgrade()
Secondary menu is selected as available menuBrowserupgrade.menu.test38MenuUpgradePathTestCase->testMenuUpgrade()
User menu is not selected as available menuBrowserupgrade.menu.test39MenuUpgradePathTestCase->testMenuUpgrade()
Secondary menu is selected as default parent itemBrowserupgrade.menu.test40MenuUpgradePathTestCase->testMenuUpgrade()
Redundant variable menu_default_node_menu has been removedOtherupgrade.menu.test42MenuUpgradePathTestCase->testMenuUpgrade()
Undefined index: include_fileNoticemenu.inc500menu_execute_active_handler()
call_user_func_array() expects parameter 1 to be a valid callback, function 'system_main_admin_page' not found or invalid function nameWarningmenu.inc503menu_execute_active_handler()
SQLSTATE[42S22]: Column not found: 1054 Unknown column 'expiration' in 'where clause': DELETE FROM {flood} WHERE (expiration < :db_condition_placeholder_0) ; Array ( [:db_condition_placeholder_0] => 1312423899 ) PDOExceptionsystem.module2984system_cron()
Link containing href admin/structure/menu/manage/main-menu found.Otherupgrade.menu.test47MenuUpgradePathTestCase->testMenuUpgrade()
Link containing href admin/structure/menu/manage/secondary-menu found.Otherupgrade.menu.test49MenuUpgradePathTestCase->testMenuUpgrade()
Found default menu: NavigationOtherupgrade.menu.test53MenuUpgradePathTestCase->testMenuUpgrade()
Found default menu: ManagementOtherupgrade.menu.test53MenuUpgradePathTestCase->testMenuUpgrade()
Found default menu: User menuOtherupgrade.menu.test53MenuUpgradePathTestCase->testMenuUpgrade()
Found default menu: Main menuOtherupgrade.menu.test53MenuUpgradePathTestCase->testMenuUpgrade()
Undefined index: include_fileNoticemenu.inc500menu_execute_active_handler()
call_user_func_array() expects parameter 1 to be a valid callback, function 'system_main_admin_page' not found or invalid function nameWarningmenu.inc503menu_execute_active_handler()
SQLSTATE[42S22]: Column not found: 1054 Unknown column 'expiration' in 'where clause': DELETE FROM {flood} WHERE (expiration < :db_condition_placeholder_0) ; Array ( [:db_condition_placeholder_0] => 1312423899 ) PDOExceptionsystem.module2984system_cron()
Access menu management for navigationBrowserupgrade.menu.test67MenuUpgradePathTestCase->testMenuUpgrade()
Link with label Add content found.Otherupgrade.menu.test69MenuUpgradePathTestCase->testMenuUpgrade()
Link with label nodeadd-navigation found.Otherupgrade.menu.test69MenuUpgradePathTestCase->testMenuUpgrade()
Undefined index: include_fileNoticemenu.inc500menu_execute_active_handler()
call_user_func_array() expects parameter 1 to be a valid callback, function 'system_main_admin_page' not found or invalid function nameWarningmenu.inc503menu_execute_active_handler()
SQLSTATE[42S22]: Column not found: 1054 Unknown column 'expiration' in 'where clause': DELETE FROM {flood} WHERE (expiration < :db_condition_placeholder_0) ; Array ( [:db_condition_placeholder_0] => 1312423899 ) PDOExceptionsystem.module2984system_cron()
Access menu management for managementBrowserupgrade.menu.test67MenuUpgradePathTestCase->testMenuUpgrade()
Link with label Administration found.Otherupgrade.menu.test69MenuUpgradePathTestCase->testMenuUpgrade()
Link with label Account settings found.Otherupgrade.menu.test69MenuUpgradePathTestCase->testMenuUpgrade()
Undefined index: include_fileNoticemenu.inc500menu_execute_active_handler()
call_user_func_array() expects parameter 1 to be a valid callback, function 'system_main_admin_page' not found or invalid function nameWarningmenu.inc503menu_execute_active_handler()
SQLSTATE[42S22]: Column not found: 1054 Unknown column 'expiration' in 'where clause': DELETE FROM {flood} WHERE (expiration < :db_condition_placeholder_0) ; Array ( [:db_condition_placeholder_0] => 1312423900 ) PDOExceptionsystem.module2984system_cron()
Access menu management for user-menuBrowserupgrade.menu.test67MenuUpgradePathTestCase->testMenuUpgrade()
Link with label My account found.Otherupgrade.menu.test69MenuUpgradePathTestCase->testMenuUpgrade()
Link with label Log out found.Otherupgrade.menu.test69MenuUpgradePathTestCase->testMenuUpgrade()
Undefined index: include_fileNoticemenu.inc500menu_execute_active_handler()
call_user_func_array() expects parameter 1 to be a valid callback, function 'system_main_admin_page' not found or invalid function nameWarningmenu.inc503menu_execute_active_handler()
SQLSTATE[42S22]: Column not found: 1054 Unknown column 'expiration' in 'where clause': DELETE FROM {flood} WHERE (expiration < :db_condition_placeholder_0) ; Array ( [:db_condition_placeholder_0] => 1312423900 ) PDOExceptionsystem.module2984system_cron()
Access menu management for main-menuBrowserupgrade.menu.test67MenuUpgradePathTestCase->testMenuUpgrade()
Link with label nodeadd-primary found.Otherupgrade.menu.test69MenuUpgradePathTestCase->testMenuUpgrade()
Undefined index: include_fileNoticemenu.inc500menu_execute_active_handler()
call_user_func_array() expects parameter 1 to be a valid callback, function 'system_main_admin_page' not found or invalid function nameWarningmenu.inc503menu_execute_active_handler()
SQLSTATE[42S22]: Column not found: 1054 Unknown column 'expiration' in 'where clause': DELETE FROM {flood} WHERE (expiration < :db_condition_placeholder_0) ; Array ( [:db_condition_placeholder_0] => 1312423900 ) PDOExceptionsystem.module2984system_cron()
Access menu management for secondary-menuBrowserupgrade.menu.test67MenuUpgradePathTestCase->testMenuUpgrade()
Link with label nodeadd-secondary found.Otherupgrade.menu.test69MenuUpgradePathTestCase->testMenuUpgrade()
Undefined index: include_fileNoticemenu.inc500menu_execute_active_handler()
call_user_func_array() expects parameter 1 to be a valid callback, function 'system_main_admin_page' not found or invalid function nameWarningmenu.inc503menu_execute_active_handler()
SQLSTATE[42S22]: Column not found: 1054 Unknown column 'expiration' in 'where clause': DELETE FROM {flood} WHERE (expiration < :db_condition_placeholder_0) ; Array ( [:db_condition_placeholder_0] => 1312423900 ) PDOExceptionsystem.module2984system_cron()
Option secondary-menu for field edit-menu-main-links-source is selected.Browserupgrade.menu.test75MenuUpgradePathTestCase->testMenuUpgrade()
Option main-menu for field edit-menu-secondary-links-source is selected.Browserupgrade.menu.test76MenuUpgradePathTestCase->testMenuUpgrade()
LeafModuleDependencyTestCase17300
LeafModuleInstallTestCase300
LeafModuleRequiredTestCase1900
LeafModuleUninstallTestCase200
LeafModuleUnitTest10300
LeafModuleVersionTestCase5100
LeafMultiStepNodeFormBasicOptionsTest1600
LeafNewDefaultThemeBlocks2400
LeafNodeAccessBaseTableTestCase16300
LeafNodeAccessRebuildTestCase1600
LeafNodeAccessRecordsUnitTest2400
LeafNodeAccessUnitTest3100
LeafNodeAdminTestCase24000
LeafNodeBlockFunctionalTest12700
LeafNodeBlockTestCase3600
ExpandNodeBodyUpgradePathTestCase2021
MessageGroupFilenameLineFunctionStatus
No pending updates at the end of the update process.Otherupgrade.test272UpgradePathTestCase->performUpgrade()
The upgrade was completed successfully.Otherupgrade.node.test29NodeBodyUpgradePathTestCase->testNodeBodyUpgrade()
PDOException: SQLSTATE[42S22]: Column not found: 1054 Unknown column 'machine_name' in 'field list': SELECT name, machine_name, vid FROM {taxonomy_vocabulary}; Array ( ) in taxonomy_vocabulary_get_names() (line 839 of /var/lib/drupaltestbot/sites/default/files/checkout/modules/taxonomy/taxonomy.module).Uncaught exceptiondatabase.inc2137PDOStatement->execute()
LeafNodeBuildContent200
LeafNodeCreationTestCase2800
LeafNodeEntityFieldQueryAlter3200
LeafNodeFeedTestCase100
LeafNodeLoadHooksTestCase500
LeafNodeLoadMultipleUnitTest3600
LeafNodePostSettingsTestCase3400
LeafNodeQueryAlter8400
LeafNodeRevisionsTestCase4400
LeafNodeRSSContentTestCase1700
LeafNodeSaveTestCase4200
LeafNodeTitleTestCase2000
LeafNodeTitleXSSTestCase2000
LeafNodeTokenReplaceTestCase3400
LeafNodeTypePersistenceTestCase6200
LeafNodeTypeTestCase11300
LeafNoHelpTestCase1200
LeafNonDefaultBlockAdmin1000
LeafNumberFieldTestCase4100
LeafOpenIDFunctionalTestCase25400
LeafOpenIDRegistrationTestCase13600
LeafOpenIDUnitTest3800
LeafOptionsWidgetsTestCase30600
LeafPageEditTestCase9300
LeafPageNotFoundTestCase1800
LeafPagePreviewTestCase3500
LeafPageTitleFiltering4000
LeafPageViewTestCase3200
LeafParseInfoFilesTestCase300
LeafPasswordHashingTest1000
LeafPathLanguageTestCase6400
LeafPathLanguageUITestCase7200
LeafPathLookupTest1700
LeafPathMonolingualTestCase3500
LeafPathTaxonomyTermTestCase3500
LeafPathTestCase10500
LeafPHPAccessTestCase3800
LeafPHPFilterTestCase4200
LeafPollBlockTestCase11900
LeafPollCreateTestCase14500
LeafPollExpirationTestCase3300
LeafPollJSAddChoice1600
LeafPollTokenReplaceTestCase11100
ExpandPollUpgradePathTestCase44140111
MessageGroupFilenameLineFunctionStatus
No pending updates at the end of the update process.Otherupgrade.test272UpgradePathTestCase->performUpgrade()
The upgrade was completed successfully.Otherupgrade.node.test85PollUpgradePathTestCase->testPollUpgrade()
Undefined index: include_fileNoticemenu.inc500menu_execute_active_handler()
call_user_func_array() expects parameter 1 to be a valid callback, function 'system_main_admin_page' not found or invalid function nameWarningmenu.inc503menu_execute_active_handler()
SQLSTATE[42S22]: Column not found: 1054 Unknown column 'expiration' in 'where clause': DELETE FROM {flood} WHERE (expiration < :db_condition_placeholder_0) ; Array ( [:db_condition_placeholder_0] => 1312423905 ) PDOExceptionsystem.module2984system_cron()
SQLSTATE[42S02]: Base table or view not found: 1146 Table 'drupaltestbotmysql.simpletest631049block_node_type' doesn't exist: SELECT module, delta, type FROM {block_node_type}; Array ( ) PDOExceptionnode.module2373node_block_list_alter()
Choice text is displayed correctly on poll viewOtherupgrade.node.test97PollUpgradePathTestCase->testPollUpgrade()
Choice text is displayed correctly on poll viewOtherupgrade.node.test97PollUpgradePathTestCase->testPollUpgrade()
Undefined variable: url_targetNoticedrupal_web_test_case.php2460DrupalWebTestCase->clickLink()
Clicked link Results () from http://drupaltestbot664-mysql/checkout/?q=content/poll/0Browserupgrade.node.test101PollUpgradePathTestCase->testPollUpgrade()
Choice text is displayed correctly on result viewOtherupgrade.node.test104PollUpgradePathTestCase->testPollUpgrade()
Choice text is displayed correctly on result viewOtherupgrade.node.test104PollUpgradePathTestCase->testPollUpgrade()
Undefined offset: 0Noticeupgrade.node.test112PollUpgradePathTestCase->testPollUpgrade()
Undefined offset: 0Noticeupgrade.node.test112PollUpgradePathTestCase->testPollUpgrade()
The number of votes is displayed correctly: expected 3, got Otherupgrade.node.test112PollUpgradePathTestCase->testPollUpgrade()
Undefined offset: 1Noticeupgrade.node.test112PollUpgradePathTestCase->testPollUpgrade()
Undefined offset: 1Noticeupgrade.node.test112PollUpgradePathTestCase->testPollUpgrade()
The number of votes is displayed correctly: expected 2, got Otherupgrade.node.test112PollUpgradePathTestCase->testPollUpgrade()
SQLSTATE[42S02]: Base table or view not found: 1146 Table 'drupaltestbotmysql.simpletest631049block_node_type' doesn't exist: SELECT module, delta, type FROM {block_node_type}; Array ( ) PDOExceptionnode.module2373node_block_list_alter()
Choice text is displayed correctly on poll viewOtherupgrade.node.test97PollUpgradePathTestCase->testPollUpgrade()
Choice text is displayed correctly on poll viewOtherupgrade.node.test97PollUpgradePathTestCase->testPollUpgrade()
Choice text is displayed correctly on poll viewOtherupgrade.node.test97PollUpgradePathTestCase->testPollUpgrade()
Undefined variable: url_targetNoticedrupal_web_test_case.php2460DrupalWebTestCase->clickLink()
Clicked link Results () from http://drupaltestbot664-mysql/checkout/?q=content/poll/1Browserupgrade.node.test101PollUpgradePathTestCase->testPollUpgrade()
Choice text is displayed correctly on result viewOtherupgrade.node.test104PollUpgradePathTestCase->testPollUpgrade()
Choice text is displayed correctly on result viewOtherupgrade.node.test104PollUpgradePathTestCase->testPollUpgrade()
Choice text is displayed correctly on result viewOtherupgrade.node.test104PollUpgradePathTestCase->testPollUpgrade()
Undefined offset: 0Noticeupgrade.node.test112PollUpgradePathTestCase->testPollUpgrade()
Undefined offset: 0Noticeupgrade.node.test112PollUpgradePathTestCase->testPollUpgrade()
The number of votes is displayed correctly: expected 2, got Otherupgrade.node.test112PollUpgradePathTestCase->testPollUpgrade()
Undefined offset: 1Noticeupgrade.node.test112PollUpgradePathTestCase->testPollUpgrade()
Undefined offset: 1Noticeupgrade.node.test112PollUpgradePathTestCase->testPollUpgrade()
The number of votes is displayed correctly: expected 2, got Otherupgrade.node.test112PollUpgradePathTestCase->testPollUpgrade()
Undefined offset: 2Noticeupgrade.node.test112PollUpgradePathTestCase->testPollUpgrade()
Undefined offset: 2Noticeupgrade.node.test112PollUpgradePathTestCase->testPollUpgrade()
The number of votes is displayed correctly: expected 2, got Otherupgrade.node.test112PollUpgradePathTestCase->testPollUpgrade()
SQLSTATE[42S02]: Base table or view not found: 1146 Table 'drupaltestbotmysql.simpletest631049block_node_type' doesn't exist: SELECT module, delta, type FROM {block_node_type}; Array ( ) PDOExceptionnode.module2373node_block_list_alter()
Choice text is displayed correctly on poll viewOtherupgrade.node.test97PollUpgradePathTestCase->testPollUpgrade()
Choice text is displayed correctly on poll viewOtherupgrade.node.test97PollUpgradePathTestCase->testPollUpgrade()
Choice text is displayed correctly on poll viewOtherupgrade.node.test97PollUpgradePathTestCase->testPollUpgrade()
Choice text is displayed correctly on poll viewOtherupgrade.node.test97PollUpgradePathTestCase->testPollUpgrade()
Undefined variable: url_targetNoticedrupal_web_test_case.php2460DrupalWebTestCase->clickLink()
Clicked link Results () from http://drupaltestbot664-mysql/checkout/?q=content/poll/2Browserupgrade.node.test101PollUpgradePathTestCase->testPollUpgrade()
Choice text is displayed correctly on result viewOtherupgrade.node.test104PollUpgradePathTestCase->testPollUpgrade()
Choice text is displayed correctly on result viewOtherupgrade.node.test104PollUpgradePathTestCase->testPollUpgrade()
Choice text is displayed correctly on result viewOtherupgrade.node.test104PollUpgradePathTestCase->testPollUpgrade()
Choice text is displayed correctly on result viewOtherupgrade.node.test104PollUpgradePathTestCase->testPollUpgrade()
Undefined offset: 0Noticeupgrade.node.test112PollUpgradePathTestCase->testPollUpgrade()
Undefined offset: 0Noticeupgrade.node.test112PollUpgradePathTestCase->testPollUpgrade()
The number of votes is displayed correctly: expected 2, got Otherupgrade.node.test112PollUpgradePathTestCase->testPollUpgrade()
Undefined offset: 1Noticeupgrade.node.test112PollUpgradePathTestCase->testPollUpgrade()
Undefined offset: 1Noticeupgrade.node.test112PollUpgradePathTestCase->testPollUpgrade()
The number of votes is displayed correctly: expected 2, got Otherupgrade.node.test112PollUpgradePathTestCase->testPollUpgrade()
Undefined offset: 2Noticeupgrade.node.test112PollUpgradePathTestCase->testPollUpgrade()
Undefined offset: 2Noticeupgrade.node.test112PollUpgradePathTestCase->testPollUpgrade()
The number of votes is displayed correctly: expected 2, got Otherupgrade.node.test112PollUpgradePathTestCase->testPollUpgrade()
Undefined offset: 3Noticeupgrade.node.test112PollUpgradePathTestCase->testPollUpgrade()
Undefined offset: 3Noticeupgrade.node.test112PollUpgradePathTestCase->testPollUpgrade()
The number of votes is displayed correctly: expected 1, got Otherupgrade.node.test112PollUpgradePathTestCase->testPollUpgrade()
SQLSTATE[42S02]: Base table or view not found: 1146 Table 'drupaltestbotmysql.simpletest631049block_node_type' doesn't exist: SELECT module, delta, type FROM {block_node_type}; Array ( ) PDOExceptionnode.module2373node_block_list_alter()
Choice text is displayed correctly on poll viewOtherupgrade.node.test97PollUpgradePathTestCase->testPollUpgrade()
Choice text is displayed correctly on poll viewOtherupgrade.node.test97PollUpgradePathTestCase->testPollUpgrade()
Choice text is displayed correctly on poll viewOtherupgrade.node.test97PollUpgradePathTestCase->testPollUpgrade()
Choice text is displayed correctly on poll viewOtherupgrade.node.test97PollUpgradePathTestCase->testPollUpgrade()
Choice text is displayed correctly on poll viewOtherupgrade.node.test97PollUpgradePathTestCase->testPollUpgrade()
Undefined variable: url_targetNoticedrupal_web_test_case.php2460DrupalWebTestCase->clickLink()
Clicked link Results () from http://drupaltestbot664-mysql/checkout/?q=content/poll/3Browserupgrade.node.test101PollUpgradePathTestCase->testPollUpgrade()
Choice text is displayed correctly on result viewOtherupgrade.node.test104PollUpgradePathTestCase->testPollUpgrade()
Choice text is displayed correctly on result viewOtherupgrade.node.test104PollUpgradePathTestCase->testPollUpgrade()
Choice text is displayed correctly on result viewOtherupgrade.node.test104PollUpgradePathTestCase->testPollUpgrade()
Choice text is displayed correctly on result viewOtherupgrade.node.test104PollUpgradePathTestCase->testPollUpgrade()
Choice text is displayed correctly on result viewOtherupgrade.node.test104PollUpgradePathTestCase->testPollUpgrade()
Undefined offset: 0Noticeupgrade.node.test112PollUpgradePathTestCase->testPollUpgrade()
Undefined offset: 0Noticeupgrade.node.test112PollUpgradePathTestCase->testPollUpgrade()
The number of votes is displayed correctly: expected 2, got Otherupgrade.node.test112PollUpgradePathTestCase->testPollUpgrade()
Undefined offset: 1Noticeupgrade.node.test112PollUpgradePathTestCase->testPollUpgrade()
Undefined offset: 1Noticeupgrade.node.test112PollUpgradePathTestCase->testPollUpgrade()
The number of votes is displayed correctly: expected 2, got Otherupgrade.node.test112PollUpgradePathTestCase->testPollUpgrade()
Undefined offset: 2Noticeupgrade.node.test112PollUpgradePathTestCase->testPollUpgrade()
Undefined offset: 2Noticeupgrade.node.test112PollUpgradePathTestCase->testPollUpgrade()
The number of votes is displayed correctly: expected 2, got Otherupgrade.node.test112PollUpgradePathTestCase->testPollUpgrade()
Undefined offset: 3Noticeupgrade.node.test112PollUpgradePathTestCase->testPollUpgrade()
Undefined offset: 3Noticeupgrade.node.test112PollUpgradePathTestCase->testPollUpgrade()
The number of votes is displayed correctly: expected 1, got Otherupgrade.node.test112PollUpgradePathTestCase->testPollUpgrade()
Undefined offset: 4Noticeupgrade.node.test112PollUpgradePathTestCase->testPollUpgrade()
Undefined offset: 4Noticeupgrade.node.test112PollUpgradePathTestCase->testPollUpgrade()
The number of votes is displayed correctly: expected 1, got Otherupgrade.node.test112PollUpgradePathTestCase->testPollUpgrade()
SQLSTATE[42S02]: Base table or view not found: 1146 Table 'drupaltestbotmysql.simpletest631049block_node_type' doesn't exist: SELECT module, delta, type FROM {block_node_type}; Array ( ) PDOExceptionnode.module2373node_block_list_alter()
Choice text is displayed correctly on poll viewOtherupgrade.node.test97PollUpgradePathTestCase->testPollUpgrade()
Choice text is displayed correctly on poll viewOtherupgrade.node.test97PollUpgradePathTestCase->testPollUpgrade()
Undefined variable: url_targetNoticedrupal_web_test_case.php2460DrupalWebTestCase->clickLink()
Clicked link Results () from http://drupaltestbot664-mysql/checkout/?q=content/poll/4Browserupgrade.node.test101PollUpgradePathTestCase->testPollUpgrade()
Choice text is displayed correctly on result viewOtherupgrade.node.test104PollUpgradePathTestCase->testPollUpgrade()
Choice text is displayed correctly on result viewOtherupgrade.node.test104PollUpgradePathTestCase->testPollUpgrade()
Undefined offset: 0Noticeupgrade.node.test112PollUpgradePathTestCase->testPollUpgrade()
Undefined offset: 0Noticeupgrade.node.test112PollUpgradePathTestCase->testPollUpgrade()
The number of votes is displayed correctly: expected 3, got Otherupgrade.node.test112PollUpgradePathTestCase->testPollUpgrade()
Undefined offset: 1Noticeupgrade.node.test112PollUpgradePathTestCase->testPollUpgrade()
Undefined offset: 1Noticeupgrade.node.test112PollUpgradePathTestCase->testPollUpgrade()
The number of votes is displayed correctly: expected 2, got Otherupgrade.node.test112PollUpgradePathTestCase->testPollUpgrade()
SQLSTATE[42S02]: Base table or view not found: 1146 Table 'drupaltestbotmysql.simpletest631049block_node_type' doesn't exist: SELECT module, delta, type FROM {block_node_type}; Array ( ) PDOExceptionnode.module2373node_block_list_alter()
Choice text is displayed correctly on poll viewOtherupgrade.node.test97PollUpgradePathTestCase->testPollUpgrade()
Choice text is displayed correctly on poll viewOtherupgrade.node.test97PollUpgradePathTestCase->testPollUpgrade()
Choice text is displayed correctly on poll viewOtherupgrade.node.test97PollUpgradePathTestCase->testPollUpgrade()
Undefined variable: url_targetNoticedrupal_web_test_case.php2460DrupalWebTestCase->clickLink()
Clicked link Results () from http://drupaltestbot664-mysql/checkout/?q=content/poll/5Browserupgrade.node.test101PollUpgradePathTestCase->testPollUpgrade()
Choice text is displayed correctly on result viewOtherupgrade.node.test104PollUpgradePathTestCase->testPollUpgrade()
Choice text is displayed correctly on result viewOtherupgrade.node.test104PollUpgradePathTestCase->testPollUpgrade()
Choice text is displayed correctly on result viewOtherupgrade.node.test104PollUpgradePathTestCase->testPollUpgrade()
Undefined offset: 0Noticeupgrade.node.test112PollUpgradePathTestCase->testPollUpgrade()
Undefined offset: 0Noticeupgrade.node.test112PollUpgradePathTestCase->testPollUpgrade()
The number of votes is displayed correctly: expected 2, got Otherupgrade.node.test112PollUpgradePathTestCase->testPollUpgrade()
Undefined offset: 1Noticeupgrade.node.test112PollUpgradePathTestCase->testPollUpgrade()
Undefined offset: 1Noticeupgrade.node.test112PollUpgradePathTestCase->testPollUpgrade()
The number of votes is displayed correctly: expected 2, got Otherupgrade.node.test112PollUpgradePathTestCase->testPollUpgrade()
Undefined offset: 2Noticeupgrade.node.test112PollUpgradePathTestCase->testPollUpgrade()
Undefined offset: 2Noticeupgrade.node.test112PollUpgradePathTestCase->testPollUpgrade()
The number of votes is displayed correctly: expected 2, got Otherupgrade.node.test112PollUpgradePathTestCase->testPollUpgrade()
SQLSTATE[42S02]: Base table or view not found: 1146 Table 'drupaltestbotmysql.simpletest631049block_node_type' doesn't exist: SELECT module, delta, type FROM {block_node_type}; Array ( ) PDOExceptionnode.module2373node_block_list_alter()
Choice text is displayed correctly on poll viewOtherupgrade.node.test97PollUpgradePathTestCase->testPollUpgrade()
Choice text is displayed correctly on poll viewOtherupgrade.node.test97PollUpgradePathTestCase->testPollUpgrade()
Choice text is displayed correctly on poll viewOtherupgrade.node.test97PollUpgradePathTestCase->testPollUpgrade()
Choice text is displayed correctly on poll viewOtherupgrade.node.test97PollUpgradePathTestCase->testPollUpgrade()
Undefined variable: url_targetNoticedrupal_web_test_case.php2460DrupalWebTestCase->clickLink()
Clicked link Results () from http://drupaltestbot664-mysql/checkout/?q=content/poll/6Browserupgrade.node.test101PollUpgradePathTestCase->testPollUpgrade()
Choice text is displayed correctly on result viewOtherupgrade.node.test104PollUpgradePathTestCase->testPollUpgrade()
Choice text is displayed correctly on result viewOtherupgrade.node.test104PollUpgradePathTestCase->testPollUpgrade()
Choice text is displayed correctly on result viewOtherupgrade.node.test104PollUpgradePathTestCase->testPollUpgrade()
Choice text is displayed correctly on result viewOtherupgrade.node.test104PollUpgradePathTestCase->testPollUpgrade()
Undefined offset: 0Noticeupgrade.node.test112PollUpgradePathTestCase->testPollUpgrade()
Undefined offset: 0Noticeupgrade.node.test112PollUpgradePathTestCase->testPollUpgrade()
The number of votes is displayed correctly: expected 2, got Otherupgrade.node.test112PollUpgradePathTestCase->testPollUpgrade()
Undefined offset: 1Noticeupgrade.node.test112PollUpgradePathTestCase->testPollUpgrade()
Undefined offset: 1Noticeupgrade.node.test112PollUpgradePathTestCase->testPollUpgrade()
The number of votes is displayed correctly: expected 2, got Otherupgrade.node.test112PollUpgradePathTestCase->testPollUpgrade()
Undefined offset: 2Noticeupgrade.node.test112PollUpgradePathTestCase->testPollUpgrade()
Undefined offset: 2Noticeupgrade.node.test112PollUpgradePathTestCase->testPollUpgrade()
The number of votes is displayed correctly: expected 2, got Otherupgrade.node.test112PollUpgradePathTestCase->testPollUpgrade()
Undefined offset: 3Noticeupgrade.node.test112PollUpgradePathTestCase->testPollUpgrade()
Undefined offset: 3Noticeupgrade.node.test112PollUpgradePathTestCase->testPollUpgrade()
The number of votes is displayed correctly: expected 1, got Otherupgrade.node.test112PollUpgradePathTestCase->testPollUpgrade()
SQLSTATE[42S02]: Base table or view not found: 1146 Table 'drupaltestbotmysql.simpletest631049block_node_type' doesn't exist: SELECT module, delta, type FROM {block_node_type}; Array ( ) PDOExceptionnode.module2373node_block_list_alter()
Choice text is displayed correctly on poll viewOtherupgrade.node.test97PollUpgradePathTestCase->testPollUpgrade()
Choice text is displayed correctly on poll viewOtherupgrade.node.test97PollUpgradePathTestCase->testPollUpgrade()
Choice text is displayed correctly on poll viewOtherupgrade.node.test97PollUpgradePathTestCase->testPollUpgrade()
Choice text is displayed correctly on poll viewOtherupgrade.node.test97PollUpgradePathTestCase->testPollUpgrade()
Choice text is displayed correctly on poll viewOtherupgrade.node.test97PollUpgradePathTestCase->testPollUpgrade()
Undefined variable: url_targetNoticedrupal_web_test_case.php2460DrupalWebTestCase->clickLink()
Clicked link Results () from http://drupaltestbot664-mysql/checkout/?q=content/poll/7Browserupgrade.node.test101PollUpgradePathTestCase->testPollUpgrade()
Choice text is displayed correctly on result viewOtherupgrade.node.test104PollUpgradePathTestCase->testPollUpgrade()
Choice text is displayed correctly on result viewOtherupgrade.node.test104PollUpgradePathTestCase->testPollUpgrade()
Choice text is displayed correctly on result viewOtherupgrade.node.test104PollUpgradePathTestCase->testPollUpgrade()
Choice text is displayed correctly on result viewOtherupgrade.node.test104PollUpgradePathTestCase->testPollUpgrade()
Choice text is displayed correctly on result viewOtherupgrade.node.test104PollUpgradePathTestCase->testPollUpgrade()
Undefined offset: 0Noticeupgrade.node.test112PollUpgradePathTestCase->testPollUpgrade()
Undefined offset: 0Noticeupgrade.node.test112PollUpgradePathTestCase->testPollUpgrade()
The number of votes is displayed correctly: expected 2, got Otherupgrade.node.test112PollUpgradePathTestCase->testPollUpgrade()
Undefined offset: 1Noticeupgrade.node.test112PollUpgradePathTestCase->testPollUpgrade()
Undefined offset: 1Noticeupgrade.node.test112PollUpgradePathTestCase->testPollUpgrade()
The number of votes is displayed correctly: expected 2, got Otherupgrade.node.test112PollUpgradePathTestCase->testPollUpgrade()
Undefined offset: 2Noticeupgrade.node.test112PollUpgradePathTestCase->testPollUpgrade()
Undefined offset: 2Noticeupgrade.node.test112PollUpgradePathTestCase->testPollUpgrade()
The number of votes is displayed correctly: expected 2, got Otherupgrade.node.test112PollUpgradePathTestCase->testPollUpgrade()
Undefined offset: 3Noticeupgrade.node.test112PollUpgradePathTestCase->testPollUpgrade()
Undefined offset: 3Noticeupgrade.node.test112PollUpgradePathTestCase->testPollUpgrade()
The number of votes is displayed correctly: expected 1, got Otherupgrade.node.test112PollUpgradePathTestCase->testPollUpgrade()
Undefined offset: 4Noticeupgrade.node.test112PollUpgradePathTestCase->testPollUpgrade()
Undefined offset: 4Noticeupgrade.node.test112PollUpgradePathTestCase->testPollUpgrade()
The number of votes is displayed correctly: expected 1, got Otherupgrade.node.test112PollUpgradePathTestCase->testPollUpgrade()
SQLSTATE[42S02]: Base table or view not found: 1146 Table 'drupaltestbotmysql.simpletest631049block_node_type' doesn't exist: SELECT module, delta, type FROM {block_node_type}; Array ( ) PDOExceptionnode.module2373node_block_list_alter()
Choice text is displayed correctly on poll viewOtherupgrade.node.test97PollUpgradePathTestCase->testPollUpgrade()
Choice text is displayed correctly on poll viewOtherupgrade.node.test97PollUpgradePathTestCase->testPollUpgrade()
Undefined variable: url_targetNoticedrupal_web_test_case.php2460DrupalWebTestCase->clickLink()
Clicked link Results () from http://drupaltestbot664-mysql/checkout/?q=content/poll/8Browserupgrade.node.test101PollUpgradePathTestCase->testPollUpgrade()
Choice text is displayed correctly on result viewOtherupgrade.node.test104PollUpgradePathTestCase->testPollUpgrade()
Choice text is displayed correctly on result viewOtherupgrade.node.test104PollUpgradePathTestCase->testPollUpgrade()
Undefined offset: 0Noticeupgrade.node.test112PollUpgradePathTestCase->testPollUpgrade()
Undefined offset: 0Noticeupgrade.node.test112PollUpgradePathTestCase->testPollUpgrade()
The number of votes is displayed correctly: expected 3, got Otherupgrade.node.test112PollUpgradePathTestCase->testPollUpgrade()
Undefined offset: 1Noticeupgrade.node.test112PollUpgradePathTestCase->testPollUpgrade()
Undefined offset: 1Noticeupgrade.node.test112PollUpgradePathTestCase->testPollUpgrade()
The number of votes is displayed correctly: expected 2, got Otherupgrade.node.test112PollUpgradePathTestCase->testPollUpgrade()
SQLSTATE[42S02]: Base table or view not found: 1146 Table 'drupaltestbotmysql.simpletest631049block_node_type' doesn't exist: SELECT module, delta, type FROM {block_node_type}; Array ( ) PDOExceptionnode.module2373node_block_list_alter()
Choice text is displayed correctly on poll viewOtherupgrade.node.test97PollUpgradePathTestCase->testPollUpgrade()
Choice text is displayed correctly on poll viewOtherupgrade.node.test97PollUpgradePathTestCase->testPollUpgrade()
Choice text is displayed correctly on poll viewOtherupgrade.node.test97PollUpgradePathTestCase->testPollUpgrade()
Undefined variable: url_targetNoticedrupal_web_test_case.php2460DrupalWebTestCase->clickLink()
Clicked link Results () from http://drupaltestbot664-mysql/checkout/?q=content/poll/9Browserupgrade.node.test101PollUpgradePathTestCase->testPollUpgrade()
Choice text is displayed correctly on result viewOtherupgrade.node.test104PollUpgradePathTestCase->testPollUpgrade()
Choice text is displayed correctly on result viewOtherupgrade.node.test104PollUpgradePathTestCase->testPollUpgrade()
Choice text is displayed correctly on result viewOtherupgrade.node.test104PollUpgradePathTestCase->testPollUpgrade()
Undefined offset: 0Noticeupgrade.node.test112PollUpgradePathTestCase->testPollUpgrade()
Undefined offset: 0Noticeupgrade.node.test112PollUpgradePathTestCase->testPollUpgrade()
The number of votes is displayed correctly: expected 2, got Otherupgrade.node.test112PollUpgradePathTestCase->testPollUpgrade()
Undefined offset: 1Noticeupgrade.node.test112PollUpgradePathTestCase->testPollUpgrade()
Undefined offset: 1Noticeupgrade.node.test112PollUpgradePathTestCase->testPollUpgrade()
The number of votes is displayed correctly: expected 2, got Otherupgrade.node.test112PollUpgradePathTestCase->testPollUpgrade()
Undefined offset: 2Noticeupgrade.node.test112PollUpgradePathTestCase->testPollUpgrade()
Undefined offset: 2Noticeupgrade.node.test112PollUpgradePathTestCase->testPollUpgrade()
The number of votes is displayed correctly: expected 2, got Otherupgrade.node.test112PollUpgradePathTestCase->testPollUpgrade()
SQLSTATE[42S02]: Base table or view not found: 1146 Table 'drupaltestbotmysql.simpletest631049block_node_type' doesn't exist: SELECT module, delta, type FROM {block_node_type}; Array ( ) PDOExceptionnode.module2373node_block_list_alter()
Choice text is displayed correctly on poll viewOtherupgrade.node.test97PollUpgradePathTestCase->testPollUpgrade()
Choice text is displayed correctly on poll viewOtherupgrade.node.test97PollUpgradePathTestCase->testPollUpgrade()
Choice text is displayed correctly on poll viewOtherupgrade.node.test97PollUpgradePathTestCase->testPollUpgrade()
Choice text is displayed correctly on poll viewOtherupgrade.node.test97PollUpgradePathTestCase->testPollUpgrade()
Undefined variable: url_targetNoticedrupal_web_test_case.php2460DrupalWebTestCase->clickLink()
Clicked link Results () from http://drupaltestbot664-mysql/checkout/?q=content/poll/10Browserupgrade.node.test101PollUpgradePathTestCase->testPollUpgrade()
Choice text is displayed correctly on result viewOtherupgrade.node.test104PollUpgradePathTestCase->testPollUpgrade()
Choice text is displayed correctly on result viewOtherupgrade.node.test104PollUpgradePathTestCase->testPollUpgrade()
Choice text is displayed correctly on result viewOtherupgrade.node.test104PollUpgradePathTestCase->testPollUpgrade()
Choice text is displayed correctly on result viewOtherupgrade.node.test104PollUpgradePathTestCase->testPollUpgrade()
Undefined offset: 0Noticeupgrade.node.test112PollUpgradePathTestCase->testPollUpgrade()
Undefined offset: 0Noticeupgrade.node.test112PollUpgradePathTestCase->testPollUpgrade()
The number of votes is displayed correctly: expected 2, got Otherupgrade.node.test112PollUpgradePathTestCase->testPollUpgrade()
Undefined offset: 1Noticeupgrade.node.test112PollUpgradePathTestCase->testPollUpgrade()
Undefined offset: 1Noticeupgrade.node.test112PollUpgradePathTestCase->testPollUpgrade()
The number of votes is displayed correctly: expected 2, got Otherupgrade.node.test112PollUpgradePathTestCase->testPollUpgrade()
Undefined offset: 2Noticeupgrade.node.test112PollUpgradePathTestCase->testPollUpgrade()
Undefined offset: 2Noticeupgrade.node.test112PollUpgradePathTestCase->testPollUpgrade()
The number of votes is displayed correctly: expected 2, got Otherupgrade.node.test112PollUpgradePathTestCase->testPollUpgrade()
Undefined offset: 3Noticeupgrade.node.test112PollUpgradePathTestCase->testPollUpgrade()
Undefined offset: 3Noticeupgrade.node.test112PollUpgradePathTestCase->testPollUpgrade()
The number of votes is displayed correctly: expected 1, got Otherupgrade.node.test112PollUpgradePathTestCase->testPollUpgrade()
SQLSTATE[42S02]: Base table or view not found: 1146 Table 'drupaltestbotmysql.simpletest631049block_node_type' doesn't exist: SELECT module, delta, type FROM {block_node_type}; Array ( ) PDOExceptionnode.module2373node_block_list_alter()
Choice text is displayed correctly on poll viewOtherupgrade.node.test97PollUpgradePathTestCase->testPollUpgrade()
Choice text is displayed correctly on poll viewOtherupgrade.node.test97PollUpgradePathTestCase->testPollUpgrade()
Choice text is displayed correctly on poll viewOtherupgrade.node.test97PollUpgradePathTestCase->testPollUpgrade()
Choice text is displayed correctly on poll viewOtherupgrade.node.test97PollUpgradePathTestCase->testPollUpgrade()
Choice text is displayed correctly on poll viewOtherupgrade.node.test97PollUpgradePathTestCase->testPollUpgrade()
Undefined variable: url_targetNoticedrupal_web_test_case.php2460DrupalWebTestCase->clickLink()
Clicked link Results () from http://drupaltestbot664-mysql/checkout/?q=content/poll/11Browserupgrade.node.test101PollUpgradePathTestCase->testPollUpgrade()
Choice text is displayed correctly on result viewOtherupgrade.node.test104PollUpgradePathTestCase->testPollUpgrade()
Choice text is displayed correctly on result viewOtherupgrade.node.test104PollUpgradePathTestCase->testPollUpgrade()
Choice text is displayed correctly on result viewOtherupgrade.node.test104PollUpgradePathTestCase->testPollUpgrade()
Choice text is displayed correctly on result viewOtherupgrade.node.test104PollUpgradePathTestCase->testPollUpgrade()
Choice text is displayed correctly on result viewOtherupgrade.node.test104PollUpgradePathTestCase->testPollUpgrade()
Undefined offset: 0Noticeupgrade.node.test112PollUpgradePathTestCase->testPollUpgrade()
Undefined offset: 0Noticeupgrade.node.test112PollUpgradePathTestCase->testPollUpgrade()
The number of votes is displayed correctly: expected 2, got Otherupgrade.node.test112PollUpgradePathTestCase->testPollUpgrade()
Undefined offset: 1Noticeupgrade.node.test112PollUpgradePathTestCase->testPollUpgrade()
Undefined offset: 1Noticeupgrade.node.test112PollUpgradePathTestCase->testPollUpgrade()
The number of votes is displayed correctly: expected 2, got Otherupgrade.node.test112PollUpgradePathTestCase->testPollUpgrade()
Undefined offset: 2Noticeupgrade.node.test112PollUpgradePathTestCase->testPollUpgrade()
Undefined offset: 2Noticeupgrade.node.test112PollUpgradePathTestCase->testPollUpgrade()
The number of votes is displayed correctly: expected 2, got Otherupgrade.node.test112PollUpgradePathTestCase->testPollUpgrade()
Undefined offset: 3Noticeupgrade.node.test112PollUpgradePathTestCase->testPollUpgrade()
Undefined offset: 3Noticeupgrade.node.test112PollUpgradePathTestCase->testPollUpgrade()
The number of votes is displayed correctly: expected 1, got Otherupgrade.node.test112PollUpgradePathTestCase->testPollUpgrade()
Undefined offset: 4Noticeupgrade.node.test112PollUpgradePathTestCase->testPollUpgrade()
Undefined offset: 4Noticeupgrade.node.test112PollUpgradePathTestCase->testPollUpgrade()
The number of votes is displayed correctly: expected 1, got Otherupgrade.node.test112PollUpgradePathTestCase->testPollUpgrade()
LeafPollVoteCheckHostname12500
LeafPollVoteTestCase8500
LeafProfileBlockTestCase9100
LeafProfileTestAutocomplete5500
LeafProfileTestBrowsing3300
LeafProfileTestDate5000
LeafProfileTestFields18100
LeafProfileTestSelect4600
LeafProfileTestWeights5400
LeafQueueTestCase700
LeafRdfCommentAttributesTestCase27300
LeafRdfCrudTestCase1000
LeafRdfGetRdfNamespacesTestCase500
LeafRdfMappingDefinitionTestCase6300
LeafRdfMappingHookTestCase600
LeafRdfRdfaMarkupTestCase2900
LeafRdfTrackerAttributesTestCase3300
LeafRegistryParseFilesTestCase600
LeafRegistryParseFileTestCase200
LeafRemoteFileDirectoryTest2400
LeafRemoteFileSaveUploadTest27100
LeafRemoteFileScanDirectoryTest2300
LeafRemoteFileUnmanagedCopyTest3400
LeafRemoteFileUnmanagedDeleteRecursiveTest2100
LeafRemoteFileUnmanagedDeleteTest1100
LeafRemoteFileUnmanagedMoveTest2500
LeafRemoteFileUnmanagedSaveDataTest800
LeafRemoveFeedItemTestCase19700
LeafRemoveFeedTestCase2400
LeafRetrieveFileTestCase700
LeafSchemaTestCase58800
LeafSearchAdvancedSearchForm3200
LeafSearchBlockTestCase6000
LeafSearchCommentCountToggleTestCase3100
LeafSearchCommentTestCase19000
LeafSearchConfigSettingsForm11800
LeafSearchEmbedForm3000
LeafSearchExactTestCase2300
LeafSearchExcerptTestCase1100
LeafSearchExpressionInsertExtractTestCase2400
LeafSearchKeywordsConditions2600
LeafSearchLanguageTestCase4600
LeafSearchMatchTestCase14500
LeafSearchNumberMatchingTestCase29300
LeafSearchNumbersTestCase17300
LeafSearchPageOverride1300
LeafSearchPageText3000
LeafSearchRankingTestCase6300
LeafSearchSimplifyTestCase65100
LeafSearchTokenizerTestCase400
LeafSessionHttpsTestCase8300
LeafSessionTestCase19200
LeafShortcutLinksTestCase10800
LeafShortcutSetsTestCase17600
LeafShutdownFunctionsTest500
LeafSimpleTestBrowserTestCase1600
LeafSimpleTestFolderTestCase200
LeafSimpleTestFunctionalTest11900
LeafSimpleTestMailCaptureTestCase1300
LeafSiteMaintenanceTestCase8000
LeafStatisticsAdminTestCase10800
LeafStatisticsBlockVisitorsTestCase4600
LeafStatisticsLoggingTestCase2600
LeafStatisticsReportsTestCase8600
LeafStatisticsTokenReplaceTestCase3000
LeafStreamWrapperTest1900
LeafSummaryLengthTestCase1500
LeafSyslogTestCase1700
LeafSystemAdminTestCase19300
LeafSystemAuthorizeCase1600
LeafSystemBlockTestCase4500
LeafSystemIndexPhpTest900
LeafSystemInfoAlterTestCase1000
LeafSystemMainContentFallback6700
LeafSystemThemeFunctionalTest9100
LeafTableSortTest600
LeafTaxonomyHooksTestCase2000
LeafTaxonomyLegacyTestCase1400
LeafTaxonomyLoadMultipleUnitTest1700
LeafTaxonomyTermFieldTestCase5500
LeafTaxonomyTermTestCase27800
LeafTaxonomyTermUnitTest100
LeafTaxonomyThemeTestCase1700
LeafTaxonomyTokenReplaceTestCase5300
LeafTaxonomyVocabularyFunctionalTest13600
LeafTaxonomyVocabularyUnitTest10200
LeafTextFieldTestCase21500
LeafTextSummaryTestCase25500
LeafTextTranslationTestCase14700
LeafThemeFastTestCase1100
LeafThemeHookInitUnitTest500
LeafThemeItemListUnitTest200
LeafThemeLinksUnitTest2200
LeafThemeTableUnitTest1200
LeafThemeUnitTest3300
LeafTokenReplaceTestCase3700
LeafTrackerTest29100
LeafTranslationTestCase62300
LeafTriggerContentTestCase35500
LeafTriggerCronTestCase3400
LeafTriggerOrphanedActionsTestCase3800
LeafTriggerOtherTestCase11500
LeafTriggerUserActionTestCase6600
LeafTriggerUserTokenTestCase18600
LeafUnicodeUnitTest17600
LeafUpdateCoreTestCase18300
LeafUpdateDependencyHookInvocationTestCase400
LeafUpdateDependencyMissingTestCase400
LeafUpdateDependencyOrderingTestCase500
LeafUpdateFeedItemTestCase6200
LeafUpdateFeedTestCase7500
LeafUpdateScriptFunctionalTest5600
LeafUpdateTestContribCase18800
LeafUpdateTestUploadCase6400
ExpandUpgradePathTaxonomyTestCase2243
MessageGroupFilenameLineFunctionStatus
No pending updates at the end of the update process.Otherupgrade.test272UpgradePathTestCase->performUpgrade()
The upgrade was completed successfully.Otherupgrade.taxonomy.test49UpgradePathTaxonomyTestCase->testTaxonomyUpgrade()
Undefined index: include_fileNoticemenu.inc500menu_execute_active_handler()
SQLSTATE[42S22]: Column not found: 1054 Unknown column 'machine_name' in 'field list': SELECT name, machine_name, vid FROM {taxonomy_vocabulary}; Array ( ) PDOExceptiontaxonomy.module839taxonomy_vocabulary_get_names()
taxonomy_vocabulary_node_type has been removed.Otherupgrade.taxonomy.test56UpgradePathTaxonomyTestCase->testTaxonomyUpgrade()
taxonomy_term_node has been removed.Otherupgrade.taxonomy.test57UpgradePathTaxonomyTestCase->testTaxonomyUpgrade()
PDOException: SQLSTATE[42S22]: Column not found: 1054 Unknown column 'machine_name' in 'field list': SELECT name, machine_name, vid FROM {taxonomy_vocabulary}; Array ( ) in taxonomy_vocabulary_get_names() (line 839 of /var/lib/drupaltestbot/sites/default/files/checkout/modules/taxonomy/taxonomy.module).Uncaught exceptiondatabase.inc2137PDOStatement->execute()
ExpandUploadUpgradePathTestCase1821
MessageGroupFilenameLineFunctionStatus
No pending updates at the end of the update process.Otherupgrade.test272UpgradePathTestCase->performUpgrade()
The upgrade was completed successfully.Otherupgrade.upload.test32UploadUpgradePathTestCase->testUploadUpgrade()
PDOException: SQLSTATE[42S02]: Base table or view not found: 1146 Table 'drupaltestbotmysql.simpletest92223taxonomy_vocabulary' doesn't exist: SELECT name, machine_name, vid FROM {taxonomy_vocabulary}; Array ( ) in taxonomy_vocabulary_get_names() (line 839 of /var/lib/drupaltestbot/sites/default/files/checkout/modules/taxonomy/taxonomy.module).Uncaught exceptiondatabase.inc2137PDOStatement->execute()
LeafUrlAlterFunctionalTest3000
LeafUserAccountLinksUnitTests2100
LeafUserAdminTestCase6500
LeafUserAuthmapAssignmentTestCase800
LeafUserAutocompleteTestCase2800
LeafUserBlocksUnitTests4300
LeafUserCancelTestCase24600
LeafUserCreateTestCase2700
LeafUserEditedOwnAccountTestCase2300
LeafUserEditTestCase6800
LeafUserLoginTestCase17100
LeafUserPermissionsTestCase5000
LeafUserPictureTestCase8900
LeafUserRegistrationTestCase13700
LeafUserRoleAdminTestCase5300
LeafUserRolesAssignmentTestCase5300
LeafUserSaveTestCase300
LeafUserSignatureTestCase4600
LeafUserTimeZoneFunctionalTest3100
LeafUserTokenReplaceTestCase4300
ExpandUserUpgradePathNoPasswordTokenTestCase1830
MessageGroupFilenameLineFunctionStatus
No pending updates at the end of the update process.Otherupgrade.test272UpgradePathTestCase->performUpgrade()
The upgrade was completed successfully.Otherupgrade.user.test57UserUpgradePathNoPasswordTokenTestCase->testUserUpgrade()
Existing email templates have been modified (password token not involved).Otherupgrade.user.test58UserUpgradePathNoPasswordTokenTestCase->testUserUpgrade()
ExpandUserUpgradePathPasswordTokenTestCase1830
MessageGroupFilenameLineFunctionStatus
No pending updates at the end of the update process.Otherupgrade.test272UpgradePathTestCase->performUpgrade()
The upgrade was completed successfully.Otherupgrade.user.test27UserUpgradePathPasswordTokenTestCase->testUserUpgrade()
Existing email templates have been modified (password token involved).Otherupgrade.user.test28UserUpgradePathPasswordTokenTestCase->testUserUpgrade()
LeafUserUserSearchTestCase3800
LeafUserValidateCurrentPassCustomForm1700
LeafUserValidationTestCase1900
LeafValidUrlTestCase7900
LeafXMLRPCBasicTestCase600
LeafXMLRPCMessagesTestCase700
LeafXMLRPCValidator1IncTestCase1000