core-fix_file_upload-1002048-85.patch

Test status
StatusResult
Last receivedWed, 06/08/2011 - 23:36:57
Last requestedWed, 06/08/2011 - 23:37:03
Last testedThu, 06/09/2011 - 00:09:25
Test count1
Environment status
MySQLfail
File information
Filecore-fix_file_upload-1002048-85.patch
BranchDrupal core - 8.x
LinkIssue Link
SummaryFAILED: [[SimpleTest]]: [MySQL] 29,800 pass(es), 243 fail(s), and 330 exception(s).
Details

MySQL

  1. Setup environment
  2. Detect an invalid patch URL
  3. Detect invalid repository information
  4. Detect invalid patch format
  5. Detect a non-applicable patch
  6. Detect invalid PHP syntax
  7. Detect a Drupal installation failure
  8. Detect a test run failure
  9. Detect a failing test
    Review the test failures below then if necessary run them locally until the problem has been fixed.
  10. Complete test suite with all tests passing
29,800 pass(es), 243 fail(s), and 330 exception(s)

Non-pass

Test namePassFailException
ExpandFileFieldDisplayTestCase20112
MessageGroupFilenameLineFunctionStatus
Undefined index: undNoticefile.test719FileFieldDisplayTestCase->testNodeDisplay()
Undefined property: stdClass::$uriNoticefile.module701theme_file_link()
Undefined property: stdClass::$filemimeNoticefile.module739theme_file_icon()
Undefined property: stdClass::$filemimeNoticefile.module781file_icon_path()
Undefined property: stdClass::$filemimeNoticefile.module823file_icon_map()
Undefined property: stdClass::$filemimeNoticefile.module796file_icon_path()
Undefined property: stdClass::$filemimeNoticefile.module796file_icon_path()
Undefined property: stdClass::$filemimeNoticefile.module796file_icon_path()
Undefined property: stdClass::$filemimeNoticefile.module796file_icon_path()
Undefined property: stdClass::$filemimeNoticefile.module708theme_file_link()
Undefined property: stdClass::$filesizeNoticefile.module708theme_file_link()
Undefined property: stdClass::$filenameNoticefile.module714theme_file_link()
Default formatter displaying correctly on full node view.Otherfile.test721FileFieldDisplayTestCase->testNodeDisplay()
ExpandFileFieldPathTestCase27412
MessageGroupFilenameLineFunctionStatus
Undefined index: undNoticefile.test919FileFieldPathTestCase->testUploadPath()
Undefined property: stdClass::$uriNoticefile.test920FileFieldPathTestCase->testUploadPath()
Undefined property: stdClass::$uriNoticefile.test920FileFieldPathTestCase->testUploadPath()
The file was uploaded to the correct path.Otherfile.test920FileFieldPathTestCase->testUploadPath()
Undefined index: undNoticefile.test930FileFieldPathTestCase->testUploadPath()
Undefined property: stdClass::$uriNoticefile.test931FileFieldPathTestCase->testUploadPath()
Undefined property: stdClass::$uriNoticefile.test931FileFieldPathTestCase->testUploadPath()
The file was uploaded to the correct path.Otherfile.test931FileFieldPathTestCase->testUploadPath()
Undefined index: undNoticefile.test942FileFieldPathTestCase->testUploadPath()
Undefined property: stdClass::$uriNoticefile.test947FileFieldPathTestCase->testUploadPath()
Undefined property: stdClass::$uriNoticefile.test947FileFieldPathTestCase->testUploadPath()
The file was uploaded to the correct path with token replacements.Otherfile.test947FileFieldPathTestCase->testUploadPath()
Undefined index: undNoticefile.test942FileFieldPathTestCase->testUploadPath()
Undefined property: stdClass::$uriNoticefile.test947FileFieldPathTestCase->testUploadPath()
Undefined property: stdClass::$uriNoticefile.test947FileFieldPathTestCase->testUploadPath()
The file was uploaded to the correct path with token replacements.Otherfile.test947FileFieldPathTestCase->testUploadPath()
ExpandFileFieldRevisionTestCase622171
MessageGroupFilenameLineFunctionStatus
Undefined index: undNoticefile.test606FileFieldRevisionTestCase->testRevisions()
Undefined property: stdClass::$uriNoticefile.test174FileFieldTestCase->assertFileExists()
New file saved to disk on node creation.Otherfile.test608FileFieldRevisionTestCase->testRevisions()
Undefined property: stdClass::$fidNoticefile.test182FileFieldTestCase->assertFileEntryExists()
array_flip(): Can only flip STRING and INTEGER values!Warningentity.inc178DrupalDefaultEntityController->load()
Trying to get property of non-objectNoticefile.test184FileFieldTestCase->assertFileEntryExists()
Undefined property: stdClass::$uriNoticefile.test184FileFieldTestCase->assertFileEntryExists()
Undefined property: stdClass::$statusNoticefile.test209FileFieldTestCase->assertFileIsPermanent()
File is permanent.Otherfile.test610FileFieldRevisionTestCase->testRevisions()
Found the Remove buttonOtherfile.test165FileFieldTestCase->replaceNodeFile()
Found the requested form fields at node/1/editOtherfile.test165FileFieldTestCase->replaceNodeFile()
Undefined index: undNoticefile.test615FileFieldRevisionTestCase->testRevisions()
Undefined property: stdClass::$uriNoticefile.test174FileFieldTestCase->assertFileExists()
Replacement file exists on disk after creating new revision.Otherfile.test617FileFieldRevisionTestCase->testRevisions()
Undefined property: stdClass::$fidNoticefile.test182FileFieldTestCase->assertFileEntryExists()
array_flip(): Can only flip STRING and INTEGER values!Warningentity.inc178DrupalDefaultEntityController->load()
Trying to get property of non-objectNoticefile.test184FileFieldTestCase->assertFileEntryExists()
Undefined property: stdClass::$uriNoticefile.test184FileFieldTestCase->assertFileEntryExists()
Undefined property: stdClass::$statusNoticefile.test209FileFieldTestCase->assertFileIsPermanent()
Replacement file is permanent.Otherfile.test619FileFieldRevisionTestCase->testRevisions()
Undefined index: undNoticefile.test623FileFieldRevisionTestCase->testRevisions()
Undefined property: stdClass::$uriNoticefile.test174FileFieldTestCase->assertFileExists()
Original file still in place after replacing file in new revision.Otherfile.test624FileFieldRevisionTestCase->testRevisions()
Undefined property: stdClass::$fidNoticefile.test182FileFieldTestCase->assertFileEntryExists()
array_flip(): Can only flip STRING and INTEGER values!Warningentity.inc178DrupalDefaultEntityController->load()
Trying to get property of non-objectNoticefile.test184FileFieldTestCase->assertFileEntryExists()
Undefined property: stdClass::$uriNoticefile.test184FileFieldTestCase->assertFileEntryExists()
Undefined property: stdClass::$statusNoticefile.test209FileFieldTestCase->assertFileIsPermanent()
Original file is still permanent.Otherfile.test626FileFieldRevisionTestCase->testRevisions()
Undefined index: undNoticefile.test632FileFieldRevisionTestCase->testRevisions()
Undefined property: stdClass::$statusNoticefile.test209FileFieldTestCase->assertFileIsPermanent()
New revision file is permanent.Otherfile.test635FileFieldRevisionTestCase->testRevisions()
Undefined index: undNoticefile.test640FileFieldRevisionTestCase->testRevisions()
Undefined property: stdClass::$statusNoticefile.test209FileFieldTestCase->assertFileIsPermanent()
Original revision file still permanent after reverting to the original revision.Otherfile.test643FileFieldRevisionTestCase->testRevisions()
Undefined property: stdClass::$uriNoticefile.test174FileFieldTestCase->assertFileExists()
Second file is still available after deleting second revision, since it is being used by the third revision.Otherfile.test648FileFieldRevisionTestCase->testRevisions()
Undefined property: stdClass::$fidNoticefile.test182FileFieldTestCase->assertFileEntryExists()
array_flip(): Can only flip STRING and INTEGER values!Warningentity.inc178DrupalDefaultEntityController->load()
Trying to get property of non-objectNoticefile.test184FileFieldTestCase->assertFileEntryExists()
Undefined property: stdClass::$uriNoticefile.test184FileFieldTestCase->assertFileEntryExists()
Undefined property: stdClass::$statusNoticefile.test209FileFieldTestCase->assertFileIsPermanent()
Second file entry is still permanent after deleting second revision, since it is being used by the third revision.Otherfile.test650FileFieldRevisionTestCase->testRevisions()
Undefined index: fidNoticefile.field.inc219file_field_presave()
array_flip(): Can only flip STRING and INTEGER values!Warningentity.inc178DrupalDefaultEntityController->load()
Trying to get property of non-objectNoticefile.field.inc220file_field_presave()
Undefined property: stdClass::$uriNoticefile.inc573file_save()
Undefined index: fidNoticefile.field.inc261file_field_update()
Undefined index: fidNoticefile.field.inc282file_field_update()
Undefined property: stdClass::$fidNoticefile.inc656file_usage_add()
PDOException: SQLSTATE[23000]: Integrity constraint violation: 1048 Column 'fid' cannot be null: INSERT INTO {file_usage} (fid, module, type, id, count) VALUES (:db_insert_placeholder_0, :db_insert_placeholder_1, :db_insert_placeholder_2, :db_insert_placeholder_3, :db_insert_placeholder_4); Array ( [:db_insert_placeholder_0] => [:db_insert_placeholder_1] => file [:db_insert_placeholder_2] => user [:db_insert_placeholder_3] => 3 [:db_insert_placeholder_4] => 1 ) in file_usage_add() (line 663 of /var/lib/drupaltestbot/sites/default/files/checkout/includes/file.inc).Uncaught exceptiondatabase.inc2095PDOStatement->execute()
Found the requested form fields at node/1/editOtherfile.test165FileFieldTestCase->replaceNodeFile()
Undefined index: undNoticefile.test615FileFieldRevisionTestCase->testRevisions()
Undefined property: stdClass::$uriNoticefile.test174FileFieldTestCase->assertFileExists()
Replacement file exists on disk after creating new revision.Otherfile.test617FileFieldRevisionTestCase->testRevisions()
Undefined property: stdClass::$fidNoticefile.test182FileFieldTestCase->assertFileEntryExists()
array_flip(): Can only flip STRING and INTEGER values!Warningentity.inc178DrupalDefaultEntityController->load()
Trying to get property of non-objectNoticefile.test184FileFieldTestCase->assertFileEntryExists()
Undefined property: stdClass::$uriNoticefile.test184FileFieldTestCase->assertFileEntryExists()
Undefined property: stdClass::$statusNoticefile.test209FileFieldTestCase->assertFileIsPermanent()
Replacement file is permanent.Otherfile.test619FileFieldRevisionTestCase->testRevisions()
Undefined index: undNoticefile.test623FileFieldRevisionTestCase->testRevisions()
Undefined property: stdClass::$uriNoticefile.test174FileFieldTestCase->assertFileExists()
Original file still in place after replacing file in new revision.Otherfile.test624FileFieldRevisionTestCase->testRevisions()
Undefined property: stdClass::$fidNoticefile.test182FileFieldTestCase->assertFileEntryExists()
array_flip(): Can only flip STRING and INTEGER values!Warningentity.inc178DrupalDefaultEntityController->load()
Trying to get property of non-objectNoticefile.test184FileFieldTestCase->assertFileEntryExists()
Undefined property: stdClass::$uriNoticefile.test184FileFieldTestCase->assertFileEntryExists()
Undefined property: stdClass::$statusNoticefile.test209FileFieldTestCase->assertFileIsPermanent()
Original file is still permanent.Otherfile.test626FileFieldRevisionTestCase->testRevisions()
Undefined index: undNoticefile.test632FileFieldRevisionTestCase->testRevisions()
Undefined property: stdClass::$statusNoticefile.test209FileFieldTestCase->assertFileIsPermanent()
New revision file is permanent.Otherfile.test635FileFieldRevisionTestCase->testRevisions()
Undefined index: undNoticefile.test640FileFieldRevisionTestCase->testRevisions()
Undefined property: stdClass::$statusNoticefile.test209FileFieldTestCase->assertFileIsPermanent()
Original revision file still permanent after reverting to the original revision.Otherfile.test643FileFieldRevisionTestCase->testRevisions()
Undefined property: stdClass::$uriNoticefile.test174FileFieldTestCase->assertFileExists()
Second file is still available after deleting second revision, since it is being used by the third revision.Otherfile.test648FileFieldRevisionTestCase->testRevisions()
Undefined property: stdClass::$fidNoticefile.test182FileFieldTestCase->assertFileEntryExists()
array_flip(): Can only flip STRING and INTEGER values!Warningentity.inc178DrupalDefaultEntityController->load()
Trying to get property of non-objectNoticefile.test184FileFieldTestCase->assertFileEntryExists()
Undefined property: stdClass::$uriNoticefile.test184FileFieldTestCase->assertFileEntryExists()
Undefined property: stdClass::$statusNoticefile.test209FileFieldTestCase->assertFileIsPermanent()
Second file entry is still permanent after deleting second revision, since it is being used by the third revision.Otherfile.test650FileFieldRevisionTestCase->testRevisions()
Undefined index: fidNoticefile.field.inc219file_field_presave()
array_flip(): Can only flip STRING and INTEGER values!Warningentity.inc178DrupalDefaultEntityController->load()
Trying to get property of non-objectNoticefile.field.inc220file_field_presave()
Undefined property: stdClass::$uriNoticefile.inc573file_save()
Undefined index: fidNoticefile.field.inc261file_field_update()
Undefined index: fidNoticefile.field.inc282file_field_update()
Undefined property: stdClass::$fidNoticefile.inc656file_usage_add()
PDOException: SQLSTATE[23000]: Integrity constraint violation: 1048 Column 'fid' cannot be null: INSERT INTO {file_usage} (fid, module, type, id, count) VALUES (:db_insert_placeholder_0, :db_insert_placeholder_1, :db_insert_placeholder_2, :db_insert_placeholder_3, :db_insert_placeholder_4); Array ( [:db_insert_placeholder_0] => [:db_insert_placeholder_1] => file [:db_insert_placeholder_2] => user [:db_insert_placeholder_3] => 3 [:db_insert_placeholder_4] => 1 ) in file_usage_add() (line 663 of /var/lib/drupaltestbot/sites/default/files/checkout/includes/file.inc).Uncaught exceptiondatabase.inc2095PDOStatement->execute()
ExpandFileFieldValidateTestCase1301060
MessageGroupFilenameLineFunctionStatus
Undefined index: undNoticefile.test771FileFieldValidateTestCase->testRequired()
Undefined property: stdClass::$uriNoticefile.test174FileFieldTestCase->assertFileExists()
File exists after uploading to the required field.Otherfile.test772FileFieldValidateTestCase->testRequired()
Undefined property: stdClass::$fidNoticefile.test182FileFieldTestCase->assertFileEntryExists()
array_flip(): Can only flip STRING and INTEGER values!Warningentity.inc178DrupalDefaultEntityController->load()
Trying to get property of non-objectNoticefile.test184FileFieldTestCase->assertFileEntryExists()
Undefined property: stdClass::$uriNoticefile.test184FileFieldTestCase->assertFileEntryExists()
Undefined index: undNoticefile.test787FileFieldValidateTestCase->testRequired()
Undefined property: stdClass::$uriNoticefile.test174FileFieldTestCase->assertFileExists()
File exists after uploading to the required multiple value field.Otherfile.test788FileFieldValidateTestCase->testRequired()
Undefined property: stdClass::$fidNoticefile.test182FileFieldTestCase->assertFileEntryExists()
array_flip(): Can only flip STRING and INTEGER values!Warningentity.inc178DrupalDefaultEntityController->load()
Trying to get property of non-objectNoticefile.test184FileFieldTestCase->assertFileEntryExists()
Undefined property: stdClass::$uriNoticefile.test184FileFieldTestCase->assertFileEntryExists()
Undefined index: undNoticefile.test771FileFieldValidateTestCase->testRequired()
Undefined property: stdClass::$uriNoticefile.test174FileFieldTestCase->assertFileExists()
File exists after uploading to the required field.Otherfile.test772FileFieldValidateTestCase->testRequired()
Undefined property: stdClass::$fidNoticefile.test182FileFieldTestCase->assertFileEntryExists()
array_flip(): Can only flip STRING and INTEGER values!Warningentity.inc178DrupalDefaultEntityController->load()
Trying to get property of non-objectNoticefile.test184FileFieldTestCase->assertFileEntryExists()
Undefined property: stdClass::$uriNoticefile.test184FileFieldTestCase->assertFileEntryExists()
Undefined index: undNoticefile.test787FileFieldValidateTestCase->testRequired()
Undefined property: stdClass::$uriNoticefile.test174FileFieldTestCase->assertFileExists()
File exists after uploading to the required multiple value field.Otherfile.test788FileFieldValidateTestCase->testRequired()
Undefined property: stdClass::$fidNoticefile.test182FileFieldTestCase->assertFileEntryExists()
array_flip(): Can only flip STRING and INTEGER values!Warningentity.inc178DrupalDefaultEntityController->load()
Trying to get property of non-objectNoticefile.test184FileFieldTestCase->assertFileEntryExists()
Undefined property: stdClass::$uriNoticefile.test184FileFieldTestCase->assertFileEntryExists()
Undefined index: undNoticefile.test823FileFieldValidateTestCase->testFileMaxSize()
Undefined property: stdClass::$uriNoticefile.test174FileFieldTestCase->assertFileExists()
File exists after uploading a file (128 KB) under the max limit (1M).Otherfile.test824FileFieldValidateTestCase->testFileMaxSize()
Undefined property: stdClass::$fidNoticefile.test182FileFieldTestCase->assertFileEntryExists()
array_flip(): Can only flip STRING and INTEGER values!Warningentity.inc178DrupalDefaultEntityController->load()
Trying to get property of non-objectNoticefile.test184FileFieldTestCase->assertFileEntryExists()
Undefined property: stdClass::$uriNoticefile.test184FileFieldTestCase->assertFileEntryExists()
Undefined index: undNoticefile.test823FileFieldValidateTestCase->testFileMaxSize()
Undefined property: stdClass::$uriNoticefile.test174FileFieldTestCase->assertFileExists()
File exists after uploading a file (128 KB) under the max limit (1024K).Otherfile.test824FileFieldValidateTestCase->testFileMaxSize()
Undefined property: stdClass::$fidNoticefile.test182FileFieldTestCase->assertFileEntryExists()
array_flip(): Can only flip STRING and INTEGER values!Warningentity.inc178DrupalDefaultEntityController->load()
Trying to get property of non-objectNoticefile.test184FileFieldTestCase->assertFileEntryExists()
Undefined property: stdClass::$uriNoticefile.test184FileFieldTestCase->assertFileEntryExists()
Undefined index: undNoticefile.test823FileFieldValidateTestCase->testFileMaxSize()
Undefined property: stdClass::$uriNoticefile.test174FileFieldTestCase->assertFileExists()
File exists after uploading a file (128 KB) under the max limit (1048576).Otherfile.test824FileFieldValidateTestCase->testFileMaxSize()
Undefined property: stdClass::$fidNoticefile.test182FileFieldTestCase->assertFileEntryExists()
array_flip(): Can only flip STRING and INTEGER values!Warningentity.inc178DrupalDefaultEntityController->load()
Trying to get property of non-objectNoticefile.test184FileFieldTestCase->assertFileEntryExists()
Undefined property: stdClass::$uriNoticefile.test184FileFieldTestCase->assertFileEntryExists()
Undefined index: undNoticefile.test839FileFieldValidateTestCase->testFileMaxSize()
Undefined property: stdClass::$uriNoticefile.test174FileFieldTestCase->assertFileExists()
File exists after uploading a file (1.25 MB) with no max limit.Otherfile.test840FileFieldValidateTestCase->testFileMaxSize()
Undefined property: stdClass::$fidNoticefile.test182FileFieldTestCase->assertFileEntryExists()
array_flip(): Can only flip STRING and INTEGER values!Warningentity.inc178DrupalDefaultEntityController->load()
Trying to get property of non-objectNoticefile.test184FileFieldTestCase->assertFileEntryExists()
Undefined property: stdClass::$uriNoticefile.test184FileFieldTestCase->assertFileEntryExists()
Undefined index: undNoticefile.test866FileFieldValidateTestCase->testFileExtension()
Undefined property: stdClass::$uriNoticefile.test174FileFieldTestCase->assertFileExists()
File exists after uploading a file with no extension checking.Otherfile.test867FileFieldValidateTestCase->testFileExtension()
Undefined property: stdClass::$fidNoticefile.test182FileFieldTestCase->assertFileEntryExists()
array_flip(): Can only flip STRING and INTEGER values!Warningentity.inc178DrupalDefaultEntityController->load()
Trying to get property of non-objectNoticefile.test184FileFieldTestCase->assertFileEntryExists()
Undefined property: stdClass::$uriNoticefile.test184FileFieldTestCase->assertFileEntryExists()
Undefined index: undNoticefile.test884FileFieldValidateTestCase->testFileExtension()
Undefined property: stdClass::$uriNoticefile.test174FileFieldTestCase->assertFileExists()
File exists after uploading a file with extension checking.Otherfile.test885FileFieldValidateTestCase->testFileExtension()
Undefined property: stdClass::$fidNoticefile.test182FileFieldTestCase->assertFileEntryExists()
array_flip(): Can only flip STRING and INTEGER values!Warningentity.inc178DrupalDefaultEntityController->load()
Trying to get property of non-objectNoticefile.test184FileFieldTestCase->assertFileEntryExists()
Undefined property: stdClass::$uriNoticefile.test184FileFieldTestCase->assertFileEntryExists()
ExpandFileFieldWidgetTestCase1934641
MessageGroupFilenameLineFunctionStatus
Undefined index: undNoticefile.test338FileFieldWidgetTestCase->testSingleValuedWidget()
Undefined property: stdClass::$uriNoticefile.test174FileFieldTestCase->assertFileExists()
New file saved to disk on node creation.Otherfile.test339FileFieldWidgetTestCase->testSingleValuedWidget()
Undefined property: stdClass::$uriNoticefile.test342FileFieldWidgetTestCase->testSingleValuedWidget()
Node with file does not display the "Upload" button.Otherfile.test347FileFieldWidgetTestCase->testSingleValuedWidget()
Node with file displays the "Remove" button.Otherfile.test348FileFieldWidgetTestCase->testSingleValuedWidget()
Found the Remove buttonOtherfile.test353FileFieldWidgetTestCase->testSingleValuedWidget()
Found the requested form fields at Otherfile.test353FileFieldWidgetTestCase->testSingleValuedWidget()
Undefined index: undNoticefile.test338FileFieldWidgetTestCase->testSingleValuedWidget()
Undefined property: stdClass::$uriNoticefile.test174FileFieldTestCase->assertFileExists()
New file saved to disk on node creation.Otherfile.test339FileFieldWidgetTestCase->testSingleValuedWidget()
Undefined property: stdClass::$uriNoticefile.test342FileFieldWidgetTestCase->testSingleValuedWidget()
Node with file does not display the "Upload" button.Otherfile.test347FileFieldWidgetTestCase->testSingleValuedWidget()
Node with file displays the "Remove" button.Otherfile.test348FileFieldWidgetTestCase->testSingleValuedWidget()
Undefined offset: 0Noticefile.test357FileFieldWidgetTestCase->testSingleValuedWidget()
Undefined offset: 0Noticefile.test357FileFieldWidgetTestCase->testSingleValuedWidget()
Undefined offset: 0Noticedrupal_web_test_case.php1950DrupalWebTestCase->drupalPostAJAX()
Undefined index: Noticedrupal_web_test_case.php1951DrupalWebTestCase->drupalPostAJAX()
Undefined index: #ajaxNoticeajax.inc368ajax_form_callback()
Undefined index: undNoticefile.test338FileFieldWidgetTestCase->testSingleValuedWidget()
Undefined property: stdClass::$uriNoticefile.test174FileFieldTestCase->assertFileExists()
New file saved to disk on node creation.Otherfile.test339FileFieldWidgetTestCase->testSingleValuedWidget()
Undefined property: stdClass::$uriNoticefile.test342FileFieldWidgetTestCase->testSingleValuedWidget()
Node with file does not display the "Upload" button.Otherfile.test347FileFieldWidgetTestCase->testSingleValuedWidget()
Node with file displays the "Remove" button.Otherfile.test348FileFieldWidgetTestCase->testSingleValuedWidget()
Found the Remove buttonOtherfile.test353FileFieldWidgetTestCase->testSingleValuedWidget()
Found the requested form fields at Otherfile.test353FileFieldWidgetTestCase->testSingleValuedWidget()
Undefined index: undNoticefile.test338FileFieldWidgetTestCase->testSingleValuedWidget()
Undefined property: stdClass::$uriNoticefile.test174FileFieldTestCase->assertFileExists()
New file saved to disk on node creation.Otherfile.test339FileFieldWidgetTestCase->testSingleValuedWidget()
Undefined property: stdClass::$uriNoticefile.test342FileFieldWidgetTestCase->testSingleValuedWidget()
Node with file does not display the "Upload" button.Otherfile.test347FileFieldWidgetTestCase->testSingleValuedWidget()
Node with file displays the "Remove" button.Otherfile.test348FileFieldWidgetTestCase->testSingleValuedWidget()
Undefined offset: 0Noticefile.test357FileFieldWidgetTestCase->testSingleValuedWidget()
Undefined offset: 0Noticefile.test357FileFieldWidgetTestCase->testSingleValuedWidget()
Undefined offset: 0Noticedrupal_web_test_case.php1950DrupalWebTestCase->drupalPostAJAX()
Undefined index: Noticedrupal_web_test_case.php1951DrupalWebTestCase->drupalPostAJAX()
Undefined index: #ajaxNoticeajax.inc368ajax_form_callback()
Failed to set field files[d0tqpas0_und_1] to /var/lib/drupaltestbot/sites/default/files/checkout/sites/default/files/simpletest/652634/text-0.txtOtherfile.test399FileFieldWidgetTestCase->testMultiValuedWidget()
Found the requested form fields at Otherfile.test399FileFieldWidgetTestCase->testMultiValuedWidget()
Failed to set field files[d0tqpas0_und_2] to /var/lib/drupaltestbot/sites/default/files/checkout/sites/default/files/simpletest/652634/text-0.txtOtherfile.test399FileFieldWidgetTestCase->testMultiValuedWidget()
Found the requested form fields at Otherfile.test399FileFieldWidgetTestCase->testMultiValuedWidget()
After uploading 3 files, the "Upload" button is no longer displayed.Otherfile.test401FileFieldWidgetTestCase->testMultiValuedWidget()
There are 3 "Remove" buttons displayed (JSMode=nojs).Otherfile.test414FileFieldWidgetTestCase->testMultiValuedWidget()
Found the Remove buttonOtherfile.test435FileFieldWidgetTestCase->testMultiValuedWidget()
Found the requested form fields at Otherfile.test435FileFieldWidgetTestCase->testMultiValuedWidget()
After removing a file, an "Upload" button is displayed (JSMode=%type).Otherfile.test448FileFieldWidgetTestCase->testMultiValuedWidget()
There are 2 "Remove" buttons displayed (JSMode=nojs).Otherfile.test414FileFieldWidgetTestCase->testMultiValuedWidget()
Found the Remove buttonOtherfile.test435FileFieldWidgetTestCase->testMultiValuedWidget()
Found the requested form fields at Otherfile.test435FileFieldWidgetTestCase->testMultiValuedWidget()
After removing a file, an "Upload" button is displayed (JSMode=%type).Otherfile.test448FileFieldWidgetTestCase->testMultiValuedWidget()
There are 1 "Remove" buttons displayed (JSMode=nojs).Otherfile.test414FileFieldWidgetTestCase->testMultiValuedWidget()
Found the Remove buttonOtherfile.test435FileFieldWidgetTestCase->testMultiValuedWidget()
Found the requested form fields at Otherfile.test435FileFieldWidgetTestCase->testMultiValuedWidget()
Failed to set field files[d0tqpas0_und_1] to /var/lib/drupaltestbot/sites/default/files/checkout/sites/default/files/simpletest/652634/text-0.txtOtherfile.test399FileFieldWidgetTestCase->testMultiValuedWidget()
Found the requested form fields at Otherfile.test399FileFieldWidgetTestCase->testMultiValuedWidget()
Failed to set field files[d0tqpas0_und_2] to /var/lib/drupaltestbot/sites/default/files/checkout/sites/default/files/simpletest/652634/text-0.txtOtherfile.test399FileFieldWidgetTestCase->testMultiValuedWidget()
Found the requested form fields at Otherfile.test399FileFieldWidgetTestCase->testMultiValuedWidget()
After uploading 3 files, the "Upload" button is no longer displayed.Otherfile.test401FileFieldWidgetTestCase->testMultiValuedWidget()
There are 3 "Remove" buttons displayed (JSMode=js).Otherfile.test414FileFieldWidgetTestCase->testMultiValuedWidget()
Undefined offset: 0Noticedrupal_web_test_case.php1950DrupalWebTestCase->drupalPostAJAX()
Undefined index: Noticedrupal_web_test_case.php1951DrupalWebTestCase->drupalPostAJAX()
Undefined index: #ajaxNoticeajax.inc368ajax_form_callback()
After removing a file, an "Upload" button is displayed (JSMode=%type).Otherfile.test448FileFieldWidgetTestCase->testMultiValuedWidget()
There are 2 "Remove" buttons displayed (JSMode=js).Otherfile.test414FileFieldWidgetTestCase->testMultiValuedWidget()
Undefined offset: 0Noticedrupal_web_test_case.php1950DrupalWebTestCase->drupalPostAJAX()
Undefined index: Noticedrupal_web_test_case.php1951DrupalWebTestCase->drupalPostAJAX()
Undefined index: #ajaxNoticeajax.inc368ajax_form_callback()
After removing a file, an "Upload" button is displayed (JSMode=%type).Otherfile.test448FileFieldWidgetTestCase->testMultiValuedWidget()
There are 1 "Remove" buttons displayed (JSMode=js).Otherfile.test414FileFieldWidgetTestCase->testMultiValuedWidget()
Undefined offset: 0Noticedrupal_web_test_case.php1950DrupalWebTestCase->drupalPostAJAX()
Undefined index: Noticedrupal_web_test_case.php1951DrupalWebTestCase->drupalPostAJAX()
Undefined index: #ajaxNoticeajax.inc368ajax_form_callback()
Undefined index: undNoticefile.test485FileFieldWidgetTestCase->testPrivateFileSetting()
Undefined property: stdClass::$uriNoticefile.test174FileFieldTestCase->assertFileExists()
New file saved to disk on node creation.Otherfile.test486FileFieldWidgetTestCase->testPrivateFileSetting()
Undefined property: stdClass::$uriNoticefile.test489FileFieldWidgetTestCase->testPrivateFileSetting()
Upload destination setting disabled.Otherfile.test495FileFieldWidgetTestCase->testPrivateFileSetting()
Undefined offset: 1Noticefile.test544FileFieldWidgetTestCase->testPrivateFileComment()
array_flip(): Can only flip STRING and INTEGER values!Warningentity.inc178DrupalDefaultEntityController->load()
Trying to get property of non-objectNoticefile.test550FileFieldWidgetTestCase->testPrivateFileComment()
Undefined property: stdClass::$uriNoticefile.test174FileFieldTestCase->assertFileExists()
New file saved to disk on node creation.Otherfile.test551FileFieldWidgetTestCase->testPrivateFileComment()
Undefined property: stdClass::$uriNoticefile.test553FileFieldWidgetTestCase->testPrivateFileComment()
Undefined property: stdClass::$uriNoticefile.test555FileFieldWidgetTestCase->testPrivateFileComment()
Undefined property: stdClass::$uriNoticefile.test560FileFieldWidgetTestCase->testPrivateFileComment()
Confirmed that access is denied for the file without the needed permission.Browserfile.test561FileFieldWidgetTestCase->testPrivateFileComment()
ExpandFileManagedFileElementTestCase2663724
MessageGroupFilenameLineFunctionStatus
New file got saved.Otherfile.test249FileManagedFileElementTestCase->testManagedFile()
Submit handler has correct file info.Otherfile.test250FileManagedFileElementTestCase->testManagedFile()
New file got uploaded.Otherfile.test269FileManagedFileElementTestCase->testManagedFile()
Found the Remove buttonOtherfile.test279FileManagedFileElementTestCase->testManagedFile()
Found the requested form fields at Otherfile.test279FileManagedFileElementTestCase->testManagedFile()
New file got saved.Otherfile.test249FileManagedFileElementTestCase->testManagedFile()
Submit handler has correct file info.Otherfile.test250FileManagedFileElementTestCase->testManagedFile()
New file got uploaded.Otherfile.test269FileManagedFileElementTestCase->testManagedFile()
Found the Remove buttonOtherfile.test279FileManagedFileElementTestCase->testManagedFile()
Found the requested form fields at Otherfile.test279FileManagedFileElementTestCase->testManagedFile()
Found the Remove buttonOtherfile.test293FileManagedFileElementTestCase->testManagedFile()
Found the requested form fields at Otherfile.test293FileManagedFileElementTestCase->testManagedFile()
New file got uploaded.Otherfile.test269FileManagedFileElementTestCase->testManagedFile()
Undefined offset: 0Noticedrupal_web_test_case.php1950DrupalWebTestCase->drupalPostAJAX()
Undefined index: Noticedrupal_web_test_case.php1951DrupalWebTestCase->drupalPostAJAX()
Undefined index: callbackNoticeajax.inc368ajax_form_callback()
Undefined offset: 0Noticedrupal_web_test_case.php1950DrupalWebTestCase->drupalPostAJAX()
Undefined index: Noticedrupal_web_test_case.php1951DrupalWebTestCase->drupalPostAJAX()
Undefined index: callbackNoticeajax.inc368ajax_form_callback()
New file got saved.Otherfile.test249FileManagedFileElementTestCase->testManagedFile()
Submit handler has correct file info.Otherfile.test250FileManagedFileElementTestCase->testManagedFile()
New file got uploaded.Otherfile.test269FileManagedFileElementTestCase->testManagedFile()
Found the Remove buttonOtherfile.test279FileManagedFileElementTestCase->testManagedFile()
Found the requested form fields at Otherfile.test279FileManagedFileElementTestCase->testManagedFile()
Found the Remove buttonOtherfile.test293FileManagedFileElementTestCase->testManagedFile()
Found the requested form fields at Otherfile.test293FileManagedFileElementTestCase->testManagedFile()
New file got uploaded.Otherfile.test269FileManagedFileElementTestCase->testManagedFile()
Undefined offset: 0Noticedrupal_web_test_case.php1950DrupalWebTestCase->drupalPostAJAX()
Undefined index: Noticedrupal_web_test_case.php1951DrupalWebTestCase->drupalPostAJAX()
Undefined index: callbackNoticeajax.inc368ajax_form_callback()
Undefined offset: 0Noticedrupal_web_test_case.php1950DrupalWebTestCase->drupalPostAJAX()
Undefined index: Noticedrupal_web_test_case.php1951DrupalWebTestCase->drupalPostAJAX()
Undefined index: callbackNoticeajax.inc368ajax_form_callback()
New file got saved.Otherfile.test249FileManagedFileElementTestCase->testManagedFile()
Submit handler has correct file info.Otherfile.test250FileManagedFileElementTestCase->testManagedFile()
New file got uploaded.Otherfile.test269FileManagedFileElementTestCase->testManagedFile()
Found the Remove buttonOtherfile.test279FileManagedFileElementTestCase->testManagedFile()
Found the requested form fields at Otherfile.test279FileManagedFileElementTestCase->testManagedFile()
Found the Remove buttonOtherfile.test293FileManagedFileElementTestCase->testManagedFile()
Found the requested form fields at Otherfile.test293FileManagedFileElementTestCase->testManagedFile()
New file got uploaded.Otherfile.test269FileManagedFileElementTestCase->testManagedFile()
Undefined offset: 0Noticedrupal_web_test_case.php1950DrupalWebTestCase->drupalPostAJAX()
Undefined index: Noticedrupal_web_test_case.php1951DrupalWebTestCase->drupalPostAJAX()
Undefined index: callbackNoticeajax.inc368ajax_form_callback()
Undefined offset: 0Noticedrupal_web_test_case.php1950DrupalWebTestCase->drupalPostAJAX()
Undefined index: Noticedrupal_web_test_case.php1951DrupalWebTestCase->drupalPostAJAX()
Undefined index: callbackNoticeajax.inc368ajax_form_callback()
New file got saved.Otherfile.test249FileManagedFileElementTestCase->testManagedFile()
Submit handler has correct file info.Otherfile.test250FileManagedFileElementTestCase->testManagedFile()
New file got uploaded.Otherfile.test269FileManagedFileElementTestCase->testManagedFile()
Found the Remove buttonOtherfile.test279FileManagedFileElementTestCase->testManagedFile()
Found the requested form fields at Otherfile.test279FileManagedFileElementTestCase->testManagedFile()
Found the Remove buttonOtherfile.test293FileManagedFileElementTestCase->testManagedFile()
Found the requested form fields at Otherfile.test293FileManagedFileElementTestCase->testManagedFile()
New file got uploaded.Otherfile.test269FileManagedFileElementTestCase->testManagedFile()
Undefined offset: 0Noticedrupal_web_test_case.php1950DrupalWebTestCase->drupalPostAJAX()
Undefined index: Noticedrupal_web_test_case.php1951DrupalWebTestCase->drupalPostAJAX()
Undefined index: callbackNoticeajax.inc368ajax_form_callback()
Undefined offset: 0Noticedrupal_web_test_case.php1950DrupalWebTestCase->drupalPostAJAX()
Undefined index: Noticedrupal_web_test_case.php1951DrupalWebTestCase->drupalPostAJAX()
Undefined index: callbackNoticeajax.inc368ajax_form_callback()
ExpandFileSaveUploadTest2174610
MessageGroupFilenameLineFunctionStatus
Found the success message.Otherfile.test595FileSaveUploadTest->setUp()
Expected hooks validate, insert to be called but insert was not called.Otherfile.test599FileSaveUploadTest->setUp()
A new file was created.Otherfile.test608FileSaveUploadTest->testNormal()
array_flip(): Can only flip STRING and INTEGER values!Warningentity.inc178DrupalDefaultEntityController->load()
Loaded the file.Otherfile.test610FileSaveUploadTest->testNormal()
Trying to get property of non-objectNoticefile.test612FileSaveUploadTest->testNormal()
A MIME type was set.Otherfile.test612FileSaveUploadTest->testNormal()
Raw "You WIN!" foundOtherfile.test623FileSaveUploadTest->testNormal()
Expected hooks validate, insert to be called but insert was not called.Otherfile.test627FileSaveUploadTest->testNormal()
array_flip(): Can only flip STRING and INTEGER values!Warningentity.inc178DrupalDefaultEntityController->load()
Value false is TRUE.Otherfile.test630FileSaveUploadTest->testNormal()
Trying to get property of non-objectNoticefile.test632FileSaveUploadTest->testNormal()
A MIME type was set.Otherfile.test632FileSaveUploadTest->testNormal()
Trying to get property of non-objectNoticefile.test635FileSaveUploadTest->testNormal()
Trying to get property of non-objectNoticefile.test635FileSaveUploadTest->testNormal()
array_flip(): Can only flip STRING and INTEGER values!Warningentity.inc178DrupalDefaultEntityController->load()
array_flip(): Can only flip STRING and INTEGER values!Warningentity.inc178DrupalDefaultEntityController->load()
Trying to get property of non-objectNoticefile.test636FileSaveUploadTest->testNormal()
File was loaded successfullyOtherfile.test636FileSaveUploadTest->testNormal()
Trying to get property of non-objectNoticefile.test637FileSaveUploadTest->testNormal()
File was loaded successfullyOtherfile.test637FileSaveUploadTest->testNormal()
Raw "You WIN!" foundOtherfile.test649FileSaveUploadTest->testNormal()
Found the success message.Otherfile.test595FileSaveUploadTest->setUp()
Expected hooks validate, insert to be called but insert was not called.Otherfile.test599FileSaveUploadTest->setUp()
Found the success message.Otherfile.test694FileSaveUploadTest->testHandleExtension()
Expected hooks validate, load, update to be called but load, update was not called.Otherfile.test697FileSaveUploadTest->testHandleExtension()
Found the success message.Otherfile.test711FileSaveUploadTest->testHandleExtension()
Expected hooks validate, load, update to be called but load, update was not called.Otherfile.test714FileSaveUploadTest->testHandleExtension()
Found the success message.Otherfile.test595FileSaveUploadTest->setUp()
Expected hooks validate, insert to be called but insert was not called.Otherfile.test599FileSaveUploadTest->setUp()
Dangerous file's MIME type was changed.Otherfile.test734FileSaveUploadTest->testHandleDangerousFile()
Found the success message.Otherfile.test735FileSaveUploadTest->testHandleDangerousFile()
Expected hooks validate, insert to be called but insert was not called.Otherfile.test738FileSaveUploadTest->testHandleDangerousFile()
Dangerous file was not renamed when insecure uploads is TRUE.Otherfile.test749FileSaveUploadTest->testHandleDangerousFile()
Found the success message.Otherfile.test750FileSaveUploadTest->testHandleDangerousFile()
Expected hooks validate, insert to be called but insert was not called.Otherfile.test753FileSaveUploadTest->testHandleDangerousFile()
Found the success message.Otherfile.test595FileSaveUploadTest->setUp()
Expected hooks validate, insert to be called but insert was not called.Otherfile.test599FileSaveUploadTest->setUp()
File was successfully munged.Otherfile.test783FileSaveUploadTest->testHandleFileMunge()
Found the success message.Otherfile.test784FileSaveUploadTest->testHandleFileMunge()
Expected hooks validate, insert to be called but insert was not called.Otherfile.test787FileSaveUploadTest->testHandleFileMunge()
File was not munged when allowing any extension.Otherfile.test801FileSaveUploadTest->testHandleFileMunge()
Found the success message.Otherfile.test802FileSaveUploadTest->testHandleFileMunge()
Expected hooks validate, insert to be called but insert was not called.Otherfile.test805FileSaveUploadTest->testHandleFileMunge()
Found the success message.Otherfile.test595FileSaveUploadTest->setUp()
Expected hooks validate, insert to be called but insert was not called.Otherfile.test599FileSaveUploadTest->setUp()
Found the success message.Otherfile.test818FileSaveUploadTest->testExistingRename()
Expected hooks validate, insert to be called but insert was not called.Otherfile.test821FileSaveUploadTest->testExistingRename()
Found the success message.Otherfile.test595FileSaveUploadTest->setUp()
Expected hooks validate, insert to be called but insert was not called.Otherfile.test599FileSaveUploadTest->setUp()
Found the success message.Otherfile.test834FileSaveUploadTest->testExistingReplace()
Expected hooks validate, load, update to be called but load, update was not called.Otherfile.test837FileSaveUploadTest->testExistingReplace()
Found the success message.Otherfile.test595FileSaveUploadTest->setUp()
Expected hooks validate, insert to be called but insert was not called.Otherfile.test599FileSaveUploadTest->setUp()
Found the success message.Otherfile.test595FileSaveUploadTest->setUp()
Expected hooks validate, insert to be called but insert was not called.Otherfile.test599FileSaveUploadTest->setUp()
ExpandFileTokenReplaceTestCase501184
MessageGroupFilenameLineFunctionStatus
Undefined index: undNoticefile.test1009FileTokenReplaceTestCase->testFileTokenReplacement()
Undefined property: stdClass::$fidNoticefile.test1014FileTokenReplaceTestCase->testFileTokenReplacement()
Undefined property: stdClass::$filenameNoticefile.test1015FileTokenReplaceTestCase->testFileTokenReplacement()
Undefined property: stdClass::$uriNoticefile.test1017FileTokenReplaceTestCase->testFileTokenReplacement()
Undefined property: stdClass::$filemimeNoticefile.test1018FileTokenReplaceTestCase->testFileTokenReplacement()
Undefined property: stdClass::$filesizeNoticefile.test1019FileTokenReplaceTestCase->testFileTokenReplacement()
Undefined property: stdClass::$uriNoticefile.test1020FileTokenReplaceTestCase->testFileTokenReplacement()
Undefined property: stdClass::$timestampNoticefile.test1021FileTokenReplaceTestCase->testFileTokenReplacement()
date_timezone_set() expects parameter 1 to be DateTime, boolean givenWarningcommon.inc1907format_date()
date_format() expects parameter 1 to be DateTime, boolean givenWarningcommon.inc1917format_date()
Undefined property: stdClass::$timestampNoticefile.test1022FileTokenReplaceTestCase->testFileTokenReplacement()
date_timezone_set() expects parameter 1 to be DateTime, boolean givenWarningcommon.inc1907format_date()
date_format() expects parameter 1 to be DateTime, boolean givenWarningcommon.inc1917format_date()
Undefined property: stdClass::$uidNoticefile.test1024FileTokenReplaceTestCase->testFileTokenReplacement()
No empty tokens generated.Otherfile.test1027FileTokenReplaceTestCase->testFileTokenReplacement()
Undefined property: stdClass::$fidNoticesystem.tokens.inc223system_tokens()
Undefined property: stdClass::$filenameNoticesystem.tokens.inc228system_tokens()
Undefined property: stdClass::$uriNoticesystem.tokens.inc236system_tokens()
Undefined property: stdClass::$filemimeNoticesystem.tokens.inc240system_tokens()
Undefined property: stdClass::$filesizeNoticesystem.tokens.inc244system_tokens()
Undefined property: stdClass::$uriNoticesystem.tokens.inc248system_tokens()
Undefined property: stdClass::$timestampNoticesystem.tokens.inc253system_tokens()
date_timezone_set() expects parameter 1 to be DateTime, boolean givenWarningcommon.inc1907format_date()
date_format() expects parameter 1 to be DateTime, boolean givenWarningcommon.inc1917format_date()
Undefined property: stdClass::$timestampNoticesystem.tokens.inc264system_tokens()
Sanitized file token [file:timestamp:short] replaced.Otherfile.test1031FileTokenReplaceTestCase->testFileTokenReplacement()
Undefined property: stdClass::$uidNoticesystem.tokens.inc257system_tokens()
array_flip(): Can only flip STRING and INTEGER values!Warningentity.inc178DrupalDefaultEntityController->load()
array_flip(): Can only flip STRING and INTEGER values!Warningentity.inc354DrupalDefaultEntityController->cacheGet()
Trying to get property of non-objectNoticesystem.tokens.inc258system_tokens()
Sanitized file token [file:owner] replaced.Otherfile.test1031FileTokenReplaceTestCase->testFileTokenReplacement()
Undefined property: stdClass::$uidNoticesystem.tokens.inc267system_tokens()
array_flip(): Can only flip STRING and INTEGER values!Warningentity.inc178DrupalDefaultEntityController->load()
array_flip(): Can only flip STRING and INTEGER values!Warningentity.inc354DrupalDefaultEntityController->cacheGet()
Sanitized file token [file:owner:uid] replaced.Otherfile.test1031FileTokenReplaceTestCase->testFileTokenReplacement()
Undefined property: stdClass::$filenameNoticefile.test1035FileTokenReplaceTestCase->testFileTokenReplacement()
Undefined index: undNoticefile.test1009FileTokenReplaceTestCase->testFileTokenReplacement()
Undefined property: stdClass::$fidNoticefile.test1014FileTokenReplaceTestCase->testFileTokenReplacement()
Undefined property: stdClass::$filenameNoticefile.test1015FileTokenReplaceTestCase->testFileTokenReplacement()
Undefined property: stdClass::$uriNoticefile.test1017FileTokenReplaceTestCase->testFileTokenReplacement()
Undefined property: stdClass::$filemimeNoticefile.test1018FileTokenReplaceTestCase->testFileTokenReplacement()
Undefined property: stdClass::$filesizeNoticefile.test1019FileTokenReplaceTestCase->testFileTokenReplacement()
Undefined property: stdClass::$uriNoticefile.test1020FileTokenReplaceTestCase->testFileTokenReplacement()
Undefined property: stdClass::$timestampNoticefile.test1021FileTokenReplaceTestCase->testFileTokenReplacement()
date_timezone_set() expects parameter 1 to be DateTime, boolean givenWarningcommon.inc1907format_date()
date_format() expects parameter 1 to be DateTime, boolean givenWarningcommon.inc1917format_date()
Undefined property: stdClass::$timestampNoticefile.test1022FileTokenReplaceTestCase->testFileTokenReplacement()
date_timezone_set() expects parameter 1 to be DateTime, boolean givenWarningcommon.inc1907format_date()
date_format() expects parameter 1 to be DateTime, boolean givenWarningcommon.inc1917format_date()
Undefined property: stdClass::$uidNoticefile.test1024FileTokenReplaceTestCase->testFileTokenReplacement()
No empty tokens generated.Otherfile.test1027FileTokenReplaceTestCase->testFileTokenReplacement()
Undefined property: stdClass::$fidNoticesystem.tokens.inc223system_tokens()
Undefined property: stdClass::$filenameNoticesystem.tokens.inc228system_tokens()
Undefined property: stdClass::$uriNoticesystem.tokens.inc236system_tokens()
Undefined property: stdClass::$filemimeNoticesystem.tokens.inc240system_tokens()
Undefined property: stdClass::$filesizeNoticesystem.tokens.inc244system_tokens()
Undefined property: stdClass::$uriNoticesystem.tokens.inc248system_tokens()
Undefined property: stdClass::$timestampNoticesystem.tokens.inc253system_tokens()
date_timezone_set() expects parameter 1 to be DateTime, boolean givenWarningcommon.inc1907format_date()
date_format() expects parameter 1 to be DateTime, boolean givenWarningcommon.inc1917format_date()
Undefined property: stdClass::$timestampNoticesystem.tokens.inc264system_tokens()
Sanitized file token [file:timestamp:short] replaced.Otherfile.test1031FileTokenReplaceTestCase->testFileTokenReplacement()
Undefined property: stdClass::$uidNoticesystem.tokens.inc257system_tokens()
array_flip(): Can only flip STRING and INTEGER values!Warningentity.inc178DrupalDefaultEntityController->load()
array_flip(): Can only flip STRING and INTEGER values!Warningentity.inc354DrupalDefaultEntityController->cacheGet()
Trying to get property of non-objectNoticesystem.tokens.inc258system_tokens()
Sanitized file token [file:owner] replaced.Otherfile.test1031FileTokenReplaceTestCase->testFileTokenReplacement()
Undefined property: stdClass::$uidNoticesystem.tokens.inc267system_tokens()
array_flip(): Can only flip STRING and INTEGER values!Warningentity.inc178DrupalDefaultEntityController->load()
array_flip(): Can only flip STRING and INTEGER values!Warningentity.inc354DrupalDefaultEntityController->cacheGet()
Sanitized file token [file:owner:uid] replaced.Otherfile.test1031FileTokenReplaceTestCase->testFileTokenReplacement()
Undefined property: stdClass::$filenameNoticefile.test1035FileTokenReplaceTestCase->testFileTokenReplacement()
Undefined property: stdClass::$uriNoticefile.test1037FileTokenReplaceTestCase->testFileTokenReplacement()
Undefined property: stdClass::$filemimeNoticefile.test1038FileTokenReplaceTestCase->testFileTokenReplacement()
Undefined property: stdClass::$filesizeNoticefile.test1039FileTokenReplaceTestCase->testFileTokenReplacement()
Undefined property: stdClass::$fidNoticesystem.tokens.inc223system_tokens()
Undefined property: stdClass::$filenameNoticesystem.tokens.inc228system_tokens()
Undefined property: stdClass::$uriNoticesystem.tokens.inc236system_tokens()
Undefined property: stdClass::$filemimeNoticesystem.tokens.inc240system_tokens()
Undefined property: stdClass::$filesizeNoticesystem.tokens.inc244system_tokens()
Undefined property: stdClass::$uriNoticesystem.tokens.inc248system_tokens()
Undefined property: stdClass::$timestampNoticesystem.tokens.inc253system_tokens()
date_timezone_set() expects parameter 1 to be DateTime, boolean givenWarningcommon.inc1907format_date()
date_format() expects parameter 1 to be DateTime, boolean givenWarningcommon.inc1917format_date()
Undefined property: stdClass::$timestampNoticesystem.tokens.inc264system_tokens()
Unsanitized file token [file:timestamp:short] replaced.Otherfile.test1043FileTokenReplaceTestCase->testFileTokenReplacement()
Undefined property: stdClass::$uidNoticesystem.tokens.inc257system_tokens()
array_flip(): Can only flip STRING and INTEGER values!Warningentity.inc178DrupalDefaultEntityController->load()
array_flip(): Can only flip STRING and INTEGER values!Warningentity.inc354DrupalDefaultEntityController->cacheGet()
Trying to get property of non-objectNoticesystem.tokens.inc258system_tokens()
Unsanitized file token [file:owner] replaced.Otherfile.test1043FileTokenReplaceTestCase->testFileTokenReplacement()
Undefined property: stdClass::$uidNoticesystem.tokens.inc267system_tokens()
array_flip(): Can only flip STRING and INTEGER values!Warningentity.inc178DrupalDefaultEntityController->load()
array_flip(): Can only flip STRING and INTEGER values!Warningentity.inc354DrupalDefaultEntityController->cacheGet()
Unsanitized file token [file:owner:uid] replaced.Otherfile.test1043FileTokenReplaceTestCase->testFileTokenReplacement()
ExpandImageAdminStylesUnitTest16434
MessageGroupFilenameLineFunctionStatus
array_flip(): Can only flip STRING and INTEGER values!Warningentity.inc178DrupalDefaultEntityController->load()
Trying to get property of non-objectNoticeimage.test602ImageAdminStylesUnitTest->testStyleReplacement()
Image displayed using style xwkgdmjx4i.Otherimage.test602ImageAdminStylesUnitTest->testStyleReplacement()
Trying to get property of non-objectNoticeimage.test612ImageAdminStylesUnitTest->testStyleReplacement()
Image displayed using style replacement style.Otherimage.test612ImageAdminStylesUnitTest->testStyleReplacement()
Trying to get property of non-objectNoticeimage.test623ImageAdminStylesUnitTest->testStyleReplacement()
Image displayed using style replacement style.Otherimage.test623ImageAdminStylesUnitTest->testStyleReplacement()
ExpandImageFieldDisplayTestCase1132410
MessageGroupFilenameLineFunctionStatus
array_flip(): Can only flip STRING and INTEGER values!Warningentity.inc178DrupalDefaultEntityController->load()
Trying to get property of non-objectNoticeimage.test667ImageFieldDisplayTestCase->_testImageFieldFormatters()
Default formatter displaying correctly on full node view.Otherimage.test672ImageFieldDisplayTestCase->_testImageFieldFormatters()
Image linked to file formatter displaying correctly on full node view.Otherimage.test681ImageFieldDisplayTestCase->_testImageFieldFormatters()
File was downloaded successfully.Otherimage.test683ImageFieldDisplayTestCase->_testImageFieldFormatters()
Image linked to content formatter displaying correctly on full node view.Otherimage.test705ImageFieldDisplayTestCase->_testImageFieldFormatters()
Image style thumbnail formatter displaying correctly on full node view.Otherimage.test717ImageFieldDisplayTestCase->_testImageFieldFormatters()
array_flip(): Can only flip STRING and INTEGER values!Warningentity.inc178DrupalDefaultEntityController->load()
Trying to get property of non-objectNoticeimage.test667ImageFieldDisplayTestCase->_testImageFieldFormatters()
Default formatter displaying correctly on full node view.Otherimage.test672ImageFieldDisplayTestCase->_testImageFieldFormatters()
Image linked to file formatter displaying correctly on full node view.Otherimage.test681ImageFieldDisplayTestCase->_testImageFieldFormatters()
File was downloaded successfully.Otherimage.test683ImageFieldDisplayTestCase->_testImageFieldFormatters()
Content-Type header was sent.Otherimage.test687ImageFieldDisplayTestCase->_testImageFieldFormatters()
Content-Disposition header was sent.Otherimage.test688ImageFieldDisplayTestCase->_testImageFieldFormatters()
Cache-Control header was sent.Otherimage.test689ImageFieldDisplayTestCase->_testImageFieldFormatters()
Image linked to content formatter displaying correctly on full node view.Otherimage.test705ImageFieldDisplayTestCase->_testImageFieldFormatters()
Image style thumbnail formatter displaying correctly on full node view.Otherimage.test717ImageFieldDisplayTestCase->_testImageFieldFormatters()
Access denied to image style thumbnail as anonymous user.Browserimage.test723ImageFieldDisplayTestCase->_testImageFieldFormatters()
Alt field displayed on article form.Browserimage.test757ImageFieldDisplayTestCase->testImageFieldSettings()
Title field displayed on article form.Browserimage.test758ImageFieldDisplayTestCase->testImageFieldSettings()
array_flip(): Can only flip STRING and INTEGER values!Warningentity.inc178DrupalDefaultEntityController->load()
Trying to get property of non-objectNoticeimage.test763ImageFieldDisplayTestCase->testImageFieldSettings()
Preview image is displayed using 'medium' style.Otherimage.test766ImageFieldDisplayTestCase->testImageFieldSettings()
Trying to get property of non-objectNoticeimage.test770ImageFieldDisplayTestCase->testImageFieldSettings()
Failed to set field nbro4ybh[und][0][alt] to yHE8antWOtherimage.test778ImageFieldDisplayTestCase->testImageFieldSettings()
Failed to set field nbro4ybh[und][0][title] to q2Tu0LH4Otherimage.test778ImageFieldDisplayTestCase->testImageFieldSettings()
Found the Save buttonOtherimage.test778ImageFieldDisplayTestCase->testImageFieldSettings()
Found the requested form fields at node//editOtherimage.test778ImageFieldDisplayTestCase->testImageFieldSettings()
Image displayed using user supplied alt and title attributes.Otherimage.test780ImageFieldDisplayTestCase->testImageFieldSettings()
Trying to get property of non-objectNoticeimage.test809ImageFieldDisplayTestCase->testImageFieldDefaultImage()
Default image displayed when no user supplied image is present.Otherimage.test811ImageFieldDisplayTestCase->testImageFieldDefaultImage()
array_flip(): Can only flip STRING and INTEGER values!Warningentity.inc178DrupalDefaultEntityController->load()
Trying to get property of non-objectNoticeimage.test818ImageFieldDisplayTestCase->testImageFieldDefaultImage()
User supplied image is displayed.Otherimage.test823ImageFieldDisplayTestCase->testImageFieldDefaultImage()
ExpandImportOPMLTestCase4852
MessageGroupFilenameLineFunctionStatus
Verifying that a duplicate URL was identifiedOtheraggregator.test677ImportOPMLTestCase->submitImportForm()
Verifying that a duplicate title was identifiedOtheraggregator.test678ImportOPMLTestCase->submitImportForm()
Verifying that two distinct feeds were added.Otheraggregator.test681ImportOPMLTestCase->submitImportForm()
Undefined variable: titleNoticeaggregator.test692ImportOPMLTestCase->submitImportForm()
First feed was added correctly.Otheraggregator.test692ImportOPMLTestCase->submitImportForm()
Undefined variable: urlNoticeaggregator.test693ImportOPMLTestCase->submitImportForm()
Second feed was added correctly.Otheraggregator.test693ImportOPMLTestCase->submitImportForm()
ExpandLocaleExportFunctionalTest2740
MessageGroupFilenameLineFunctionStatus
Failed to set field langcode to frOtherlocale.test1030LocaleExportFunctionalTest->testExportTranslation()
Found the requested form fields at admin/config/regional/translate/exportOtherlocale.test1030LocaleExportFunctionalTest->testExportTranslation()
Exported French translation file.Otherlocale.test1033LocaleExportFunctionalTest->testExportTranslation()
French translations present in exported file.Otherlocale.test1035LocaleExportFunctionalTest->testExportTranslation()
ExpandLocaleImportFunctionalTest96220
MessageGroupFilenameLineFunctionStatus
The language has been automatically created.Otherlocale.test642LocaleImportFunctionalTest->testStandalonePoFile()
The translation file was successfully imported.Otherlocale.test645LocaleImportFunctionalTest->testStandalonePoFile()
Plural number initialized.Otherlocale.test648LocaleImportFunctionalTest->testStandalonePoFile()
Correct page redirection.Otherlocale.test651LocaleImportFunctionalTest->testStandalonePoFile()
The translation file was successfully imported.Otherlocale.test660LocaleImportFunctionalTest->testStandalonePoFile()
Unsafe strings were skipped.Otherlocale.test662LocaleImportFunctionalTest->testStandalonePoFile()
The translation file was successfully imported.Otherlocale.test672LocaleImportFunctionalTest->testStandalonePoFile()
The translation file was successfully imported.Otherlocale.test694LocaleImportFunctionalTest->testStandalonePoFile()
Failed to set field language to frOtherlocale.test702LocaleImportFunctionalTest->testStandalonePoFile()
Found the requested form fields at admin/config/regional/translate/translateOtherlocale.test702LocaleImportFunctionalTest->testStandalonePoFile()
String not overwritten by imported string.Otherlocale.test703LocaleImportFunctionalTest->testStandalonePoFile()
Plural numbers untouched.Otherlocale.test706LocaleImportFunctionalTest->testStandalonePoFile()
The translation file was successfully imported.Otherlocale.test716LocaleImportFunctionalTest->testStandalonePoFile()
Failed to set field language to frOtherlocale.test724LocaleImportFunctionalTest->testStandalonePoFile()
Found the requested form fields at admin/config/regional/translate/translateOtherlocale.test724LocaleImportFunctionalTest->testStandalonePoFile()
Plural numbers changed.Otherlocale.test727LocaleImportFunctionalTest->testStandalonePoFile()
Long month name context is working.Otherlocale.test778LocaleImportFunctionalTest->testLanguageContext()
Default context is working.Otherlocale.test779LocaleImportFunctionalTest->testLanguageContext()
The translation file was successfully imported.Otherlocale.test793LocaleImportFunctionalTest->testEmptyMsgstr()
String imported and translated.Otherlocale.test794LocaleImportFunctionalTest->testEmptyMsgstr()
The translation file was successfully imported.Otherlocale.test801LocaleImportFunctionalTest->testEmptyMsgstr()
String is untranslated again.Otherlocale.test816LocaleImportFunctionalTest->testEmptyMsgstr()
ExpandRdfRdfaMarkupTestCase2520
MessageGroupFilenameLineFunctionStatus
Attribute 'rel' set on file field. Attribute 'resource' is also set.Otherrdf.test182RdfRdfaMarkupTestCase->testAttributesInMarkupFile()
Attribute 'rel' set on image field. Attribute 'resource' is also set.Otherrdf.test188RdfRdfaMarkupTestCase->testAttributesInMarkupFile()
ExpandUpdateTestUploadCase6010
MessageGroupFilenameLineFunctionStatus
Existing module was extracted and not reinstalled.Otherupdate.test630UpdateTestUploadCase->testUploadModule()
ExpandUserPictureTestCase10360
MessageGroupFilenameLineFunctionStatus
Image is displayed in user's edit pageOtheruser.test919UserPictureTestCase->testWithGDinvalidDimension()
File is located in proper directoryOtheruser.test922UserPictureTestCase->testWithGDinvalidDimension()
Image is displayed in user's profile pageOtheruser.test1049UserPictureTestCase->testPictureIsValid()
Image is displayed in user's profile pageOtheruser.test1049UserPictureTestCase->testPictureIsValid()
File is located in proper directoryOtheruser.test1052UserPictureTestCase->testPictureIsValid()
Filename of second picture is different.Otheruser.test1059UserPictureTestCase->testPictureIsValid()

All

Test namePassFailException
LeafAccessDeniedTestCase7500
LeafActionLoopTestCase2400
LeafActionsConfigurationTestCase3800
LeafAddFeedTestCase2800
LeafAdminMetaTagTestCase300
LeafAggregatorCronTestCase5300
LeafAggregatorRenderingTestCase6800
LeafAJAXCommandsTestCase6800
LeafAJAXElementValidation800
LeafAJAXFormValuesTestCase2800
LeafAJAXFrameworkTestCase1000
LeafAJAXMultiFormTestCase3500
LeafBatchPageTestCase1500
LeafBatchPercentagesUnitTestCase1300
LeafBatchProcessingTestCase15400
LeafBlockAdminThemeTestCase1800
LeafBlockCacheTestCase22800
LeafBlockHTMLIdTestCase1500
LeafBlockTemplateSuggestionsUnitTest200
LeafBlockTestCase31300
LeafBlogTestCase24100
LeafBookTestCase34900
LeafBootstrapGetFilenameTestCase400
LeafBootstrapIPAddressTestCase1100
LeafBootstrapMiscTestCase100
LeafBootstrapOverrideServerVariablesTestCase600
LeafBootstrapPageCacheTestCase7800
LeafBootstrapResettableStaticTestCase500
LeafBootstrapTimerTestCase500
LeafBootstrapVariableTestCase700
LeafCacheClearCase1300
LeafCacheGetMultipleUnitTest700
LeafCacheIsEmptyCase500
LeafCacheSavingCase500
LeafCascadingStylesheetsTestCase2500
LeafCascadingStylesheetsUnitTest1200
LeafCategorizeFeedItemTestCase5300
LeafCategorizeFeedTestCase1900
LeafColorTestCase12000
LeafCommentActionsTestCase2800
LeafCommentAnonymous16500
LeafCommentApprovalTest15400
LeafCommentBlockFunctionalTest11500
LeafCommentContentRebuild3200
LeafCommentFieldsTest8300
ExpandCommentInterfaceTest139500
MessageGroupFilenameLineFunctionStatus
Changed environment:array ( 'authenticated' => false, 'comment count' => false, 'form' => 'below', 'user_register' => 1, 'contact' => 'optional', 'comments' => 'open', 'access comments' => 0, 'post comments' => 0, 'skip comment approval' => 1, 'edit own comments' => 0, )Debugcomment.test672CommentInterfaceTest->setEnvironment()
Changed environment:array ( 'authenticated' => true, 'comment count' => false, 'form' => 'below', 'user_register' => 1, 'contact' => 'optional', 'comments' => 'open', 'access comments' => 0, 'post comments' => 0, 'skip comment approval' => 1, 'edit own comments' => 0, )Debugcomment.test672CommentInterfaceTest->setEnvironment()
Changed environment:array ( 'authenticated' => false, 'comment count' => true, 'form' => 'below', 'user_register' => 1, 'contact' => 'optional', 'comments' => 'open', 'access comments' => 0, 'post comments' => 0, 'skip comment approval' => 1, 'edit own comments' => 0, )Debugcomment.test672CommentInterfaceTest->setEnvironment()
Changed environment:array ( 'authenticated' => true, 'comment count' => true, 'form' => 'below', 'user_register' => 1, 'contact' => 'optional', 'comments' => 'open', 'access comments' => 0, 'post comments' => 0, 'skip comment approval' => 1, 'edit own comments' => 0, )Debugcomment.test672CommentInterfaceTest->setEnvironment()
Changed environment:array ( 'authenticated' => false, 'comment count' => false, 'form' => 'below', 'user_register' => 1, 'contact' => 'optional', 'comments' => 'open', 'access comments' => 1, 'post comments' => 0, 'skip comment approval' => 1, 'edit own comments' => 0, )Debugcomment.test672CommentInterfaceTest->setEnvironment()
Changed environment:array ( 'authenticated' => true, 'comment count' => false, 'form' => 'below', 'user_register' => 1, 'contact' => 'optional', 'comments' => 'open', 'access comments' => 1, 'post comments' => 0, 'skip comment approval' => 1, 'edit own comments' => 0, )Debugcomment.test672CommentInterfaceTest->setEnvironment()
Changed environment:array ( 'authenticated' => false, 'comment count' => true, 'form' => 'below', 'user_register' => 1, 'contact' => 'optional', 'comments' => 'open', 'access comments' => 1, 'post comments' => 0, 'skip comment approval' => 1, 'edit own comments' => 0, )Debugcomment.test672CommentInterfaceTest->setEnvironment()
Changed environment:array ( 'authenticated' => true, 'comment count' => true, 'form' => 'below', 'user_register' => 1, 'contact' => 'optional', 'comments' => 'open', 'access comments' => 1, 'post comments' => 0, 'skip comment approval' => 1, 'edit own comments' => 0, )Debugcomment.test672CommentInterfaceTest->setEnvironment()
Changed environment:array ( 'authenticated' => false, 'comment count' => false, 'form' => 'below', 'user_register' => 1, 'contact' => 'optional', 'comments' => 'open', 'access comments' => 0, 'post comments' => 1, 'skip comment approval' => 1, 'edit own comments' => 0, )Debugcomment.test672CommentInterfaceTest->setEnvironment()
Changed environment:array ( 'authenticated' => true, 'comment count' => false, 'form' => 'below', 'user_register' => 1, 'contact' => 'optional', 'comments' => 'open', 'access comments' => 0, 'post comments' => 1, 'skip comment approval' => 1, 'edit own comments' => 0, )Debugcomment.test672CommentInterfaceTest->setEnvironment()
Changed environment:array ( 'authenticated' => false, 'comment count' => true, 'form' => 'below', 'user_register' => 1, 'contact' => 'optional', 'comments' => 'open', 'access comments' => 0, 'post comments' => 1, 'skip comment approval' => 1, 'edit own comments' => 0, )Debugcomment.test672CommentInterfaceTest->setEnvironment()
Changed environment:array ( 'authenticated' => true, 'comment count' => true, 'form' => 'below', 'user_register' => 1, 'contact' => 'optional', 'comments' => 'open', 'access comments' => 0, 'post comments' => 1, 'skip comment approval' => 1, 'edit own comments' => 0, )Debugcomment.test672CommentInterfaceTest->setEnvironment()
Changed environment:array ( 'authenticated' => false, 'comment count' => false, 'form' => 'below', 'user_register' => 1, 'contact' => 'optional', 'comments' => 'open', 'access comments' => 1, 'post comments' => 1, 'skip comment approval' => 1, 'edit own comments' => 0, )Debugcomment.test672CommentInterfaceTest->setEnvironment()
Changed environment:array ( 'authenticated' => true, 'comment count' => false, 'form' => 'below', 'user_register' => 1, 'contact' => 'optional', 'comments' => 'open', 'access comments' => 1, 'post comments' => 1, 'skip comment approval' => 1, 'edit own comments' => 0, )Debugcomment.test672CommentInterfaceTest->setEnvironment()
Changed environment:array ( 'authenticated' => false, 'comment count' => true, 'form' => 'below', 'user_register' => 1, 'contact' => 'optional', 'comments' => 'open', 'access comments' => 1, 'post comments' => 1, 'skip comment approval' => 1, 'edit own comments' => 0, )Debugcomment.test672CommentInterfaceTest->setEnvironment()
Changed environment:array ( 'authenticated' => true, 'comment count' => true, 'form' => 'below', 'user_register' => 1, 'contact' => 'optional', 'comments' => 'open', 'access comments' => 1, 'post comments' => 1, 'skip comment approval' => 1, 'edit own comments' => 0, )Debugcomment.test672CommentInterfaceTest->setEnvironment()
Changed environment:array ( 'authenticated' => false, 'comment count' => false, 'form' => 'separate page', 'user_register' => 1, 'contact' => 'optional', 'comments' => 'open', 'access comments' => 0, 'post comments' => 0, 'skip comment approval' => 1, 'edit own comments' => 0, )Debugcomment.test672CommentInterfaceTest->setEnvironment()
Changed environment:array ( 'authenticated' => true, 'comment count' => false, 'form' => 'separate page', 'user_register' => 1, 'contact' => 'optional', 'comments' => 'open', 'access comments' => 0, 'post comments' => 0, 'skip comment approval' => 1, 'edit own comments' => 0, )Debugcomment.test672CommentInterfaceTest->setEnvironment()
Changed environment:array ( 'authenticated' => false, 'comment count' => true, 'form' => 'separate page', 'user_register' => 1, 'contact' => 'optional', 'comments' => 'open', 'access comments' => 0, 'post comments' => 0, 'skip comment approval' => 1, 'edit own comments' => 0, )Debugcomment.test672CommentInterfaceTest->setEnvironment()
Changed environment:array ( 'authenticated' => true, 'comment count' => true, 'form' => 'separate page', 'user_register' => 1, 'contact' => 'optional', 'comments' => 'open', 'access comments' => 0, 'post comments' => 0, 'skip comment approval' => 1, 'edit own comments' => 0, )Debugcomment.test672CommentInterfaceTest->setEnvironment()
Changed environment:array ( 'authenticated' => false, 'comment count' => false, 'form' => 'separate page', 'user_register' => 1, 'contact' => 'optional', 'comments' => 'open', 'access comments' => 1, 'post comments' => 0, 'skip comment approval' => 1, 'edit own comments' => 0, )Debugcomment.test672CommentInterfaceTest->setEnvironment()
Changed environment:array ( 'authenticated' => true, 'comment count' => false, 'form' => 'separate page', 'user_register' => 1, 'contact' => 'optional', 'comments' => 'open', 'access comments' => 1, 'post comments' => 0, 'skip comment approval' => 1, 'edit own comments' => 0, )Debugcomment.test672CommentInterfaceTest->setEnvironment()
Changed environment:array ( 'authenticated' => false, 'comment count' => true, 'form' => 'separate page', 'user_register' => 1, 'contact' => 'optional', 'comments' => 'open', 'access comments' => 1, 'post comments' => 0, 'skip comment approval' => 1, 'edit own comments' => 0, )Debugcomment.test672CommentInterfaceTest->setEnvironment()
Changed environment:array ( 'authenticated' => true, 'comment count' => true, 'form' => 'separate page', 'user_register' => 1, 'contact' => 'optional', 'comments' => 'open', 'access comments' => 1, 'post comments' => 0, 'skip comment approval' => 1, 'edit own comments' => 0, )Debugcomment.test672CommentInterfaceTest->setEnvironment()
Changed environment:array ( 'authenticated' => false, 'comment count' => false, 'form' => 'separate page', 'user_register' => 1, 'contact' => 'optional', 'comments' => 'open', 'access comments' => 0, 'post comments' => 1, 'skip comment approval' => 1, 'edit own comments' => 0, )Debugcomment.test672CommentInterfaceTest->setEnvironment()
Changed environment:array ( 'authenticated' => true, 'comment count' => false, 'form' => 'separate page', 'user_register' => 1, 'contact' => 'optional', 'comments' => 'open', 'access comments' => 0, 'post comments' => 1, 'skip comment approval' => 1, 'edit own comments' => 0, )Debugcomment.test672CommentInterfaceTest->setEnvironment()
Changed environment:array ( 'authenticated' => false, 'comment count' => true, 'form' => 'separate page', 'user_register' => 1, 'contact' => 'optional', 'comments' => 'open', 'access comments' => 0, 'post comments' => 1, 'skip comment approval' => 1, 'edit own comments' => 0, )Debugcomment.test672CommentInterfaceTest->setEnvironment()
Changed environment:array ( 'authenticated' => true, 'comment count' => true, 'form' => 'separate page', 'user_register' => 1, 'contact' => 'optional', 'comments' => 'open', 'access comments' => 0, 'post comments' => 1, 'skip comment approval' => 1, 'edit own comments' => 0, )Debugcomment.test672CommentInterfaceTest->setEnvironment()
Changed environment:array ( 'authenticated' => false, 'comment count' => false, 'form' => 'separate page', 'user_register' => 1, 'contact' => 'optional', 'comments' => 'open', 'access comments' => 1, 'post comments' => 1, 'skip comment approval' => 1, 'edit own comments' => 0, )Debugcomment.test672CommentInterfaceTest->setEnvironment()
Changed environment:array ( 'authenticated' => true, 'comment count' => false, 'form' => 'separate page', 'user_register' => 1, 'contact' => 'optional', 'comments' => 'open', 'access comments' => 1, 'post comments' => 1, 'skip comment approval' => 1, 'edit own comments' => 0, )Debugcomment.test672CommentInterfaceTest->setEnvironment()
Changed environment:array ( 'authenticated' => false, 'comment count' => true, 'form' => 'separate page', 'user_register' => 1, 'contact' => 'optional', 'comments' => 'open', 'access comments' => 1, 'post comments' => 1, 'skip comment approval' => 1, 'edit own comments' => 0, )Debugcomment.test672CommentInterfaceTest->setEnvironment()
Changed environment:array ( 'authenticated' => true, 'comment count' => true, 'form' => 'separate page', 'user_register' => 1, 'contact' => 'optional', 'comments' => 'open', 'access comments' => 1, 'post comments' => 1, 'skip comment approval' => 1, 'edit own comments' => 0, )Debugcomment.test672CommentInterfaceTest->setEnvironment()
Changed environment:array ( 'authenticated' => false, 'comment count' => false, 'form' => 'below', 'user_register' => 0, 'contact' => 'optional', 'comments' => 'open', 'access comments' => 0, 'post comments' => 0, 'skip comment approval' => 1, 'edit own comments' => 0, )Debugcomment.test672CommentInterfaceTest->setEnvironment()
Changed environment:array ( 'authenticated' => true, 'comment count' => false, 'form' => 'below', 'user_register' => 0, 'contact' => 'optional', 'comments' => 'open', 'access comments' => 0, 'post comments' => 0, 'skip comment approval' => 1, 'edit own comments' => 0, )Debugcomment.test672CommentInterfaceTest->setEnvironment()
Changed environment:array ( 'authenticated' => false, 'comment count' => true, 'form' => 'below', 'user_register' => 0, 'contact' => 'optional', 'comments' => 'open', 'access comments' => 0, 'post comments' => 0, 'skip comment approval' => 1, 'edit own comments' => 0, )Debugcomment.test672CommentInterfaceTest->setEnvironment()
Changed environment:array ( 'authenticated' => true, 'comment count' => true, 'form' => 'below', 'user_register' => 0, 'contact' => 'optional', 'comments' => 'open', 'access comments' => 0, 'post comments' => 0, 'skip comment approval' => 1, 'edit own comments' => 0, )Debugcomment.test672CommentInterfaceTest->setEnvironment()
Changed environment:array ( 'authenticated' => false, 'comment count' => false, 'form' => 'below', 'user_register' => 0, 'contact' => 'optional', 'comments' => 'open', 'access comments' => 1, 'post comments' => 0, 'skip comment approval' => 1, 'edit own comments' => 0, )Debugcomment.test672CommentInterfaceTest->setEnvironment()
Changed environment:array ( 'authenticated' => true, 'comment count' => false, 'form' => 'below', 'user_register' => 0, 'contact' => 'optional', 'comments' => 'open', 'access comments' => 1, 'post comments' => 0, 'skip comment approval' => 1, 'edit own comments' => 0, )Debugcomment.test672CommentInterfaceTest->setEnvironment()
Changed environment:array ( 'authenticated' => false, 'comment count' => true, 'form' => 'below', 'user_register' => 0, 'contact' => 'optional', 'comments' => 'open', 'access comments' => 1, 'post comments' => 0, 'skip comment approval' => 1, 'edit own comments' => 0, )Debugcomment.test672CommentInterfaceTest->setEnvironment()
Changed environment:array ( 'authenticated' => true, 'comment count' => true, 'form' => 'below', 'user_register' => 0, 'contact' => 'optional', 'comments' => 'open', 'access comments' => 1, 'post comments' => 0, 'skip comment approval' => 1, 'edit own comments' => 0, )Debugcomment.test672CommentInterfaceTest->setEnvironment()
Changed environment:array ( 'authenticated' => false, 'comment count' => false, 'form' => 'below', 'user_register' => 0, 'contact' => 'optional', 'comments' => 'open', 'access comments' => 0, 'post comments' => 1, 'skip comment approval' => 1, 'edit own comments' => 0, )Debugcomment.test672CommentInterfaceTest->setEnvironment()
Changed environment:array ( 'authenticated' => true, 'comment count' => false, 'form' => 'below', 'user_register' => 0, 'contact' => 'optional', 'comments' => 'open', 'access comments' => 0, 'post comments' => 1, 'skip comment approval' => 1, 'edit own comments' => 0, )Debugcomment.test672CommentInterfaceTest->setEnvironment()
Changed environment:array ( 'authenticated' => false, 'comment count' => true, 'form' => 'below', 'user_register' => 0, 'contact' => 'optional', 'comments' => 'open', 'access comments' => 0, 'post comments' => 1, 'skip comment approval' => 1, 'edit own comments' => 0, )Debugcomment.test672CommentInterfaceTest->setEnvironment()
Changed environment:array ( 'authenticated' => true, 'comment count' => true, 'form' => 'below', 'user_register' => 0, 'contact' => 'optional', 'comments' => 'open', 'access comments' => 0, 'post comments' => 1, 'skip comment approval' => 1, 'edit own comments' => 0, )Debugcomment.test672CommentInterfaceTest->setEnvironment()
Changed environment:array ( 'authenticated' => false, 'comment count' => false, 'form' => 'below', 'user_register' => 0, 'contact' => 'optional', 'comments' => 'open', 'access comments' => 1, 'post comments' => 1, 'skip comment approval' => 1, 'edit own comments' => 0, )Debugcomment.test672CommentInterfaceTest->setEnvironment()
Changed environment:array ( 'authenticated' => true, 'comment count' => false, 'form' => 'below', 'user_register' => 0, 'contact' => 'optional', 'comments' => 'open', 'access comments' => 1, 'post comments' => 1, 'skip comment approval' => 1, 'edit own comments' => 0, )Debugcomment.test672CommentInterfaceTest->setEnvironment()
Changed environment:array ( 'authenticated' => false, 'comment count' => true, 'form' => 'below', 'user_register' => 0, 'contact' => 'optional', 'comments' => 'open', 'access comments' => 1, 'post comments' => 1, 'skip comment approval' => 1, 'edit own comments' => 0, )Debugcomment.test672CommentInterfaceTest->setEnvironment()
Changed environment:array ( 'authenticated' => true, 'comment count' => true, 'form' => 'below', 'user_register' => 0, 'contact' => 'optional', 'comments' => 'open', 'access comments' => 1, 'post comments' => 1, 'skip comment approval' => 1, 'edit own comments' => 0, )Debugcomment.test672CommentInterfaceTest->setEnvironment()
Changed environment:array ( 'authenticated' => false, 'comment count' => false, 'form' => 'separate page', 'user_register' => 0, 'contact' => 'optional', 'comments' => 'open', 'access comments' => 0, 'post comments' => 0, 'skip comment approval' => 1, 'edit own comments' => 0, )Debugcomment.test672CommentInterfaceTest->setEnvironment()
Changed environment:array ( 'authenticated' => true, 'comment count' => false, 'form' => 'separate page', 'user_register' => 0, 'contact' => 'optional', 'comments' => 'open', 'access comments' => 0, 'post comments' => 0, 'skip comment approval' => 1, 'edit own comments' => 0, )Debugcomment.test672CommentInterfaceTest->setEnvironment()
Changed environment:array ( 'authenticated' => false, 'comment count' => true, 'form' => 'separate page', 'user_register' => 0, 'contact' => 'optional', 'comments' => 'open', 'access comments' => 0, 'post comments' => 0, 'skip comment approval' => 1, 'edit own comments' => 0, )Debugcomment.test672CommentInterfaceTest->setEnvironment()
Changed environment:array ( 'authenticated' => true, 'comment count' => true, 'form' => 'separate page', 'user_register' => 0, 'contact' => 'optional', 'comments' => 'open', 'access comments' => 0, 'post comments' => 0, 'skip comment approval' => 1, 'edit own comments' => 0, )Debugcomment.test672CommentInterfaceTest->setEnvironment()
Changed environment:array ( 'authenticated' => false, 'comment count' => false, 'form' => 'separate page', 'user_register' => 0, 'contact' => 'optional', 'comments' => 'open', 'access comments' => 1, 'post comments' => 0, 'skip comment approval' => 1, 'edit own comments' => 0, )Debugcomment.test672CommentInterfaceTest->setEnvironment()
Changed environment:array ( 'authenticated' => true, 'comment count' => false, 'form' => 'separate page', 'user_register' => 0, 'contact' => 'optional', 'comments' => 'open', 'access comments' => 1, 'post comments' => 0, 'skip comment approval' => 1, 'edit own comments' => 0, )Debugcomment.test672CommentInterfaceTest->setEnvironment()
Changed environment:array ( 'authenticated' => false, 'comment count' => true, 'form' => 'separate page', 'user_register' => 0, 'contact' => 'optional', 'comments' => 'open', 'access comments' => 1, 'post comments' => 0, 'skip comment approval' => 1, 'edit own comments' => 0, )Debugcomment.test672CommentInterfaceTest->setEnvironment()
Changed environment:array ( 'authenticated' => true, 'comment count' => true, 'form' => 'separate page', 'user_register' => 0, 'contact' => 'optional', 'comments' => 'open', 'access comments' => 1, 'post comments' => 0, 'skip comment approval' => 1, 'edit own comments' => 0, )Debugcomment.test672CommentInterfaceTest->setEnvironment()
Changed environment:array ( 'authenticated' => false, 'comment count' => false, 'form' => 'separate page', 'user_register' => 0, 'contact' => 'optional', 'comments' => 'open', 'access comments' => 0, 'post comments' => 1, 'skip comment approval' => 1, 'edit own comments' => 0, )Debugcomment.test672CommentInterfaceTest->setEnvironment()
Changed environment:array ( 'authenticated' => true, 'comment count' => false, 'form' => 'separate page', 'user_register' => 0, 'contact' => 'optional', 'comments' => 'open', 'access comments' => 0, 'post comments' => 1, 'skip comment approval' => 1, 'edit own comments' => 0, )Debugcomment.test672CommentInterfaceTest->setEnvironment()
Changed environment:array ( 'authenticated' => false, 'comment count' => true, 'form' => 'separate page', 'user_register' => 0, 'contact' => 'optional', 'comments' => 'open', 'access comments' => 0, 'post comments' => 1, 'skip comment approval' => 1, 'edit own comments' => 0, )Debugcomment.test672CommentInterfaceTest->setEnvironment()
Changed environment:array ( 'authenticated' => true, 'comment count' => true, 'form' => 'separate page', 'user_register' => 0, 'contact' => 'optional', 'comments' => 'open', 'access comments' => 0, 'post comments' => 1, 'skip comment approval' => 1, 'edit own comments' => 0, )Debugcomment.test672CommentInterfaceTest->setEnvironment()
Changed environment:array ( 'authenticated' => false, 'comment count' => false, 'form' => 'separate page', 'user_register' => 0, 'contact' => 'optional', 'comments' => 'open', 'access comments' => 1, 'post comments' => 1, 'skip comment approval' => 1, 'edit own comments' => 0, )Debugcomment.test672CommentInterfaceTest->setEnvironment()
Changed environment:array ( 'authenticated' => true, 'comment count' => false, 'form' => 'separate page', 'user_register' => 0, 'contact' => 'optional', 'comments' => 'open', 'access comments' => 1, 'post comments' => 1, 'skip comment approval' => 1, 'edit own comments' => 0, )Debugcomment.test672CommentInterfaceTest->setEnvironment()
Changed environment:array ( 'authenticated' => false, 'comment count' => true, 'form' => 'separate page', 'user_register' => 0, 'contact' => 'optional', 'comments' => 'open', 'access comments' => 1, 'post comments' => 1, 'skip comment approval' => 1, 'edit own comments' => 0, )Debugcomment.test672CommentInterfaceTest->setEnvironment()
Changed environment:array ( 'authenticated' => true, 'comment count' => true, 'form' => 'separate page', 'user_register' => 0, 'contact' => 'optional', 'comments' => 'open', 'access comments' => 1, 'post comments' => 1, 'skip comment approval' => 1, 'edit own comments' => 0, )Debugcomment.test672CommentInterfaceTest->setEnvironment()
LeafCommentNodeAccessTest5300
LeafCommentPagerTest20800
LeafCommentPreviewTest9100
LeafCommentRSSUnitTest2400
LeafCommentTokenReplaceTestCase6400
LeafCommonSizeTestCase3500
LeafCommonURLUnitTest5600
LeafCommonXssUnitTest900
LeafContactPersonalTestCase14200
LeafContactSitewideTestCase23700
LeafCronRunTestCase4500
LeafDashboardBlocksTestCase10900
LeafDatabaseAlterTestCase5500
LeafDatabaseBasicSyntaxTestCase2600
LeafDatabaseConnectionTestCase3400
LeafDatabaseDeleteTruncateTestCase2000
LeafDatabaseEmptyStatementTestCase400
LeafDatabaseFetch2TestCase2600
LeafDatabaseFetchTestCase3300
LeafDatabaseInsertDefaultsTestCase1900
LeafDatabaseInsertLOBTestCase1300
LeafDatabaseInsertTestCase4500
LeafDatabaseInvalidDataTestCase700
LeafDatabaseLoggingTestCase3800
LeafDatabaseMergeTestCase7500
LeafDatabaseNextIdCase200
LeafDatabaseQueryTestCase600
LeafDatabaseRangeQueryTestCase200
LeafDatabaseRegressionTestCase2700
LeafDatabaseSelectComplexTestCase12300
LeafDatabaseSelectComplexTestCase21400
LeafDatabaseSelectOrderedTestCase2600
LeafDatabaseSelectPagerDefaultTestCase4200
LeafDatabaseSelectSubqueryTestCase3600
LeafDatabaseSelectTableSortDefaultTestCase4100
LeafDatabaseSelectTestCase12400
LeafDatabaseSerializeQueryTestCase600
LeafDatabaseTaggingTestCase2800
LeafDatabaseTemporaryQueryTestCase500
LeafDatabaseTransactionTestCase4600
LeafDatabaseUpdateComplexTestCase5200
LeafDatabaseUpdateLOBTestCase1300
LeafDatabaseUpdateTestCase4900
LeafDateTimeFunctionalTest9600
LeafDBLogTestCase44500
LeafDrupalAddFeedTestCase600
LeafDrupalAlterTestCase500
LeafDrupalAttributesUnitTest600
LeafDrupalDataApiTest3200
LeafDrupalErrorCollectionUnitTest1500
LeafDrupalErrorHandlerUnitTest2800
LeafDrupalGetRdfNamespacesTestCase600
LeafDrupalGotoTest1800
LeafDrupalHTMLIdentifierTestCase1000
LeafDrupalHTTPRequestTestCase2700
LeafDrupalJSONTest1400
LeafDrupalMatchPathTestCase4100
LeafDrupalRenderTestCase4000
LeafDrupalSetContentTestCase4000
LeafDrupalSystemListingTestCase600
LeafDrupalTagsHandlingTestCase800
LeafEnableDisableTestCase5600
LeafEntityCrudHookTestCase7200
LeafEntityFieldQueryTestCase10000
LeafEntityPropertiesTestCase300
LeafFeedParserTestCase4100
LeafFieldAttachOtherTestCase4800
LeafFieldAttachStorageTestCase8300
LeafFieldBulkDeleteTestCase3900
LeafFieldCrudTestCase5900
LeafFieldDisplayAPITestCase4400
LeafFieldFormTestCase23700
LeafFieldInfoTestCase7900
LeafFieldInstanceCrudTestCase3300
LeafFieldSqlStorageTestCase8100
LeafFieldTranslationsTestCase6600
LeafFieldUIManageDisplayTestCase8100
LeafFieldUIManageFieldsTestCase16100
LeafFileCopyTest10600
LeafFileDeleteTest1800
LeafFileDirectoryTest2000
LeafFileDownloadTest3500
ExpandFileFieldDisplayTestCase20112
MessageGroupFilenameLineFunctionStatus
Undefined index: undNoticefile.test719FileFieldDisplayTestCase->testNodeDisplay()
Undefined property: stdClass::$uriNoticefile.module701theme_file_link()
Undefined property: stdClass::$filemimeNoticefile.module739theme_file_icon()
Undefined property: stdClass::$filemimeNoticefile.module781file_icon_path()
Undefined property: stdClass::$filemimeNoticefile.module823file_icon_map()
Undefined property: stdClass::$filemimeNoticefile.module796file_icon_path()
Undefined property: stdClass::$filemimeNoticefile.module796file_icon_path()
Undefined property: stdClass::$filemimeNoticefile.module796file_icon_path()
Undefined property: stdClass::$filemimeNoticefile.module796file_icon_path()
Undefined property: stdClass::$filemimeNoticefile.module708theme_file_link()
Undefined property: stdClass::$filesizeNoticefile.module708theme_file_link()
Undefined property: stdClass::$filenameNoticefile.module714theme_file_link()
Default formatter displaying correctly on full node view.Otherfile.test721FileFieldDisplayTestCase->testNodeDisplay()
ExpandFileFieldPathTestCase27412
MessageGroupFilenameLineFunctionStatus
Undefined index: undNoticefile.test919FileFieldPathTestCase->testUploadPath()
Undefined property: stdClass::$uriNoticefile.test920FileFieldPathTestCase->testUploadPath()
Undefined property: stdClass::$uriNoticefile.test920FileFieldPathTestCase->testUploadPath()
The file was uploaded to the correct path.Otherfile.test920FileFieldPathTestCase->testUploadPath()
Undefined index: undNoticefile.test930FileFieldPathTestCase->testUploadPath()
Undefined property: stdClass::$uriNoticefile.test931FileFieldPathTestCase->testUploadPath()
Undefined property: stdClass::$uriNoticefile.test931FileFieldPathTestCase->testUploadPath()
The file was uploaded to the correct path.Otherfile.test931FileFieldPathTestCase->testUploadPath()
Undefined index: undNoticefile.test942FileFieldPathTestCase->testUploadPath()
Undefined property: stdClass::$uriNoticefile.test947FileFieldPathTestCase->testUploadPath()
Undefined property: stdClass::$uriNoticefile.test947FileFieldPathTestCase->testUploadPath()
The file was uploaded to the correct path with token replacements.Otherfile.test947FileFieldPathTestCase->testUploadPath()
Undefined index: undNoticefile.test942FileFieldPathTestCase->testUploadPath()
Undefined property: stdClass::$uriNoticefile.test947FileFieldPathTestCase->testUploadPath()
Undefined property: stdClass::$uriNoticefile.test947FileFieldPathTestCase->testUploadPath()
The file was uploaded to the correct path with token replacements.Otherfile.test947FileFieldPathTestCase->testUploadPath()
ExpandFileFieldRevisionTestCase622171
MessageGroupFilenameLineFunctionStatus
Undefined index: undNoticefile.test606FileFieldRevisionTestCase->testRevisions()
Undefined property: stdClass::$uriNoticefile.test174FileFieldTestCase->assertFileExists()
New file saved to disk on node creation.Otherfile.test608FileFieldRevisionTestCase->testRevisions()
Undefined property: stdClass::$fidNoticefile.test182FileFieldTestCase->assertFileEntryExists()
array_flip(): Can only flip STRING and INTEGER values!Warningentity.inc178DrupalDefaultEntityController->load()
Trying to get property of non-objectNoticefile.test184FileFieldTestCase->assertFileEntryExists()
Undefined property: stdClass::$uriNoticefile.test184FileFieldTestCase->assertFileEntryExists()
Undefined property: stdClass::$statusNoticefile.test209FileFieldTestCase->assertFileIsPermanent()
File is permanent.Otherfile.test610FileFieldRevisionTestCase->testRevisions()
Found the Remove buttonOtherfile.test165FileFieldTestCase->replaceNodeFile()
Found the requested form fields at node/1/editOtherfile.test165FileFieldTestCase->replaceNodeFile()
Undefined index: undNoticefile.test615FileFieldRevisionTestCase->testRevisions()
Undefined property: stdClass::$uriNoticefile.test174FileFieldTestCase->assertFileExists()
Replacement file exists on disk after creating new revision.Otherfile.test617FileFieldRevisionTestCase->testRevisions()
Undefined property: stdClass::$fidNoticefile.test182FileFieldTestCase->assertFileEntryExists()
array_flip(): Can only flip STRING and INTEGER values!Warningentity.inc178DrupalDefaultEntityController->load()
Trying to get property of non-objectNoticefile.test184FileFieldTestCase->assertFileEntryExists()
Undefined property: stdClass::$uriNoticefile.test184FileFieldTestCase->assertFileEntryExists()
Undefined property: stdClass::$statusNoticefile.test209FileFieldTestCase->assertFileIsPermanent()
Replacement file is permanent.Otherfile.test619FileFieldRevisionTestCase->testRevisions()
Undefined index: undNoticefile.test623FileFieldRevisionTestCase->testRevisions()
Undefined property: stdClass::$uriNoticefile.test174FileFieldTestCase->assertFileExists()
Original file still in place after replacing file in new revision.Otherfile.test624FileFieldRevisionTestCase->testRevisions()
Undefined property: stdClass::$fidNoticefile.test182FileFieldTestCase->assertFileEntryExists()
array_flip(): Can only flip STRING and INTEGER values!Warningentity.inc178DrupalDefaultEntityController->load()
Trying to get property of non-objectNoticefile.test184FileFieldTestCase->assertFileEntryExists()
Undefined property: stdClass::$uriNoticefile.test184FileFieldTestCase->assertFileEntryExists()
Undefined property: stdClass::$statusNoticefile.test209FileFieldTestCase->assertFileIsPermanent()
Original file is still permanent.Otherfile.test626FileFieldRevisionTestCase->testRevisions()
Undefined index: undNoticefile.test632FileFieldRevisionTestCase->testRevisions()
Undefined property: stdClass::$statusNoticefile.test209FileFieldTestCase->assertFileIsPermanent()
New revision file is permanent.Otherfile.test635FileFieldRevisionTestCase->testRevisions()
Undefined index: undNoticefile.test640FileFieldRevisionTestCase->testRevisions()
Undefined property: stdClass::$statusNoticefile.test209FileFieldTestCase->assertFileIsPermanent()
Original revision file still permanent after reverting to the original revision.Otherfile.test643FileFieldRevisionTestCase->testRevisions()
Undefined property: stdClass::$uriNoticefile.test174FileFieldTestCase->assertFileExists()
Second file is still available after deleting second revision, since it is being used by the third revision.Otherfile.test648FileFieldRevisionTestCase->testRevisions()
Undefined property: stdClass::$fidNoticefile.test182FileFieldTestCase->assertFileEntryExists()
array_flip(): Can only flip STRING and INTEGER values!Warningentity.inc178DrupalDefaultEntityController->load()
Trying to get property of non-objectNoticefile.test184FileFieldTestCase->assertFileEntryExists()
Undefined property: stdClass::$uriNoticefile.test184FileFieldTestCase->assertFileEntryExists()
Undefined property: stdClass::$statusNoticefile.test209FileFieldTestCase->assertFileIsPermanent()
Second file entry is still permanent after deleting second revision, since it is being used by the third revision.Otherfile.test650FileFieldRevisionTestCase->testRevisions()
Undefined index: fidNoticefile.field.inc219file_field_presave()
array_flip(): Can only flip STRING and INTEGER values!Warningentity.inc178DrupalDefaultEntityController->load()
Trying to get property of non-objectNoticefile.field.inc220file_field_presave()
Undefined property: stdClass::$uriNoticefile.inc573file_save()
Undefined index: fidNoticefile.field.inc261file_field_update()
Undefined index: fidNoticefile.field.inc282file_field_update()
Undefined property: stdClass::$fidNoticefile.inc656file_usage_add()
PDOException: SQLSTATE[23000]: Integrity constraint violation: 1048 Column 'fid' cannot be null: INSERT INTO {file_usage} (fid, module, type, id, count) VALUES (:db_insert_placeholder_0, :db_insert_placeholder_1, :db_insert_placeholder_2, :db_insert_placeholder_3, :db_insert_placeholder_4); Array ( [:db_insert_placeholder_0] => [:db_insert_placeholder_1] => file [:db_insert_placeholder_2] => user [:db_insert_placeholder_3] => 3 [:db_insert_placeholder_4] => 1 ) in file_usage_add() (line 663 of /var/lib/drupaltestbot/sites/default/files/checkout/includes/file.inc).Uncaught exceptiondatabase.inc2095PDOStatement->execute()
Found the requested form fields at node/1/editOtherfile.test165FileFieldTestCase->replaceNodeFile()
Undefined index: undNoticefile.test615FileFieldRevisionTestCase->testRevisions()
Undefined property: stdClass::$uriNoticefile.test174FileFieldTestCase->assertFileExists()
Replacement file exists on disk after creating new revision.Otherfile.test617FileFieldRevisionTestCase->testRevisions()
Undefined property: stdClass::$fidNoticefile.test182FileFieldTestCase->assertFileEntryExists()
array_flip(): Can only flip STRING and INTEGER values!Warningentity.inc178DrupalDefaultEntityController->load()
Trying to get property of non-objectNoticefile.test184FileFieldTestCase->assertFileEntryExists()
Undefined property: stdClass::$uriNoticefile.test184FileFieldTestCase->assertFileEntryExists()
Undefined property: stdClass::$statusNoticefile.test209FileFieldTestCase->assertFileIsPermanent()
Replacement file is permanent.Otherfile.test619FileFieldRevisionTestCase->testRevisions()
Undefined index: undNoticefile.test623FileFieldRevisionTestCase->testRevisions()
Undefined property: stdClass::$uriNoticefile.test174FileFieldTestCase->assertFileExists()
Original file still in place after replacing file in new revision.Otherfile.test624FileFieldRevisionTestCase->testRevisions()
Undefined property: stdClass::$fidNoticefile.test182FileFieldTestCase->assertFileEntryExists()
array_flip(): Can only flip STRING and INTEGER values!Warningentity.inc178DrupalDefaultEntityController->load()
Trying to get property of non-objectNoticefile.test184FileFieldTestCase->assertFileEntryExists()
Undefined property: stdClass::$uriNoticefile.test184FileFieldTestCase->assertFileEntryExists()
Undefined property: stdClass::$statusNoticefile.test209FileFieldTestCase->assertFileIsPermanent()
Original file is still permanent.Otherfile.test626FileFieldRevisionTestCase->testRevisions()
Undefined index: undNoticefile.test632FileFieldRevisionTestCase->testRevisions()
Undefined property: stdClass::$statusNoticefile.test209FileFieldTestCase->assertFileIsPermanent()
New revision file is permanent.Otherfile.test635FileFieldRevisionTestCase->testRevisions()
Undefined index: undNoticefile.test640FileFieldRevisionTestCase->testRevisions()
Undefined property: stdClass::$statusNoticefile.test209FileFieldTestCase->assertFileIsPermanent()
Original revision file still permanent after reverting to the original revision.Otherfile.test643FileFieldRevisionTestCase->testRevisions()
Undefined property: stdClass::$uriNoticefile.test174FileFieldTestCase->assertFileExists()
Second file is still available after deleting second revision, since it is being used by the third revision.Otherfile.test648FileFieldRevisionTestCase->testRevisions()
Undefined property: stdClass::$fidNoticefile.test182FileFieldTestCase->assertFileEntryExists()
array_flip(): Can only flip STRING and INTEGER values!Warningentity.inc178DrupalDefaultEntityController->load()
Trying to get property of non-objectNoticefile.test184FileFieldTestCase->assertFileEntryExists()
Undefined property: stdClass::$uriNoticefile.test184FileFieldTestCase->assertFileEntryExists()
Undefined property: stdClass::$statusNoticefile.test209FileFieldTestCase->assertFileIsPermanent()
Second file entry is still permanent after deleting second revision, since it is being used by the third revision.Otherfile.test650FileFieldRevisionTestCase->testRevisions()
Undefined index: fidNoticefile.field.inc219file_field_presave()
array_flip(): Can only flip STRING and INTEGER values!Warningentity.inc178DrupalDefaultEntityController->load()
Trying to get property of non-objectNoticefile.field.inc220file_field_presave()
Undefined property: stdClass::$uriNoticefile.inc573file_save()
Undefined index: fidNoticefile.field.inc261file_field_update()
Undefined index: fidNoticefile.field.inc282file_field_update()
Undefined property: stdClass::$fidNoticefile.inc656file_usage_add()
PDOException: SQLSTATE[23000]: Integrity constraint violation: 1048 Column 'fid' cannot be null: INSERT INTO {file_usage} (fid, module, type, id, count) VALUES (:db_insert_placeholder_0, :db_insert_placeholder_1, :db_insert_placeholder_2, :db_insert_placeholder_3, :db_insert_placeholder_4); Array ( [:db_insert_placeholder_0] => [:db_insert_placeholder_1] => file [:db_insert_placeholder_2] => user [:db_insert_placeholder_3] => 3 [:db_insert_placeholder_4] => 1 ) in file_usage_add() (line 663 of /var/lib/drupaltestbot/sites/default/files/checkout/includes/file.inc).Uncaught exceptiondatabase.inc2095PDOStatement->execute()
ExpandFileFieldValidateTestCase1301060
MessageGroupFilenameLineFunctionStatus
Undefined index: undNoticefile.test771FileFieldValidateTestCase->testRequired()
Undefined property: stdClass::$uriNoticefile.test174FileFieldTestCase->assertFileExists()
File exists after uploading to the required field.Otherfile.test772FileFieldValidateTestCase->testRequired()
Undefined property: stdClass::$fidNoticefile.test182FileFieldTestCase->assertFileEntryExists()
array_flip(): Can only flip STRING and INTEGER values!Warningentity.inc178DrupalDefaultEntityController->load()
Trying to get property of non-objectNoticefile.test184FileFieldTestCase->assertFileEntryExists()
Undefined property: stdClass::$uriNoticefile.test184FileFieldTestCase->assertFileEntryExists()
Undefined index: undNoticefile.test787FileFieldValidateTestCase->testRequired()
Undefined property: stdClass::$uriNoticefile.test174FileFieldTestCase->assertFileExists()
File exists after uploading to the required multiple value field.Otherfile.test788FileFieldValidateTestCase->testRequired()
Undefined property: stdClass::$fidNoticefile.test182FileFieldTestCase->assertFileEntryExists()
array_flip(): Can only flip STRING and INTEGER values!Warningentity.inc178DrupalDefaultEntityController->load()
Trying to get property of non-objectNoticefile.test184FileFieldTestCase->assertFileEntryExists()
Undefined property: stdClass::$uriNoticefile.test184FileFieldTestCase->assertFileEntryExists()
Undefined index: undNoticefile.test771FileFieldValidateTestCase->testRequired()
Undefined property: stdClass::$uriNoticefile.test174FileFieldTestCase->assertFileExists()
File exists after uploading to the required field.Otherfile.test772FileFieldValidateTestCase->testRequired()
Undefined property: stdClass::$fidNoticefile.test182FileFieldTestCase->assertFileEntryExists()
array_flip(): Can only flip STRING and INTEGER values!Warningentity.inc178DrupalDefaultEntityController->load()
Trying to get property of non-objectNoticefile.test184FileFieldTestCase->assertFileEntryExists()
Undefined property: stdClass::$uriNoticefile.test184FileFieldTestCase->assertFileEntryExists()
Undefined index: undNoticefile.test787FileFieldValidateTestCase->testRequired()
Undefined property: stdClass::$uriNoticefile.test174FileFieldTestCase->assertFileExists()
File exists after uploading to the required multiple value field.Otherfile.test788FileFieldValidateTestCase->testRequired()
Undefined property: stdClass::$fidNoticefile.test182FileFieldTestCase->assertFileEntryExists()
array_flip(): Can only flip STRING and INTEGER values!Warningentity.inc178DrupalDefaultEntityController->load()
Trying to get property of non-objectNoticefile.test184FileFieldTestCase->assertFileEntryExists()
Undefined property: stdClass::$uriNoticefile.test184FileFieldTestCase->assertFileEntryExists()
Undefined index: undNoticefile.test823FileFieldValidateTestCase->testFileMaxSize()
Undefined property: stdClass::$uriNoticefile.test174FileFieldTestCase->assertFileExists()
File exists after uploading a file (128 KB) under the max limit (1M).Otherfile.test824FileFieldValidateTestCase->testFileMaxSize()
Undefined property: stdClass::$fidNoticefile.test182FileFieldTestCase->assertFileEntryExists()
array_flip(): Can only flip STRING and INTEGER values!Warningentity.inc178DrupalDefaultEntityController->load()
Trying to get property of non-objectNoticefile.test184FileFieldTestCase->assertFileEntryExists()
Undefined property: stdClass::$uriNoticefile.test184FileFieldTestCase->assertFileEntryExists()
Undefined index: undNoticefile.test823FileFieldValidateTestCase->testFileMaxSize()
Undefined property: stdClass::$uriNoticefile.test174FileFieldTestCase->assertFileExists()
File exists after uploading a file (128 KB) under the max limit (1024K).Otherfile.test824FileFieldValidateTestCase->testFileMaxSize()
Undefined property: stdClass::$fidNoticefile.test182FileFieldTestCase->assertFileEntryExists()
array_flip(): Can only flip STRING and INTEGER values!Warningentity.inc178DrupalDefaultEntityController->load()
Trying to get property of non-objectNoticefile.test184FileFieldTestCase->assertFileEntryExists()
Undefined property: stdClass::$uriNoticefile.test184FileFieldTestCase->assertFileEntryExists()
Undefined index: undNoticefile.test823FileFieldValidateTestCase->testFileMaxSize()
Undefined property: stdClass::$uriNoticefile.test174FileFieldTestCase->assertFileExists()
File exists after uploading a file (128 KB) under the max limit (1048576).Otherfile.test824FileFieldValidateTestCase->testFileMaxSize()
Undefined property: stdClass::$fidNoticefile.test182FileFieldTestCase->assertFileEntryExists()
array_flip(): Can only flip STRING and INTEGER values!Warningentity.inc178DrupalDefaultEntityController->load()
Trying to get property of non-objectNoticefile.test184FileFieldTestCase->assertFileEntryExists()
Undefined property: stdClass::$uriNoticefile.test184FileFieldTestCase->assertFileEntryExists()
Undefined index: undNoticefile.test839FileFieldValidateTestCase->testFileMaxSize()
Undefined property: stdClass::$uriNoticefile.test174FileFieldTestCase->assertFileExists()
File exists after uploading a file (1.25 MB) with no max limit.Otherfile.test840FileFieldValidateTestCase->testFileMaxSize()
Undefined property: stdClass::$fidNoticefile.test182FileFieldTestCase->assertFileEntryExists()
array_flip(): Can only flip STRING and INTEGER values!Warningentity.inc178DrupalDefaultEntityController->load()
Trying to get property of non-objectNoticefile.test184FileFieldTestCase->assertFileEntryExists()
Undefined property: stdClass::$uriNoticefile.test184FileFieldTestCase->assertFileEntryExists()
Undefined index: undNoticefile.test866FileFieldValidateTestCase->testFileExtension()
Undefined property: stdClass::$uriNoticefile.test174FileFieldTestCase->assertFileExists()
File exists after uploading a file with no extension checking.Otherfile.test867FileFieldValidateTestCase->testFileExtension()
Undefined property: stdClass::$fidNoticefile.test182FileFieldTestCase->assertFileEntryExists()
array_flip(): Can only flip STRING and INTEGER values!Warningentity.inc178DrupalDefaultEntityController->load()
Trying to get property of non-objectNoticefile.test184FileFieldTestCase->assertFileEntryExists()
Undefined property: stdClass::$uriNoticefile.test184FileFieldTestCase->assertFileEntryExists()
Undefined index: undNoticefile.test884FileFieldValidateTestCase->testFileExtension()
Undefined property: stdClass::$uriNoticefile.test174FileFieldTestCase->assertFileExists()
File exists after uploading a file with extension checking.Otherfile.test885FileFieldValidateTestCase->testFileExtension()
Undefined property: stdClass::$fidNoticefile.test182FileFieldTestCase->assertFileEntryExists()
array_flip(): Can only flip STRING and INTEGER values!Warningentity.inc178DrupalDefaultEntityController->load()
Trying to get property of non-objectNoticefile.test184FileFieldTestCase->assertFileEntryExists()
Undefined property: stdClass::$uriNoticefile.test184FileFieldTestCase->assertFileEntryExists()
ExpandFileFieldWidgetTestCase1934641
MessageGroupFilenameLineFunctionStatus
Undefined index: undNoticefile.test338FileFieldWidgetTestCase->testSingleValuedWidget()
Undefined property: stdClass::$uriNoticefile.test174FileFieldTestCase->assertFileExists()
New file saved to disk on node creation.Otherfile.test339FileFieldWidgetTestCase->testSingleValuedWidget()
Undefined property: stdClass::$uriNoticefile.test342FileFieldWidgetTestCase->testSingleValuedWidget()
Node with file does not display the "Upload" button.Otherfile.test347FileFieldWidgetTestCase->testSingleValuedWidget()
Node with file displays the "Remove" button.Otherfile.test348FileFieldWidgetTestCase->testSingleValuedWidget()
Found the Remove buttonOtherfile.test353FileFieldWidgetTestCase->testSingleValuedWidget()
Found the requested form fields at Otherfile.test353FileFieldWidgetTestCase->testSingleValuedWidget()
Undefined index: undNoticefile.test338FileFieldWidgetTestCase->testSingleValuedWidget()
Undefined property: stdClass::$uriNoticefile.test174FileFieldTestCase->assertFileExists()
New file saved to disk on node creation.Otherfile.test339FileFieldWidgetTestCase->testSingleValuedWidget()
Undefined property: stdClass::$uriNoticefile.test342FileFieldWidgetTestCase->testSingleValuedWidget()
Node with file does not display the "Upload" button.Otherfile.test347FileFieldWidgetTestCase->testSingleValuedWidget()
Node with file displays the "Remove" button.Otherfile.test348FileFieldWidgetTestCase->testSingleValuedWidget()
Undefined offset: 0Noticefile.test357FileFieldWidgetTestCase->testSingleValuedWidget()
Undefined offset: 0Noticefile.test357FileFieldWidgetTestCase->testSingleValuedWidget()
Undefined offset: 0Noticedrupal_web_test_case.php1950DrupalWebTestCase->drupalPostAJAX()
Undefined index: Noticedrupal_web_test_case.php1951DrupalWebTestCase->drupalPostAJAX()
Undefined index: #ajaxNoticeajax.inc368ajax_form_callback()
Undefined index: undNoticefile.test338FileFieldWidgetTestCase->testSingleValuedWidget()
Undefined property: stdClass::$uriNoticefile.test174FileFieldTestCase->assertFileExists()
New file saved to disk on node creation.Otherfile.test339FileFieldWidgetTestCase->testSingleValuedWidget()
Undefined property: stdClass::$uriNoticefile.test342FileFieldWidgetTestCase->testSingleValuedWidget()
Node with file does not display the "Upload" button.Otherfile.test347FileFieldWidgetTestCase->testSingleValuedWidget()
Node with file displays the "Remove" button.Otherfile.test348FileFieldWidgetTestCase->testSingleValuedWidget()
Found the Remove buttonOtherfile.test353FileFieldWidgetTestCase->testSingleValuedWidget()
Found the requested form fields at Otherfile.test353FileFieldWidgetTestCase->testSingleValuedWidget()
Undefined index: undNoticefile.test338FileFieldWidgetTestCase->testSingleValuedWidget()
Undefined property: stdClass::$uriNoticefile.test174FileFieldTestCase->assertFileExists()
New file saved to disk on node creation.Otherfile.test339FileFieldWidgetTestCase->testSingleValuedWidget()
Undefined property: stdClass::$uriNoticefile.test342FileFieldWidgetTestCase->testSingleValuedWidget()
Node with file does not display the "Upload" button.Otherfile.test347FileFieldWidgetTestCase->testSingleValuedWidget()
Node with file displays the "Remove" button.Otherfile.test348FileFieldWidgetTestCase->testSingleValuedWidget()
Undefined offset: 0Noticefile.test357FileFieldWidgetTestCase->testSingleValuedWidget()
Undefined offset: 0Noticefile.test357FileFieldWidgetTestCase->testSingleValuedWidget()
Undefined offset: 0Noticedrupal_web_test_case.php1950DrupalWebTestCase->drupalPostAJAX()
Undefined index: Noticedrupal_web_test_case.php1951DrupalWebTestCase->drupalPostAJAX()
Undefined index: #ajaxNoticeajax.inc368ajax_form_callback()
Failed to set field files[d0tqpas0_und_1] to /var/lib/drupaltestbot/sites/default/files/checkout/sites/default/files/simpletest/652634/text-0.txtOtherfile.test399FileFieldWidgetTestCase->testMultiValuedWidget()
Found the requested form fields at Otherfile.test399FileFieldWidgetTestCase->testMultiValuedWidget()
Failed to set field files[d0tqpas0_und_2] to /var/lib/drupaltestbot/sites/default/files/checkout/sites/default/files/simpletest/652634/text-0.txtOtherfile.test399FileFieldWidgetTestCase->testMultiValuedWidget()
Found the requested form fields at Otherfile.test399FileFieldWidgetTestCase->testMultiValuedWidget()
After uploading 3 files, the "Upload" button is no longer displayed.Otherfile.test401FileFieldWidgetTestCase->testMultiValuedWidget()
There are 3 "Remove" buttons displayed (JSMode=nojs).Otherfile.test414FileFieldWidgetTestCase->testMultiValuedWidget()
Found the Remove buttonOtherfile.test435FileFieldWidgetTestCase->testMultiValuedWidget()
Found the requested form fields at Otherfile.test435FileFieldWidgetTestCase->testMultiValuedWidget()
After removing a file, an "Upload" button is displayed (JSMode=%type).Otherfile.test448FileFieldWidgetTestCase->testMultiValuedWidget()
There are 2 "Remove" buttons displayed (JSMode=nojs).Otherfile.test414FileFieldWidgetTestCase->testMultiValuedWidget()
Found the Remove buttonOtherfile.test435FileFieldWidgetTestCase->testMultiValuedWidget()
Found the requested form fields at Otherfile.test435FileFieldWidgetTestCase->testMultiValuedWidget()
After removing a file, an "Upload" button is displayed (JSMode=%type).Otherfile.test448FileFieldWidgetTestCase->testMultiValuedWidget()
There are 1 "Remove" buttons displayed (JSMode=nojs).Otherfile.test414FileFieldWidgetTestCase->testMultiValuedWidget()
Found the Remove buttonOtherfile.test435FileFieldWidgetTestCase->testMultiValuedWidget()
Found the requested form fields at Otherfile.test435FileFieldWidgetTestCase->testMultiValuedWidget()
Failed to set field files[d0tqpas0_und_1] to /var/lib/drupaltestbot/sites/default/files/checkout/sites/default/files/simpletest/652634/text-0.txtOtherfile.test399FileFieldWidgetTestCase->testMultiValuedWidget()
Found the requested form fields at Otherfile.test399FileFieldWidgetTestCase->testMultiValuedWidget()
Failed to set field files[d0tqpas0_und_2] to /var/lib/drupaltestbot/sites/default/files/checkout/sites/default/files/simpletest/652634/text-0.txtOtherfile.test399FileFieldWidgetTestCase->testMultiValuedWidget()
Found the requested form fields at Otherfile.test399FileFieldWidgetTestCase->testMultiValuedWidget()
After uploading 3 files, the "Upload" button is no longer displayed.Otherfile.test401FileFieldWidgetTestCase->testMultiValuedWidget()
There are 3 "Remove" buttons displayed (JSMode=js).Otherfile.test414FileFieldWidgetTestCase->testMultiValuedWidget()
Undefined offset: 0Noticedrupal_web_test_case.php1950DrupalWebTestCase->drupalPostAJAX()
Undefined index: Noticedrupal_web_test_case.php1951DrupalWebTestCase->drupalPostAJAX()
Undefined index: #ajaxNoticeajax.inc368ajax_form_callback()
After removing a file, an "Upload" button is displayed (JSMode=%type).Otherfile.test448FileFieldWidgetTestCase->testMultiValuedWidget()
There are 2 "Remove" buttons displayed (JSMode=js).Otherfile.test414FileFieldWidgetTestCase->testMultiValuedWidget()
Undefined offset: 0Noticedrupal_web_test_case.php1950DrupalWebTestCase->drupalPostAJAX()
Undefined index: Noticedrupal_web_test_case.php1951DrupalWebTestCase->drupalPostAJAX()
Undefined index: #ajaxNoticeajax.inc368ajax_form_callback()
After removing a file, an "Upload" button is displayed (JSMode=%type).Otherfile.test448FileFieldWidgetTestCase->testMultiValuedWidget()
There are 1 "Remove" buttons displayed (JSMode=js).Otherfile.test414FileFieldWidgetTestCase->testMultiValuedWidget()
Undefined offset: 0Noticedrupal_web_test_case.php1950DrupalWebTestCase->drupalPostAJAX()
Undefined index: Noticedrupal_web_test_case.php1951DrupalWebTestCase->drupalPostAJAX()
Undefined index: #ajaxNoticeajax.inc368ajax_form_callback()
Undefined index: undNoticefile.test485FileFieldWidgetTestCase->testPrivateFileSetting()
Undefined property: stdClass::$uriNoticefile.test174FileFieldTestCase->assertFileExists()
New file saved to disk on node creation.Otherfile.test486FileFieldWidgetTestCase->testPrivateFileSetting()
Undefined property: stdClass::$uriNoticefile.test489FileFieldWidgetTestCase->testPrivateFileSetting()
Upload destination setting disabled.Otherfile.test495FileFieldWidgetTestCase->testPrivateFileSetting()
Undefined offset: 1Noticefile.test544FileFieldWidgetTestCase->testPrivateFileComment()
array_flip(): Can only flip STRING and INTEGER values!Warningentity.inc178DrupalDefaultEntityController->load()
Trying to get property of non-objectNoticefile.test550FileFieldWidgetTestCase->testPrivateFileComment()
Undefined property: stdClass::$uriNoticefile.test174FileFieldTestCase->assertFileExists()
New file saved to disk on node creation.Otherfile.test551FileFieldWidgetTestCase->testPrivateFileComment()
Undefined property: stdClass::$uriNoticefile.test553FileFieldWidgetTestCase->testPrivateFileComment()
Undefined property: stdClass::$uriNoticefile.test555FileFieldWidgetTestCase->testPrivateFileComment()
Undefined property: stdClass::$uriNoticefile.test560FileFieldWidgetTestCase->testPrivateFileComment()
Confirmed that access is denied for the file without the needed permission.Browserfile.test561FileFieldWidgetTestCase->testPrivateFileComment()
LeafFileLoadTest2900
ExpandFileManagedFileElementTestCase2663724
MessageGroupFilenameLineFunctionStatus
New file got saved.Otherfile.test249FileManagedFileElementTestCase->testManagedFile()
Submit handler has correct file info.Otherfile.test250FileManagedFileElementTestCase->testManagedFile()
New file got uploaded.Otherfile.test269FileManagedFileElementTestCase->testManagedFile()
Found the Remove buttonOtherfile.test279FileManagedFileElementTestCase->testManagedFile()
Found the requested form fields at Otherfile.test279FileManagedFileElementTestCase->testManagedFile()
New file got saved.Otherfile.test249FileManagedFileElementTestCase->testManagedFile()
Submit handler has correct file info.Otherfile.test250FileManagedFileElementTestCase->testManagedFile()
New file got uploaded.Otherfile.test269FileManagedFileElementTestCase->testManagedFile()
Found the Remove buttonOtherfile.test279FileManagedFileElementTestCase->testManagedFile()
Found the requested form fields at Otherfile.test279FileManagedFileElementTestCase->testManagedFile()
Found the Remove buttonOtherfile.test293FileManagedFileElementTestCase->testManagedFile()
Found the requested form fields at Otherfile.test293FileManagedFileElementTestCase->testManagedFile()
New file got uploaded.Otherfile.test269FileManagedFileElementTestCase->testManagedFile()
Undefined offset: 0Noticedrupal_web_test_case.php1950DrupalWebTestCase->drupalPostAJAX()
Undefined index: Noticedrupal_web_test_case.php1951DrupalWebTestCase->drupalPostAJAX()
Undefined index: callbackNoticeajax.inc368ajax_form_callback()
Undefined offset: 0Noticedrupal_web_test_case.php1950DrupalWebTestCase->drupalPostAJAX()
Undefined index: Noticedrupal_web_test_case.php1951DrupalWebTestCase->drupalPostAJAX()
Undefined index: callbackNoticeajax.inc368ajax_form_callback()
New file got saved.Otherfile.test249FileManagedFileElementTestCase->testManagedFile()
Submit handler has correct file info.Otherfile.test250FileManagedFileElementTestCase->testManagedFile()
New file got uploaded.Otherfile.test269FileManagedFileElementTestCase->testManagedFile()
Found the Remove buttonOtherfile.test279FileManagedFileElementTestCase->testManagedFile()
Found the requested form fields at Otherfile.test279FileManagedFileElementTestCase->testManagedFile()
Found the Remove buttonOtherfile.test293FileManagedFileElementTestCase->testManagedFile()
Found the requested form fields at Otherfile.test293FileManagedFileElementTestCase->testManagedFile()
New file got uploaded.Otherfile.test269FileManagedFileElementTestCase->testManagedFile()
Undefined offset: 0Noticedrupal_web_test_case.php1950DrupalWebTestCase->drupalPostAJAX()
Undefined index: Noticedrupal_web_test_case.php1951DrupalWebTestCase->drupalPostAJAX()
Undefined index: callbackNoticeajax.inc368ajax_form_callback()
Undefined offset: 0Noticedrupal_web_test_case.php1950DrupalWebTestCase->drupalPostAJAX()
Undefined index: Noticedrupal_web_test_case.php1951DrupalWebTestCase->drupalPostAJAX()
Undefined index: callbackNoticeajax.inc368ajax_form_callback()
New file got saved.Otherfile.test249FileManagedFileElementTestCase->testManagedFile()
Submit handler has correct file info.Otherfile.test250FileManagedFileElementTestCase->testManagedFile()
New file got uploaded.Otherfile.test269FileManagedFileElementTestCase->testManagedFile()
Found the Remove buttonOtherfile.test279FileManagedFileElementTestCase->testManagedFile()
Found the requested form fields at Otherfile.test279FileManagedFileElementTestCase->testManagedFile()
Found the Remove buttonOtherfile.test293FileManagedFileElementTestCase->testManagedFile()
Found the requested form fields at Otherfile.test293FileManagedFileElementTestCase->testManagedFile()
New file got uploaded.Otherfile.test269FileManagedFileElementTestCase->testManagedFile()
Undefined offset: 0Noticedrupal_web_test_case.php1950DrupalWebTestCase->drupalPostAJAX()
Undefined index: Noticedrupal_web_test_case.php1951DrupalWebTestCase->drupalPostAJAX()
Undefined index: callbackNoticeajax.inc368ajax_form_callback()
Undefined offset: 0Noticedrupal_web_test_case.php1950DrupalWebTestCase->drupalPostAJAX()
Undefined index: Noticedrupal_web_test_case.php1951DrupalWebTestCase->drupalPostAJAX()
Undefined index: callbackNoticeajax.inc368ajax_form_callback()
New file got saved.Otherfile.test249FileManagedFileElementTestCase->testManagedFile()
Submit handler has correct file info.Otherfile.test250FileManagedFileElementTestCase->testManagedFile()
New file got uploaded.Otherfile.test269FileManagedFileElementTestCase->testManagedFile()
Found the Remove buttonOtherfile.test279FileManagedFileElementTestCase->testManagedFile()
Found the requested form fields at Otherfile.test279FileManagedFileElementTestCase->testManagedFile()
Found the Remove buttonOtherfile.test293FileManagedFileElementTestCase->testManagedFile()
Found the requested form fields at Otherfile.test293FileManagedFileElementTestCase->testManagedFile()
New file got uploaded.Otherfile.test269FileManagedFileElementTestCase->testManagedFile()
Undefined offset: 0Noticedrupal_web_test_case.php1950DrupalWebTestCase->drupalPostAJAX()
Undefined index: Noticedrupal_web_test_case.php1951DrupalWebTestCase->drupalPostAJAX()
Undefined index: callbackNoticeajax.inc368ajax_form_callback()
Undefined offset: 0Noticedrupal_web_test_case.php1950DrupalWebTestCase->drupalPostAJAX()
Undefined index: Noticedrupal_web_test_case.php1951DrupalWebTestCase->drupalPostAJAX()
Undefined index: callbackNoticeajax.inc368ajax_form_callback()
LeafFileMimeTypeTest3800
LeafFileMoveTest10500
LeafFileNameMungingTest500
LeafFileSaveDataTest8800
LeafFileSaveTest1400
ExpandFileSaveUploadTest2174610
MessageGroupFilenameLineFunctionStatus
Found the success message.Otherfile.test595FileSaveUploadTest->setUp()
Expected hooks validate, insert to be called but insert was not called.Otherfile.test599FileSaveUploadTest->setUp()
A new file was created.Otherfile.test608FileSaveUploadTest->testNormal()
array_flip(): Can only flip STRING and INTEGER values!Warningentity.inc178DrupalDefaultEntityController->load()
Loaded the file.Otherfile.test610FileSaveUploadTest->testNormal()
Trying to get property of non-objectNoticefile.test612FileSaveUploadTest->testNormal()
A MIME type was set.Otherfile.test612FileSaveUploadTest->testNormal()
Raw "You WIN!" foundOtherfile.test623FileSaveUploadTest->testNormal()
Expected hooks validate, insert to be called but insert was not called.Otherfile.test627FileSaveUploadTest->testNormal()
array_flip(): Can only flip STRING and INTEGER values!Warningentity.inc178DrupalDefaultEntityController->load()
Value false is TRUE.Otherfile.test630FileSaveUploadTest->testNormal()
Trying to get property of non-objectNoticefile.test632FileSaveUploadTest->testNormal()
A MIME type was set.Otherfile.test632FileSaveUploadTest->testNormal()
Trying to get property of non-objectNoticefile.test635FileSaveUploadTest->testNormal()
Trying to get property of non-objectNoticefile.test635FileSaveUploadTest->testNormal()
array_flip(): Can only flip STRING and INTEGER values!Warningentity.inc178DrupalDefaultEntityController->load()
array_flip(): Can only flip STRING and INTEGER values!Warningentity.inc178DrupalDefaultEntityController->load()
Trying to get property of non-objectNoticefile.test636FileSaveUploadTest->testNormal()
File was loaded successfullyOtherfile.test636FileSaveUploadTest->testNormal()
Trying to get property of non-objectNoticefile.test637FileSaveUploadTest->testNormal()
File was loaded successfullyOtherfile.test637FileSaveUploadTest->testNormal()
Raw "You WIN!" foundOtherfile.test649FileSaveUploadTest->testNormal()
Found the success message.Otherfile.test595FileSaveUploadTest->setUp()
Expected hooks validate, insert to be called but insert was not called.Otherfile.test599FileSaveUploadTest->setUp()
Found the success message.Otherfile.test694FileSaveUploadTest->testHandleExtension()
Expected hooks validate, load, update to be called but load, update was not called.Otherfile.test697FileSaveUploadTest->testHandleExtension()
Found the success message.Otherfile.test711FileSaveUploadTest->testHandleExtension()
Expected hooks validate, load, update to be called but load, update was not called.Otherfile.test714FileSaveUploadTest->testHandleExtension()
Found the success message.Otherfile.test595FileSaveUploadTest->setUp()
Expected hooks validate, insert to be called but insert was not called.Otherfile.test599FileSaveUploadTest->setUp()
Dangerous file's MIME type was changed.Otherfile.test734FileSaveUploadTest->testHandleDangerousFile()
Found the success message.Otherfile.test735FileSaveUploadTest->testHandleDangerousFile()
Expected hooks validate, insert to be called but insert was not called.Otherfile.test738FileSaveUploadTest->testHandleDangerousFile()
Dangerous file was not renamed when insecure uploads is TRUE.Otherfile.test749FileSaveUploadTest->testHandleDangerousFile()
Found the success message.Otherfile.test750FileSaveUploadTest->testHandleDangerousFile()
Expected hooks validate, insert to be called but insert was not called.Otherfile.test753FileSaveUploadTest->testHandleDangerousFile()
Found the success message.Otherfile.test595FileSaveUploadTest->setUp()
Expected hooks validate, insert to be called but insert was not called.Otherfile.test599FileSaveUploadTest->setUp()
File was successfully munged.Otherfile.test783FileSaveUploadTest->testHandleFileMunge()
Found the success message.Otherfile.test784FileSaveUploadTest->testHandleFileMunge()
Expected hooks validate, insert to be called but insert was not called.Otherfile.test787FileSaveUploadTest->testHandleFileMunge()
File was not munged when allowing any extension.Otherfile.test801FileSaveUploadTest->testHandleFileMunge()
Found the success message.Otherfile.test802FileSaveUploadTest->testHandleFileMunge()
Expected hooks validate, insert to be called but insert was not called.Otherfile.test805FileSaveUploadTest->testHandleFileMunge()
Found the success message.Otherfile.test595FileSaveUploadTest->setUp()
Expected hooks validate, insert to be called but insert was not called.Otherfile.test599FileSaveUploadTest->setUp()
Found the success message.Otherfile.test818FileSaveUploadTest->testExistingRename()
Expected hooks validate, insert to be called but insert was not called.Otherfile.test821FileSaveUploadTest->testExistingRename()
Found the success message.Otherfile.test595FileSaveUploadTest->setUp()
Expected hooks validate, insert to be called but insert was not called.Otherfile.test599FileSaveUploadTest->setUp()
Found the success message.Otherfile.test834FileSaveUploadTest->testExistingReplace()
Expected hooks validate, load, update to be called but load, update was not called.Otherfile.test837FileSaveUploadTest->testExistingReplace()
Found the success message.Otherfile.test595FileSaveUploadTest->setUp()
Expected hooks validate, insert to be called but insert was not called.Otherfile.test599FileSaveUploadTest->setUp()
Found the success message.Otherfile.test595FileSaveUploadTest->setUp()
Expected hooks validate, insert to be called but insert was not called.Otherfile.test599FileSaveUploadTest->setUp()
LeafFileScanDirectoryTest2300
LeafFileSpaceUsedTest1100
ExpandFileTokenReplaceTestCase501184
MessageGroupFilenameLineFunctionStatus
Undefined index: undNoticefile.test1009FileTokenReplaceTestCase->testFileTokenReplacement()
Undefined property: stdClass::$fidNoticefile.test1014FileTokenReplaceTestCase->testFileTokenReplacement()
Undefined property: stdClass::$filenameNoticefile.test1015FileTokenReplaceTestCase->testFileTokenReplacement()
Undefined property: stdClass::$uriNoticefile.test1017FileTokenReplaceTestCase->testFileTokenReplacement()
Undefined property: stdClass::$filemimeNoticefile.test1018FileTokenReplaceTestCase->testFileTokenReplacement()
Undefined property: stdClass::$filesizeNoticefile.test1019FileTokenReplaceTestCase->testFileTokenReplacement()
Undefined property: stdClass::$uriNoticefile.test1020FileTokenReplaceTestCase->testFileTokenReplacement()
Undefined property: stdClass::$timestampNoticefile.test1021FileTokenReplaceTestCase->testFileTokenReplacement()
date_timezone_set() expects parameter 1 to be DateTime, boolean givenWarningcommon.inc1907format_date()
date_format() expects parameter 1 to be DateTime, boolean givenWarningcommon.inc1917format_date()
Undefined property: stdClass::$timestampNoticefile.test1022FileTokenReplaceTestCase->testFileTokenReplacement()
date_timezone_set() expects parameter 1 to be DateTime, boolean givenWarningcommon.inc1907format_date()
date_format() expects parameter 1 to be DateTime, boolean givenWarningcommon.inc1917format_date()
Undefined property: stdClass::$uidNoticefile.test1024FileTokenReplaceTestCase->testFileTokenReplacement()
No empty tokens generated.Otherfile.test1027FileTokenReplaceTestCase->testFileTokenReplacement()
Undefined property: stdClass::$fidNoticesystem.tokens.inc223system_tokens()
Undefined property: stdClass::$filenameNoticesystem.tokens.inc228system_tokens()
Undefined property: stdClass::$uriNoticesystem.tokens.inc236system_tokens()
Undefined property: stdClass::$filemimeNoticesystem.tokens.inc240system_tokens()
Undefined property: stdClass::$filesizeNoticesystem.tokens.inc244system_tokens()
Undefined property: stdClass::$uriNoticesystem.tokens.inc248system_tokens()
Undefined property: stdClass::$timestampNoticesystem.tokens.inc253system_tokens()
date_timezone_set() expects parameter 1 to be DateTime, boolean givenWarningcommon.inc1907format_date()
date_format() expects parameter 1 to be DateTime, boolean givenWarningcommon.inc1917format_date()
Undefined property: stdClass::$timestampNoticesystem.tokens.inc264system_tokens()
Sanitized file token [file:timestamp:short] replaced.Otherfile.test1031FileTokenReplaceTestCase->testFileTokenReplacement()
Undefined property: stdClass::$uidNoticesystem.tokens.inc257system_tokens()
array_flip(): Can only flip STRING and INTEGER values!Warningentity.inc178DrupalDefaultEntityController->load()
array_flip(): Can only flip STRING and INTEGER values!Warningentity.inc354DrupalDefaultEntityController->cacheGet()
Trying to get property of non-objectNoticesystem.tokens.inc258system_tokens()
Sanitized file token [file:owner] replaced.Otherfile.test1031FileTokenReplaceTestCase->testFileTokenReplacement()
Undefined property: stdClass::$uidNoticesystem.tokens.inc267system_tokens()
array_flip(): Can only flip STRING and INTEGER values!Warningentity.inc178DrupalDefaultEntityController->load()
array_flip(): Can only flip STRING and INTEGER values!Warningentity.inc354DrupalDefaultEntityController->cacheGet()
Sanitized file token [file:owner:uid] replaced.Otherfile.test1031FileTokenReplaceTestCase->testFileTokenReplacement()
Undefined property: stdClass::$filenameNoticefile.test1035FileTokenReplaceTestCase->testFileTokenReplacement()
Undefined index: undNoticefile.test1009FileTokenReplaceTestCase->testFileTokenReplacement()
Undefined property: stdClass::$fidNoticefile.test1014FileTokenReplaceTestCase->testFileTokenReplacement()
Undefined property: stdClass::$filenameNoticefile.test1015FileTokenReplaceTestCase->testFileTokenReplacement()
Undefined property: stdClass::$uriNoticefile.test1017FileTokenReplaceTestCase->testFileTokenReplacement()
Undefined property: stdClass::$filemimeNoticefile.test1018FileTokenReplaceTestCase->testFileTokenReplacement()
Undefined property: stdClass::$filesizeNoticefile.test1019FileTokenReplaceTestCase->testFileTokenReplacement()
Undefined property: stdClass::$uriNoticefile.test1020FileTokenReplaceTestCase->testFileTokenReplacement()
Undefined property: stdClass::$timestampNoticefile.test1021FileTokenReplaceTestCase->testFileTokenReplacement()
date_timezone_set() expects parameter 1 to be DateTime, boolean givenWarningcommon.inc1907format_date()
date_format() expects parameter 1 to be DateTime, boolean givenWarningcommon.inc1917format_date()
Undefined property: stdClass::$timestampNoticefile.test1022FileTokenReplaceTestCase->testFileTokenReplacement()
date_timezone_set() expects parameter 1 to be DateTime, boolean givenWarningcommon.inc1907format_date()
date_format() expects parameter 1 to be DateTime, boolean givenWarningcommon.inc1917format_date()
Undefined property: stdClass::$uidNoticefile.test1024FileTokenReplaceTestCase->testFileTokenReplacement()
No empty tokens generated.Otherfile.test1027FileTokenReplaceTestCase->testFileTokenReplacement()
Undefined property: stdClass::$fidNoticesystem.tokens.inc223system_tokens()
Undefined property: stdClass::$filenameNoticesystem.tokens.inc228system_tokens()
Undefined property: stdClass::$uriNoticesystem.tokens.inc236system_tokens()
Undefined property: stdClass::$filemimeNoticesystem.tokens.inc240system_tokens()
Undefined property: stdClass::$filesizeNoticesystem.tokens.inc244system_tokens()
Undefined property: stdClass::$uriNoticesystem.tokens.inc248system_tokens()
Undefined property: stdClass::$timestampNoticesystem.tokens.inc253system_tokens()
date_timezone_set() expects parameter 1 to be DateTime, boolean givenWarningcommon.inc1907format_date()
date_format() expects parameter 1 to be DateTime, boolean givenWarningcommon.inc1917format_date()
Undefined property: stdClass::$timestampNoticesystem.tokens.inc264system_tokens()
Sanitized file token [file:timestamp:short] replaced.Otherfile.test1031FileTokenReplaceTestCase->testFileTokenReplacement()
Undefined property: stdClass::$uidNoticesystem.tokens.inc257system_tokens()
array_flip(): Can only flip STRING and INTEGER values!Warningentity.inc178DrupalDefaultEntityController->load()
array_flip(): Can only flip STRING and INTEGER values!Warningentity.inc354DrupalDefaultEntityController->cacheGet()
Trying to get property of non-objectNoticesystem.tokens.inc258system_tokens()
Sanitized file token [file:owner] replaced.Otherfile.test1031FileTokenReplaceTestCase->testFileTokenReplacement()
Undefined property: stdClass::$uidNoticesystem.tokens.inc267system_tokens()
array_flip(): Can only flip STRING and INTEGER values!Warningentity.inc178DrupalDefaultEntityController->load()
array_flip(): Can only flip STRING and INTEGER values!Warningentity.inc354DrupalDefaultEntityController->cacheGet()
Sanitized file token [file:owner:uid] replaced.Otherfile.test1031FileTokenReplaceTestCase->testFileTokenReplacement()
Undefined property: stdClass::$filenameNoticefile.test1035FileTokenReplaceTestCase->testFileTokenReplacement()
Undefined property: stdClass::$uriNoticefile.test1037FileTokenReplaceTestCase->testFileTokenReplacement()
Undefined property: stdClass::$filemimeNoticefile.test1038FileTokenReplaceTestCase->testFileTokenReplacement()
Undefined property: stdClass::$filesizeNoticefile.test1039FileTokenReplaceTestCase->testFileTokenReplacement()
Undefined property: stdClass::$fidNoticesystem.tokens.inc223system_tokens()
Undefined property: stdClass::$filenameNoticesystem.tokens.inc228system_tokens()
Undefined property: stdClass::$uriNoticesystem.tokens.inc236system_tokens()
Undefined property: stdClass::$filemimeNoticesystem.tokens.inc240system_tokens()
Undefined property: stdClass::$filesizeNoticesystem.tokens.inc244system_tokens()
Undefined property: stdClass::$uriNoticesystem.tokens.inc248system_tokens()
Undefined property: stdClass::$timestampNoticesystem.tokens.inc253system_tokens()
date_timezone_set() expects parameter 1 to be DateTime, boolean givenWarningcommon.inc1907format_date()
date_format() expects parameter 1 to be DateTime, boolean givenWarningcommon.inc1917format_date()
Undefined property: stdClass::$timestampNoticesystem.tokens.inc264system_tokens()
Unsanitized file token [file:timestamp:short] replaced.Otherfile.test1043FileTokenReplaceTestCase->testFileTokenReplacement()
Undefined property: stdClass::$uidNoticesystem.tokens.inc257system_tokens()
array_flip(): Can only flip STRING and INTEGER values!Warningentity.inc178DrupalDefaultEntityController->load()
array_flip(): Can only flip STRING and INTEGER values!Warningentity.inc354DrupalDefaultEntityController->cacheGet()
Trying to get property of non-objectNoticesystem.tokens.inc258system_tokens()
Unsanitized file token [file:owner] replaced.Otherfile.test1043FileTokenReplaceTestCase->testFileTokenReplacement()
Undefined property: stdClass::$uidNoticesystem.tokens.inc267system_tokens()
array_flip(): Can only flip STRING and INTEGER values!Warningentity.inc178DrupalDefaultEntityController->load()
array_flip(): Can only flip STRING and INTEGER values!Warningentity.inc354DrupalDefaultEntityController->cacheGet()
Unsanitized file token [file:owner:uid] replaced.Otherfile.test1043FileTokenReplaceTestCase->testFileTokenReplacement()
LeafFileTranferTest200
LeafFileUnmanagedCopyTest3100
LeafFileUnmanagedDeleteRecursiveTest1700
LeafFileUnmanagedDeleteTest800
LeafFileUnmanagedMoveTest2200
LeafFileUnmanagedSaveDataTest700
LeafFileURLRewritingTest2100
LeafFileUsageTest2800
LeafFileValidateTest1100
LeafFileValidatorTest2700
LeafFilterAdminTestCase16400
LeafFilterCRUDTestCase21400
LeafFilterDefaultFormatTestCase3300
LeafFilterFormatAccessTestCase24400
LeafFilterHooksTestCase3200
LeafFilterNoFormatTestCase100
LeafFilterSecurityTestCase2600
LeafFilterUnitTestCase20900
LeafFloodFunctionalTest600
LeafFormAlterTestCase300
LeafFormatDateUnitTest6100
LeafFormCheckboxTestCase9600
LeafFormElementTestCase2600
LeafFormsArbitraryRebuildTestCase1400
LeafFormsElementsLabelsTestCase1500
LeafFormsElementsTableSelectFunctionalTest5200
LeafFormsElementsVerticalTabsFunctionalTest300
LeafFormsFileInclusionTestCase900
LeafFormsFormStorageTestCase11500
LeafFormsFormWrapperTestCase400
LeafFormsProgrammaticTestCase2300
LeafFormsRebuildTestCase5000
LeafFormStateValuesCleanTestCase1300
LeafFormsTestCase27000
LeafFormsTriggeringElementTestCase4800
LeafFormValidationTestCase4700
LeafForumTestCase60800
LeafFrontPageTestCase3600
LeafGraphUnitTest2800
LeafHelpTestCase30800
LeafHookBootExitTestCase1800
LeafHookRequirementsTestCase1500
ExpandImageAdminStylesUnitTest16434
MessageGroupFilenameLineFunctionStatus
array_flip(): Can only flip STRING and INTEGER values!Warningentity.inc178DrupalDefaultEntityController->load()
Trying to get property of non-objectNoticeimage.test602ImageAdminStylesUnitTest->testStyleReplacement()
Image displayed using style xwkgdmjx4i.Otherimage.test602ImageAdminStylesUnitTest->testStyleReplacement()
Trying to get property of non-objectNoticeimage.test612ImageAdminStylesUnitTest->testStyleReplacement()
Image displayed using style replacement style.Otherimage.test612ImageAdminStylesUnitTest->testStyleReplacement()
Trying to get property of non-objectNoticeimage.test623ImageAdminStylesUnitTest->testStyleReplacement()
Image displayed using style replacement style.Otherimage.test623ImageAdminStylesUnitTest->testStyleReplacement()
LeafImageEffectsUnitTest3300
ExpandImageFieldDisplayTestCase1132410
MessageGroupFilenameLineFunctionStatus
array_flip(): Can only flip STRING and INTEGER values!Warningentity.inc178DrupalDefaultEntityController->load()
Trying to get property of non-objectNoticeimage.test667ImageFieldDisplayTestCase->_testImageFieldFormatters()
Default formatter displaying correctly on full node view.Otherimage.test672ImageFieldDisplayTestCase->_testImageFieldFormatters()
Image linked to file formatter displaying correctly on full node view.Otherimage.test681ImageFieldDisplayTestCase->_testImageFieldFormatters()
File was downloaded successfully.Otherimage.test683ImageFieldDisplayTestCase->_testImageFieldFormatters()
Image linked to content formatter displaying correctly on full node view.Otherimage.test705ImageFieldDisplayTestCase->_testImageFieldFormatters()
Image style thumbnail formatter displaying correctly on full node view.Otherimage.test717ImageFieldDisplayTestCase->_testImageFieldFormatters()
array_flip(): Can only flip STRING and INTEGER values!Warningentity.inc178DrupalDefaultEntityController->load()
Trying to get property of non-objectNoticeimage.test667ImageFieldDisplayTestCase->_testImageFieldFormatters()
Default formatter displaying correctly on full node view.Otherimage.test672ImageFieldDisplayTestCase->_testImageFieldFormatters()
Image linked to file formatter displaying correctly on full node view.Otherimage.test681ImageFieldDisplayTestCase->_testImageFieldFormatters()
File was downloaded successfully.Otherimage.test683ImageFieldDisplayTestCase->_testImageFieldFormatters()
Content-Type header was sent.Otherimage.test687ImageFieldDisplayTestCase->_testImageFieldFormatters()
Content-Disposition header was sent.Otherimage.test688ImageFieldDisplayTestCase->_testImageFieldFormatters()
Cache-Control header was sent.Otherimage.test689ImageFieldDisplayTestCase->_testImageFieldFormatters()
Image linked to content formatter displaying correctly on full node view.Otherimage.test705ImageFieldDisplayTestCase->_testImageFieldFormatters()
Image style thumbnail formatter displaying correctly on full node view.Otherimage.test717ImageFieldDisplayTestCase->_testImageFieldFormatters()
Access denied to image style thumbnail as anonymous user.Browserimage.test723ImageFieldDisplayTestCase->_testImageFieldFormatters()
Alt field displayed on article form.Browserimage.test757ImageFieldDisplayTestCase->testImageFieldSettings()
Title field displayed on article form.Browserimage.test758ImageFieldDisplayTestCase->testImageFieldSettings()
array_flip(): Can only flip STRING and INTEGER values!Warningentity.inc178DrupalDefaultEntityController->load()
Trying to get property of non-objectNoticeimage.test763ImageFieldDisplayTestCase->testImageFieldSettings()
Preview image is displayed using 'medium' style.Otherimage.test766ImageFieldDisplayTestCase->testImageFieldSettings()
Trying to get property of non-objectNoticeimage.test770ImageFieldDisplayTestCase->testImageFieldSettings()
Failed to set field nbro4ybh[und][0][alt] to yHE8antWOtherimage.test778ImageFieldDisplayTestCase->testImageFieldSettings()
Failed to set field nbro4ybh[und][0][title] to q2Tu0LH4Otherimage.test778ImageFieldDisplayTestCase->testImageFieldSettings()
Found the Save buttonOtherimage.test778ImageFieldDisplayTestCase->testImageFieldSettings()
Found the requested form fields at node//editOtherimage.test778ImageFieldDisplayTestCase->testImageFieldSettings()
Image displayed using user supplied alt and title attributes.Otherimage.test780ImageFieldDisplayTestCase->testImageFieldSettings()
Trying to get property of non-objectNoticeimage.test809ImageFieldDisplayTestCase->testImageFieldDefaultImage()
Default image displayed when no user supplied image is present.Otherimage.test811ImageFieldDisplayTestCase->testImageFieldDefaultImage()
array_flip(): Can only flip STRING and INTEGER values!Warningentity.inc178DrupalDefaultEntityController->load()
Trying to get property of non-objectNoticeimage.test818ImageFieldDisplayTestCase->testImageFieldDefaultImage()
User supplied image is displayed.Otherimage.test823ImageFieldDisplayTestCase->testImageFieldDefaultImage()
LeafImageFieldValidateTestCase1800
LeafImageStylesPathAndUrlUnitTest4200
LeafImageToolkitGdTestCase100
LeafImageToolkitUnitTest4400
ExpandImportOPMLTestCase4852
MessageGroupFilenameLineFunctionStatus
Verifying that a duplicate URL was identifiedOtheraggregator.test677ImportOPMLTestCase->submitImportForm()
Verifying that a duplicate title was identifiedOtheraggregator.test678ImportOPMLTestCase->submitImportForm()
Verifying that two distinct feeds were added.Otheraggregator.test681ImportOPMLTestCase->submitImportForm()
Undefined variable: titleNoticeaggregator.test692ImportOPMLTestCase->submitImportForm()
First feed was added correctly.Otheraggregator.test692ImportOPMLTestCase->submitImportForm()
Undefined variable: urlNoticeaggregator.test693ImportOPMLTestCase->submitImportForm()
Second feed was added correctly.Otheraggregator.test693ImportOPMLTestCase->submitImportForm()
LeafInfoFileParserTestCase900
LeafIPAddressBlockingTestCase4200
LeafJavaScriptTestCase4400
LeafListFieldTestCase1400
LeafListFieldUITestCase20300
LeafLocaleCommentLanguageFunctionalTest5200
LeafLocaleConfigurationTest9700
LeafLocaleContentFunctionalTest6400
LeafLocaleDateFormatsFunctionalTest3500
ExpandLocaleExportFunctionalTest2740
MessageGroupFilenameLineFunctionStatus
Failed to set field langcode to frOtherlocale.test1030LocaleExportFunctionalTest->testExportTranslation()
Found the requested form fields at admin/config/regional/translate/exportOtherlocale.test1030LocaleExportFunctionalTest->testExportTranslation()
Exported French translation file.Otherlocale.test1033LocaleExportFunctionalTest->testExportTranslation()
French translations present in exported file.Otherlocale.test1035LocaleExportFunctionalTest->testExportTranslation()
ExpandLocaleImportFunctionalTest96220
MessageGroupFilenameLineFunctionStatus
The language has been automatically created.Otherlocale.test642LocaleImportFunctionalTest->testStandalonePoFile()
The translation file was successfully imported.Otherlocale.test645LocaleImportFunctionalTest->testStandalonePoFile()
Plural number initialized.Otherlocale.test648LocaleImportFunctionalTest->testStandalonePoFile()
Correct page redirection.Otherlocale.test651LocaleImportFunctionalTest->testStandalonePoFile()
The translation file was successfully imported.Otherlocale.test660LocaleImportFunctionalTest->testStandalonePoFile()
Unsafe strings were skipped.Otherlocale.test662LocaleImportFunctionalTest->testStandalonePoFile()
The translation file was successfully imported.Otherlocale.test672LocaleImportFunctionalTest->testStandalonePoFile()
The translation file was successfully imported.Otherlocale.test694LocaleImportFunctionalTest->testStandalonePoFile()
Failed to set field language to frOtherlocale.test702LocaleImportFunctionalTest->testStandalonePoFile()
Found the requested form fields at admin/config/regional/translate/translateOtherlocale.test702LocaleImportFunctionalTest->testStandalonePoFile()
String not overwritten by imported string.Otherlocale.test703LocaleImportFunctionalTest->testStandalonePoFile()
Plural numbers untouched.Otherlocale.test706LocaleImportFunctionalTest->testStandalonePoFile()
The translation file was successfully imported.Otherlocale.test716LocaleImportFunctionalTest->testStandalonePoFile()
Failed to set field language to frOtherlocale.test724LocaleImportFunctionalTest->testStandalonePoFile()
Found the requested form fields at admin/config/regional/translate/translateOtherlocale.test724LocaleImportFunctionalTest->testStandalonePoFile()
Plural numbers changed.Otherlocale.test727LocaleImportFunctionalTest->testStandalonePoFile()
Long month name context is working.Otherlocale.test778LocaleImportFunctionalTest->testLanguageContext()
Default context is working.Otherlocale.test779LocaleImportFunctionalTest->testLanguageContext()
The translation file was successfully imported.Otherlocale.test793LocaleImportFunctionalTest->testEmptyMsgstr()
String imported and translated.Otherlocale.test794LocaleImportFunctionalTest->testEmptyMsgstr()
The translation file was successfully imported.Otherlocale.test801LocaleImportFunctionalTest->testEmptyMsgstr()
String is untranslated again.Otherlocale.test816LocaleImportFunctionalTest->testEmptyMsgstr()
LeafLocaleInstallTest100
LeafLocaleLanguageNegotiationInfoFunctionalTest4800
LeafLocaleLanguageSwitchingFunctionalTest2500
LeafLocaleMultilingualFieldsFunctionalTest6000
LeafLocalePathFunctionalTest4900
LeafLocaleTranslationFunctionalTest25000
LeafLocaleUILanguageNegotiationTest7300
LeafLocaleUninstallFrenchFunctionalTest3100
LeafLocaleUninstallFunctionalTest3100
LeafLocaleUrlRewritingTest3200
LeafLocaleUserCreationTest6800
LeafLocaleUserLanguageFunctionalTest5100
LeafLockFunctionalTest1700
LeafMailTestCase100
LeafMenuBreadcrumbTestCase41000
LeafMenuLinksUnitTestCase5000
LeafMenuNodeTestCase5500
LeafMenuRebuildTestCase500
LeafMenuRouterTestCase22600
LeafMenuTestCase64400
LeafMenuTreeDataTestCase400
LeafMenuTreeOutputTestCase700
LeafModuleDependencyTestCase15800
LeafModuleInstallTestCase200
LeafModuleRequiredTestCase1800
LeafModuleUninstallTestCase100
LeafModuleUnitTest6800
LeafModuleVersionTestCase5000
LeafMultiStepNodeFormBasicOptionsTest1500
LeafNewDefaultThemeBlocks2400
LeafNodeAccessRebuildTestCase1600
LeafNodeAccessRecordsUnitTest2300
LeafNodeAccessUnitTest3100
LeafNodeAdminTestCase14200
LeafNodeBlockFunctionalTest8300
LeafNodeBlockTestCase1800
LeafNodeBuildContent100
LeafNodeCreationTestCase2500
LeafNodeEntityFieldQueryAlter3000
LeafNodeFeedTestCase100
LeafNodeLoadHooksTestCase400
LeafNodeLoadMultipleUnitTest3600
LeafNodePostSettingsTestCase3400
LeafNodeQueryAlter7900
LeafNodeRevisionsTestCase4400
LeafNodeRSSContentTestCase1600
LeafNodeSaveTestCase3900
LeafNodeTitleTestCase2000
LeafNodeTitleXSSTestCase2000
LeafNodeTokenReplaceTestCase3400
LeafNodeTypePersistenceTestCase6200
LeafNodeTypeTestCase11300
LeafNoHelpTestCase1100
LeafNonDefaultBlockAdmin1000
LeafNumberFieldTestCase1500
LeafOpenIDFunctionalTestCase26800
LeafOpenIDRegistrationTestCase15800
LeafOpenIDUnitTest3200
LeafOptionsWidgetsTestCase30900
LeafPageEditTestCase9300
LeafPageNotFoundTestCase1800
LeafPagePreviewTestCase3500
LeafPageTitleFiltering4000
LeafPageViewTestCase3200
LeafParseInfoFilesTestCase300
LeafPasswordHashingTest1000
LeafPathLanguageTestCase6300
LeafPathLanguageUITestCase6900
LeafPathLookupTest1700
LeafPathMonolingualTestCase3400
LeafPathTaxonomyTermTestCase3400
LeafPathTestCase10200
LeafPHPAccessTestCase3700
LeafPHPFilterTestCase4100
LeafPollBlockTestCase16100
LeafPollCreateTestCase20400
LeafPollExpirationTestCase4100
LeafPollJSAddChoice3000
LeafPollTokenReplaceTestCase18700
LeafPollVoteCheckHostname16000
LeafPollVoteTestCase9000
LeafProfileBlockTestCase9000
LeafProfileTestAutocomplete5400
LeafProfileTestBrowsing3200
LeafProfileTestDate4900
LeafProfileTestFields18000
LeafProfileTestSelect4500
LeafProfileTestWeights5300
LeafQueueTestCase700
LeafRdfCommentAttributesTestCase20400
LeafRdfCrudTestCase900
LeafRdfGetRdfNamespacesTestCase400
LeafRdfMappingDefinitionTestCase5800
LeafRdfMappingHookTestCase500
ExpandRdfRdfaMarkupTestCase2520
MessageGroupFilenameLineFunctionStatus
Attribute 'rel' set on file field. Attribute 'resource' is also set.Otherrdf.test182RdfRdfaMarkupTestCase->testAttributesInMarkupFile()
Attribute 'rel' set on image field. Attribute 'resource' is also set.Otherrdf.test188RdfRdfaMarkupTestCase->testAttributesInMarkupFile()
LeafRdfTrackerAttributesTestCase3200
LeafRegistryParseFilesTestCase600
LeafRegistryParseFileTestCase200
LeafRemoveFeedItemTestCase19600
LeafRemoveFeedTestCase2300
LeafRetrieveFileTestCase700
LeafSchemaTestCase58800
LeafSearchAdvancedSearchForm3100
LeafSearchBlockTestCase5800
LeafSearchCommentCountToggleTestCase3000
LeafSearchCommentTestCase18700
LeafSearchConfigSettingsForm11600
LeafSearchEmbedForm2900
LeafSearchExactTestCase2200
LeafSearchExcerptTestCase1100
LeafSearchExpressionInsertExtractTestCase2400
LeafSearchKeywordsConditions2500
LeafSearchLanguageTestCase4500
LeafSearchMatchTestCase14400
LeafSearchNumberMatchingTestCase29200
LeafSearchNumbersTestCase17200
LeafSearchPageOverride1200
LeafSearchPageText2900
LeafSearchRankingTestCase6000
LeafSearchSimplifyTestCase65100
LeafSearchTokenizerTestCase200
LeafSessionHttpsTestCase8200
LeafSessionTestCase18700
LeafShortcutLinksTestCase10300
LeafShortcutSetsTestCase15300
LeafShutdownFunctionsTest400
LeafSimpleTestBrowserTestCase1600
LeafSimpleTestFolderTestCase100
LeafSimpleTestFunctionalTest11400
LeafSimpleTestMailCaptureTestCase1300
LeafSiteMaintenanceTestCase8000
LeafStatisticsAdminTestCase10400
LeafStatisticsBlockVisitorsTestCase4500
LeafStatisticsLoggingTestCase2500
LeafStatisticsReportsTestCase8000
LeafStatisticsTokenReplaceTestCase2900
LeafStreamWrapperTest1500
LeafSummaryLengthTestCase1500
LeafSyslogTestCase1600
LeafSystemAdminTestCase19100
LeafSystemAuthorizeCase1500
LeafSystemBlockTestCase3400
LeafSystemIndexPhpTest900
LeafSystemInfoAlterTestCase1000
LeafSystemMainContentFallback6600
LeafSystemThemeFunctionalTest9100
LeafTableSortTest600
LeafTaxonomyHooksTestCase1900
LeafTaxonomyLegacyTestCase1300
LeafTaxonomyLoadMultipleUnitTest1700
LeafTaxonomyTermFieldTestCase3600
LeafTaxonomyTermTestCase16800
LeafTaxonomyTermUnitTest100
LeafTaxonomyThemeTestCase1700
LeafTaxonomyTokenReplaceTestCase5300
LeafTaxonomyVocabularyFunctionalTest9700
LeafTaxonomyVocabularyUnitTest6100
LeafTextFieldTestCase19700
LeafTextSummaryTestCase13800
LeafTextTranslationTestCase10400
LeafThemeFastTestCase1000
LeafThemeHookInitUnitTest400
LeafThemeItemListUnitTest100
LeafThemeLinksUnitTest1700
LeafThemeTableUnitTest600
LeafThemeUnitTest1600
LeafTokenReplaceTestCase3700
LeafTrackerTest22200
LeafTranslationTestCase55700
LeafTriggerContentTestCase35300
LeafTriggerCronTestCase3300
LeafTriggerOrphanedActionsTestCase3700
LeafTriggerOtherTestCase11200
LeafTriggerUserActionTestCase6500
LeafTriggerUserTokenTestCase18500
LeafUnicodeUnitTest17600
LeafUpdateCoreTestCase17500
LeafUpdateDependencyHookInvocationTestCase300
LeafUpdateDependencyMissingTestCase300
LeafUpdateDependencyOrderingTestCase300
LeafUpdateFeedItemTestCase6100
LeafUpdateFeedTestCase7400
LeafUpdateScriptFunctionalTest5600
LeafUpdateTestContribCase18100
ExpandUpdateTestUploadCase6010
MessageGroupFilenameLineFunctionStatus
Existing module was extracted and not reinstalled.Otherupdate.test630UpdateTestUploadCase->testUploadModule()
LeafUrlAlterFunctionalTest2800
LeafUserAccountLinksUnitTests2100
LeafUserAdminTestCase6500
LeafUserAuthmapAssignmentTestCase800
LeafUserAutocompleteTestCase2800
LeafUserBlocksUnitTests4300
LeafUserCancelTestCase28600
LeafUserCreateTestCase2700
LeafUserEditedOwnAccountTestCase2300
LeafUserEditTestCase6800
LeafUserLoginTestCase17100
LeafUserPermissionsTestCase5000
ExpandUserPictureTestCase10360
MessageGroupFilenameLineFunctionStatus
Image is displayed in user's edit pageOtheruser.test919UserPictureTestCase->testWithGDinvalidDimension()
File is located in proper directoryOtheruser.test922UserPictureTestCase->testWithGDinvalidDimension()
Image is displayed in user's profile pageOtheruser.test1049UserPictureTestCase->testPictureIsValid()
Image is displayed in user's profile pageOtheruser.test1049UserPictureTestCase->testPictureIsValid()
File is located in proper directoryOtheruser.test1052UserPictureTestCase->testPictureIsValid()
Filename of second picture is different.Otheruser.test1059UserPictureTestCase->testPictureIsValid()
LeafUserRegistrationTestCase17900
LeafUserRoleAdminTestCase6700
LeafUserRolesAssignmentTestCase7900
LeafUserSaveTestCase300
LeafUserSignatureTestCase9000
LeafUserTimeZoneFunctionalTest6200
LeafUserTokenReplaceTestCase8600
LeafUserUserSearchTestCase7600
LeafUserValidateCurrentPassCustomForm3200
LeafUserValidationTestCase3500
LeafValidUrlTestCase7900
LeafXMLRPCBasicTestCase700
LeafXMLRPCMessagesTestCase700
LeafXMLRPCValidator1IncTestCase900